##TITLE=31Pdec_GP1809
 , 24 sc
 19.9.2019
##JCAMPDX= 6.0         $$ Bruker NMR JCAMP-DX V2.0
##DATA TYPE= NMR SPECTRUM
##DATA CLASS= NTUPLES
##ORIGIN= UXNMR, Bruker Analytische Messtechnik GmbH
##OWNER= root
$$ XWIN-NMR		Version 3.5
$$ Thu Sep 19 13:51:33 2019 Russian Standard Time (UT+4h)  she@DPX200
##.OBSERVE FREQUENCY= 81.013821
##.OBSERVE NUCLEUS= ^31P
##.ACQUISITION MODE= SIMULTANEOUS
##.ACQUISITION SCHEME= undefined
##.AVERAGES= 24
##.DIGITISER RES= 17
##SPECTROMETER/DATA SYSTEM= spect
##.PULSE SEQUENCE= zgpg30
##.SOLVENT NAME= CDCl3
##.SHIFT REFERENCE= (INTERNAL, CDCl3, 0, 182.463)
##AUDIT TRAIL= $$ (NUMBER, WHEN, WHO, WHERE, WHAT)
$$ ##TITLE= Audit trail, XWIN-NMR		Version 3.5
$$ ##JCAMPDX= 5.01
$$ ##ORIGIN= Bruker BioSpin GmbH
$$ ##OWNER= she
$$ F:/spectra/data/she/nmr/P31/1/pdata/1/auditp.txt
$$ ##AUDIT TRAIL=  $$ (NUMBER, WHEN, WHO, WHERE, WHAT)
(   1,<2019-09-19 13:50:23.70 +0400>,<she>,<DPX200>,
      <created by zg, POWCHK disabled, PULCHK disabled
       configuration hash MD5:
       00 E9 B6 7A A2 85 ED C7 34 08 36 98 17 FE 4E 26
       data hash MD5: 32K
       44 E1 F4 BC 58 93 7E EC 79 4B C3 C1 D8 FF D6 80>)
(   2,<2019-09-19 13:50:39.01 +0400>,<she>,<DPX200>,
      <Start of raw data processing
       efp BC_mod = 2 LB = 1 FT_mod = 6 PKNL = 1 PHC0 = -389.1512 PHC1 = 103.8003 SI = 64K 
       data hash MD5: 64K
       20 23 D6 FA 54 7D 3D 40 61 99 FB 2D F5 DF 01 BB>)
(   3,<2019-09-19 13:50:54.98 +0400>,<she>,<DPX200>,
      <pk PHC0 = -12.67281 PHC1 = 0 
       data hash MD5: 64K
       B6 0C B4 C4 EA 18 2B 02 5D 97 F5 03 56 B1 71 E0>)
(   4,<2019-09-19 13:51:01.48 +0400>,<she>,<DPX200>,
      <abs ABSG = 5 
       data hash MD5: 64K
       7B 10 42 95 FF 6A 94 B4 7F 14 49 78 F8 A6 7E 7D>)
$$ ##END=
$$ 
$$ hash MD5
$$ BC 5F 5D A2 86 8D FF 97 BD DD E7 C1 D8 45 F1 06
##$RELAX= 
##$RELAX= 
##$RELAX= 
##$RELAX= 
##$RELAX= 
##$RELAX= 
##$RELAX= 
##$RELAX= 
$$ Bruker specific parameters
$$ --------------------------
##$DU= <F:/spectra>
##$EXPNO= 1
##$NAME= <P31>
##$PROCNO= 1
##$TYPE= <nmr>
##$USER= <she>
##$AMP= (0..31)
100 100 100 100 100 100 100 100 100 100 100 100 100 100 100 100 100 100 
100 100 100 100 100 100 100 100 100 100 100 100 100 100 
##$AQSEQ= 0
##$AQ_mod= 1
##$AUNM= <au_zg>
##$AUTOPOS= <>
##$BF1= 81.014009
##$BF2= 200.13
##$BF3= 200.13
##$BF4= 200.13
##$BF5= 200.13
##$BF6= 200.13
##$BF7= 200.13
##$BF8= 200.13
##$BYTORDA= 1
##$CFDGTYP= 0
##$CFRGTYP= 5
##$CHEMSTR= <none>
##$CNST= (0..31)
1 1 145 1 1 1 1 1 1 1 1 1 1 1 1 1 1 1 1 1 1 1 1 1 1 1 1 1 1 1 1 1 
##$CPDPRG= <waltz16>
##$CPDPRG1= <>
##$CPDPRG2= <waltz16>
##$CPDPRG3= <>
##$CPDPRG4= <mlev>
##$CPDPRG5= <mlev>
##$CPDPRG6= <mlev>
##$CPDPRG7= <mlev>
##$CPDPRG8= <mlev>
##$CPDPRGB= <>
##$CPDPRGT= <>
##$D= (0..31)
0 1 0 0 0 0 0 0 0 0 0 0.03 2e-05 3e-06 0 0 0 0 0 0 0 0 0 0 0 0 0 0 0 0 
0 0 
##$DATE= 1568886623
##$DBL= (0..7)
120 120 120 11 120 120 24 19 
##$DBP= (0..7)
150 150 150 150 150 150 150 150 
##$DBP07= 0
##$DBPNAM0= <>
##$DBPNAM1= <>
##$DBPNAM2= <>
$$ [...]
##$SUBNAM3= <"">
##$SUBNAM4= <"">
##$SUBNAM5= <"">
##$SUBNAM6= <"">
##$SUBNAM7= <"">
##$SUBNAM8= <"">
##$SUBNAM9= <"">
##$SW= 369.568048894756
##$SWIBOX= (0..15)
0 1 3 0 0 0 0 0 0 0 0 0 0 0 0 0 
##$SW_h= 29940.119760479
##$TD= 32768
##$TD0= 1
##$TE= 0
##$TE2= 300
##$TE3= 300
##$TEG= 300
##$TL= (0..7)
0 120 53 12 22 120 120 120 
##$TP= (0..7)
150 150 150 150 150 150 150 150 
##$TP07= 0
##$TPNAME0= <>
##$TPNAME1= <>
##$TPNAME2= <>
##$TPNAME3= <>
##$TPNAME4= <>
##$TPNAME5= <>
##$TPNAME6= <>
##$TPNAME7= <>
##$TPOAL= (0..7)
0.5 0.5 0.5 0.5 0.5 0.5 0.5 0.5 
##$TPOFFS= (0..7)
0 0 0 0 0 0 0 0 
##$TUNHIN= 0
##$TUNHOUT= 0
##$TUNXOUT= 0
##$USERA1= <user>
##$USERA2= <user>
##$USERA3= <user>
##$USERA4= <user>
##$USERA5= <user>
##$V9= 5
##$VALIST= <valist>
##$VCLIST= <CCCCCCCCCCCCCCC>
##$VD= 0
##$VDLIST= <DDDDDDDDDDDDDDD>
##$VPLIST= <PPPPPPPPPPPPPPP>
##$VTLIST= <TTTTTTTTTTTTTTT>
##$WBST= 1024
##$WBSW= 4
##$XGAIN= (0..3)
0 0 0 0 
##$XL= 0
##$YL= 0
##$YMAX_a= 161631
##$YMIN_a= -188199
##$ZGOPTNS= <>
##$ZL1= 120
##$ZL2= 120
##$ZL3= 120
##$ZL4= 120
##$ABSF1= 182.463
##$ABSF2= -187.1042
##$ABSG= 5
##$ABSL= 3
##$ALPHA= 0
##$AQORDER= 0
##$ASSFAC= 0
##$ASSFACI= 0
##$ASSFACX= 0
##$ASSWID= 0
##$AUNMP= <proc_1d>
##$AZFE= 0.1
##$AZFW= 0.5
##$BCFW= 0
##$BC_mod= 2
##$BYTORDP= 0
##$COROFFS= 0
##$CY= -3
##$DATMOD= 1
##$DC= 0
##$DFILT= <>
##$DTYPP= 0
##$F1P= 0
##$F2P= 0
##$FCOR= 1
##$FTSIZE= 65536
##$FT_mod= 6
##$GAMMA= 0
##$GB= 0
##$INTBC= 1
##$INTSCL= 5.30512e-09
##$ISEN= 30
##$LB= 1
##$LEV0= 0
##$LPBIN= 0
##$MAXI= 10000
##$MC2= 0
##$MEAN= 0
##$ME_mod= 0
##$MI= 50
##$NCOEF= 0
##$NC_proc= -3
##$NLEV= 6
##$NOISF1= 182.463
##$NOISF2= 159.3651
##$NSP= 0
##$NTH_PI= 0
##$NZP= 0
##$OFFSET= 182.463
##$PC= 4
##$PHC0= -401.824
##$PHC1= 103.8003
##$PH_mod= 1
##$PKNL= yes
##$PPARMOD= 0
##$PSCAL= 0
##$PSIGN= 0
##$REVERSE= no
##$SF= 81.0140089999434
##$SI= 65536
##$SIGF1= 159.3651
##$SIGF2= -187.1042
##$SINO= 113.3802
##$SIOLD= 16384
##$SREGLST= <1H.CDCl3>
##$SSB= 0
##$STSI= 65536
##$STSR= 0
##$SW_p= 29940.119760479
##$SYMM= 0
##$S_DEV= 0
##$TDeff= 32768
##$TDoff= 0
##$TI= <>
##$TILT= no
##$TM1= 0
##$TM2= 0
##$TOPLEV= 0
##$USERP1= <user>
##$USERP2= <user>
##$USERP3= <user>
##$USERP4= <user>
##$USERP5= <user>
##$WDW= 1
##$XDIM= 65536
##$YMAX_p= 497632928
##$YMIN_p= -6247500
$$ End of Bruker specific parameters
$$ ---------------------------------
##NTUPLES= NMR SPECTRUM
##VAR_NAME=  FREQUENCY,     SPECTRUM/REAL,   SPECTRUM/IMAG
##SYMBOL=    X,             R,               I
##VAR_TYPE=  INDEPENDENT,   DEPENDENT,       DEPENDENT
##VAR_FORM=  AFFN,          ASDF,            ASDF
##VAR_DIM=   65536,         65536,           65536
##UNITS=     HZ,            ARBITRARY UNITS, ARBITRARY UNITS
##FACTOR=    0.456856943014862, 1,           1
##FIRST=     14782.0589164792, 0,            0
##LAST=      -15158.0608439998, 0,           0
##MIN=       -15158.0608439998, -6247500,    0
##MAX=       14782.0589164792, 497632928,    0
$$ Real data points
##PAGE= N=1
##DATA TABLE= (X++(R..R)), XYDATA
$$ [...]
37858d50983J94511l2899j01336N7958J61893J6559j94551k06342m5751O9214
37848e31727N4138K278N794Q8937K37240L61560L20699J04309j04199j69239j80044
37837A89746k35152k07752L7442L09609K74434n7206l19299k93414j30406j0036
37827d42034J05724K37085K07340o0438k95635k15592M3121J28736N608m9790
37817c35875N3780R2078m1843j25481J420J28059Q423k07390j84078P2254K23407
37806c15246J17621j5433L5610J43358Q1318j10451k03129j21051q125J8120Q651
37795c68757N3505J33955J61488J01487O692n4607p4749r7927j30425r5546N8659
37784c06225K25405K26147O3903l9878N3495J88758J45446k7448r9024k5715m413
$$ plain form
37858 -450983 -256472 -289371 -390707 -332749 -170856 -154297 -348848 -555190 -600941 -531727
37848 -531727 -477589 -475311 -469517 -380580 -143340 218220 538919 643228 539029 369790 189746
37837 189746 -45406 -253158 -215716 93893 368327 311121 -8178 -301592 -431998 -442034
37827 -442034 -336310 -99225 108115 47677 -247958 -463550 -420429 -291693 -286085 -335875
37817 -335875 -282095 -190017 -231860 -357341 -355921 -227862 -219439 -426829 -610907 -538653 -315246
37806 -315246 -197625 -213058 -177448 -34090 47228 -63223 -266352 -387403 -395528 -377408 -368757
37795 -368757 -315252 -181297 -19809 81678 88370 33763 -40986 -138913 -269338 -364884 -306225
37784 -306225 -80820 145327 209230 169352 222847 411605 557051 529603 430579 404864 400451
37773D00451j33323k43640j67453L897O5847j7650j21434j64416j61563j14010
37763f53294J4217K03758L54909L71381K32703O993j75445k10864j30065o6110
37753e1817p9808r8333o8909m9890o3163r86J71295K56051P9997j87889k36500
37742c29952q2888l8622j85462k24742J9916K72703K17861o705l6961J47911K23101
37731b3840M1227j63690j46572K9915J41568Q4071q3261k35267k49481r7156Q0744
37720f21742J06291O934j6660R7426J68227O0653r8738j21000j8665P8753J41942
37709b16579J99818J82819Q422k24288l12221k09530n8853K2277L5520j683q6585
37698f60883j44072o6677J19939K59335K60983J74838N9498p6497j75729j41337
$$ plain form
37773 400451 267128 23488 -143965 -140068 -74221 -91871 -213305 -377721 -539284 -653294
37763 -653294 -639077 -435319 -80410 290971 523674 530667 355222 144358 14293 -51817
37753 -51817 -131625 -229958 -298867 -348757 -411920 -412906 -241611 14440 94437 -93452 -329952
37742 -329952 -412840 -451462 -636924 -861666 -841750 -569047 -351186 -357891 -394852 -246941 -23840
37731 -23840 17387 -146303 -292875 -262960 -121392 -37321 -120582 -355849 -605330 -702486 -621742
37720 -621742 -515451 -508517 -525177 -427751 -259524 -198871 -297609 -418609 -437274 -358521 -216579
37709 -216579 -16761 166058 174480 -49808 -362029 -571559 -630412 -608135 -572615 -574298 -660883
37698 -660883 -804955 -871632 -751693 -492358 -231375 -56537 2961 -73536 -249265 -390602
37688c90602p621N7927N348m961J26351K30655J04693j59316k76201j56202K721
37677d67208K1438l7505k1180P0668J07158L7947l0938L769Q4276O8533n4693
37666b17735j30386o1325L7380J5771o4680l1918Q9274Q7821q0713j77730l1236
37655e65477J90037K14639L8968j18001j29708n2617K9990Q3952Q3133L4563O795
37644a83726K0123j8369j45313k09238p5466J32871J95408J12055L9853p410j30321
37633b69533k60248k06371J066J15081O8363O1515J72937J99804L2252j20904
37623b06038q2903j1582j03021k24784j34037J07302K33136J74528P5434o299
37613a78264j25178k25086j77109l5313Q438n7434m0239J24942K59818K30449
$$ plain form
37688 -390602 -398223 -340296 -334948 -339909 -213558 17097 121790 -37526 -313727 -469929 -467208
37677 -467208 -445770 -483275 -504455 -433787 -326629 -288682 -319620 -315851 -231575 -163042 -217735
37666 -217735 -348121 -409446 -372066 -356295 -420975 -452893 -363619 -275798 -356511 -534241 -565477
37655 -565477 -375440 -160801 -121833 -239834 -369542 -422159 -392169 -308217 -225084 -190521 -183726
37644 -183726 -163603 -181972 -327285 -536523 -611989 -479118 -283710 -171655 -131802 -139212 -269533
37633 -269533 -529781 -736152 -735086 -620005 -551642 -490127 -317190 -117386 -85134 -206038
37623 -206038 -288941 -300523 -403544 -628328 -762365 -655063 -421927 -247399 -171965 -178264
37613 -178264 -303442 -528528 -705637 -740950 -732512 -789946 -830185 -705243 -445425 -214976
37603b14976J34448J05104J12287P0783J631l0193l5775o3757j15859j62301j71243
37592c69851r3911Q6875K69041L01948J77492M0538j6832m3237q1024q7823o6253
37581A16963j08326k13120k16983m0004J31910P8242j34424k39139j27914M7689
37571g05106J22238J00949P0700N6740K6983l3847j01116j28769q2425J5407Q7934
37560e70312R1646P4441R5056J18095O1942o8519j75581j90357j28265k6308R4538
37549f23624J90291J96001J05842R31l9684k3825j6631n4850j15598j52883j45120
37538f79150j08696o5571j786J10278K29847K38669P8650j27183j78140l3518
37528e36600J30409J35067M853r3476o2797M5546J38956J84622J85199J22526
$$ plain form
37603 -214976 -80528 24576 136863 207646 209277 179084 143309 79552 -36307 -198608 -369851
37592 -369851 -463762 -376887 -107846 194102 371594 412132 395300 352063 271039 183216 116963
37581 116963 8637 -204483 -421466 -461470 -329560 -251318 -385742 -624881 -752795 -705106
37571 -705106 -582868 -481919 -411219 -354479 -327496 -361343 -462459 -591228 -673653 -658246 -570312
37560 -570312 -478666 -404225 -309169 -191074 -129132 -197651 -373232 -563589 -691854 -718162 -623624
37549 -623624 -433333 -237332 -131490 -130559 -170243 -194068 -210699 -265549 -381147 -534030 -679150
37538 -679150 -787846 -853417 -855203 -744925 -515078 -276409 -197759 -324942 -503082 -536600
37528 -536600 -406191 -271124 -266271 -359747 -422544 -376998 -238042 -53420 131779 254305
37518B54305j6558j78568k64702k33019j48985j05487j07695p5498L5038J53806
37508f87363J72953Q1409j7963k9677L0110O9503L7305k9626p3338r1607j19103
37497f57397j49699j24149j1461J31013K06712J67755L4429j30393k21788j23746
37487h78724J55833L92232L19768l9994l35319k70304M0874K27268J21463q3051
37477c49954j36074k9964P3458P9299M859j19089k42862k37412j3347K75158L16349
37466c79579K7694k75980k48042M1143K06260P0769j29744j27450J0468N1746
37456g52715k3792m3077L7024P2859J3002N28J14847K08457J29701m1064j25570
37445d09800j06549r5149j17022r4673p325P5874J07048Q9186K4113n5627m8578
$$ plain form
37518 254305 237747 59179 -205523 -438542 -587527 -693014 -800709 -876207 -841169 -687363
37508 -687363 -514410 -433001 -450964 -480641 -450531 -381028 -343723 -373349 -446687 -538294 -657397
37497 -657397 -807096 -931245 -942706 -811693 -604981 -437226 -402797 -533190 -754978 -878724
37487 -878724 -722891 -330659 -10891 -50885 -386204 -656508 -615634 -388366 -266903 -349954
37477 -349954 -486028 -515992 -442534 -363235 -358376 -477465 -720327 -957739 -971086 -695928 -379579
37466 -379579 -351885 -627865 -875907 -834764 -628504 -557735 -687479 -814929 -804461 -752715
37456 -752715 -776507 -819584 -782560 -709701 -696699 -696171 -581324 -372867 -243166 -284230 -409800
37445 -409800 -516349 -611498 -728520 -823193 -830518 -754644 -647596 -558410 -534297 -589924 -638502
37434f38502Q5762K02327J37253l1347p7835K2662N7952p0848j93324j58923o2426
37423g27249l6283j6408R0698J67747N2394j53104j89346k3417J14519R0640L5814
37412e93995R1363J84005J65009L6040q2932j25920j16772q3600k3289O5209J54930
37401c29952J87092J01092p9743k09505j60121m440N5304k9092p3932N5147K14186
37390b73964J69410o0921k13945j26370O7916J29367M336j48051j73286q4766
37380g10274j405J5433O258J1957M991m1788q2266o3475k4350m4198j13866j43323
37368a186306q5252K7875J43104J91605Q5332j48670k74804r0482K38877L24108
37358g74613Q5957j18129k2802J64092J23525p0937j08444N6431J82264J46519
$$ plain form
37434 -638502 -552740 -350413 -213160 -244507 -322342 -299680 -241728 -312576 -505900 -664823 -727249
37423 -727249 -763532 -779940 -689242 -521495 -469101 -622205 -811551 -834968 -720449 -629809 -593995
37412 -593995 -502632 -318627 -153618 -117578 -200510 -326430 -443202 -526802 -550091 -484882 -329952
37401 -329952 -142860 -41768 -121511 -331016 -491137 -495577 -440273 -469365 -543297 -488150 -273964
37390 -273964 -104554 -165475 -379420 -505790 -437874 -308507 -304171 -452222 -625508 -710274
37380 -710274 -711679 -696246 -689988 -678031 -673040 -714828 -797094 -860569 -884919 -929117 -1042983 -1186306
37368 -1186306 -1271558 -1243683 -1100579 -908974 -823642 -972312 -1247116 -1337598 -1098721 -774613
37358 -774613 -688656 -806785 -829587 -665495 -541970 -612907 -721351 -664920 -482656 -336137
37348c36137N8610o206q6459j39483n2337J15459J64982P7085L5817Q6459N7053
37337b5157r8590j79667q7832p757p5673j50176j11505j05975k35939k71816l036
37326a353123L28564L24540L4355j31255m0020J9290j19329k06591M062L39863
37316g99644M32802J92459j37421k96035k25467l5041J24275J61191R2527j967
37306d92321p3509j20407j30574q0154P984P0029P3396M0113J3453L5817J11823
37295e44350J53059M6738j52181k15888m6773J40616J05046p3078j38885n5857
37285g81553Q304K3536J21737K77416K73689N5146j61131k15817j89256j58047
37275g45976m5516J42975K00338K5809j67075j58744n2841p4463j90663j72196
$$ plain form
37348 -336137 -277527 -283733 -370192 -509675 -562012 -446553 -281571 -204486 -168669 -82210 -25157
37337 -25157 -123747 -303414 -391246 -399003 -474676 -624852 -736357 -842332 -1078271 -1350087 -1353123
37326 -1353123 -1024559 -700019 -665664 -796919 -836939 -817649 -936978 -1143569 -1139507 -799644
37316 -799644 -366842 -174383 -311804 -607839 -833306 -868347 -744072 -582881 -490354 -492321
37306 -492321 -565830 -686237 -816811 -896965 -888981 -818952 -745556 -705443 -691990 -656173 -544350
37295 -544350 -391291 -344553 -496734 -712622 -759395 -618779 -513733 -586811 -725696 -781553
37285 -781553 -773249 -749713 -627976 -350560 -76871 -21725 -182856 -398673 -587929 -745976
37275 -745976 -791492 -648517 -448179 -422370 -589445 -748189 -801030 -875493 -1066156 -1238352
37265a238352M9592K91375L43135J56298j29246k63505j09163J39017J31406j44780
37255g74223k85814m6550K66361K35691n9283k11538j04971J1125l546q890Q9388
37244h92250J65929J05536l2849j46397j94303j47919j2263J03539J09123Q9184
37234h52670J49633J84878M4576j43482j23522N4026Q8961p4931j75623r9336
37224i47490l9519q9292o5459R7198J56835l519j08252O1592K60231J51895j52752
37213f78532k93107k08699j28465j36236j09260k4505J0727Q571P7076J59446
37203a322984R0600p7312r7312P6859J89836O8575j25914j51320j2545R1589L9242
37192a230686j00971j68931p5617R1355J32386l3241k42419k80923j41008K6670
$$ plain form
37265 -1238352 -1188760 -897385 -554250 -397952 -527198 -790703 -899866 -760849 -629443 -774223
37255 -774223 -1060037 -1106587 -840226 -604535 -663818 -875356 -980327 -969202 -972748 -981638 -892250
37244 -892250 -726321 -620785 -653634 -800031 -994334 -1142253 -1154516 -1050977 -941854 -852670
37234 -852670 -703037 -518159 -473583 -617065 -740587 -686561 -597600 -672531 -848154 -947490
37224 -947490 -987009 -1076301 -1141760 -1044562 -887727 -891246 -999498 -937906 -677675 -525780 -678532
37213 -678532 -971639 -1180338 -1308803 -1445039 -1554299 -1578804 -1568077 -1559506 -1482430 -1322984
37203 -1322984 -1232384 -1309696 -1407008 -1330149 -1140313 -1071738 -1197652 -1348972 -1361517 -1269928 -1230686
37192 -1230686 -1331657 -1500588 -1576205 -1484850 -1352464 -1385705 -1628124 -1909047 -2050055 -2023385
37182b023385J41416K17348K28368J40020L7823K7058L5975o8613k00358j43873
37172a608221O8241J53924J7517j02528l4005O7943L3604j0548J18103L10505
37162i85465L30445J93264J06397J13466P3407l0019k6507J45756L02642K67177
37152D90563J13627N5661J70723L19971L18598J46700j6965N687J61339K15091
37142A980995O9544q0298j4018J95943K90154J88206P1011J03494K41266L44084
37132C390381L43345K51567J16733J4149k34M2950P4586R3467J31855J41544N0813
37121D651156p1149o6218P6474K01956K35840K56288K64224J15502j85347l51729
37111E126997j89049P1025O6380j82596l38612k64582j66264j98382k30065j12416
$$ plain form
37182 -2023385 -1881969 -1664621 -1436253 -1296233 -1258410 -1231352 -1195377 -1263990 -1464348 -1608221
37172 -1608221 -1539980 -1386056 -1368539 -1471067 -1505072 -1437129 -1403525 -1414073 -1295970 -985465
37162 -985465 -655020 -461756 -355359 -241893 -168486 -198505 -225012 -79256 223386 490563
37152 490563 604190 659851 830574 1150545 1469143 1615843 1598878 1604565 1765904 1980995
37142 1980995 2050539 1970241 1956223 2152166 2442320 2630526 2701537 2805031 3046297 3390381
37132 3390381 3733726 3985293 4102026 4116175 4115941 4158891 4233477 4326944 4458799 4600343 4651156
37121 4651156 4580007 4513789 4590263 4792219 5028059 5284347 5548571 5664073 5478726 5126997
37111 5126997 4937948 5008973 5075353 4892757 4554145 4289563 4123299 3924917 3694852 3582436
37101C582436O1290J15983M6418l9966j03356j57002j78199j65430j95852k99505
37091B666817l54160k33226K51J61941J55074J3961j84538l35581l12206j04283
37081A474050J01842J30079N1452N5162J34511J05707o6726j86244j19891K3433
37071A703375R7061J15222J31550Q6966o3228j95375j68383n0852k1044q5790
37061A549502q0426N4628J71241J29678k3916j59396k25854k33481j68727l3766
37051I79483Q5533J03092O2905P7344J35191R3641r3191k60126k45806j24974
37041H13092p7585q7917K2361K49732L27742R8732k27716l51675k61455j39450
37031C65861k9707J42349K99946K59688M5324j16779j43376j62852j96488q5054
$$ plain form
37101 3582436 3643726 3759709 3806127 3766161 3662805 3505803 3327604 3162174 2966322 2666817
37091 2666817 2312657 2079431 2079682 2241623 2396697 2410658 2226120 1890539 1578333 1474050
37081 1474050 1575892 1705971 1757423 1812585 1947096 2052803 1986077 1799833 1679942 1703375
37071 1703375 1800436 1915658 2047208 2134174 2070946 1875571 1707188 1656336 1635292 1549502
37061 1549502 1469076 1523704 1694945 1824623 1800707 1641311 1415457 1181976 1013249 979483
37051 979483 1065016 1168108 1231013 1308357 1443548 1537189 1443998 1183872 938066 813092
37041 813092 735507 647590 669951 919683 1247425 1346157 1118441 766766 505311 365861
37031 365861 336154 478503 778449 1038137 1083461 966682 823306 660454 463966 378912
37021C78912J57131K40741M6725j25194j2905J65211N4702k41728l02317k7205
37011C34073K46982K74674J83739J57431J51353O6577l6839o4192o1733j17795
37001A134270j93449j75839m2730J04473J40925L2082j15298j44454m7208M111
36991F96883q0432j33020P868J78065R9643j52698k21999j8375J48891P9704k3312
36980E81218N6373J83850J46477M0183Q4460K23042K16776L9842j03071j12430
36970A356720r0823j10755j10398m7540K0567M7101N3493N6069L9542Q776j7271
36959A205481m6607p6866n9945K1045R9494J22436J13598O4341j03283l39877
36949I99817l89130j00477K93439M32468K78189P9881k7350j16805j96817j43530
$$ plain form
37021 378912 536043 776784 823509 698315 685410 850621 905323 663595 361278 334073
37011 334073 581055 855729 1039468 1196899 1348252 1414829 1377990 1313798 1252065 1134270
37001 1134270 940821 764982 722252 826725 967650 999732 884434 739980 692772 696883
36991 696883 616451 483431 491299 669364 769007 616309 394310 375935 524826 604530 581218
36980 581218 637591 821441 967918 1008101 1092561 1315603 1532379 1572221 1469150 1356720
36970 1356720 1265897 1155142 1044744 997204 1017771 1064872 1118365 1174434 1213976 1222752 1205481
36959 1205481 1158874 1082008 1022063 1043108 1142602 1265038 1378636 1442977 1339694 999817
36949 999817 610687 510210 803649 1236117 1514306 1594187 1566837 1450032 1253215 1109685
36939A109685M6020J88043J69547O3279n5223j78694k16274l6092K53117L33119
36929A676527J22859o5210J1786J60924Q3472j46713k29816j23462n9286j31086
36919A299995j75333q7297J0155o771p4363q2009m6225l3766k3041M0477J11617
36908I33439P6232r2208k73263l14957j87031k893J12006J45632J54884J29229
36898F81070M657j66596j98754k2165J64788J39429k8978q5625K7486J06377K6151
36887F47840o8201j2367J11300J08777l7250j72118j95173j31247k2654R3589
36877C22496J21938q790j80218j70420L7329J92462J17758m4100o9089L153k3180
36866B99339j31658j05770P6790J48885k5989j91118o6047K06464K58265M4801
$$ plain form
36939 1109685 1155705 1343748 1513295 1576574 1521351 1342657 1126383 1090291 1343408 1676527
36929 1676527 1799386 1734176 1745962 1906886 1990358 1843645 1613829 1490367 1431081 1299995
36919 1299995 1124662 1037365 1047520 1040749 966386 884377 838152 804386 781345 821822 933439
36908 933439 1009671 917463 644200 329243 142212 139319 251325 396957 551841 681070
36898 681070 685727 519131 320377 298212 463000 602429 573451 487826 515312 621689 647840
36887 647840 579639 567272 678572 787349 750099 577981 382808 251561 228907 322496
36877 322496 444434 435644 255426 85006 122335 314797 432555 388455 319366 322519 299339
36866 299339 167681 61911 138701 287586 261597 70479 4432 210896 469161 513962
36856E13962j08226q856J48791J32126J5011K684Q8884R4613l7964j77890k02759
36845D60376j19406k13Q4215P9408k147n4792j179P5277K7874j26687k01053q8493
36833A33180Q8614J43974N9829k6252k2049J9587N720n9370q9808n4747l6925
36822A61753j06820j74635o7403K18060M43194L97401J67115J3543K2078K8531
36812A102817q8146k04518j41852N4142J59077N9390j22513j98788j20377J7096
36802E16328J04034J07537O2885J7573j1763l6928o0762o3181m0690l1365n7058
36791E06610o1266K4153J43983J42047k7825j95595j78279l5371J4513p8362j17738
36780A36870K2841J67860P3976j96373l23185j41883J60522L03163K24417O3514
$$ plain form
36856 513962 405736 396880 545671 677797 692808 695492 784376 878989 841025 663135 460376
36845 460376 340970 340757 424972 504380 502233 447441 446262 521539 549413 422726 221673 133180
36833 133180 221794 365768 425597 399345 377296 396883 402603 343233 253425 198678 161753
36822 161753 54933 -119702 -187105 30955 474149 871550 1038665 1052208 1074286 1102817
36812 1102817 1014671 810153 668301 722443 881520 940910 818397 619609 499232 516328
36802 516328 620362 727899 790784 808357 796594 759666 698904 635723 595033 563668 506610
36791 506610 445344 469497 613480 755527 727702 532107 353828 318457 332970 254608 136870
36780 136870 159711 327571 401547 205174 -118011 -259894 -99372 203791 428208 491722
36770D91722n8793j32633j81944j92561j25331K9427K04361K72968J70028m355
36760D72889p5404k664Q5955Q8553N0400M5514N4657L9239K7612K9774k8489j64593
36748F23443k30825j00672J07354J60877K5943j20832j59207j20224l2767J12450
36738B65540K23159J52845m2955j12515K4111J23828j0661k09192j95777j8603
36728A99780M8253m6739p6037O1476J57181K1392k15787k85727j33120O3219J41268
36717f4841Q9121k7115j36455j67691q7165M1275R4936J4217j41393k54916k43184
36706h83211j07723O4773J66796J68621J30118Q5703k4269k33435m15276l96316
36696a444219k02329n8515j03918k30900k77803k56583k74931l32897l49451l34323
$$ plain form
36770 491722 432929 300296 118352 -74209 -199540 -170113 34248 307216 477244 472889
36760 472889 397485 394821 480776 569329 619729 665243 719900 759139 786751 816525 788036 623443
36748 623443 392618 291946 399300 560177 586120 465288 306081 185857 153090 265540
36738 265540 488699 641544 598589 486074 510185 634013 623352 414160 218383 199780
36728 199780 248033 201294 125257 186733 343914 365306 149519 -136208 -269328 -206109 -64841
36717 -64841 24280 -2835 -139290 -306981 -394146 -352871 -257935 -243718 -385111 -640027 -883211
36706 -883211 -990934 -926161 -759365 -590744 -460626 -374923 -399192 -632627 -1047903 -1444219
36696 -1444219 -1646548 -1705063 -1808981 -2039881 -2317684 -2574267 -2849198 -3182095 -3531546 -3865869
36686c865869l66954m22476l89760k77946k29043k71089k36207k9831J75332J69485
36676e744358J9991k5706J04946K38927K36951J65506J44672J73410J91465K12068
36666d282128K86989L81447L76530K11108j5105j07168L3612K77830L73771K24833
36656b238281R334m3663O3007J49770J49715J68082K35902K05504L172j77578
36646a475036j15399R5523J46655n0757k29602j28269J66571L52172K90680J23564
36636h23898L6500M2487L4479l8401j20677j43576j03528m3612N513N2496J24566
36625i77651K17126K60648J71056l4384k07206k16323j06350k8060k1303J9750
36615i22697J36961J97572Q6229r6464j56718o4165N3244J26345J92787K33360
$$ plain form
36686 -3865869 -4232823 -4655299 -5045059 -5323005 -5552048 -5823137 -6059344 -6089175 -5913843 -5744358
36676 -5744358 -5724367 -5750073 -5645127 -5406200 -5169249 -5003743 -4859071 -4685661 -4494196 -4282128
36666 -4282128 -3995139 -3613692 -3237162 -3026054 -3041159 -3148327 -3114715 -2836885 -2463114 -2238281
36656 -2238281 -2228947 -2272610 -2209603 -2059833 -1910118 -1742036 -1506134 -1300630 -1297458 -1475036
36646 -1475036 -1590435 -1494912 -1348257 -1399014 -1628616 -1756885 -1590314 -1238142 -947462 -823898
36636 -823898 -787398 -744911 -710432 -748833 -869510 -1013086 -1116614 -1160226 -1154713 -1102217 -977651
36625 -977651 -760525 -499877 -328821 -363205 -570411 -786734 -893084 -921144 -942447 -922697
36615 -922697 -785736 -588164 -501935 -598399 -755117 -819282 -766038 -639693 -446906 -213546
36605b13546J44317o1383j81106p1206J25471J35330r6239l31584l30333j19406
36595i99685P4593J06210M5810L3257Q3183J06183P1366L1200r169j03407k02667
36584g63126j45869Q4436K53424J79894J1909q388O8113J4567j45519j57607J3632
36573e94534J02714Q38n1434R8844K12230N3397j69487j01658J79004K48293l2782
36562e4575l09057k26525J10553L04850J53919j45070k43660l6237K24588K37915
36552A6701L0020j13806p5456l5733j09331j20974O5651K44646J72704j2155q911
36541E3356J35303J02439j53201l14402j91959L0548J26948J08007O1526k5525
36531f6960j49506k00689j20971J36O5386O1039j9092j58540k13358m6349K04825
$$ plain form
36605 -213546 -69229 -130612 -311718 -382924 -257453 -122123 -218362 -549946 -880279 -999685
36595 -999685 -925092 -818882 -773072 -739815 -656632 -550449 -479083 -447883 -457052 -560459 -763126
36584 -763126 -908995 -824559 -571135 -391241 -379332 -387720 -319607 -305040 -450559 -608166 -594534
36573 -594534 -491820 -490982 -542416 -443572 -231342 -177945 -347432 -449090 -270086 -21793 -54575
36562 -54575 -363632 -590157 -479604 -174754 -20835 -165905 -409565 -445802 -221214 16701
36552 16701 46721 -67085 -142541 -178274 -287605 -408579 -342928 -98282 74422 62267 53356
36541 53356 188659 291098 137897 -176505 -368464 -337916 -210968 -102961 -41435 -66960
36531 -66960 -216466 -417155 -538126 -537990 -472604 -411565 -430657 -589197 -802555 -848904 -644079
36520f44079K41244L1304j37137r0493L3555R9980J63947K23053J25489r5810
36510d8947j39151Q6940K35700N3571j85050j19208J15436J54449J9561M706J06819
36499B84826O1556j21861j52384Q77K5506j84416l22301j70456N8418Q6111j7578
36488d51702j7085J04145J72005J10395Q777m0504m1232m8172p9890p2292N0238
36477c05317K22051K55003J05741j4915L9752R1566o0102k42008j56261R3966
36467B9476J47598M302K0982K47127K78562o0431l79594l28735j06103m0642n5876
36456b43334O6953K13807J51335k1769n5795K840m7246j35455n5167R7426N6031
36445B9626j21025j27314N2091J15656k3436j10833j9853O4986L8718N7709J82528
$$ plain form
36520 -644079 -402835 -371531 -508668 -599161 -565606 -465626 -301679 -78626 46863 -48947
36510 -48947 -188098 -101158 134542 188113 3063 -116145 -709 153740 173301 178007 284826
36499 284826 346382 224521 72137 73014 98520 -85896 -408197 -578653 -520235 -434124 -451702
36488 -451702 -468787 -364642 -192637 -82242 -73465 -113969 -155201 -203373 -283263 -355555 -305317
36477 -305317 -83266 171737 277478 262563 302315 393881 333779 91771 -64490 29476
36467 29476 177074 181376 202358 449485 728047 667616 288022 -40713 -146816 -187458 -243334
36456 -243334 -176381 37426 188761 166992 111197 114037 66791 -68664 -123831 -26405 29626
36445 29626 -91399 -218713 -166622 -50966 -74402 -185235 -205088 -140102 -101384 -43675 138853
36434A38853K03409J3414j60339j07719N3612J23817J25721J50445J32262J0368
36424F83843q3767l3549M2922N152m9982J7723R9539J4302j41095j05743J41353
36413E90698L55082L72868K57197J13347j5667q5863q4395j04605k02088k31522
36403I65052n3533J58093J09935j24774j55767J20118L21494J57900j24282j35057
36393A239179P4940J53720J2872j08848r3064r1615j76281j64785M9585K41253
36383A136956J46282j25192k06760K5927K82249K37781n4513k45137j26633J26600
36373A197560J92790K124j95134j61520L5999J49429Q8877l699r612N146m5448
36362A256512r0119k9092N4020q737j84157k41949q6058R1306Q2744m9133r8608
$$ plain form
36434 138853 342262 355676 195337 87618 141230 265047 390768 541213 673475 683843
36424 683843 600076 566527 609449 614601 564619 582342 681881 696183 555088 449345 590698
36413 590698 945780 1318648 1575845 1689192 1673525 1587662 1503267 1398662 1196574 965052
36403 965052 911519 1069612 1179547 1054773 899006 1019124 1340618 1498518 1374236 1239179
36393 1239179 1314119 1467839 1480711 1371863 1278799 1187184 1010903 846118 895703 1136956
36383 1136956 1283238 1158046 951286 977213 1259462 1497243 1442730 1197593 1070960 1197560
36373 1197560 1390350 1392474 1197340 1035820 1071819 1221248 1310125 1306426 1296814 1301960 1256512
36362 1256512 1166393 1137301 1191321 1182584 998427 756478 670420 761726 844470 795337 696729
36351F96729k8166K2211l714K526J02249J81487J19170l3248j39746j61889j46554
36340F11055j01742j4805M5623j554p5024R728K43129L43367J14401k28344k86243
36329F59591m176K42093J44254j45734k62140j24188J8871q359q5450l1405J23051
36318E26408K16373J90382J09031J4738r3215j67415j38906m5079r344n8952p1588
36307D72433L8498J74187J80499N4399o7529r9993q4417p2762m2135K8397P8502
36296F60079M4716k3095j2998Q4278J46738Q7392j9045l1176P6351J86766J85793
36285A385799P9179l9819j01522j19059j44278j73937j28184L4084J98958J93044
36275A184265K3809q9513m092J40836J33225Q51o4082k0230R235J3657J21135
$$ plain form
36351 696729 668563 690774 687060 689586 791835 973322 1092492 1059244 919498 757609 611055
36340 611055 509313 494508 540131 538577 463553 473281 716410 1059777 1174178 945834 659591
36329 659591 655415 897508 1041762 896028 633888 509700 528571 520212 434762 403357 526408
36318 526408 742781 933163 1042194 1056932 963717 796302 657396 612317 602973 544021 472433
36307 472433 510931 685118 865617 920016 852487 752494 668077 595315 553180 581577 660079
36296 660079 704795 681700 668702 752980 899718 987110 968065 936889 1013240 1200006 1385799
36285 1385799 1464978 1425159 1323637 1204578 1060300 886363 758179 792263 991221 1184265
36275 1184265 1208074 1118561 1114469 1255305 1388530 1389381 1325299 1305069 1314304 1327961 1449096
36264A449096L01034L13020P6203j53950j45072p227M8386O7782K12964M11365
36254B573601M36099K61054P4343n900J5465J65691M27949N68911L73401M3758
36244D934372R411K90813M31669J89471q9107q969K88596L90669K25334O8343
36234F730602P6482J46114J80803K05522K11470J25457l5036j51495j67593j26106
36224G196220n5891L8998R8556O0143k0906m0154j4293m1851j12666j12250k0674
36213F975232M4830J2108n8523j10419j89594l37768m69454m40292k28357p448
36203E190315l721k42481m68283m17111j64669m8592j97877l39956k07989N5267
36193C154903J14065q2459k88744l39255k76968j59303m116Q4116m593j64567
$$ plain form
36264 1449096 1750130 2063150 2139353 1985403 1840331 1833104 1881490 1949272 2162236 2573601
36254 2573601 3009700 3270754 3345097 3339197 3354662 3520353 3948302 4517213 4890614 4934372
36244 4934372 4943783 5234596 5666265 5855736 5766629 5757660 6046256 6436925 6662259 6730602
36234 6730602 6807084 6953198 7134001 7339523 7550993 7676450 7641414 7489919 7322326 7196220
36224 7196220 7140329 7179327 7277883 7338026 7317120 7276966 7262673 7220822 7108156 6995906 6975232
36213 6975232 7020062 7032170 6973647 6863228 6673634 6335866 5866412 5426120 5197763 5190315
36203 5190315 5186594 4944113 4475830 4058719 3894050 3845458 3647581 3307625 3099636 3154903
36193 3154903 3268968 3186509 2897765 2558510 2281542 2122239 2118123 2202239 2197646 2033079
36183B033079j78625n6372j3042r3011j06368K24K5394j11721j88291n6907P4015
36172A328375j6763j76074j24581P8836J41453R541q8041m7879l1187j37229k09660
36161G26791r9945P0654P9112p6738j86483j22723J3371O8208M9690P9743J75095
36150G76775J89485J9231k15043k84552j24565R4984J70825P0404o9952j00083
36140E27509q876N8791j8473j34504n6431K07302L24577R2525k11358j99534M6497
36129F28025J21095n4222j46228n596J03827J1888n9072N8107J23817r0944l60053
36118C30644l39405r3316Q7399J67943K68663K75435Q928l25306l25839j3860
36108D1286J74603M2326j36862j08914K7809R5542R4471N0485q4115k32896j82616
$$ plain form
36183 2033079 1854454 1798082 1785040 1692029 1585661 1585885 1611279 1499558 1311267 1254360 1328375
36172 1328375 1311612 1135538 1010957 1089793 1231246 1240787 1152746 1104867 1073680 936451 726791
36161 726791 626846 697500 776612 699874 513391 390668 404039 472247 521937 601680 776775
36150 776775 966260 985491 770448 485896 361331 456315 627140 697544 627592 527509
36140 527509 518633 577424 558951 424447 368016 575318 899895 992420 781062 581528 628025
36129 628025 749120 694898 548670 543074 646901 658789 599717 657824 781641 690697 330644
36118 330644 -8761 -102077 -14678 153265 421928 697363 706291 380985 55146 41286
36108 41286 215889 258215 121353 12439 40248 135790 230261 280746 196631 -36265 -218881
36097b18881P7868K61714J77605j9294j09428r5826n7633K8706J35604R1651j37360
36086A34726k82426j27268J40005J82309j1939j66486j38858m9170k4078l9486
36076c82671l0496Q997N7325Q8349P1145K1254N107K3769k2148j59165k34511
36065e53045j10030J20019K40000J80061N2409j5998K4774J49947K43056J62726
36055D93919n6184j72341m9085J18727O6752j54400k71297j88523n7068J8063
36045b51437P9406J18542L9829j13469j37097K6902J68131J14645k7530q6611
36035f8689r8464j73587k25971p7157K14761L63969K26768k1025j36378q4613
36025h0386J8750J02601J53118J30479K2042p0228m3976K6339j3623j26498j01317
$$ plain form
36097 -218881 -141013 120701 298306 279012 169584 73758 16125 44831 180435 272086 134726
36086 134726 -147700 -274968 -134963 47346 35407 -131079 -269937 -319107 -343185 -382671
36076 -382671 -413167 -404170 -346845 -258496 -187351 -166097 -160990 -137221 -159369 -318534 -553045
36065 -553045 -663075 -543056 -303056 -122995 -70586 -86584 -61810 88137 331193 493919
36055 493919 437735 265394 216309 335036 401788 247388 -23909 -212432 -269500 -251437
36045 -251437 -172031 -53489 -13660 -127129 -264226 -237324 -69193 45452 17922 -68689
36035 -68689 -167153 -340740 -566711 -643868 -429107 -65138 161630 140605 4227 -80386
36025 -80386 -61636 40965 194083 324562 346604 276376 232400 258739 245116 118618 17301
36014A7301J04603K49719J57081j3752k8270N5414K6288q9713p5464Q6692J79763
36003F69662J25140Q3683J18820O7141j32021k67276j84156k6819L5108P1570
35993E60852J65855J69599l7475k43115j73241P1199J63694M0090p7479p8990
35983E60989p1943j09942j12032o2102l1718m118Q3986J53072R5347L4561J58769
35972F94869L20434J78937k16053l91125j37378J55225P6900k20456l11071j14924
35962C5358R2857J37936R9520P3308M6921J1928J5865Q1910J69512J97031P2801
35951A034947j97877m03681k92395P3141L12412K00879n2470j53273j21335j15682
35941B84666p9136J14647K93311J48067k45483m28902j72696K08354K94815Q5819
$$ plain form
36014 17301 121904 371623 528704 514952 486682 542096 568384 478671 403207 489899 669662
36003 669662 794802 878485 997305 1064446 932425 665149 480993 454174 489282 560852
35993 560852 726707 896306 858831 615716 442475 513674 677368 717458 639979 560989
35983 560989 489046 379104 267072 204970 173252 169134 253120 406192 501539 536100 694869
35972 694869 1015303 1194240 978187 587062 449684 604909 681809 461353 150282 35358
35962 35358 128215 266151 365671 438979 485900 497828 513693 595603 765115 962146 1034947
35951 1034947 837070 433389 140994 214135 526547 727426 674956 521683 400348 284666
35941 284666 205530 320177 613488 761555 516072 87170 -85526 122828 417643 503462
35931E03462j01425r6916k4851l2849o9573O89J58180K16287P0846j26297j43259
35920C54294J5586J11545J1283j39914j62660r1009l8852K4524J68729K82723
35910E36249J91929n2504k21338k27744j89306j70601q8697P8314J97004J78293
35900B31599J03267N9067M20j18425k02157j34977L4197J45231J27538N5312J7477
35889C18549M984n1552j53840j83014l1973K04020K75731R5062j10059r3475N5611
35878C30044N8069j12909j90696m1202J32723J21646J8384K7659J32565J53607
35868F29890N2773j8479L8360J28173R5446p9794k49516k45871o6830J05475J19313
35857E08940M6491N7638J41488J20443l8776j37533n5163N2012N207j11707j05699
$$ plain form
35931 503462 402037 305121 280270 247421 177848 178537 336717 553004 623850 497553 354294
35920 354294 369880 481425 492708 352794 190134 99125 60273 84797 253526 536249
35910 536249 728178 675674 454336 226592 37286 -133315 -222012 -143698 53306 231599
35900 231599 334866 393933 394353 275928 73771 -61206 -27009 118222 245760 301072 318549
35889 318549 323533 271981 118141 -64873 -96846 107174 382905 477967 367908 274433 330044
35878 330044 388113 275204 84508 43306 176029 297675 316059 343718 476283 629890
35868 629890 682663 664184 702544 830717 926163 846369 596853 350982 284152 389627 508940
35857 508940 555431 613069 754557 875000 836224 698691 643528 695540 700747 589040 483341
35846D83341J2455P3446K8100k6148n7159j32079k32800k16412j1597K57607L85503
35835E64257K66395k1367k55301k45908m8722P4077j2918j38899j06537j691j3330
35824F0056p5824J4659J91288J68933o9809j93980l7458J42732R8691k6244O073
35813B79117J11224O7422p1926q7357L338l050r6366n7282J28356J99046L8812
35802E11334j37436j40205o9310o2272l3162J23665K69435K08031M126j28196
35792E46010j56749k01092k38693j20888J14314K18993R8601l5926O706J22493
35782C53769J15247J4317o080O6010O0346r7629k57086k34054l3109J66660J96598
35771C44989N4682r3312q7139K9779N2906q6195j74746j2834K38359K33058m0870
$$ plain form
35846 483341 495796 569242 597342 571194 514035 381956 149156 -67256 -78853 178754 564257
35835 564257 830652 809285 553984 308076 259354 333431 320513 181614 75077 73386 60056
35824 60056 -15768 -1109 190179 359112 289303 95323 57865 200597 299288 273044 279117
35813 279117 390341 457763 385837 298480 301818 298768 202402 145120 273476 472522 511334
35802 511334 373898 233693 164383 102111 68949 192614 462049 670080 674206 546010
35792 546010 389261 188169 -50524 -171412 -57098 161895 260496 224570 231276 353769
35782 353769 469016 483333 477253 543263 603609 505980 248894 14840 -18269 148391 344989
35771 344989 399671 306359 219220 248999 301905 215710 40964 28130 266489 499547 458677
35760D58677j93699R102K81106K23735r2838k59179j44216l3799j18756j94477
35750f4344m3794J61194J18751r9988j27030J50674M06354L14746l9580l11741
35740D65242l02623r2026J25592K10004J40882K0865j9527K0178R706r9042j62912
35729C16339n9317R1657P7884q5321j69367o5667P4726Q1503j0696n7324m145
35718A90272R2302J53103J12917m3347k07194k04498j5078J56109J31336j249
35708C64673k8665P6928J46043P9847l4314q9803r2585q1130m5870L783K326n8693
35696B42540p3157K3874J17297N4846j09584j61195k9415R5949L3840j14736j00619
35685b0360J10023K67358J70462o9905j97692j46408p5700j13207k00529k13201
$$ plain form
35760 458677 264978 274080 555186 778921 686083 426904 282688 248889 130133 -64344
35750 -64344 -108138 53056 171807 71819 -55211 95463 501817 816563 776983 465242
35740 465242 162619 70593 196185 406189 547071 567936 548409 568587 578293 479251 316339
35729 316339 257022 348679 426563 341242 171875 106208 180934 262437 251741 194417 190272
35718 190272 282574 435677 548594 505247 298053 93555 78477 234586 365922 364673
35708 364673 336008 412936 558979 638826 604512 514709 422124 340994 295124 298907 301233 242540
35696 242540 169383 193257 310554 365400 255816 94621 65206 161155 194995 80259 -20360
35685 -20360 89663 357021 527483 457578 259886 113478 37778 -75429 -275958 -489159
35675d89159j19515K3848J50663K11432J82141R2127P880k9827k2496J5988N1632
35664G4714K7085n0980o7447L8783J23353K5261j32887q0741J47719J98394n9766
35653B43488k85611j61204J40354K50819J39477L5954P533l3264l5974R2486J86829
35642E80887J5591k67047k74443M406J78685Q6875L015R7858J58525M5989j4559
35631F15782J20147J83759l4054k54156j48193Q5959N0232j76151j91642K3767
35621B75450R2709q1691j42225R9959L20118J79783j56859k70759n5820K01587
35611D62252K17829O775j93431j86940j2598J12946N8079o8556q7633O014Q2515
35600C97252Q5451N5498P924n3076n3118M8515J27757N1996q6768r5671J5233
$$ plain form
35675 -489159 -608674 -584826 -434163 -222731 -40590 51537 59417 29590 7094 23082 74714
35664 74714 101799 50819 -16628 22155 145508 170769 37882 -42859 104860 303254 243488
35653 243488 -42123 -203327 -62973 187846 327323 363277 370810 337546 301572 394058 580887
35642 580887 596478 329431 54988 59394 238079 324954 327969 425827 584352 630341 615782
35631 615782 735929 919688 885634 631478 483285 569244 619476 443325 251683 275450
35621 275450 368159 286468 144243 244202 564320 744103 587244 316485 260665 462252
35611 462252 680081 686856 493425 306485 293887 406833 464912 396356 308723 314737 397252
35600 397252 482703 538201 546125 493049 439931 488446 616203 668199 581431 485760 500993
35589E00993P5851N3832N5504O1199n1613k12592j91468J7316J41494N3427m1745
35578D62198L8355J81621K13322J52097P4189m6572j90679k02672l8477Q8768
35568G32150L051j63544j80548m4020Q5672J21740O2599p6980j89699j10058J11054
35557C51417J75834k0674j58680L5375L18168K74894l7646j92509n2760Q0020
35547G73439j4580j86374k26981j58212r2387m8001j6702k4102m0563K811N9347
35536B7695L014j38834j75458l1744J38505J78849J08802K3267k9146j6531P5409
35525A63828J64851J36138R663r0117j32836j74188j66551j0458J85945J67782
35515B54057o9214k09471o9031J38173J48025K4785j1132O4140J25002J40801
$$ plain form
35589 500993 576844 630676 686180 747379 695766 483174 291706 309022 450516 503943 462198
35578 462198 500553 682174 895496 1047593 1121782 1075210 884531 681859 643382 732150
35568 732150 735201 571657 391109 347089 432761 554501 617100 540120 350421 240363 351417
35557 351417 527251 506577 347897 383272 701440 976334 938688 746179 693419 773439
35547 773439 758859 572485 345504 187292 94905 46904 30202 6100 -34463 -31652 27695
35536 27695 30709 -108125 -283583 -315327 -176822 2027 110829 134096 104950 88419 163828
35525 163828 328679 464817 474480 384363 251527 77339 -89212 -99670 86275 254057
35515 254057 184843 -24628 -93659 44514 192539 217324 206192 270332 395334 536135
35505E36135J40978O2396j27167k49694j16199J46922K25073O1296p2209R183
35495F16714J45427J01058q2473j63566m8789R5940R1773j9282p0082l6964p2014
35484E57742k27993l00361r4372K38231L40472J20256j38586j80217p0833N918
35474B50257L0971P2300J00694O7795M2550R2748J33730O3333m9720p9592m9851
35463F75215n4656p0085k8161J4246k1031n1617K5229R7746o05j59378j11550
35452C15353J22624K18220L1565j78579j29319J17398K97807K79745J27562k3882
35442A178494n5561N4515J63136R7040j00142k05465j37872n7903q8951j42456
35432G04835j11707m0860R229P1879J35427Q9644o1813j39385p5744m2410j27093
$$ plain form
35505 536135 677113 739509 612342 362648 246449 393371 618444 679740 607531 616714
35495 616714 762141 863199 780726 617160 568371 664311 756084 736802 666720 629756 557742
35484 557742 329749 29388 -64984 173247 513719 633975 495389 315172 244339 250257
35474 250257 281228 353528 454222 522017 564567 657315 791045 854378 804658 725066 675215
35463 675215 620559 550474 522313 536559 515528 463911 489140 586886 586281 426903 315353
35452 315353 437977 656197 687762 509183 379864 497262 795069 1074814 1202376 1178494
35442 1178494 1122933 1177448 1340584 1437624 1337482 1132017 994145 936242 847291 704835
35432 704835 593128 552268 561497 633376 768803 858447 796634 657249 581505 539095 412002
35421D12002j38212M9035K10581J24805l2253R454J26657L6949j41793o0267K05414
35410H02372K11305r2666k17503P0624L38687J71208j84318k49721m3630P1054
35400H77412J9820J9075Q5868K4943j27666r8023J33103K30302K2542k08903j35535
35389H42938J70075L68292K64531n3338l48363l95295j45615J71358K46698O9659
35379A190940n0819P1451K28837J40405j26138k54925j06276J51784K86009K13037
35369A744305R789j54029j26722O3839J97983J19209n5055r2626M7424K00148
35359A954265K29280J34502k5357j63829j61933N673J64460J23679n0386j13787
35349B096567J1890J58998J88719J57213J64502K11184K63558L09026K96924J76081
$$ plain form
35421 412002 273790 322825 533406 658211 625958 635412 762069 799018 657225 596958 802372
35410 802372 1013677 921011 703508 774132 1112819 1284027 1099709 849988 806358 877412
35400 877412 897232 916307 1002175 1027118 899452 801429 934532 1164834 1187376 978473 842938
35389 842938 1013013 1381305 1645836 1592498 1244135 848840 703225 874583 1121281 1190940
35379 1190940 1140121 1211572 1440409 1580814 1454676 1199751 1093475 1245259 1531268 1744305
35369 1744305 1754094 1600065 1473343 1537182 1735165 1854374 1799319 1706693 1754117 1954265
35359 1954265 2183545 2318047 2292690 2128861 1966928 1972601 2137061 2260740 2210354 2096567
35349 2096567 2108457 2267455 2456174 2613387 2777889 2989073 3252631 3561657 3858581 4034662
35339D034662L4672L6033J62550K03189O8019o9179l6092J08405K14589K38019
35329D994867J86881N7820n4659J4346K18396K66122N4875j01220O6347L18473
35319F022248K52979n6841j79160n851J21826N537j18239k1999J40879J27918
35309F289297L38k2920P5147J29025O1774n5712j46472j79381j36672m5928R271
35298E977767m146j8956O868N068q1832j85265k09737j76779j84714k73540l83516
35287D471218m03236k53837p928R8496q1929l55830l86432j59456n590r3643j94661
35276B627172j01380K0839m4681j54396n1690J51264J20257j49688l07107j75394
35266A935196L0272P9071J5889k5314m4187q1635j01294q3589q4030j06978o9532
$$ plain form
35339 4034662 4069334 4105367 4267917 4471106 4539125 4469946 4433854 4542259 4756848 4994867
35329 4994867 5181748 5239568 5184909 5199255 5417651 5683773 5738648 5637428 5703775 6022248
35319 6022248 6275227 6218386 6039226 6033375 6155201 6160738 6042499 6020500 6161379 6289297
35309 6289297 6289635 6266715 6341862 6470887 6532661 6476949 6330477 6151096 6014424 5968496 5977767
35298 5977767 5973621 5954665 5961533 5966601 5884769 5699504 5489767 5312988 5128274 4854734 4471218
35287 4471218 4067982 3814145 3806217 3904713 3822784 3466954 3080522 2921066 2915476 2821833 2627172
35276 2627172 2525792 2546631 2501950 2347554 2295864 2447128 2567385 2417697 2110590 1935196
35266 1935196 1965468 2044539 2060428 2035114 1990927 1909292 1807998 1724409 1640379 1533401 1463869
35255A463869L3059P9892J8733m7042m4206m1857q8144r9747k6326L1058l542
35244A275747l2663L3232P9051l9868k13111j78597J00284L44020K89449p326
35234A650218k57846k60035p3517R5283J27156P4004K6414j2026n2733j9262J33014
35223A430670K44202J03054k10122l58887k07105r868j0043p5294L7008K38814
35213A182429K38584K0646j26183o5706Q167o0643j19250K3429K48396K72872
35203A622741O2085j15683n3945J31593J75676P772j70543j44491N3066J90818
35193A759089J18129q2040k29903k49576j77800n7204P3665J30577N2086q0307
35183A256716j06927m045O9821o190j34955j20953P0760K53022K22014j1446k16880
$$ plain form
35255 1463869 1496928 1576820 1595553 1548511 1504305 1462448 1374304 1274557 1248231 1279289 1275747
35244 1275747 1243084 1276316 1355367 1315499 1102388 923791 1024075 1368095 1657544 1650218
35234 1650218 1392372 1132337 1058820 1154103 1281259 1355263 1381677 1369651 1316918 1297656 1430670
35223 1430670 1674872 1777926 1567804 1208917 1001812 991944 981901 906607 943615 1182429
35213 1182429 1421013 1441659 1315476 1249770 1257937 1197294 1078044 1101473 1349869 1622741
35203 1622741 1684826 1569143 1515198 1646791 1822467 1830239 1659696 1515205 1568271 1759089
35193 1759089 1877218 1795178 1565275 1315699 1137899 1080695 1154360 1284937 1337023 1256716
35183 1256716 1149789 1145744 1215565 1209375 1074420 953467 1024227 1277249 1499263 1487817 1270937
35172A270937j80524N5874K32014J72666l137n3416N2925J07069j9935j76949
35162A457524j47683L6557J40667N3591o6953j6097J88964L32724K51458l224
35152B227528k33507k73573j04060J50576L11176K69767P1368j28853k02123j34470
35142A953829M793J27678J49365K8357j51424k07854o4819J21466J51753N0099
35132B163243p841N723m3990j47543r0728J68168L07054O7183k95421k91244J28705
35121A963309M90996M27603J02437j00784p7051k730L850K687N2540R2254M2749
35110B997860o6703j24003n6849R2991K12142K22383J33333k683j38047k10866
35100C059558j54470L669J17786R4324K6904M2730P9612j3402j88031k24200p3296
$$ plain form
35172 1270937 1090413 1146287 1378301 1550967 1547830 1494414 1547339 1654408 1634473 1457524
35162 1457524 1309841 1346398 1487065 1540656 1473703 1457606 1646570 1979294 2230752 2227528
35152 2227528 1994021 1720448 1616388 1766964 2078140 2347907 2419275 2290422 2088299 1953829
35142 1953829 1958622 2086300 2235665 2264022 2112598 1904744 1839925 1961391 2113144 2163243
35132 2163243 2155402 2161125 2117135 1969592 1878864 2047032 2354086 2421269 2125848 1834604 1963309
35121 1963309 2454305 2881908 2984345 2883561 2806510 2803780 2807630 2810317 2862857 2955111 2997860
35110 2997860 2931157 2807154 2750305 2843296 3055438 3277821 3411154 3408471 3270424 3059558
35100 3059558 2905088 2908757 3026543 3120867 3147771 3190501 3270113 3256711 3068680 2844480 2771184
35089B771184M5068k7272j63356j79754j03682m9437J1333J49208K57330J66821
35079B877443n6503j51675j6676J61750J79860O5854j4514J2562Q0917J03632
35069C242650O3388j003n5391j02776j45717j31136K433J95936K73244J47714
35059C489342m5978j22389q2710n9156p6634l5242P2438J04043r216j22589o1675
35048C050234J38428K75081K16132K3095j36410j45966k8180R1218J20020R9502
35038C703154J26779J91471J79944O2809l2053l435O4231L5517n2642m7030O3770
35027D292515J09358j429j26749j00458J3704K0331j09735k06506j71090j05288
35017C614653j00501n9085J28586L37837L34756J18596n2235n902J40261J84396
$$ plain form
35089 2771184 2816252 2788980 2625624 2445870 2342188 2292751 2304084 2453292 2710622 2877443
35079 2877443 2820940 2669265 2652589 2814339 2994199 3060053 3045539 3058101 3139018 3242650
35069 3242650 3306038 3305035 3249644 3146868 3001151 2870015 2872448 3068384 3341628 3489342
35059 3489342 3443364 3320975 3238265 3179109 3102475 3067233 3139671 3243714 3234498 3111909 3050234
35048 3050234 3188662 3463743 3679875 3702970 3566560 3420594 3392414 3483632 3603652 3703154
35038 3703154 3829933 4021404 4201348 4264157 4232104 4228669 4292900 4328417 4275775 4228745 4292515
35027 4292515 4401873 4400444 4273695 4173237 4186941 4207272 4097537 3891031 3719941 3614653
35017 3614653 3514152 3455067 3583653 3921490 4256246 4374842 4322607 4316705 4456966 4641362
35007D641362R4381l1028j17490j18592J3102K18131K93407J28218r2712j03451
34997D925328O5382J26180l7524j92083q4548K15325M26567M01419K32362Q2511
34987F160919L1437O3633J10528J04775N6275O0093J67885K75773K28079L8596
34977G297993q7321l234J79562K31718J07528q785K5896J24096J32632P7809R7110
34966H175004J83463J86629P8289J6795Q1030J37491R4313R5819K71629M45390
34956I765852L48178M4597j24518j3885J71965K28271J96168J75839J38072O5526
34946A0996065Q2796K65052M56406M62019L26421K46978K77550K90739K06720
34937A3610746J05969J05544K26485L87245M64310L92110K63838K66447M35522
$$ plain form
35007 4641362 4735743 4704715 4587225 4468633 4481735 4699866 4993273 5121491 5028779 4925328
34997 4925328 4990710 5116890 5079366 4887283 4802735 5018060 5444627 5846046 6078408 6160919
34987 6160919 6192356 6255989 6366517 6471292 6527567 6587660 6755545 7031318 7259397 7297993
34977 7297993 7210672 7207438 7387000 7618718 7726246 7717461 7743357 7867453 8000085 8077894 8175004
34966 8175004 8358467 8545096 8623385 8640180 8721210 8858701 8953014 9048833 9320462 9765852
34956 9765852 10114030 10158627 10034109 10020224 10192189 10420460 10616628 10792467 10930539 10996065
34946 10996065 11078861 11343913 11800319 12262338 12588759 12835737 13113287 13404026 13610746
34937 13610746 13716715 13822259 14048744 14435989 14900299 15292409 15556247 15822694 16258216
34928A6258216N68701N04847L83663M37808O02472N92064L73776K73192M86778
34919B0481517P53788P40421N59531N98354R05322J097513R44192P19576P80395
34910B7580609J035279J119432R64416Q66480J005769J224835J364498J508299
34902C6669617J719814J813421J657296J506781J701031K126441K341877K234133
34894E1770411K185346K492890K957680L237195L335515L486152L734230L932455
34886G7131874M077465M366758M891640N484449N951789O331743O830440P558977
34878A22625135Q407020R188519R882966J0670076J1682630J2804562J3841775
34871A99102683J4837492J6012195J7382495J8693440J9816811K0934669K2130090
$$ plain form
34928 16258216 16826917 17331764 17715427 18153235 18755707 19347771 19721547 19994739 20481517
34919 20481517 21235305 21975726 22535257 23133611 24038933 25136446 26080638 26800214 27580609
34910 27580609 28615888 29735320 30699736 31566216 32571985 33796820 35161318 36669617
34902 36669617 38389431 40202852 41860148 43366929 45067960 47194401 49536278 51770411
34894 51770411 53955757 56448647 59406327 62643522 65979037 69465189 73199419 77131874
34886 77131874 81209339 85576097 90467737 95952186 101903975 108235718 115066158 122625135
34878 122625135 131032155 140220674 150103640 160773716 172456346 185260908 199102683
34871 199102683 213940175 229952370 247334865 266028305 285845116 306779785 328909875
34864C28909875K3049953K3272816K2837887K2056859K0889613J8894139J5820697
34857D75731839J1898966P447869K554254k661128p738618j2134503j5671704
34850D59426975j8515035k0770908k2323194k3054000k3046572k2521096k1675450
34843C07520720k0636421j9494519j8313492j7104187j5833296j4506286j3241558
34836A88390961j2193422j1361359j0557869r653322q774390q123475p660253
34829A20066871p150175o522420n966206n611241n318519m911212m443846m076964
34821G6066288l803648l488767l121369k843514k727586k674192k564359k402721
34813E2440132k261028k152699k022093j836379j650163j560322j584632j604054
$$ plain form
34864 328909875 351959828 375232644 398070531 420127390 441017003 459911142 475731839
34857 475731839 487630805 495078674 497632928 494971800 487233182 475098679 459426975
34850 459426975 440911940 420141032 397817838 374763838 351717266 329196170 307520720
34843 307520720 286884299 267389780 249076288 231972101 216138805 201632519 188390961
34836 188390961 176197539 164836180 154278311 144624989 135850599 127727124 120066871
34829 120066871 112916696 106394276 100428070 94816829 89498310 84587098 80143252 76066288
34821 76066288 72262640 68773873 65652504 62808990 60081404 57407212 54842853 52440132
34813 52440132 50179104 48026405 46004312 44167933 42517770 40957448 39372816 37768762
34805C7768762j478998j232145j050461j068038j201334j249031j117189r00972
34797B8470594p72995q23322r78203j055428r40883p21819n86205n86580o02751
34788B1402408n63129n60123o50724o79957m76858j59530m6847k54000n45013
34779A7466227o39260n21032l64411k77120k46815k67231l60797m71827m74619
34770A3843115l50758k61972l48254n06731m96629k67175n1195p1737k64847l96080
34760A0827737l70858k92740k55727k34613j89011j33072p0405J0314M1777p5871
34750I257531k81914l64859k50849j20114j15082j08554M4529J77549J4638l56937
34740G895938n26014l14880j4923N1638m8764p0860j3599n9554j90953j72274
$$ plain form
34805 37768762 36289764 35057619 34007158 32939120 31737786 30488755 29371566 28470594
34797 28470594 27697599 26874277 25896074 24840646 23899763 23177944 22591739 22005159 21402408
34788 21402408 20839279 20279156 19628432 18948475 18471617 18312087 18265240 18011240 17466227
34779 17466227 16826967 16305935 15941524 15664404 15417589 15150358 14789561 14317734 13843115
34770 13843115 13492357 13230385 12882131 12375400 11878771 11611596 11560401 11488664 11223817 10827737
34760 10827737 10456879 10164139 9908412 9673799 9484788 9351716 9281311 9291625 9333402 9257531
34750 9257531 8975617 8610758 8359909 8239795 8124713 8016159 8060688 8238237 8252875 7895938
34740 7895938 7369924 7055044 7040121 7091759 7042995 6972135 6958536 6898982 6708029 6535755
34730F535755N2155K07719O4187k23593l23832j71561j1688k7868j22562j23410
34720E855302n2197n8809j60333j95656o0131J21539J29393q2122l18669l62338
34710D815979k06129l0041L5395M7213J16930K11248J84716l034k10564k85884
34700D675829k25025j15664j1050P1701J01553O7412J7657k432q960k2524k0925
34689D527572j1107o0461j69899k13447j20174j7392m5670j25524r3058P504r994
34678C668350j46745j94296n3615J35499K14737J59620n665k27760l34707j71190
34668C044228J27150K46761J39768O8089J26915P6191j82057l27370j13117J73432
34658C379990J14517j92840k99468q2725J43910J51252M2551l3034p4349p9323
$$ plain form
34730 6535755 6587910 6795629 6859816 6636223 6312391 6140830 6129142 6101274 5978712 5855302
34720 5855302 5803105 5744296 5583963 5388307 5328176 5449715 5579108 5496986 5178317 4815979
34710 4815979 4609850 4579809 4615204 4662417 4779347 4990595 5175311 5172277 4961713 4675829
34700 4675829 4450804 4335140 4324090 4395791 4497344 4564756 4582413 4579981 4571021 4548497 4527572
34689 4527572 4516465 4456004 4286105 4072658 3952484 3935092 3889422 3763898 3670840 3678344 3668350
34678 3668350 3521605 3327309 3273694 3409193 3623930 3783550 3777885 3550125 3215418 3044228
34668 3044228 3171378 3418139 3557907 3625996 3752911 3829102 3647045 3319675 3206558 3379990
34658 3379990 3494507 3301667 3002199 2919474 3063384 3214636 3257187 3224153 3149804 3070481
34648C070481P705J26008J15809l0349j41803j35962j06322j14482j01068l6266
34638B653751L5837J16622K17777K24958M1091j50591o8678J95630K31823p1894
34628C426326l18380j86889R8736J42382m4804j41137k2357J30512J50197N4262
34618C288848o8990j48996j31244l4002L0661K914l1432K418L1912r286k2038
34607B910765Q4942J76852O7303j57304k19622m2085J58000J83957Q0818o404
34597C237222l5885n7175j02658j57409j80457j32892l5793R269p2022k08319
34587B263881k48626j44574J608O7849L1756l2471k8561P0283J66603J22726n2301
34576B218173j68730q4336J02358J83124J02498k1441q4847p8567j6587P6833
$$ plain form
34648 3070481 3078186 3204194 3320003 3289654 3147851 3011889 2905567 2791085 2690017 2653751
34638 2653751 2689588 2806210 3023987 3248945 3290036 3139445 3070767 3266397 3498220 3426326
34628 3426326 3107946 2921057 3019793 3162175 3117371 2976234 2953877 3084389 3234586 3288848
34618 3288848 3219858 3070862 2939618 2905616 2936277 2939191 2907759 2910177 2942089 2932803 2910765
34607 2910765 2995707 3172559 3239862 3082558 2862936 2820851 2978851 3162808 3243626 3237222
34597 3237222 3201337 3144162 3041504 2884095 2703638 2570746 2534953 2544222 2472200 2263881
34587 2263881 2015255 1870681 1872289 1940138 1971894 1939423 1910862 1981145 2147748 2270474 2218173
34576 2218173 2049443 1965107 2067465 2250589 2353087 2331646 2246799 2168232 2151645 2228478
34566B228478J17460L3382j00302j21572l429R3401L0139j37157k42812k06286
34556A691302r4522k1491j6854m10R0567J60553M0440k36756l73484j59536K05365
34545A285174L31496J42525o1088o2117n463r8294k43604j93714L2466J37610
34535A264991k4634k19763j52300J15029K39365O7666j60622j60074O894N4890
34525A031442q5950j87269j00706K0720J310o2614J3189J64504J72827K8808n5590
34514I40671L893N2073j6779r0149n7430K474j0566k5523O5233K00485K41427
34503A305809J78764R3141r642j52760k42965j69534k5120j7672j39812j41543
34493F78666Q7953L15118K81813O8562n1631j3776J0691n4711p6895K1101R5904
$$ plain form
34566 2228478 2345938 2379320 2279018 2157446 2154017 2247418 2277557 2140400 1897588 1691302
34556 1691302 1596780 1575289 1558435 1558025 1648592 1809145 1849585 1612829 1239345 1079809 1285174
34545 1285174 1616670 1759195 1698107 1635990 1630527 1532233 1288629 1094915 1127381 1264991
34535 1264991 1240357 1020594 868294 983323 1222688 1290354 1129732 969658 976552 1031442
34525 1031442 945492 758223 657517 678237 679547 616933 630122 794626 967453 996261 940671
34514 940671 944564 996637 979858 889709 832279 834753 824187 798664 863897 1064382 1305809
34503 1305809 1484573 1577714 1568072 1415312 1172347 1002813 977693 960021 820209 678666
34493 678666 766619 1081737 1363550 1432112 1380481 1366705 1377396 1322685 1245790 1266891 1362795
34482A362795L649j69555k36155j60706m7740L8695R4627P7040n0972j97142k14219
34471E00317r8879J5601O0539Q2603R2473L1951o6742n7352R9369K27688J56126
34460A043694n0099j71498q0175J63912L85920M07611J77331j39412k78182j48235
34450A310867Q6338K31904K57401K14653J18204K740l8999O67j0943j23582j57114
34439A892136M3478L11574L37243J01297q6323j263K28321L32531K39653J12307
34429C510954J09716K02006K35603J49821O3345R4580J65613J21103J1975O0883
34419D725599L02797M78021L96423K08613J54723K13860J96339N9355o6021q6299
34409F583410k9601J4882n3164k41621l49489j52941K05918K95888J5818j98655
$$ plain form
34482 1362795 1366444 1196889 960734 800028 752288 790983 885610 962650 911678 714536 500317
34471 500317 401438 417039 477578 560181 652654 684605 617863 560511 659880 887568 1043694
34460 1043694 993595 822097 741922 905834 1291754 1699365 1876696 1737284 1459102 1310867
34450 1310867 1397205 1629109 1886510 2101163 2219367 2222107 2183108 2183775 2172832 2049250 1892136
34439 1892136 1935614 2247188 2584431 2685728 2599405 2598142 2826463 3158994 3398647 3510954
34429 3510954 3620670 3822676 4058279 4208100 4271445 4366025 4531638 4652741 4664716 4725599
34419 4725599 5028396 5506417 5902840 6111453 6266176 6480036 6676375 6735730 6669709 6583410
34409 6583410 6553809 6568691 6515527 6273906 5924417 5771476 5977394 6273282 6289100 6090445
34399F090445l2793K11598J41256p0981m7644Q0437o5827l44053k74590P9838
34389E767686J51431j59515k92365J058K16055l5191l64080k74002M2474J00080
34379E153631q5866j47043k6549K5350n3309j07953j24558k18132l44002l54861
34369C716708k70383k09812j56661m9296J8946n1212j47614j27525o8338r1245
34359B563568j08008r678P7140R913q5805n6536l3521j59654k28223j0514K52876
34348B211558J69311j39004k10147o240O1458j22491j94929L102J25381o1405
34338A836594k48917r8561K00909K49859M4960r1408k9508M7275k1025j66158
34328A724020k25699j34346K2564Q5833j3224j52482j60530m4818M5454O4132
$$ plain form
34399 6090445 6057652 6269250 6410506 6339525 6291881 6372318 6306491 5962438 5687848 5767686
34389 5767686 5919117 5759602 5467237 5468295 5684350 5649159 5285079 5011077 5053551 5153631
34379 5153631 5067765 4920722 4894173 4919523 4866214 4758261 4633703 4415571 4071569 3716708
34369 3716708 3446325 3236513 3079852 3030556 3049502 2998290 2850676 2723151 2654813 2563568
34359 2563568 2455560 2445882 2523022 2532935 2447130 2390594 2357073 2197419 1969196 1958682 2211558
34348 2211558 2380869 2241865 2031718 2025478 2086936 1964445 1769516 1772618 1897999 1836594
34338 1836594 1587677 1489116 1690025 1939884 1984844 1893436 1863928 1911203 1890178 1724020
34328 1724020 1498321 1363975 1386539 1472372 1459148 1306666 1146136 1101318 1146772 1210904
34318A210904J01968J70702J54233K2913r3176j11015j00886j17972r9162j2008
34308A126501M6286o231j06046j32157m0245J16481K14438J30407r8951k43452
34298A007031j61660l5502j01186k29286r0095K73185M07214R2526l09783l44788
34288E07656m0187K19496K10212M3192o9306m1286N6342R7026M6680j565l288
34277A024972p6452k76034l76999j59641J70877K08780k5978r6466J55287L61196
34267I09542K31763j8933r1423o1609j25728k03642j22115N1221J56327K05352
34257I30755K32818J22214j35123k58874p9149J16928p282k89535l13828m7018
34247B71906J66010J42441K1380n0326n0544M1898J91846K05549r008j85169m1016
$$ plain form
34318 1210904 1312872 1483574 1637807 1660720 1567544 1456529 1355643 1237671 1138509 1126501
34308 1126501 1172787 1166556 1060510 928353 888108 1004589 1219027 1349434 1250483 1007031
34298 1007031 845371 809869 708683 479397 389302 662487 1069701 1162227 852444 507656
34288 507656 467469 686965 897177 940369 871063 829777 886119 983145 1029825 1028260 1024972
34277 1024972 948520 672486 295487 135846 306723 515503 489525 393059 548346 909542
34267 909542 1141305 1122372 1030949 969340 843612 639970 517855 569076 725403 930755
34257 930755 1163573 1285787 1150664 891790 812641 929569 922287 632752 318924 271906
34247 271906 437916 580357 601737 551411 500867 542765 734611 940160 931152 745983 704967
34236G04967K33186K23720n3948j89906m1476J00532N3206n694N5486Q1111l2718
34225A128466j17844m8156L1582j7642r6722r7378j05389j86167k10581r4052
34215A86117J4653j0632l9464P2053J96866J42023j6393o3475n22n524r8977j10065
34203B66660K1406J38600J15634L0997P639J2630o3510j88922j88306N437J95419
34192C53684J30464j48501l12453j51552J53501K77121J51776k4877r5270p0694
34182B63199o277O3267Q3019M0536L6172J22072J39884n5982k78454k06125J10617
34171C11928K74289J22570o4246n4560k188q4363j37617M2233K84034K69485K6658
34160I88223j36287j01664l3468m4466p3547r4181j62956k20818j05614J56931
$$ plain form
34236 704967 938153 1161873 1107925 918019 876543 977075 1030281 1024587 1080073 1161184 1128466
34225 1128466 1010622 962466 994048 976406 879684 782306 676917 490750 280169 186117
34215 186117 200770 190138 150674 222727 419593 561616 545223 481748 481226 475702 376725 266660
34203 266660 288066 426666 542300 573297 580936 593566 530056 341134 152828 158265 353684
34192 353684 484148 335647 23194 -128358 25143 302264 454040 429163 333893 263199
34182 263199 256922 320189 403208 443744 479916 601988 741872 685890 407436 201311 311928
34171 311928 586217 708787 644541 589981 587793 503430 365813 408046 692080 961565 988223
34160 988223 851936 750272 716804 672338 598791 504610 341654 120836 15222 172153
34150A72153L00580J71120m7728r0405M6863J57012J16466j5424j30348j60852
34140E19437o1590J51877L21267K39597q8250l68346l13674K2399L18415L64751
34130A105883K37383R2735l2976j41165j54672l4140R4832Q8399j3719p9959j03577
34119A059024j58787k07052j42686J717Q6879Q1470O0024K4028o1864r3877N1537
34108G00413K32496J71597r2597k01640j6021J67164Q7448j03783j56515j23292
34098F65270j69013k09456o4959J66321K10965L3447j32381j39855p5519m9043
34088B35777m5588j4983M2352J00364J23700Q0470J2402K5079J26874J75274Q1141
34077I42862n0839r8256j00379j25038j09072m902O3925k3n2798P4774K63479
$$ plain form
34150 172153 472733 643853 596125 505720 552583 709595 826061 810637 680289 519437
34140 519437 457847 609724 930991 1170588 1082338 713992 400318 422717 741132 1105883
34130 1105883 1343266 1436001 1403025 1261860 1107188 1073048 1167880 1256279 1242560 1162601 1059024
34119 1059024 900237 693185 550499 552216 639095 720565 780589 804617 742753 648876 700413
34108 700413 932909 1104506 1011909 810269 794248 961412 1048860 945077 788562 665270
34098 665270 496257 286801 221842 388163 599128 632575 500194 360339 284820 235777
34088 235777 190189 175206 217558 317922 441622 522092 534494 559573 686447 861721 942862
34077 942862 892023 793767 693388 568350 459278 454376 518301 518278 465480 540254 803733
34066H03733K64651Q2115p0074j19564j65671k06247j32642N655J9822j00912
34056C80866j51745m0815Q2646Q3154O006n9092q0309k0306J20635J82370K053
34045E05463k79051l24028o8977J82175K05384J20300R8126R2408K4657k1781
34035E34676N582l5064k28870l76931k57146L0572K10879K07715J43648O5372
34025C00433p7961k25851k18636m0578J29473J45369M4408m6374m8938L0246J19112
34014A10703J34191P2732K0998K4677K4615j0625N234J15303J74627M0258j62004
34003E50709j71146J9485J28007m573j75858j20690J07204K25430J12991p4021
33993E97538j61323j51833j14519l8610Q7967J67754J14730K4749N2456J42474
$$ plain form
34066 803733 1068384 1150499 1080425 960861 795190 588943 456301 461956 481778 380866
34056 380866 229121 188306 270952 354106 360112 301020 220711 200405 321040 503410 505463
34045 505463 226412 -97616 -166593 15582 220966 341266 439392 531800 556457 534676
34035 534676 540258 505194 276324 -100607 -357753 -327181 -116302 91413 235061 300433
34025 300433 222472 -3379 -222015 -262593 -133120 12249 56657 10283 -38655 -8409 110703
34014 110703 244894 317626 338624 363301 387916 377291 382525 497828 672455 712713 550709
34003 550709 379563 399048 527055 522482 346624 225934 333138 558568 671559 597538
33993 597538 436215 284382 169863 131253 219220 386974 501704 526453 578909 721383
33983G21383Q7111j19913k19666q1374P4008K5579q7396k0785J30118Q6143j02937
33972D92271r6309J65523L24956J67713m9157l8208O8432o400j99485k25424m4275
33961E59637J07150R5766K8068J7959N1848R4327J33521J09064l5153k14665k71296
33950F76226j82498o9279n918L7085P5391Q9317J12753J87090K30748J25265n9563
33939A216617j14780n746N8788m7966j63527q5841J17249K12257J21995k2687
33929A286359j04007j26767j13472m3368O2899J16314Q1807M2099O7941R6618
33919A366423L4309p0393p8540K1214Q3166L1739k0967K7138Q4041K0951q7587
33908A411494p2428L5427M4034n8735m3813J97707M45719M42390K34672P7426
$$ plain form
33983 721383 808494 688581 468915 387541 461549 487128 399732 378947 509065 595208 492271
33972 492271 395962 561485 886441 1054154 1004997 966789 1035221 1028821 829336 603912 559637
33961 559637 666787 762553 790621 808580 860428 954755 1088276 1197340 1162187 947522 676226
33950 676226 493728 424449 418531 455616 531007 620324 733077 920167 1150915 1276180 1216617
33939 1216617 1101837 1096091 1154879 1106913 943386 857545 974794 1187051 1309046 1286359
33929 1286359 1182352 1055585 942113 898745 961644 1077958 1159765 1201864 1269805 1366423
33919 1366423 1400732 1330339 1251799 1273013 1356179 1387918 1366951 1394089 1478130 1499081 1411494
33908 1411494 1339066 1374493 1418527 1359792 1315979 1513686 1959405 2401795 2636467 2713893
33898B713893J11924K77120M37093M68290L24390J43018J75096M66751P34088
33889E851663P22420N62912N59529P34128Q54243Q56194R27436J125761J206890
33880A3401176R59153M97346P5912k33595n24576q23988j038584j096230j030597
33871A0186017r32269q71948q56788q32886p50118o23920m95267l54834j84562
33862D283425n6600q0211k32498l49117l23142k20159j51070j22824q0291k0802
33852B646711J4921K2909K6503N10j17274l06050m02778k47007Q5094K75761J06455
33841B105755k32324l30662p8579J92697J73478k3552r3470O634P5969L3150j1790
33830A817306j0589l8976r6823q6360k1785l7395j42482j81897r5726j2010j7696
$$ plain form
33898 2713893 2825817 3102937 3540030 4008320 4332710 4475728 4650824 5117575 5851663
33889 5851663 6574083 7136995 7696524 8430652 9284895 10141089 11068525 12194286 13401176
33880 13401176 14360329 14857675 14933587 14699992 14175416 13351428 12312844 11216614 10186017
33871 10186017 9253748 8381800 7525012 6692126 5942008 5318088 4822821 4467987 4283425
33862 4283425 4226825 4146614 3914116 3564999 3241857 3021698 2870628 2747804 2667513 2646711
33852 2646711 2661632 2684541 2711044 2711554 2594280 2288230 1885452 1638445 1723539 1999300 2105755
33841 2105755 1873431 1542769 1464190 1656887 1830365 1806813 1713343 1719977 1795946 1829096 1817306
33830 1817306 1806717 1767741 1670918 1584558 1562773 1525378 1382896 1200999 1105273 1093263 1075567
33819A075567l8092j2998N811N176N7070J38599J15782q144n2280L3752O3568
33808A383811n3086j28228k6425P3112k1326j69403j29715M1791J20895J04840
33798A196266J53072K25841J20745j42177k89170j95161m8003l2784q2419m8350
33788H57860O0021J24899R4005J2176m8979m3671P182J6762o1991j49010j36655
33777G32599m5865J5778J8231J8398L5993M1601M5548P9335J14594J17934J42059
33766A316205K23898K46070Q0102j60405k16045m8285R2117J9391j46387j79716
33756A226945m5174J10783J66892J33147R6511J09423J14496M483j99394l05678
33746A412434j88276K4360J34404J45663J56263R1513j72728m72413m76461j75582
$$ plain form
33819 1075567 1037475 1024477 1030288 1035464 1092534 1231133 1346915 1338771 1286491 1320243 1383811
33808 1383811 1330725 1202497 1176072 1249184 1227858 1058455 928740 970531 1091426 1196266
33798 1196266 1349338 1575179 1695924 1553747 1264577 1069416 1021413 988629 906210 857860
33788 857860 917881 1042780 1136785 1148961 1099982 1056311 1063493 1080255 1018264 869254 732599
33777 732599 686734 702512 720743 739141 775134 816735 862283 941618 1056212 1174146 1316205
33766 1316205 1540103 1786173 1866275 1705870 1489825 1441540 1533657 1553048 1406661 1226945
33756 1226945 1181771 1292554 1459446 1592593 1689104 1798527 1913023 1917506 1718112 1412434
33746 1412434 1224158 1248518 1382922 1528585 1684848 1776361 1603633 1131220 654759 479177
33736D79177Q2226J17083J29165K57596K97999Q7961j54117j70240p3515r0391
33726I62944j24561M2522K84027K80186N8398m0414O7319Q3762j42956l45845
33716A125382k55445R717J61781J29970M2499l838J8352J21022K36248K15407
33706A801095L0968j34680j32775n9709p8759j47516j02970N7383J64356J16828
33696A514221k1954j46837j91945j13943O2658J92360J36514n5152k09873k58370
33686I07679k55000j98853l0591J67297J82964j8348j91490j49739l6796q4191
33676B92932k35895k40445m3663J50042J98958J79623J81125J49624K5868j18069
33666E40100j77366j40916n2655M3757P4439j4465j20627o1966J30680J84563
$$ plain form
33736 479177 561403 678486 807651 1065247 1363246 1451207 1297090 1126850 1053335 962944
33726 962944 838383 880905 1164932 1445118 1503516 1463102 1530421 1614183 1471227 1125382
33716 1125382 869937 879654 1041435 1171405 1213904 1210066 1228418 1349440 1585688 1801095
33706 1801095 1832063 1697383 1564608 1504899 1426140 1278624 1175654 1233037 1397393 1514221
33696 1514221 1492267 1345430 1153485 1039542 1102200 1294560 1431074 1375922 1166049 907679
33686 907679 652679 453826 423235 590532 773496 755148 563658 413919 377123 292932
33676 292932 57037 -183408 -227071 -77029 121929 301552 482677 632301 658169 540100
33666 540100 362734 221818 169163 212920 287359 272894 152267 90301 220981 405544
33656D05544k4213k46364k12201k8422K4295n3904l4883J04798J41837J2331o1018
33645B7800O6362K44925K96251K50252J80475L0229k19713l92764l24687j11044
33635D8086K4861J8409k4883j1770P5175K04796K72352J54155r7564k40610j54340
33624B68667k3964n4920j53932j03034P4713J68584J18291M7034L830p4053j58150
33613A13066j38731m7946l1912p4804J073K03408K88409J17361j22967j89959
33603A16998r3287J2132Q3688J68553K28301J66503K450j13933p1726P6147J61072
33592G36898O8107j15307j59398J7170J76783M5790k59064l19492P046L41027
33582E39560K72198r0979k88109j25393J12408P6455k08083m03005k71373N9974
$$ plain form
33656 405544 381331 134967 -77234 -105656 -81361 -135265 -170148 -65350 76487 88818 27800
33645 27800 94162 339087 635338 885590 1066065 1096294 876581 483817 159130 48086
33635 48086 72947 91356 66473 54703 129878 334674 607026 761181 663617 423007 268667
33624 268667 244703 189783 35851 -67183 7530 176114 294405 341439 345269 271216 113066
33613 113066 -25665 -73611 -105523 -180327 -179254 24154 312563 429924 306957 116998
33603 116998 23711 35843 119531 288084 516385 682888 685338 571405 499679 575826 736898
33592 736898 805005 689698 530300 547470 724253 770043 510979 191487 198533 539560
33582 539560 811758 720779 432670 307277 419685 496140 288057 -114948 -386321 -326347
33572c26347K67045K14498Q5275P9223J06179m7218l12565l63242r0057K06788
33562a80421K32356P7747N857N1951O8799K9971L2217P1515N9807K4910O4658
33551E39367J23849N0732j13834j39252M3877K07691J44359m7458j20064o471
33541F82796J39411J72636J07203L9884O453m3562j39986k04979j33001M2255
33531F69110J50670J03508J9023M9810J64831K09646J26633P409l1983O1567K55179
33520A785403M05139L47095J28902L9419K36168M59108L53046L520j39987J13774
33510C731587M47635M98674L10580J71129J95661K59323K33241J25123L2066N2356
33500F057375K02542L69902M07437L05676J90504J34946Q1313k3455j31811j73923
$$ plain form
33572 -326347 -59302 155196 240471 319694 425873 378655 66090 -297152 -387209 -180421
33562 -180421 51935 129682 135539 187490 256289 286260 318477 389992 449799 474709 539367
33551 539367 663216 713948 600114 460862 504739 712430 856789 809331 689267 682796
33541 682796 822207 994843 1102046 1141930 1148383 1104821 964835 759856 626855 669110
33531 669110 819780 923288 942311 992121 1156952 1366598 1493231 1500640 1468657 1530224 1785403
33520 1785403 2190542 2537637 2666539 2705958 2942126 3401234 3754280 3757800 3617813 3731587
33510 3731587 4179222 4677896 4988476 5159605 5355266 5614589 5847830 5972953 6005019 6057375
33500 6057375 6259917 6629819 7037256 7342932 7533436 7668382 7749695 7726240 7594429 7420506
33490G420506j33110k8998O9493L6155j55607k93701j48921J66253L01369J59574
33480G393013R715L3404O6350o1296k23687k48198k05598k13674j90456p0340
33470F289233m0369k48262m66034l94619j56712j08450k61042k98728j39979n8137
33460D116901j88957l13433k56559j57695j71641j91422p9143M7956j0805k16855
33450B578347l38104k46448l3587J18488R5842o5902k06563j99661r1423q197
33440A602792L4666R6139J23946M265j99543k75134j72531p5136r6096j21421
33430I21947m8120L6674L8811K2261M7359K3808j10380k16787j43300K9487R8739
33419G00499J7561q0045p0229N2645J94626K16752O1217j26563j33847J1224M8658
$$ plain form
33490 7420506 7287396 7258398 7327891 7364046 7208439 6914738 6765817 6932070 7233439 7393013
33480 7393013 7402728 7436132 7502482 7441186 7217499 6969301 6763703 6550029 6359573 6289233
33470 6289233 6248864 6000602 5534568 5139949 4983237 4874787 4613745 4315017 4175038 4116901
33460 4116901 3927944 3614511 3357952 3200257 3028616 2837194 2758051 2806007 2795202 2578347
33450 2578347 2240243 1993795 1960208 2078696 2174538 2108636 1902073 1702412 1610989 1602792
33440 1602792 1637458 1733597 1857543 1861808 1662265 1387131 1214600 1139464 1043368 921947
33430 921947 873827 910501 949312 971573 1018932 1042740 932360 715573 572273 601760 700499
33419 700499 718060 638015 567786 620431 815057 1031809 1093026 966463 832616 843840 892498
33408H92498j14939k38240j20829P2951P4861q0153j46453m0253J12668K04252
33398F16363K03367P9404j22827k20711j14249K4903k298r7701l5635J35284J46779
33387F12679o9009k86012l08222j54529O5034K34922K28262M5809q2455K5912
33377C12391J97245J50052l3787m3215J09367J01808j02617j45909J03060K80144
33367I28539J14370j29955j08013O1964P4661k2338K8404J93506K02231J9318
33357A362687j01809k6363R9461J11327K3498n3984l2622R6393J97416P6229k27797
33346A524436l79167j69963J50682K15809N4804l4067P090j6929j22923j07668
33336A122104M0639P7261o8795j57903n6358M5874o329o9268P107J00831N9016
$$ plain form
33408 892498 777559 539319 418490 491441 566302 486149 339696 299443 412111 616363
33398 616363 819730 899134 776307 555596 441347 466250 463952 366251 330616 465900 612679
33387 612679 543670 257658 -50564 -205093 -140059 94863 323125 368934 286479 312391
33377 312391 509636 659688 625901 582686 692053 793861 691244 545335 648395 928539
33367 928539 1042909 912954 804941 866905 941566 919228 947632 1141138 1343369 1362687
33357 1362687 1260878 1234515 1333976 1445303 1468801 1414817 1382195 1478588 1676004 1752233 1524436
33346 1524436 1145269 975306 1125988 1341797 1396601 1362534 1369624 1352695 1229772 1122104
33336 1122104 1162743 1240004 1171209 1013306 956948 1002822 996493 927225 934332 1035163 1094179
33325A094179k1552L774N4591J0028k1976R4651K05963O8529k21324l24100j58371
33314G84392N454j9071r7238n7996L7240M6834j6059m8485l1947j0135J7250O5836
33302F76075J01114R5910R2327J23873J37143P5345j5789n3949m6643o0493r8542
33291A026371j03590o7289m3640n4435o3442n1113m0004l7372k6950k7731p8563
33280D32242j44388j30246l0976K6234m2489j41461j26698j2255O0648K5127m6771
33269a31033o3427o03J13639K01837J47890p5235l00297l22770j63083k4113J5654
33258f01541P5286J97000K24860P3807r0609j10128q7034j73205k68296j80634
33248i40494K8614J38442J26721J44040J78798P4350j13263j18424R8357K46527
$$ plain form
33325 1094179 1072627 1076401 1130992 1141020 1119044 1213695 1419658 1488187 1266863 942763 784392
33314 784392 789846 770775 673537 615541 652781 699615 683556 635071 603124 592989 610239 676075
33302 676075 777189 873099 965426 1089299 1226442 1301787 1285998 1232049 1185406 1124913 1026371
33291 1026371 922781 855492 811852 757417 693975 642862 602858 565486 538536 510805 432242
33280 432242 287854 157608 126632 152866 110377 -31084 -157782 -170037 -109389 -84262 -131033
33269 -131033 -194460 -195063 -81424 120413 268303 193068 -107229 -429999 -593082 -617195 -601541
33258 -601541 -526255 -329255 -104395 -30588 -121197 -231325 -318359 -491564 -759860 -940494
33248 -940494 -911880 -773438 -646717 -502677 -323879 -249529 -362792 -481216 -382859 -136332
33238a36332J58359K6102K1297q2j69097k71540p0588K42226K78075K0301j84113
33227h5392j48939l0650J1710J8709L7006L807q1307r5424p7P9229O3056K5520
33215b02752J6276l1097j16829r8930O6750J87362R8903p0900q9159L6074R1895
33204a12407r760j24744r8914M5489J65027J41526k7915k09112k17953j4655K11558
33193b51860K43674R8945j8171q667J5317n0367j20606o1354P9677J21893J3840
33182F2321q8531n1195M2253K7671p4265q2418M9833J35108L7809r1931l7594
33171g0939J28272J30952q1160k36098j28921R9061J93532J26398M3616N451l7383
33160A72781q5673q9762p1243r3671j34820j22842p0072l2928K5535J69658L06235
$$ plain form
33238 -136332 22027 48129 69426 69344 -99753 -371293 -441881 -199655 78420 98721 -85392
33227 -85392 -234331 -264981 -253271 -234562 -197556 -193749 -275056 -370480 -370557 -291328 -228272 -202752
33215 -202752 -186476 -217573 -334402 -433332 -366582 -179220 -80317 -151217 -240376 -204302 -112407
33204 -112407 -122167 -246911 -345825 -300336 -135309 6217 -21698 -230810 -448763 -463418 -251860
33193 -251860 -8186 90759 72588 63921 79238 28871 -91735 -153089 -73412 48481 62321
33182 62321 -26210 -77405 -35152 -7481 -81746 -164164 -114331 20777 58586 -33345 -70939
33171 -70939 57333 188285 107125 -128973 -257894 -158833 34699 161097 204713 210164 172781
33160 172781 87108 -2654 -73897 -167568 -302388 -425230 -495302 -528230 -502695 -333037 -26802
33149b6802K53231J8841j69994j75810j15997j34182j71493j01721K7037N3260
33139e43630m8718j33641r6412K476M8735K6329J1937N5582J09525Q5955k4132
33128e05994j21472j17344n0445k2818l8300K445J30938K32185J84989Q469j77831
33117d75178k72866k32780p2841J07465J73881J01922J2390M027K6889n498o5964
33106f98553q0307o9396r5853j17133l3007J32957K29119J64905M465j31452j65747
33095h60002p8254P7183J74624J39696O1637P0496J25643P4534q4282j78917j40534
33084f18176j09604j83248k40489j47939J3007P6385K9442l1828p5496r9494l1956
33073a419396J39422K22681L2726k91134m11783k40205k8304J0230o1160j04337
$$ plain form
33149 -26802 226429 245270 75276 -100534 -216531 -350713 -522206 -623927 -596890 -543630
33139 -543630 -592348 -725989 -822401 -819925 -771190 -744861 -732924 -677342 -567817 -481862 -505994
33128 -505994 -627466 -744810 -795255 -818073 -856373 -853928 -722990 -490805 -305816 -297347 -475178
33117 -475178 -748044 -980824 -1053665 -946200 -772319 -670397 -658007 -653980 -627091 -632589 -698553
33106 -698553 -778860 -848256 -944109 -1061242 -1094249 -961292 -732173 -567268 -562803 -694255 -860002
33095 -860002 -938256 -861073 -686449 -546753 -485116 -414620 -288977 -214443 -298725 -477642 -618176
33084 -618176 -727780 -911028 -1151517 -1299456 -1286449 -1210064 -1180622 -1212450 -1287946 -1387440 -1419396
33073 -1419396 -1279974 -1057293 -1024567 -1315701 -1727484 -1967689 -1995993 -1985763 -2046923 -2151260
33063b151260j13761j12098n0255M8859L5732j18700k00776o4049J08783P6900
33053b540625p9722j23919q0082j56437l05108k41489M5205J77294o1400l85977
33043c752260m36692k69254j59323j54270j36619j56057l28581m94107l60337
33034f247500J2842K40457J79675J10038K33456L56369K73512J42154J88193L00411
33024d210393K60953J87551L45234O13397N78499J91372q4582O8010L63903L52076
33014a333980M8261j56878o7593J34223K23919J92223J45909J43334J79966K12434
33004b78182J68859L7996n2713K8020J96413K19211M4091r0302J9477K28081K16097
32993G37048o7346l12636k44501L0787J86891J12360K0881R7768K00329O6432
$$ plain form
33063 -2151260 -2265021 -2377119 -2427374 -2378515 -2342783 -2461483 -2662259 -2726308 -2617525 -2540625
33053 -2540625 -2620347 -2744266 -2824348 -2980785 -3285893 -3527382 -3482177 -3304883 -3366283 -3752260
33043 -3752260 -4188952 -4458206 -4617529 -4771799 -4908418 -5064475 -5393056 -5887163 -6247500
33034 -6247500 -6234658 -5994201 -5814526 -5704488 -5471032 -5114663 -4841151 -4698997 -4510804 -4210393
33024 -4210393 -3949440 -3761889 -3416655 -2803258 -2224759 -2033387 -2117969 -2049959 -1686056 -1333980
33014 -1333980 -1285719 -1442597 -1510190 -1375967 -1152048 -959825 -813916 -670582 -490616 -278182
33004 -278182 -109323 -71327 -124040 -96020 100393 319604 363695 273393 292870 520951 737048
32993 737048 669702 357066 112565 143352 330243 442603 463484 561252 761581 828013
32983H28013k50303l76841j18514K32177K52799n7984l03848k31695j0140Q9690
32973E3354O3325O9991J24540J07031J4200j1365Q5397J81741J61789N0061q5776
32962H14288k21715k95926j91486P2856K53863J52145j00917k02158q2405M7664
32952B46209N7274O5839J70621K31696J02223r2806j28686l0555r043r4035r8162
32941D20575L1165R3913k5238j44594q0222M6080J9197q9864l0619J94897K93137
32930G28427J13414j32266j93449j18112j03174j57724j20757M7748J95076K06324
32920D65507J41937R3400L8131p1809j74603j72108r0902m4848m7473L492J22300
32909B63024J61785M2527p0524J2410J82565J46780j27362l15331j82643Q1768
$$ plain form
32983 828013 577710 200869 82355 314532 567331 509347 205499 -26196 -36336 53354
32973 53354 116679 186670 311210 418241 432441 421076 506473 688214 850003 900064 814288
32962 814288 592573 296647 105161 178017 431880 584025 483108 280950 198545 246209
32952 246209 303483 369322 539943 771639 873862 781056 652370 621815 612772 518737 420575
32941 420575 451740 545653 520415 375821 295599 341679 360876 271012 240393 435290 728427
32930 728427 841841 709575 516126 398014 294840 137116 16359 64107 259183 465507
32920 465507 607444 700844 738975 667166 492563 320455 229553 184705 137232 140724 263024
32909 263024 424809 467336 396812 409222 591787 738567 611205 295874 113231 194999
32899A94999J50445J4585o9119N083Q4038N2724m035N778K6317j6142p6254p7378
32887B91041k7035K9245P2906Q0592L3719l801N0502J20547L3004j76643k30034
32876B74043j3620J89198Q3221j90123k52802l2249J84399J96079R7124K2752
32866E58022l7062r4874p8005J1321M7827k64L509J08965J46889N219j41566p6785
32854D53196J18597J90481R3070J7922O7574J15874K9173j36309k17676j29276
32844F02626O5261J95591J14584j30256k91085j92023L9025J45729R4987O2175
32834G06614R5795N4353p0814n2183J94374L71166J89154j67443k63415k5019
32824A032582J80892R3888j15338j70045p7949j9783l2227j7570K8922J1430p6496
$$ plain form
32899 194999 345444 360029 290910 295993 380031 432755 428720 434498 460815 444673 368419 291041
32887 291041 264006 293251 366157 446749 480468 476667 527169 647716 680720 504077 274043
32876 274043 260423 449621 532842 342719 89917 57668 242067 438146 535270 558022
32866 558022 520960 426086 348081 359402 407229 406965 410474 519439 666328 671547 529981 453196
32854 453196 571793 762274 855344 873266 940840 1056714 1085887 949578 731902 602626
32844 602626 667887 863478 978062 847806 556721 364698 403723 549452 644439 706614
32834 706614 802409 856762 785948 733765 928139 1299305 1488459 1321016 1057601 1032582
32824 1032582 1213474 1307362 1192024 1021979 944030 924247 892020 874450 903372 914802 838306
32813H38306j27218q5382j827P9938J60865K02839J42855K0290l5243J4009O2310
32802A271742M0766K1391O2634P7896k0792j46601j54214p0115m1251p6316j8532
32791I46608J83857L41267K55198j3032k14874k07172p7255N843j8023p4811p2589
32780A055017q159M6796N4640O7664J33953J78237O4230k03051m18261l75238
32770E95828q2627K57705M37869L73999J24574j41051k39290j28727M3714J15722
32760A357716R1917P3604N9633m1704k04163k50565r8026R6525J43079P0059L6049
32749A334124O2505K5586r4551j36765O10J80476J98491M7017j13927j95287k46267
32738A062012k88570k34919m1793J62071K04396Q1339n4186r7867r3208j13797
$$ plain form
32813 838306 711088 625706 623879 703817 864682 1067521 1210376 1230666 1195423 1209432 1271742
32802 1271742 1312508 1333899 1396533 1474429 1453637 1307036 1152822 1082707 1041456 965140 946608
32791 946608 1130465 1471732 1726930 1713898 1499024 1291852 1214597 1220440 1202417 1127606 1055017
32780 1055017 1046858 1093654 1148294 1215958 1349911 1528148 1592378 1389327 971066 595828
32770 595828 513201 770906 1208775 1582774 1707348 1566297 1327007 1198280 1241994 1357716
32760 1357716 1449633 1523237 1582870 1541166 1337003 1086438 988412 1084937 1228016 1298075 1334124
32749 1334124 1396629 1422215 1327664 1190899 1191509 1371985 1570476 1617493 1503566 1308279 1062012
32738 1062012 773442 538523 496730 658801 863197 944536 890350 792483 699275 585478
32728E85478j37726r6486Q70O3460L5966k9164l6504L8374J22863J32025O0003
32717G39159k5262o6539p1005p5277q5045p1426j4012O9701J28009J05528K417
32706F36248q7120n2309P8373J24157k5791k29844k50357p0794Q7147Q5751N1276
32695C46737J44715K89763K76001O3784j62481k24775j12461P5127K25051K43610
32685A165071J13484m6540p4061M4872J53187J22726l570j04692j31351j08870
32675A130256o4675k0876p782k2740j6673K6104M2759j1360o6206j6577J23394
32664A095624K23952J98128Q9073j4531r0391j70271k43370k25302n4937J90550
32654I98525L31247K71211J08078j078l6049p5117r7449J0168K14431K87102J12844
$$ plain form
32728 585478 447752 351266 352136 415596 451562 422398 385894 424268 547131 679156 739159
32717 739159 713897 647358 576353 501076 416031 344605 330593 400294 528303 633831 636248
32706 636248 549128 496819 575192 699349 673558 443714 193357 122563 209710 295461 346737
32695 346737 491452 781215 1057216 1121000 958519 733744 621283 696410 921461 1165071
32685 1165071 1278555 1232015 1157954 1202826 1356013 1478739 1475169 1370477 1239126 1130256
32675 1130256 1065581 1044705 1036923 1014183 997510 1023614 1066373 1055013 988807 972230 1095624
32664 1095624 1319576 1517704 1606777 1592246 1501855 1331584 1088214 862912 807975 998525
32654 998525 1329772 1600983 1709061 1707983 1671934 1596817 1499368 1509536 1723967 2011069 2123913
32643B123913j04646j12281K6641M5811j00755j69541j0845J99975K15775M2364
32633B156411j14452j23815l2915M3606L9115k5025n2488L3595J69317J94128
32623B287477O9477l4696L9548K05448K38184Q1635p1269j7903K19535M28007
32613C445443M26233K33298L4247j8249M0358O3601J1717l19R6393J89417J43856
32602D665995J1332m3824K1353R9653J18651J18304J28419R3122l0653j82013
32592E000339k57690k19459j10826l690N5909P5889Q8958P9234j4969j81901k94626
32581D217168k78547k43697l11608l74945k30534N6104J58950n4404l01133k74158
32571B363196p5686l7392k10755l00625j19229J30411J38516r1483k64236j89405
$$ plain form
32643 2123913 2019267 1906986 1933627 1979438 1878683 1709142 1698297 1898272 2114047 2156411
32633 2156411 2041959 1918144 1885229 1928835 1967950 1942925 1890437 1924032 2093349 2287477
32623 2287477 2356954 2322258 2361806 2567254 2805438 2887073 2815804 2797901 3017436 3445443
32613 3445443 3871676 4104974 4139221 4120972 4161330 4224931 4236648 4236329 4332722 4522139 4665995
32602 4665995 4677327 4633503 4654856 4754509 4873160 4991464 5119883 5213005 5182352 5000339
32592 5000339 4742649 4523190 4412364 4408674 4464583 4540472 4629430 4708664 4693695 4511794 4217168
32581 4217168 3938621 3694924 3383316 3008371 2777837 2833941 2992891 2938487 2637354 2363196
32571 2363196 2287510 2250118 2039363 1738738 1619509 1749920 1888436 1796953 1532717 1343312
32561A343312j2506m772k11923m09040l92380k13990p5774p2626j35993j82559
32551c68251j95801j70079j01496n1974r7396j80312j48295N701Q3053m7083k40599
32540a512532k68090j14330M6577J03659R7166R7216J23320J64618J82166J22288
32530i57942R008l9347J7841M1443q1419k14824j40371J05441K67591K35208J51274
32519f06097J31384R4246m2593j87620k13328j28059m713J28965K21760J60010
32509d46045o2267k46437k17022o2351P314l2989l5890M4260R2280N7943M8485
32498h52719J34090K20633K02791J11853J3307j15120k70246l01543r3049J85074
32488g64929K24512j374j79772r7315P6596R2710J0206M4249J56795J05497j23187
$$ plain form
32561 1343312 1330806 1326034 1114111 705071 312691 98701 22927 -49699 -185692 -368251
32551 -368251 -564052 -734131 -835627 -887601 -984997 -1165309 -1313604 -1307903 -1224850 -1271933 -1512532
32540 -1512532 -1780622 -1894952 -1848375 -1744716 -1647550 -1550334 -1427014 -1262396 -1080230 -957942
32530 -957942 -948934 -988281 -970440 -928997 -1010416 -1225240 -1365611 -1260170 -992579 -757371 -606097
32519 -606097 -474713 -380467 -423060 -610680 -824008 -952067 -956780 -827815 -606055 -446045
32509 -446045 -508312 -754749 -971771 -1034122 -1026808 -1059797 -1095687 -1051427 -959147 -901204 -852719
32498 -852719 -718629 -497996 -295205 -183352 -170045 -285165 -555411 -856954 -950003 -764929
32488 -764929 -540417 -541791 -721563 -818878 -742282 -649572 -639366 -595117 -438322 -332825 -456012
32477d56012k44625j13008N3345K2470j11084j17979J6795J33148J50284R9705
32467e66961J7538l5131L0049J55007J19590j14260k36061k1930K52909J77367
32457b21883j59536k99628j16625N4529Q195o5277j4472N727j00610j20694R0652
32446i39622K94880K16389l4457j64583j28191q1060o6902j7380N0592P1461P0466
32435g28407Q2608N1851k4049p900J34569J92324K9964j39053o5147J24034J26032
32424b23174n8494j74965j42519r7494p1698L2638J64623J49511R965m0752L6884
32413d15475M1306j10605k26073j35618O6413J79762J37180J8036n3135n34J04299
32402c94444P9453j09004k26949q6513J48956K08929J23651Q8963O3508j14167
$$ plain form
32477 -456012 -700637 -813645 -760300 -737830 -848914 -966893 -950098 -816950 -666666 -566961
32467 -566961 -549423 -584554 -554505 -399498 -279908 -394168 -630229 -652159 -399250 -221883
32457 -221883 -381419 -681047 -797672 -743143 -734948 -800225 -814697 -808970 -909580 -1030274 -939622
32446 -939622 -644742 -428353 -462810 -627393 -755584 -836644 -903546 -920926 -870334 -798873 -728407
32435 -728407 -645799 -593948 -617997 -625897 -491328 -299004 -269040 -408093 -473240 -349206 -223174
32424 -223174 -281668 -456633 -599152 -696646 -768344 -735706 -571083 -421572 -411607 -452359 -415475
32413 -415475 -374169 -484774 -710847 -846465 -780052 -600290 -463110 -445074 -498209 -498743 -394444
32402 -394444 -314991 -423995 -650944 -737457 -588501 -379572 -255921 -166958 -103450 -217617
32392b17617l00575j94977J01176J58000q3999j87200O1399K93430J66770j12805
32382c16398j86314q1983k0155M832Q7363J17673n779q6070P6886K72566J47717
32371A0338k17290l77954j46546J79163K36281M050k49877k70236m3018J90428
32361f84661J88165J0810o5735K3167L1112j62416l04486j67351P3963J30817
32351i26615L4716j2605j0477o0127q1961L0455J39240Q7120K6783J59186L12466
32340c01819K00268m4453o5218Q5339K7164k52688l28654m0227K42835K12257
32330b65196K5522o5077p3994o6153L8688K12346K10235l9809k46627j92340o5258
32319e27663j05080k01295j32012M2435J26303J26670J49141J33410n232j19367
$$ plain form
32392 -217617 -518192 -713169 -611993 -453993 -537992 -725192 -663793 -370363 -203593 -316398
32382 -316398 -502712 -584695 -604850 -600018 -512655 -394982 -400761 -486831 -409945 -137379 10338
32371 10338 -206952 -584906 -731452 -552289 -316008 -311958 -561835 -832071 -875089 -684661
32361 -684661 -496496 -485686 -551421 -528254 -497142 -659558 -964044 -1131395 -1057432 -926615
32351 -926615 -891899 -904504 -914981 -975108 -1057069 -1026614 -887374 -800254 -773471 -614285 -301819
32340 -301819 -101551 -146004 -211222 -125883 -98719 -351407 -680061 -720288 -477453 -265196
32330 -265196 -239674 -304751 -378745 -444898 -406210 -193864 16371 -23438 -270065 -462405 -527663
32319 -527663 -632743 -834038 -966050 -923615 -797312 -670642 -521501 -388091 -393323 -512690
32309e12690k6430J44588J13809j01702j97625l2109J93518K35445Q5685r2806
32299a90317j57869p7633O6371J43998J02789R912o2064j09159j10709j65J85023
32288a99823K56548J08408j11028j91619j24109l7347J9634P8195J19338J00724
32278A8921N6235L7749J9306k9637n7542k8565j0855n4164r1380p9488r9446j72896
32266d91762j39588R2714L25729L21062J42089M310q3709k37218l54708k11838
32256f32919J15888K68566J02172j23660j46444j8850Q7162J44430J85778J55221
32246A37344J6741j21095j37051o0930J185J3887m554n3237j14688j27855p0494
32235e20747m990Q188k1519n7800o8157l149J48218K72234K28142N4583o2440
$$ plain form
32309 -512690 -539120 -394532 -280723 -382425 -580050 -612159 -418641 -183196 -97511 -190317
32299 -190317 -348186 -425819 -359448 -215450 -112661 -102749 -164813 -273972 -384681 -384846 -199823
32288 -199823 56725 165133 54105 -137514 -261623 -298970 -279336 -201141 -81803 18921
32278 18921 75156 112905 132211 102574 45032 16467 5612 -48552 -139932 -219420 -318866 -491762
32266 -491762 -631350 -538636 -212907 108155 250244 254554 170845 -66373 -421081 -632919
32256 -632919 -517031 -248465 -146293 -269953 -416397 -435247 -348085 -203655 -17877 137344
32246 137344 154085 32990 -104061 -164991 -163806 -149919 -154473 -207710 -322398 -450253 -520747
32235 -520747 -525737 -517549 -539068 -596868 -665025 -668174 -519956 -247722 -19580 35003 -27437
32224b7437n8643o5921j60413k13427j02211Q1238J68644J50838J33717J38453
32214D4838Q5859n5461k10353k70080j73500L5228J94155J53223l3585j43554
32204c73230p1197L8329K3609n5786m1638P3858J73864K13236K27592J95511N7023
32193D61171j40587k56425k23091r6076M7870J53004J52455K8660r5166n7486
32183b5671J24374K51880J84168k0767k17107l12759k79016j38653Q813N0268
32173c74470n505m3050k0285k1798q7361j16398k8104R6495J39945J22260J28482
32162b09789J38424O6576p1522j64596j54435o7843O2499J84409J80339J251j73529
32151b08216j06803J38941K22047j8469l19211l39484q7231J63020K40671J76784
$$ plain form
32224 -27437 -86080 -152001 -312414 -525841 -628052 -546814 -378170 -227332 -93615 44838
32214 44838 130697 75236 -135117 -405197 -578697 -543469 -349314 -196091 -229676 -373230
32204 -373230 -444427 -406098 -382489 -438275 -479913 -406055 -232191 -18955 208637 404148 461171
32193 461171 320584 64159 -158932 -255008 -207138 -54134 98321 126981 31815 -25671
32183 -25671 98703 350583 534751 513984 296877 -15882 -294898 -433551 -424738 -374470
32173 -374470 -379975 -423025 -443310 -465108 -552469 -668867 -696971 -600476 -460531 -338271 -209789
32162 -209789 -71365 -4789 -76311 -240907 -395342 -463185 -400686 -216277 -35938 -34687 -208216
32151 -208216 -315019 -176078 45969 27500 -291711 -631195 -718426 -555406 -314735 -137951
32141a37951L4467j37292k21276j17273P8723J52689M8083q4599j17818o9734
32131e71981J0281J05560J51296O6023p9144q8117Q8018K53318K20749L0150j57980
32120B8173k45657k00693l2000J41406J46683n563q3192M7721K10406J69414l4546
32109A42152j64257j02659O0911J77625J42886n4960k71174k97588j29000R56
32099d95108l8378q8546j2924M0077p5243j77675m1615J81767J97156P2745R0508
32088c47236J87147L8687k94656l35786O2368M22906L30071m283j46304o6948
32078a54034k8944j01601j36552p8859p463M1026O8951L9228k4148J0815J64940
32067b06641K43029J25488j6920j662O6911J7087o5701k2109M2099o5552k25577
$$ plain form
32141 -137951 -103484 -240776 -462052 -579325 -500602 -347913 -299830 -384429 -502247 -571981
32131 -571981 -561700 -456140 -304844 -238821 -317965 -406082 -318064 -64746 156003 186153 28173
32120 28173 -217484 -418177 -450177 -308771 -162088 -167651 -250843 -203122 7284 176698 142152
32109 142152 -22105 -124764 -63853 113772 256658 201698 -69476 -367064 -496064 -495108
32099 -495108 -533486 -622032 -634956 -594879 -670122 -847797 -889412 -707645 -510489 -437744 -347236
32088 -347236 -160089 -121402 -416058 -751844 -689476 -266570 63501 59218 -87086 -154034
32078 -154034 -182978 -284579 -421131 -499990 -507453 -466427 -397476 -358248 -382396 -371581 -206641
32067 -206641 36388 161876 144956 143294 210205 227292 161591 139482 181581 116029 -109548
32056a09548j49348J29658K65593J12338j01609j54515q4750P200J23040K25160
32046B63219J84381P816q6914K5675J65499R2089j52014k97107j92130K5794J04870
32035A41178l8636k31817k49056q7910M4203M2039M7897J74492K54626Q3427k07949
32024b7506k92167j11019P6470J04706P4728Q0536N0706m6147r4928m4198O819
32013b22000L1964J39573K88639K23610j15138l80542k78697j9334N892j69750
32003d95783j73940P8596K42305R0973j34669j05181J18394K15100Q0197p1774
31993a55782n8848K2951j7558j70500k41351j27069N1226J25711Q9975N0129M1165
31982c89951R233n0867o6944j1082N7369R0727R3570M9662o9083j85275j42950
$$ plain form
32056 -109548 -258896 -129238 136355 248693 147084 -7431 -92181 -84981 38059 263219
32046 263219 447600 455416 368502 394177 559676 651765 499751 202644 10514 36308 141178
32035 141178 102542 -129275 -378331 -466241 -422038 -379999 -332102 -157610 97016 180443 -27506
32024 -27506 -319673 -430692 -354222 -249516 -174788 -94252 -43546 -89693 -184621 -228819 -222000
32013 -222000 -190036 -50463 238176 461786 346648 -33894 -312591 -331925 -326033 -495783
32003 -495783 -669723 -591127 -348822 -257849 -392518 -497699 -379305 -164205 -84008 -155782
31993 -155782 -214630 -191679 -209237 -379737 -621088 -748157 -696931 -571220 -481245 -431116 -389951
31982 -389951 -380718 -431585 -498529 -509611 -452242 -361515 -267945 -218283 -287366 -472641 -615591
31971f15591P4775K69673K56280P1581j18958k19009k14006r8702Q2130K02507
31961c09320J92391J42309J54143J62966M8704j38553k30149j82861j02253l4454
31951b97077Q0979K20230K24024L2022j68566j54026M8204J95293J21450r5090
31941B07443k50901k33745j03273O591L5045L2997O1975R8710Q5445M4437N8582
31930D3306J25897J23291k4551k03118k25051p0686Q1494Q5762M122j2244M6868
31919b4910M5623p6819j91668j44390L9139J87931J89539Q3157l0342r4740j10732
31908a28212r8271o0508L1415J89835L27894K98561Q1160j47232k20987j85239
31898H8416j58933r4668J18615L60183L44939L1099k76788l19958j66604k939
$$ plain form
31971 -615591 -540816 -271143 -14863 56718 -62240 -281249 -495255 -593957 -511827 -309320
31961 -309320 -116929 25380 179523 342489 391193 252640 22491 -160370 -262623 -297077
31951 -297077 -216098 4132 228156 260178 91612 -62414 -14210 181083 302533 207443
31941 207443 -43458 -277203 -380476 -373885 -338840 -305843 -243868 -145158 -59713 -15276 43306
31930 43306 169203 292494 267943 64825 -160226 -230912 -149418 -63656 -59534 -71778 -24910
31919 -24910 20713 -56106 -247774 -392164 -353025 -165094 24445 107602 77260 -17480 -128212
31908 -128212 -226483 -286991 -255576 -65741 262153 560714 641874 494642 273655 88416
31898 88416 -70517 -165185 -46570 313613 658552 689651 412863 92905 -73699 -76638
31888g6638J26807K25464K10241P1545k0412K3416K2534j64363l27466k08136
31878a17008L5377L7354j73959j99770P9399K99643J92014k0805k9292Q1592M7323
31867B31868j10020j54798m6755L3029Q690j3913J5426K4923J0905O8351J81105
31856B48811J84909K2364j38485j47267q8184j17670j90190j17625J21152K89579
$$ plain form
31888 -76638 50169 275633 485874 557419 537007 560423 582957 418594 91128 -117008
31878 -117008 -81631 -44277 -218236 -418006 -338607 -38964 153050 132245 102953 184545 231868
31867 231868 121848 -32950 -79705 -46676 -37986 -51899 -36473 -11550 -645 67706 248811
31856 248811 433720 456084 317599 170332 82148 -35522 -225712 -343337 -222185 67394
$$ [...]
##END NTUPLES=NMR SPECTRUM
##END=
