##TITLE=31Pdec_GC1011
 CDCl3, 24 sc
 11.11.2021
##JCAMPDX= 6.0         $$ Bruker NMR JCAMP-DX V2.0
##DATA TYPE= NMR SPECTRUM
##DATA CLASS= NTUPLES
##ORIGIN= UXNMR, Bruker Analytische Messtechnik GmbH
##OWNER= root
$$ XWIN-NMR		Version 3.5
$$ Thu Nov 11 10:34:20 2021 Russian Standard Time (UT+4h)  she@DPX200
##.OBSERVE FREQUENCY= 81.013821
##.OBSERVE NUCLEUS= ^31P
##.ACQUISITION MODE= SIMULTANEOUS
##.ACQUISITION SCHEME= undefined
##.AVERAGES= 24
##.DIGITISER RES= 16
##SPECTROMETER/DATA SYSTEM= spect
##.PULSE SEQUENCE= zgpg30
##.SOLVENT NAME= Acetone
##.SHIFT REFERENCE= (INTERNAL, Acetone, 0, 248.564)
##AUDIT TRAIL= $$ (NUMBER, WHEN, WHO, WHERE, WHAT)
$$ ##TITLE= Audit trail, XWIN-NMR		Version 3.5
$$ ##JCAMPDX= 5.01
$$ ##ORIGIN= Bruker BioSpin GmbH
$$ ##OWNER= she
$$ F:/spectra/data/she/nmr/P31/1/pdata/1/auditp.txt
$$ ##AUDIT TRAIL=  $$ (NUMBER, WHEN, WHO, WHERE, WHAT)
(   1,<2021-11-11 10:33:19.54 +0400>,<she>,<DPX200>,
      <created by zg, POWCHK disabled, PULCHK disabled
       configuration hash MD5:
       00 E9 B6 7A A2 85 ED C7 34 08 36 98 17 FE 4E 26
       data hash MD5: 32K
       D1 EB 4B EA 4F AC 8F 09 E9 69 7F 06 0D 10 6D 14>)
(   2,<2021-11-11 10:33:22.34 +0400>,<she>,<DPX200>,
      <Start of raw data processing
       efp BC_mod = 2 LB = 1 FT_mod = 6 PKNL = 1 PHC0 = -8841.797 PHC1 = 134.2694 SI = 64K 
       data hash MD5: 64K
       97 EC 14 23 DA EA CE E1 A5 F4 98 7B 9B C7 FC AF>)
(   3,<2021-11-11 10:33:49.59 +0400>,<she>,<DPX200>,
      <pk PHC0 = 5.624719 PHC1 = 0 
       data hash MD5: 64K
       F7 C0 AF E5 84 5C 04 8B B0 D3 32 48 6B 9F BF DE>)
(   4,<2021-11-11 10:33:52.75 +0400>,<she>,<DPX200>,
      <abs ABSG = 5 
       data hash MD5: 64K
       26 10 C7 56 EC 12 3B 54 F0 FE 0E 78 5B 1D 83 CA>)
$$ ##END=
$$ 
$$ hash MD5
$$ 20 A4 5D 5F C4 A1 6C 1F 18 81 DC 16 43 67 D4 E9
##$RELAX= 
##$RELAX= 
##$RELAX= 
##$RELAX= 
##$RELAX= 
##$RELAX= 
##$RELAX= 
##$RELAX= 
$$ Bruker specific parameters
$$ --------------------------
##$DU= <F:/spectra>
##$EXPNO= 1
##$NAME= <P31>
##$PROCNO= 1
##$TYPE= <nmr>
##$USER= <she>
##$AMP= (0..31)
100 100 100 100 100 100 100 100 100 100 100 100 100 100 100 100 100 100 
100 100 100 100 100 100 100 100 100 100 100 100 100 100 
##$AQSEQ= 0
##$AQ_mod= 1
##$AUNM= <au_zg>
##$AUTOPOS= <>
##$BF1= 81.014009
##$BF2= 200.13
##$BF3= 200.13
##$BF4= 200.13
##$BF5= 200.13
##$BF6= 200.13
##$BF7= 200.13
##$BF8= 200.13
##$BYTORDA= 1
##$CFDGTYP= 0
##$CFRGTYP= 5
##$CHEMSTR= <none>
##$CNST= (0..31)
1 1 145 1 1 1 1 1 1 1 1 1 1 1 1 1 1 1 1 1 1 1 1 1 1 1 1 1 1 1 1 1 
##$CPDPRG= <waltz16>
##$CPDPRG1= <>
##$CPDPRG2= <waltz16>
##$CPDPRG3= <>
##$CPDPRG4= <mlev>
##$CPDPRG5= <mlev>
##$CPDPRG6= <mlev>
##$CPDPRG7= <mlev>
##$CPDPRG8= <mlev>
##$CPDPRGB= <>
##$CPDPRGT= <>
##$D= (0..31)
0 1 0 0 0 0 0 0 0 0 0 0.03 2e-05 3e-06 0 0 0 0 0 0 0 0 0 0 0 0 0 0 0 0 
0 0 
##$DATE= 1636612399
##$DBL= (0..7)
120 120 120 11 120 120 24 19 
##$DBP= (0..7)
150 150 150 150 150 150 150 150 
##$DBP07= 0
##$DBPNAM0= <>
##$DBPNAM1= <>
##$DBPNAM2= <>
$$ [...]
##$SUBNAM3= <"">
##$SUBNAM4= <"">
##$SUBNAM5= <"">
##$SUBNAM6= <"">
##$SUBNAM7= <"">
##$SUBNAM8= <"">
##$SUBNAM9= <"">
##$SW= 501.771253377433
##$SWIBOX= (0..15)
0 1 3 0 0 0 0 0 0 0 0 0 0 0 0 0 
##$SW_h= 40650.406504065
##$TD= 32768
##$TD0= 1
##$TE= 0
##$TE2= 300
##$TE3= 300
##$TEG= 300
##$TL= (0..7)
0 120 53 12 22 120 120 120 
##$TP= (0..7)
150 150 150 150 150 150 150 150 
##$TP07= 0
##$TPNAME0= <>
##$TPNAME1= <>
##$TPNAME2= <>
##$TPNAME3= <>
##$TPNAME4= <>
##$TPNAME5= <>
##$TPNAME6= <>
##$TPNAME7= <>
##$TPOAL= (0..7)
0.5 0.5 0.5 0.5 0.5 0.5 0.5 0.5 
##$TPOFFS= (0..7)
0 0 0 0 0 0 0 0 
##$TUNHIN= 0
##$TUNHOUT= 0
##$TUNXOUT= 0
##$USERA1= <user>
##$USERA2= <user>
##$USERA3= <user>
##$USERA4= <user>
##$USERA5= <user>
##$V9= 5
##$VALIST= <valist>
##$VCLIST= <CCCCCCCCCCCCCCC>
##$VD= 0
##$VDLIST= <DDDDDDDDDDDDDDD>
##$VPLIST= <PPPPPPPPPPPPPPP>
##$VTLIST= <TTTTTTTTTTTTTTT>
##$WBST= 1024
##$WBSW= 4
##$XGAIN= (0..3)
0 0 0 0 
##$XL= 0
##$YL= 0
##$YMAX_a= 28787
##$YMIN_a= -33578
##$ZGOPTNS= <>
##$ZL1= 120
##$ZL2= 120
##$ZL3= 120
##$ZL4= 120
##$ABSF1= 248.5645
##$ABSF2= -253.2056
##$ABSG= 5
##$ABSL= 3
##$ALPHA= 0
##$AQORDER= 0
##$ASSFAC= 0
##$ASSFACI= 0
##$ASSFACX= 0
##$ASSWID= 0
##$AUNMP= <proc_1d>
##$AZFE= 0.1
##$AZFW= 0.5
##$BCFW= 0
##$BC_mod= 2
##$BYTORDP= 0
##$COROFFS= 0
##$CY= -3
##$DATMOD= 1
##$DC= 0
##$DFILT= <>
##$DTYPP= 0
##$F1P= 0
##$F2P= 0
##$FCOR= 1
##$FTSIZE= 65536
##$FT_mod= 6
##$GAMMA= 0
##$GB= 0
##$INTBC= 1
##$INTSCL= 5.30512e-09
##$ISEN= 30
##$LB= 1
##$LEV0= 0
##$LPBIN= 0
##$MAXI= 10000
##$MC2= 0
##$MEAN= 0
##$ME_mod= 0
##$MI= 50
##$NCOEF= 0
##$NC_proc= -5
##$NLEV= 6
##$NOISF1= 182.463
##$NOISF2= 159.3651
##$NSP= 0
##$NTH_PI= 0
##$NZP= 0
##$OFFSET= 248.5645
##$PC= 4
##$PHC0= -8836.172
##$PHC1= 134.2694
##$PH_mod= 1
##$PKNL= yes
##$PPARMOD= 0
##$PSCAL= 0
##$PSIGN= 0
##$REVERSE= no
##$SF= 81.014009
##$SI= 65536
##$SIGF1= 159.3651
##$SIGF2= -187.1042
##$SINO= 113.3802
##$SIOLD= 16384
##$SREGLST= <1H.CDCl3>
##$SSB= 0
##$STSI= 65536
##$STSR= 0
##$SW_p= 40650.406504065
##$SYMM= 0
##$S_DEV= 0
##$TDeff= 32768
##$TDoff= 0
##$TI= <>
##$TILT= no
##$TM1= 0
##$TM2= 0
##$TOPLEV= 0
##$USERP1= <user>
##$USERP2= <user>
##$USERP3= <user>
##$USERP4= <user>
##$USERP5= <user>
##$WDW= 1
##$XDIM= 65536
##$YMAX_p= 398623618
##$YMIN_p= -18770431
$$ End of Bruker specific parameters
$$ ---------------------------------
##NTUPLES= NMR SPECTRUM
##VAR_NAME=  FREQUENCY,     SPECTRUM/REAL,   SPECTRUM/IMAG
##SYMBOL=    X,             R,               I
##VAR_TYPE=  INDEPENDENT,   DEPENDENT,       DEPENDENT
##VAR_FORM=  AFFN,          ASDF,            ASDF
##VAR_DIM=   65536,         65536,           65536
##UNITS=     HZ,            ARBITRARY UNITS, ARBITRARY UNITS
##FACTOR=    0.620285442955139, 1,           1
##FIRST=     20137.2065510759, 0,            0
##LAST=      -20513.1999529892, 0,           0
##MIN=       -20513.1999529892, -18770431,   0
##MAX=       20137.2065510759, 398623618,    0
$$ Real data points
##PAGE= N=1
##DATA TABLE= (X++(R..R)), XYDATA
$$ [...]
39427f72590q0070m5383J37994L48113J35147l55922l79423K30640O40145K41226
39417A99877l68490k93756K73883M02750j00772m46709j26490L88623M71736K07385
39407F08037M6242P4830P6523J5084K9720J13186J34914P4015k4036j87425l84562
39396E76528m17451k00241K7239L7492j6369J12764L00415K66499J03507J19135
39386I09518K40125J10398k11928k44904J03681L15065J02552j20740n303P6199
39376A274663k94021p02165m49215K56425M63650j27097o83099m27592K74489
39367d13962M67326q1575o18416m38787J99276M41818j913m37077j49269N15352
39357e17227N90712o3960n18365k08624K11339L2146k79918P2196P23317O53569
$$ plain form
39427 -672590 -752660 -798043 -660049 -311936 -176789 -532711 -912134 -681494 -41349 199877
39417 199877 -168613 -462369 -188486 214264 113492 -333217 -459707 -71084 400652 608037
39407 608037 654279 729109 805632 820716 850436 963622 1098536 1172551 1148515 961090 576528
39396 576528 159077 -41164 -13925 23567 7198 119962 420377 686876 790383 909518
39386 909518 1149643 1260041 1048113 803209 906890 1221955 1324507 1203767 1198464 1274663
39376 1274663 980642 278477 -170738 85687 549337 422240 -260859 -688451 -413962
39367 -413962 53364 -28211 -646627 -1085414 -886138 -444320 -446233 -883310 -1032579 -517227
39357 -517227 73485 9525 -508840 -717464 -506125 -473979 -753897 -681701 41616 695185
39347F95185j00274m82067j35674J58070o2380k78407j48628j36783m55592n05072
39337a451622j3258L31929J32268Q4672O39024R24935J65025p88542o84984J14479
39327e46074L50468J4961J33354P05384O25937k78201q18432l92359J63398J65562
39317A23998J06856M18036N05879j14064p89145p47219k76709j3314J54490N36941
39307i4251P09653J71823n53172n14852K37226P42108M85884j24042n27780n39555
39297f958j85156L39050N85544K84328k02630l18063o3054J46405J66736J38772
39287H84974K1043k88913n24532l66315o4917r5459k93573p9893M59494N45027
39277A96936n1976n39006k73736K71813K75144j97517l76403K3288M52237L88238
$$ plain form
39347 695185 594911 112844 -22830 135240 72860 -205547 -354175 -490958 -946550 -1451622
39337 -1451622 -1464880 -1132951 -1000683 -916011 -276987 647948 812973 24431 -660553 -546074
39327 -546074 -195606 -180645 -47291 658093 1284030 1005829 187397 -204962 -41564 123998
39317 123998 230854 648890 1154769 1040705 251560 -495659 -772368 -785682 -631192 -94251
39307 -94251 615402 787225 234053 -280799 -43573 698535 1184419 1060377 532597 -6958
39297 -6958 -192114 146936 732480 1016808 814178 496115 433061 579466 746202 884974
39287 884974 906017 617104 92572 -273743 -338660 -434119 -727692 -807585 -348091 196936
39277 196936 144960 -394046 -667782 -395969 -120825 -318342 -694745 -671457 -219220 169018
39267A69018J8310j48131j0431Q4817q3299l01509k59019J8219K42052K53597
39257a6376J31855j9311j42587j15504J31860L61921K29673j82368l95064k20445
39247b36346Q80L8484J48949M66248N19475q3553q45356r09316k41442L47578
39237g94399L27857J9654l4524K20158M23307K68602j97735n66203m16924J31118
39227f19089M33110J50741k40356j79791J15572J19973k0078K01300N52444K78076
39217G91902n27467q04497j31509N15445J93607n98543p05205J8128O39364N21705
39207h7070K9556j48900J30230M10941K27873l16675n89024j98034L67750L01344
39197A27991l38161o26581j34218M39962L97373P5660J16199L32554J62523k01428
$$ plain form
39267 169018 187328 39197 28766 113583 30284 -271225 -530244 -512025 -269973 -16376
39257 -16376 115479 96168 -46419 -161923 -30063 331858 561531 379163 -15901 -236346
39247 -236346 -235466 -196982 -48033 418215 937690 854137 8781 -900535 -1141977 -794399
39237 -794399 -466542 -446888 -481412 -261254 162053 430655 232920 -333283 -750207 -619089
39227 -619089 -185979 -35238 -275594 -455385 -339813 -219840 -239918 -38618 513826 791902
39217 791902 264435 -540062 -671571 -156126 37481 -561062 -1266267 -1248139 -608775 -87070
39207 -87070 -57514 -206414 -76184 334757 562630 245955 -343069 -541103 -173353 127991
39197 127991 -210170 -836751 -970969 -531007 -133634 -57974 58225 390779 553302 351874
39187C51874j20774K76401K32596k89845m46271O1878L93056r8827p73402o57989
39177a071303J08961O07676N42439M24304M55942J68283n80070j041392n72842
39168i58002L21160O24168K26424m2959K20870M20223L7899m50696l55920P7963
39158A21130J02542k63487l05400J06463K73738q7591k97933J38128O52992N26389
39148I66971J8629j57068J0179K8377j05587j1249J67759j08657p28486q90299
39138h09431l03820L47895M43085K37943K52252M04650K66358j78395n16037m81357
39128c36857j85040J43598L69406M49447L95331K39744J4077j86599j95690M03
39118G07820J27723l7362k96131l10843j53215j50859k56446j02206K74323L48529
$$ plain form
39187 351874 231100 507501 740097 450252 3981 65859 458915 360088 -413314 -1071303
39177 -1071303 -962342 -354666 187773 612077 1068019 1236302 656232 -385160 -958002
39168 -958002 -636842 -12674 213750 170791 391661 811884 849783 399087 43167 121130
39158 121130 223672 -39815 -345215 -238752 34986 -52605 -350538 -212410 440582 966971
39148 966971 985600 828532 838711 867088 761501 750252 918011 809354 80868 -809431
39138 -809431 -1113251 -765356 -322271 -84328 167924 572574 838932 660537 144500 -336857
39128 -336857 -521897 -378299 -8893 440554 835885 1075629 1089706 903107 707417 707820
39118 707820 835543 798181 502050 191207 37992 -112867 -369313 -471519 -197196 151333
39108A51333o1809m47285l71745o8614P9010J58748L77006N13615K76594q9514
39098E17339j11489J70681K94501R8668j41928k46448l07751l33874j65144J69314
39088e6131L90079L58390K11391L6938k53353o10563p26386m21671N4693L05397
39078g11216K31786N5110p304M9726R4364N1044N509J05957L41624M89391L60704
39067A066695L6482k44011l55736l26957j94739o027P8820r9947m35103n62072
39057a042595k35338L57907P20536N07004j02511n27719m07802n3493l8145l34013
39047a156169k73967M08421R75906O36248k34010n26046K8420N14231K36891l14605
39037B95320l58674j8769M9376j94989k03209J40576L19631R2335j12758L9036
$$ plain form
39108 151333 89524 -357761 -729506 -798120 -719110 -560362 -183356 330259 606853 517339
39098 517339 405850 576531 871032 969700 827772 581324 273573 -60301 -225445 -56131
39088 -56131 333948 692338 903729 940667 687314 76751 -649635 -1071306 -1016613 -711216
39078 -711216 -479430 -424320 -431624 -381898 -287534 -236490 -230981 -125024 216600 705991 1066695
39067 1066695 1103177 859166 503430 176473 -18266 -24293 54527 -45420 -480523 -1042595
39057 -1042595 -1277933 -920026 -199490 307514 205003 -322716 -730518 -784011 -822156 -1156169
39047 -1156169 -1430136 -1021715 -45809 590439 356429 -169617 -141197 373034 609925 295320
39037 295320 -63354 -82123 -32747 -227736 -430945 -290369 29262 121597 8839 47875
39027D7875K37146J11464j29683j16024J4866q6317k71709j02094L28932M16434
39017D50890j1276l52832j03530L94799M49834k4135m50150l84103k9312Q8913
39007B9098k07477n03677k74494L71626O61113J33838n89401n48246J65305N00046
38997b62269L6739l97287j15447L28560J69662k23379n6133L99789K48748l71474
38987b42491m03523L15480O67721K5551p72203p61037j62930K86227M47560M94711
38977a04934K71530k62896n34384j06718N05990N23845K1274l34744l11562j78279
38967e10878n1854J37458K60742J75168N9301N7932n1512l18616k48309L61214
38957a29354P58769K77242m64458m11415K65257M93265L2135l39832k67922j76900
$$ plain form
39027 47875 285021 396485 266802 150778 165644 79327 -192382 -294476 34456 450890
39017 450890 439614 86782 -16748 378051 827885 803750 353600 -30503 -59815 29098
39007 29098 -178379 -682056 -956550 -584924 76189 210027 -379374 -927620 -762315 -262269
38997 -262269 -225530 -622817 -738264 -409704 -240042 -463421 -519554 -119765 128983 -242491
38987 -242491 -646014 -330534 337187 362738 -409465 -1170502 -1333432 -1047205 -599645 -104934
38977 -104934 166596 -96300 -630684 -737402 -231412 292433 313707 -21037 -332599 -510878
38967 -510878 -562732 -425274 -164532 10636 69937 127869 76357 -242259 -490568 -129354
38957 -129354 629415 906657 442199 30784 296041 789306 821441 481609 213687 36787
38947C6787j41347K74043Q17482N41724n49721j126629m57733M47077M25946j43208
38937A24421k11427K31806M17236J85355K2682M3500p3105l06964l21468j62925
38927e0889j78588l13366j97304J06079J36479j28540j34949L62388Q06135N35062
38917I42507l20941r39128p26303L1408N15951L35712o8314j24757O1755L8130
38907b53980j25125O205K94575J45351l29434k72093M45623P79013J49995n31847
38897C08283l44517J60411N7849k77220J3481M94287J17986p17692n94355M80767
38887c00720Q88372n961q37192n00272K03656J70127j70347J10605O37325L99450
38877E95043m37210p74407k95345K79354M54775L95297K16238j40730l67328o7984
$$ plain form
38947 36787 -104560 169483 986965 1528689 978968 -147661 -605394 -158317 267629 124421
38937 124421 -87006 144800 562036 747391 770073 813573 740468 433504 112036 -50889
38927 -50889 -229477 -542843 -740147 -634068 -497589 -626129 -761078 -398690 407445 942507
38917 942507 621566 -317562 -1043865 -1012457 -496506 -160794 -229108 -353865 -292110 -253980
38907 -253980 -379105 -372900 -78325 67026 -262408 -534501 -88878 690135 840130 308283
38897 308283 -36234 124177 182026 -95194 -81713 412574 530560 -187132 -781487 -300720
38887 -300720 587652 581691 -255501 -755773 -552117 -381990 -552337 -441732 195593 595043
38877 595043 157833 -616574 -911919 -632565 -177790 217507 433745 293015 -74313 -142297
38867a42297M23744M00160n8549k04208P5322R8001l03289l99733J23921N20021
38857E33093K14093k51346k32192q6174l59493n93506n2663Q13604Q42513n9000
38847G68929p54338n64158m0514J61499J65129K37115J89744o2634j32279J00325
38837F8818J06645l24114m97136N1298N67157K05686m82161l87553K68401K87619
38827a35340m12455o03291J31724O40302J85655k74637K09901Q52879M36330n63084
38817D67984p02942P2543M30049j13983n41541j76090K83998J44641j25859Q2766
38807a78434L60040Q9735l36774j75233L14114K54522l67174o78960l30037R5993
38797i52208J90059K62633M78875L72909k39959o33810j73809N89147O24961q8874
$$ plain form
38867 -142297 281447 681607 623058 418850 494172 592173 288884 -110849 13072 533093
38857 533093 747186 495840 263648 177474 -182019 -775525 -828188 -14584 827929 768929
38847 768929 14591 -549567 -590081 -428582 -263453 -26338 163406 100772 -31507 68818
38837 68818 175463 -148651 -645787 -594489 -27332 178354 -303807 -691360 -422959 -135340
38827 -135340 -547795 -1151086 -1019362 -379060 -193405 -468042 -258141 594738 1031068 467984
38817 467984 -234958 -162415 267634 153651 -387890 -563980 -279982 -135341 -261200 -178434
38807 -178434 181606 271341 -65433 -240666 73448 327970 -39204 -718164 -1048201 -952208
38797 -952208 -762149 -499516 -20641 352268 112309 -521501 -695310 -106163 518798 429924
38787D29924o00046l76434J30209L68487L78022L62709K24317j05710l49709k86203
38777A75566r9835P586J66962M20172L64883k39740q27357o44435J12992M62604
38767a00602j0535n98325m95029J34728M75980J51384l86693m76941j2356M84143
38757h34246N00928J59559J6248K37348L40568m209l28590k1848O43129P85609
38747A494496J36915o54629r65560q28051n26785j75262J22870K17126J94682
38738i84198K65034K97791K2005l04234j42485L29934L36661j75476l14198K53437
38728d15729O26918J61708l97158j93544K43438m7342p05133n92999K89566Q03929
38718b26346M65453l5277j49863j17410j24736O0550L45153K26435k25201k84128
$$ plain form
38787 429924 -170122 -546556 -416347 -47860 330162 692871 917188 811478 461769 175566
38777 175566 75731 83317 250279 670451 1035334 795594 -31763 -676198 -563206 -100602
38767 -100602 -111137 -709462 -1204491 -1069763 -593783 -442399 -829092 -1306033 -1318389 -834246
38757 -834246 -333318 -173759 -157511 79837 420405 416196 87606 65758 708887 1494496
38747 1494496 1631411 976782 11222 -816829 -1343614 -1518876 -1396006 -1178880 -984198
38738 -984198 -719164 -421373 -399368 -703602 -846087 -516153 -179492 -354968 -669166 -415729
38728 -415729 211189 372897 -24261 -217805 25633 -21709 -726842 -1319841 -1030275 -226346
38718 -226346 239107 203830 53967 -63443 -188179 -127629 217524 443959 218758 -65370
38708f5370J67591L01848k44006o24212j41910N48194M61319k02265n33278l85989
38698g18078l19278l61218L6957P81202R39112J38413o71043m47300M78668Q52914
38688G10349J91580o58133p25804j11916L48901K41663q4932j93629p9378O2856
38678b98443J70897K25365J49291L795K832J47632J66121J8192N5051L67175M30833
38667A438741j10732p13724o15337J7235L28821M7885k24830n1318K24382J30684
38657D71807j96395k64740Q1415M75679M34364j02993n93973m36058J99366M55075
38647E23547j8057m74024j94995L48050K55240l13411m25417N5029K92231r0405
38637d2212m72476l42026J6466K18027K94959K41335j22513n52960m82777J8046
$$ plain form
38708 -65370 102221 404069 160063 -464149 -606059 -57865 403454 201189 -332089 -718078
38698 -718078 -1037356 -1398574 -1361617 -580415 358697 497110 -173933 -621233 -142565 710349
38688 710349 901929 243796 -482008 -593924 -245023 -3360 -88292 -281921 -361299 -298443
38678 -298443 -127546 97819 247110 250905 253737 401369 567490 585682 640733 1007908 1438741
38667 1438741 1328009 614285 -1052 16183 345004 392889 168059 116741 341123 471807
38657 471807 275412 10672 92087 567766 1002130 899137 305164 -130894 68472 523547
38647 523547 505490 31466 -163529 184521 439761 126350 -299067 -244038 48193 -42212
38637 -42212 -514688 -856714 -840248 -622221 -327262 -85927 -208440 -761400 -1244177 -1226131
38627a226131K42706M5811O1261M30460M40027j00426l12180K36688O49145K23516
38617F90877k67881O0342N74718J99949o43617o82094Q9756M54274q649l88357
38607G9318o1050M11220L35235j16600l45175j11894L49898N52199J00691p10039
38597D83803r00501m0903Q68760O17074m35938q72719l35812J28948q1878k80025
38587h49191J17840N71581M42762L4493j24416j97979m75839o04978k13552K75057
38577a024222K95187J36093M04744Q42868O33725k40373q61957o71219j06803
38568e91957K21409K97061L43101L00221P2741j23095r1804n2031k63826m73098
38558c61278k23489L43157N24730K8892n50368n07686O2246M92730M43061J34337
$$ plain form
38627 -1226131 -983425 -937614 -876353 -445893 -5866 -106292 -418472 -181784 467361 690877
38617 690877 422996 483338 1058056 1258005 614388 -67706 22050 476324 467675 79318
38607 79318 18268 429488 764723 648123 302948 191054 540952 1093151 1193842 483803
38597 483803 -416698 -457601 411159 1028233 592295 -280424 -616236 -487288 -569166 -849191
38587 -849191 -731351 -159770 282992 317485 193069 -4910 -480749 -1085727 -1299279 -1024222
38577 -1024222 -729035 -592942 -188198 654670 1288395 1048022 186065 -485154 -591957
38568 -591957 -370548 -73487 269614 569835 642576 519481 427677 375646 111820 -361278
38558 -361278 -584767 -241610 283120 312012 -238356 -746042 -683796 -191066 251995 386332
38548C86332j71082m18981m83233j53990M19343O97986M14210o1050k43065j27359
38538B59111k0130n9532j69281k53955k10671K5919K78764K61729O6699J08009
38528B86662L77913K95992l31027p78387m02039L35651N49374K34632N9540J38040
38518G66351l2317m69140n23157R330M44079K26176k79024l96843l0204M16290
38508A31541N84747L48349j79180n83596m60502K6801K71037L6863k87078l79652
38498d90670l81005l73679q2786N20319Q71797N68169J0445k16868j72942j87954
38488F4826j07991L25043O56257K10705o63490q28216l6072N71674J20294o92417
38478c79387o87365M7255M68979K81372J98354N06980N19503j40430p12885m56799
$$ plain form
38548 386332 215250 -203731 -686964 -840954 -421611 276375 690585 629535 386470 259111
38538 259111 238981 179449 10168 -243787 -454458 -428539 -149775 111954 178653 286662
38528 286662 664575 960567 629540 -148847 -550886 -215235 334139 568771 628311 766351
38518 766351 734034 264894 -258263 -248933 195146 421322 142298 -254545 -284749 131541
38508 131541 716288 1064637 885457 301861 -158641 -131840 139197 176060 -111018 -490670
38498 -490670 -871675 -1245354 -1328140 -807821 63976 632145 642590 425722 252780 64826
38488 64826 -43165 281878 938135 1148840 485350 -342866 -378938 192736 313030 -379387
38478 -379387 -1066752 -1019497 -550518 -269146 -70792 436188 955691 815261 102376 -354423
38468c54423J53176K44431l4263Q0576N29573N36494L0296k04343P7092J62657
38458A221266l06116o69608m06931j1990q2321l50209l07257p3952N1328K27626
38448g08164N36522M97682r4706n23121j94402L19323K22527j84253j86035M12
38438c14215k00377l83216J71841R12023O72204k82660n45226R2172L22189l72319
38428G2416q41163k83326M66326M81765J65683J84315K21543j66668m98276k25469
38418d22854K21242K43582J16378K48294K26323l42824p97205l81280L84049M79305
38408b4990K0637r2307K47059L76085K00087K49782M89964K72677m38285q67405
38398D33304o27239j95149m531R9710K82302L48885K03397N5517j5081j57220
$$ plain form
38468 -354423 -201247 43184 8921 89497 619070 1155564 1185860 981517 1058609 1221266
38458 1221266 915150 245542 -161389 -173379 -255700 -605909 -913166 -987118 -935790 -708164
38448 -708164 -171642 326040 231334 -291787 -486189 -166866 55661 -128592 -314627 -314215
38438 -314215 -514592 -897808 -725967 186056 858260 575600 30374 122546 444735 72416
38428 72416 -768747 -1052073 -585747 -103982 61701 246016 467559 300891 -197385 -422854
38418 -422854 -201612 41970 158348 406642 632965 290141 -507064 -888344 -504295 -24990
38408 -24990 -4353 -96660 150399 526484 726571 976353 1466317 1738994 1300709 433304
38398 433304 -193935 -389084 -393615 -293905 -11603 337282 540679 596196 581115 423895
38388D23895l16290k57305o9491p1551j91049o2167K32506K10857j30446k20362
38378d51403J13618L06895M763l17732j12597L87529N44103J83627l25232o12214
38368b78643n71476k73738Q9179K75371K04778M2401L585J55856L81757M19715
38358D48785P1875m33607n02302P6122O66727N41422r7390m24374k06230j6707
38348A24321k02958l71892j38513K48962L61080J72434r7910k91632k20953K44749
38338a72312P50843O46267p7339n80089l15446J70559J15946k86167k93231J53599
38328A12630M01944J82154n1989K3220R1417j81173n25297m56946K884L68159
38318c2997L37226J08258L5791J71241K47167N9207k52708l77204k34992p3744
$$ plain form
38388 423895 107605 -149700 -219191 -290742 -481791 -543958 -311452 -100595 -231041 -451403
38378 -451403 -337785 -30890 -26127 -343859 -456456 -68927 475176 658803 333571 -278643
38368 -278643 -850119 -1123857 -1034678 -759307 -554529 -512128 -508543 -352687 29070 448785
38358 448785 520660 87053 -415249 -339127 327600 869022 771632 347258 141028 124321
38348 124321 -78637 -450529 -589042 -340080 21000 193434 95524 -196108 -417061 -172312
38338 -172312 578531 1224798 1147459 567370 251924 422483 538429 252262 -40969 112630
38328 112630 514574 696728 644739 667959 759376 578203 52906 -404040 -401156 -32997
38318 -32997 304229 412487 448278 619519 866686 925893 673185 295981 60989 -12755
38308a2755j29888l33961m37159l15616m0073K59730M64994M61891K15157j36319
38298c999l47542k78018k8560J47070J01202l5042k4215J11685Q5638j67706k54709
38287f94196J20878N80839N23148M3277j86203J0535N7640l17918n31096j43791
38277e36887K69449L0950l98849q7871P38235Q86368P5451n56005k34129K55914
38267D42626p8686p70575o35516L10012Q39712L50830l51242l32720K47664N94861
38257F16966L53151j97114o03156n41660Q179N93836O07419L8921m25510l18531
38247A32501lJ146j76778o9556K52396K85795p2771l78688l13809j8483K60674
38236i7576M08833L19397l0700l61073l61577j81236j97068l27198j27298L91460
$$ plain form
38308 -12755 -142643 -476604 -913763 -1229379 -1269452 -1009722 -544728 -82837 132320 -3999
38298 -3999 -351541 -629559 -658119 -511049 -409847 -444889 -469104 -357419 -271781 -439487 -694196
38287 -694196 -573318 7521 530669 573946 387743 398278 455918 138000 -393096 -536887
38277 -536887 -267438 -236488 -635337 -723208 15027 901395 976846 420841 186712 442626
38267 442626 363940 -406635 -1042151 -732139 107573 458403 107161 -225559 22105 616966
38257 616966 970117 773003 169847 -371813 -363634 230202 837621 876542 451032 132501
38247 132501 132498 133644 -43134 -112690 139706 425501 352730 -25958 -339767 -358250 -97576
38236 -97576 311257 630654 599954 238881 -122696 -303932 -501000 -828198 -955496 -564036
38226e64036O66790M56101J65635P8506p2042m00155m30454Q8240N34916K76507
38216H00008k89694l38334P1514J61138k36412m25915k3127M52404M20737k929
38206E89390m08657o48249o41736k04474M75497O93215J30394m82552k62677N22350
38196b37499P95496K50262k30302M0007N08252K69937n19435q57965l50853K84417
38186d7683K93338j39156l13810m709L94908M97320K89834l9926l08410l68321
38176B53385j99859R642O8190L8838J08737K51943K54775N6826j66773k72465
38166D03239k94193l17137l77696m59955m40774j50626L13331N20106K55900n7982
38156f05787Q1637M68788M96874J44551k1674J46526J28362k98656n91767l33221
$$ plain form
38226 -564036 102754 558855 724490 802996 730954 330799 -99655 -11415 523501 800008
38216 800008 510314 171980 243494 404632 168220 -257695 -280822 171582 592319 589390
38206 589390 180733 -467516 -1109252 -1313726 -838229 -145014 -14620 -497172 -759849 -237499
38196 -237499 557997 808259 577957 617964 1126216 1396153 876718 18753 -332100 -47683
38186 -47683 245655 106499 -207311 -212020 182888 680208 970042 930116 621706 253385
38176 253385 53526 63168 131358 170196 278933 530876 785651 842477 675704 403239
38166 403239 109046 -208091 -585787 -1045742 -1486516 -1637142 -1323811 -803705 -547805 -605787
38156 -605787 -524150 -55362 441512 586063 564389 710915 839277 540621 -51146 -384367
38146c84367Q3404J58463Q1346K17889L20724j8040m81096l86245K18748N67059
38136C77885K80599j80019k63095K2122L37565M48493K67576j62113n62587n82303
38126a5877k06935J91587K91585J23045r5321k14029j98089q6683L0048Q6115
38116i4554R5408Q0885K4335m9045n8044j4430l0594r8838o0194J06843J91053
38105I2825O0752j57022l03043l24975j40067K63210N21881K11070l84307m28959
38095e88635K38649P21473L57923k97946m24897j93597k39452m25084j38780M89731
38085e00615P01916L13406j31267l25219m12149l11814J89428O67412M06019l57745
38075B39372n65574N0440N29483K22431k70546k51481l9483j84217l68577k397
$$ plain form
38146 -384367 -300963 -142500 -61154 156735 477459 459419 -21677 -407922 -189174 377885
38136 377885 658484 478465 215370 237492 575057 1023550 1291126 1129013 566426 -15877
38126 -15877 -222812 -31225 260360 383405 288084 74055 -124034 -210717 -180669 -94554
38116 -94554 854 81739 106074 57029 -1015 -15445 -46039 -144877 -205071 -98228 92825
38105 92825 153577 -3445 -306488 -631463 -771530 -508320 13561 224631 -159676 -588635
38095 -588635 -349986 371487 729410 431464 6567 -187030 -426482 -851566 -990346 -500615
38085 -500615 201301 514707 383440 58221 -353928 -665742 -476314 191098 597117 239372
38075 239372 -326202 -275762 253721 476152 205606 -45875 -85358 -269575 -638152 -640549
38065f40549O19049O72928O8667m50759l89641m3768O6594j46640l36098j55465
38055g35682L06663N12877J11156m42194l44084L80717P66404K59697m39443l98898
38045b2787K14041M95660J54228k50531k90366j72302j67814j25041J83400N68106
38035E86594N78956P7261n16075o19636j52265L17971K44042j99985l93532j59410
38025b36079Q0742O9457O1158K05764J86618j37166k80243J20394N46798K79856
38015H97299m29223o30757p1778M29751J88376l98711m78632P8120N70184M02299
38005E56928k34989o69336n12844j324L47647K72983n5342k73588j46091K48716
37995d67240N37227L67708j39887m09021j00769L73082L73847o1340l07866j15929
$$ plain form
38065 -640549 -21500 651428 720095 269336 -120305 -164073 -97479 -244119 -580217 -735682
38055 -735682 -429019 83858 195014 -247180 -591264 -210547 555857 815554 376111 -22787
38045 -22787 191254 686914 841142 590611 300245 127943 -39871 -164912 18488 586594
38035 586594 1165550 1242811 726736 107100 -45165 272806 516848 316863 -76669 -236079
38025 -236079 -155337 -85880 -24722 181042 367660 230494 -49749 70645 617443 897299
38015 897299 468076 -162681 -234459 195292 383668 -15043 -493675 -415555 154629 556928
38005 556928 321939 -347397 -860241 -861565 -513918 -240935 -296277 -569865 -715956 -467240
37995 -467240 69987 437695 297808 -111213 -211982 161100 534947 473607 165741 49812
37985D9812O4061j46649m86520n29632k96262n9122J14053K79793L52418K50704
37975d07344J03850L3650n8268k26478k40099Q8448N15712O18996L25759n5112
37965F99114k31302j58332K0111R9058j3737j48471n4270K00236K44138o5221
37955E91324l89666l53021j7530K38503J46012k31580n16296k83277M04490Q24043
37945D13002M11462l23891l58477L22806N95377j00738q03589m23039O13094R74481
37935A320488K82089n45741o52535j53047L40274M46584J47620l25851n89519
37926B70362m03298L7002L04931K24340j3915j18736O1370M09371N38618J61888
37916A471933m40655o71477m44291k77299l77979k78544K38980N55658J74126
$$ plain form
37985 49812 113873 -32776 -519296 -1048928 -1345190 -1404312 -1290259 -1010466 -658048 -407344
37975 -407344 -303494 -269844 -328112 -554590 -794689 -706241 -190529 428467 754226 699114
37965 699114 467812 309480 329591 428649 414912 266441 212171 412407 656545 591324
37955 591324 201658 -151363 -168893 69610 215622 -15958 -532254 -815531 -411041 413002
37945 413002 824464 500573 142096 464902 1060279 959541 155952 -267087 346007 1320488
37935 1320488 1602577 1056836 404301 251254 591528 1038112 1185732 859881 270362
37926 270362 -132936 -95934 208997 433337 419422 300686 362056 771427 1310045 1471933
37916 1471933 1031278 359801 -84490 -361789 -739768 -1018312 -779332 -223674 -49548
37907d9548l49059k17272L36203M79114J43925m051J96542J84974k46785n52810
37897g8767l24287J22569K92578J02204k47949n16603m37475M7153N10930M57080
37887g2567K3681j90575K0643L00274L69268K84589Q7359k20335l75542j56308
37877G0487N7818k58651p77417o21057K17927O99691K97537j97100K5829N21352
37867C6416L80112k95315n71737p2619N89327P23572L21434j53630l39754k52210
37857C65596j77277l00173m05388j37871L86146N69658J19975n03298o95234m42489
37847a220355j26749J13333L99729O74468O97295M61748K43012J80194J02282
37838A524957j32863l53310k98351l4303N1166k54823o33227n87066j38099J43068
$$ plain form
37907 -49548 -398607 -615879 -279676 199438 343363 339312 535854 720828 474043 -78767
37897 -78767 -403054 -280485 12093 114297 -133652 -650255 -1087730 -1040577 -529647 -72567
37887 -72567 -48886 -239461 -218818 81456 450724 735313 822672 602337 226795 70487
37877 70487 128305 -130346 -907763 -1528820 -1310893 -611202 -313665 -510765 -484936 36416
37867 36416 416528 121213 -450524 -523143 66184 789756 1111190 957560 617806 365596
37857 365596 188319 -111854 -517242 -655113 -268967 300691 420666 -82632 -777866 -1220355
37847 -1220355 -1347104 -1233771 -834042 -159574 537721 999469 1242481 1422675 1524957
37838 1524957 1392094 1038784 740433 706130 757296 502473 -130754 -717820 -855919 -712851
37828g12851n0306k74290m136N13137N99748J84108j18023K5453K35413J35584
37818E33837q2131j02638j7695m4710q9232K2923J56896R6083m5006j872J80240
37807F06695K11337K5375j09360K3910K80112K98774o9695n06781n02975j943
37797B55449M07421K20269k28881j99736L20437N21671k5153o78185o21848K4902
37787c654M95732M45894J90614M5548l0643j27418j46499J578K01711K27486n4407
37776A245942n20916p63323m07594L61926Q07491M40845l32928o84443l55778
37767b08778J64604L88747L24989J73889k9631k44625k40739P4042L50241K05018
37757I57757j61186j85894J81254L10339j52487o14782l27499M32746O50141K5245
$$ plain form
37828 -712851 -763157 -1037447 -1041583 -528446 71302 255410 137387 162840 398253 533837
37818 533837 451706 349068 331373 286663 197431 220354 377250 473333 428327 426455 606695
37807 606695 818032 843407 734047 757957 1038069 1336843 1267148 760367 257392 255449
37797 255449 662870 883139 654258 454522 774959 1296630 1271477 593292 -28556 -3654
37787 -3654 492078 937972 1128586 1174134 1143491 1016073 869574 871152 1072863 1300349 1245942
37776 1245942 725026 -38297 -445891 -83965 723526 1164371 831443 147000 -208778
37767 -208778 -44174 344573 669562 843451 813820 569195 328456 402498 752739 957757
37757 957757 796571 610677 791931 1102270 949783 335001 7502 440248 1090389 1115634
37747A115634n80867m09720J55527K94140m0612k61092j59967n8454o3954J06724
37737I7359M92652O81973M16743n0567l67927m72189m42652l28015k35487k58972
37727d67082k42099L5452L91530L89808M5000j02357J92989M64679K50352j80116
37717G78156k24897J63980M18379J24728m51224o84389l26744J59745J09983m73178
37707d05461q09694l40852M53942O99882L73190K48760O24319Q51861L88572l57057
37697A727462o59810m60330k28867j92766j84189o3457J08538K18815J62338j10091
37687C17643m13888m06970m8253K48386J49747j23661j13138K58897O21363N93120
37677A083246J33122m24315n98775k04604L79741N96196L67119P2489j05605l51162
$$ plain form
37747 1115634 534767 125047 280574 574714 534102 273010 113043 54589 -9365 97359
37737 97359 590011 1271984 1688727 1638160 1270233 798044 355392 27377 -208110 -467082
37727 -467082 -709181 -673729 -282199 107609 152609 50252 243241 707920 958272 778156
37717 778156 553259 717239 1135618 1260346 809122 124733 -202011 -42266 67717 -405461
37707 -405461 -1215155 -1556007 -1102065 -402183 -28993 219767 844086 1695947 2084519 1727462
37697 1727462 1067652 607322 378455 185689 1500 -61957 46581 265396 427734 317643
37687 317643 -96245 -503215 -551468 -303082 -153335 -276996 -390134 -131237 490126 1083246
37677 1083246 1216368 792053 193278 -11326 368415 964611 1331730 1404219 1298614 947452
37667I47452o46361n95181p9456M15136M83454L56471L62570K79503k27253q37169
37657D59166q68764k21728N11455Q28692P38086M20051l3770m47603n55690l58217
37647D71678j77641j78703j15880J94499M06681N9241o15970p94976j58039N75662
37637c33448O20042K33837J98739M50592K00752n12694n62154M43087J184839
37628A923592M60784q98070j183288k88480L80708J74875j29042M1296K14467
37619F96842j837k14903j07469M0867O1732J40775J01781m49029j029276o23589
37609a384106N21801Q90224L7399o03130o8366N87873K48937l13237L2411O16464
37599E66270J68141p85117o93697L97345R58954M68239o2704m7263o1054l83386
$$ plain form
37667 947452 301091 -294090 -373546 41590 525044 881515 1244085 1523588 1296335 459166
37657 459166 -409598 -631326 -119871 708821 1446907 1866958 1833188 1385585 829895 471678
37647 471678 294037 115334 -546 193953 600634 659875 43905 -751071 -909110 -333448
37637 -333448 286594 520431 719170 1169762 1370514 857820 295666 738753 1923592
37628 1923592 2384376 1486306 303018 14538 395246 570121 441079 482375 696842
37619 696842 695005 480102 372633 413500 475232 616007 717788 268759 -760517 -1384106
37609 -1384106 -862305 27919 65318 -537812 -606178 -18305 230632 -82605 -50194 566270
37599 566270 734411 -50706 -744403 -347058 611896 1080135 1017431 970168 909114 525728
37589E25728l99549R3824L41521o7909m58492j68365N02061R11939Q86679N30951
37579B698388n4559n44898n31079j58532k1431k33246k46496J98682N88579L69312
37569B064720l40609r82591j098715n70374K65142P41581N24041M7242j23434
37560E27003j07289l14227n56761l34094J99489L93998J44442m2103K6938L3850
37550b8754j28388j91031o6402Q8623K65260M30480K36979l55520n68091J48833
37540a68011R73596P62981j26312m04675K8774P0610n37100p94084k86613J77779
37530c03055J61010K38789N55713L28313n34101q65776j48359M94618J89712k19163
37520a02299K22113P93501L32652p40849j105453n58888K1318K43143M28375N97290
$$ plain form
37589 525728 126179 220003 561524 493615 35123 -133242 368819 1280758 2167437 2698388
37579 2698388 2643829 2098931 1567852 1409320 1387889 1154643 908147 1106829 1695408 2064720
37569 2064720 1724111 741520 -357195 -927569 -662427 79154 603195 650437 527003
37560 527003 419714 105487 -451274 -785368 -585879 -191881 -47439 -89542 -62604 -28754
37550 -28754 -157142 -348173 -414575 -325952 -60692 369788 606767 251247 -316844 -168011
37540 -168011 805585 1568566 1442254 1037579 1066353 1136963 599863 -194221 -480834 -303055
37530 -303055 -142045 96744 652457 980770 446669 -419107 -567466 -72848 116864 -102299
37520 -102299 119814 913315 1245967 505118 -600335 -1159223 -1137905 -894762 -466387 130903
37510A30903M12375k510j48115L4601J71589J20342K3341o7478j14714L2404K71862
37499H64600K06944j58061k88687n9652k7635l11521j94223M96583P22961r3741
37489A157568q24135k91984P49536P58419j85700o94710l50423m3062j95541k13713
37479a33745J88992M85515L80617K20657J62765l5310k54443n7984L60003K78278
37469A595345l21245o18486k75993P9577p395j46013M0374K20740J9659k87096
37459B99467k37960J17883L77309K99480n6810m04109l66883R7914M64643K51522
37449H42456k49537l88006j43827l0655j25703K204L73155M41210L1897l33361
37439D19833k93903j27721r4890K2289L62045N49528K46964k79268n21232l65745
$$ plain form
37510 130903 543278 540768 392653 427254 598843 719185 742526 675048 560334 592738 864600
37499 864600 1071544 913483 624796 565144 537509 225988 31765 528348 1251309 1157568
37489 1157568 333433 41449 790985 1549404 1363704 668994 318571 275509 79968 -133745
37479 -133745 55247 540762 921379 1142036 1304801 1269491 1015048 957064 1317067 1595345
37469 1595345 1274100 655614 379621 459198 451803 305790 346164 566904 586563 299467
37459 299467 61507 179390 556699 856179 799369 395260 28377 126291 590934 842456
37449 842456 592919 204913 61086 30431 -95272 -93068 280087 721297 753194 419833
37439 419833 125930 -1791 -96681 -74392 287653 837181 1084145 804877 283645 -82100
37429h2100q4838P7021R6534J07390K30445L69549K79619j0960j12671J15384
37419I85373K35308o7480l72723j97636J50804J38729O383K74152N74302J06969
37409A834181q45540j071010k35503O03600N85326Q7325k05943k78277l23758
37400A50401j90930J54095L25338J72607Q2398K12057J34554l13108n63099k15574
37390e1261K77157L65058J96879J15326m131k98767l89447K3402N07229M92901
37380A234346J32989m1935K4805K25j78420k71931j78883K339J61300J53531j26061
37369I12305m39153l60985O2556K90872J16175o2993j8447n0424k61160k43471
37359e4725Q5251J52737k40301m15666J4293L64973P1845k34716J40406N94606
$$ plain form
37429 -82100 -166938 -89917 6617 114007 344452 714001 993620 982660 869989 985373
37419 985373 1220681 1153201 780478 582842 733646 872375 878758 1152910 1727212 1834181
37409 1834181 988641 -82369 -317872 285728 871054 958379 752436 474159 150401
37400 150401 -40529 113566 438904 611511 693909 905966 1040520 727412 164313 -51261
37390 -51261 225896 590954 787833 903159 899028 600261 210814 234216 741445 1234346
37380 1234346 1367335 1325400 1350205 1350430 1172010 900079 721196 723535 884835 1038366 912305
37369 912305 473152 112167 174723 465595 581770 518777 500330 449906 188746 -54725
37359 -54725 30526 183263 -57038 -472704 -458411 -93438 -21593 -256309 -115903 478703
37349D78703K38854m18627k49426M78300M42288n04674j043042n04489K19249
37340h62864L10998J93819M07779N25305N9866m64433l14777K15010L12881l2538
37330C51046j36984J77024L51875P2124k69598k60720n6272N385k5058J05576
37320C14398K93398J35517l90823o79780k32976N53963P89935K78192k13256q8401
37310G60167K18958J8393m44331l22746M45563R22260N17521j74916l10264k715
37300A627890j338m52166o70692j90328N40835P92770M94235J30619p5584l41354
37290A854887o70235o28015p3271M03711K69992j24585j34505J10487K6180k62564
37280G72082q5553M57391M80317j50367m56798j3810K64679k27619n91219J0567
$$ plain form
37349 478703 717557 298930 49504 527804 970092 465418 -577624 -1082113 -862864
37340 -862864 -551866 -358047 49732 575037 634903 170470 -144307 70703 383584 351046
37330 351046 214062 391086 742961 815085 545487 284767 228495 233880 208822 314398
37320 314398 607796 743313 352490 -327290 -560266 -6303 783632 1061824 848568 760167
37310 760167 979125 997518 553187 230441 676004 1598264 2115785 1940869 1630605 1627890
37300 1627890 1626552 1174386 503694 313366 854201 1646971 2141206 2271825 2196241 1854887
37290 1854887 1184652 556637 483366 887077 1157069 1032484 897979 1008466 1034646 772082
37280 772082 686529 1143920 1624237 1473870 1017072 1003262 1267941 1040322 449103 459670
37270D59670O88691J93255q88181r78258m3069N17837K88736K51720O86309O04818
37260A781528k21842n41579K26843Q05258J44957p77842o25761Q4370L3361n59068
37250C50225m23804M45214P82176K43090j13379K26817L81454k68801r04263n87268
37240A31461K19123M10226j04402m60751k45014N8339J6713q8070J97372P31954
37230H66951R02611L85517m54918r49931p83272k02861L21054M94883K95206j01601
37220G73639l87548l18722J4319K64735K78612K46825K89194K11489p3862k33434
37210A065247k0111J96791o6802n62464n75270o097M36913K50939k23375l98737
37200I7034j88429J24993L53175M09260J86143k26435m45836k36533J36011K59252
$$ plain form
37270 459670 1148361 1341616 453435 -524823 -567892 -50055 238681 490401 1176710 1781528
37260 1781528 1559686 1018107 1244950 2050208 2195165 1417323 791562 875932 909293 350225
37250 350225 -73579 371635 1153811 1396901 1283522 1510339 1891793 1622992 718729 131461
37240 131461 350584 760810 656408 195657 -49357 8982 25695 -62375 134997 866951
37230 866951 1769562 2155079 1700161 750230 -33042 -235903 85151 580034 875240 773639
37220 773639 386091 67369 81688 346423 625035 871860 1161054 1372543 1298681 1065247
37210 1065247 1045136 1241927 1175125 612661 37391 31294 468207 719146 495771 97034
37200 97034 -91395 33598 386773 796033 982176 755741 309905 73372 209383 468635
37190D68635J08932j4337P7934L09328M68319L20599j99640p46177p90771l11590
37180c08768Q2912O780j17824K34121P68339P66495J79737l54129m98138n09765
37170B49760n16800k48565K96772O00685L82494M1382k2183J6478p3020k6815
37160G00188L76067O78344L27227l91033o91926m04747n8883N5585J82688L93694
37150A167204L16801j61896n23073l13741J96264M22032K17697j09331k84454
37141I27503k42169j1092K63660L09872J5493l50442m20733j64190J38981K67143
37131G34026K17975P1118j12557k59484k92461j97294k9575J23676J71690Q6278
37121E13392k3099J0556K06029L84964L72435J82715j4299m6966J29901L77237
$$ plain form
37190 468635 577567 563230 641164 950492 1418811 1739410 1539770 793593 2822 -308768
37180 -308768 -225856 -219076 -336900 -102779 665560 1432055 1611792 1257663 759525 249760
37170 249760 -267040 -515605 -218833 381852 764346 805728 783545 800023 727003 700188
37160 700188 1076255 1754599 2081826 1690793 998867 594120 535237 590822 773510 1167204
37150 1167204 1484005 1322109 799036 485295 681559 1103591 1321288 1211957 927503
37141 927503 685334 674242 937902 1247774 1263267 912825 492092 327902 466883 734026
37131 734026 952001 1023119 910562 651078 358617 161323 131748 255424 427114 513392
37121 513392 490293 500849 706878 1091842 1464277 1646992 1632693 1585727 1715628 2092865
37111B092865M54985K43221j43492n05201p12827o54096k39095L57780O86675
37102A580815N27524K05194Q8340K2074l00425o35003m61606J23981M42359K02398
37092A795651j65175k32790m0220K57360N71930O01568O8447n95013n67705J08936
37082A802989M46967L1975l08649R0259O08414M15521j61859l06581o8114j2668
37072B538254o6439J77030M14733P7984m54938k99195M07916O33224J26868k21457
37062C333980J11232N44591M86173J67022J1205L2832K04924O14187R41871O31143
37052G079160j04783l20345K38116O63717L32367j18008Q4844N84653N86430J61854
37042I188005j0805K25320M60004N13096N45207N41785K96072j79525o43246q96404
$$ plain form
37111 2092865 2547850 2791071 2647579 2142378 1429551 775455 536360 894140 1580815
37102 1580815 2108339 2313533 2401873 2423947 2123522 1488519 1026913 1150894 1593253 1795651
37092 1795651 1630476 1397686 1357466 1614826 2186756 2788324 2856771 2261758 1694053 1802989
37082 1802989 2249956 2281931 1973282 2063541 2671955 3087476 2925617 2619036 2550922 2538254
37072 2538254 2471815 2648845 3063578 3141562 2686624 2387429 2795345 3428569 3555437 3333980
37062 3333980 3445212 3989803 4475976 4642998 4654203 4687035 4891959 5506146 6448017 7079160
37052 7079160 6974377 6654032 6892148 7555865 7888232 7770224 7855068 8439721 9026151 9188005
37042 9188005 9177200 9402520 9862524 10375620 10920827 11462612 11758684 11579159 10935913 10039509
37032A0039509q09067l56625J36049J86411j62685l44706k05780k80825p56684
37023G445597r46876m20917J07645j41571p01787o18003k8700J23209l16791n57379
37013C944427k50411M0078j03184l57167l56868k07682o5706J11908J96197p6316
37003B875276m91376m33557J74055O20549L95171j28072l21000j30119P6789R6511
36993B734227k0600j72191k22120o0754J74145J95395j174j15383n0093n9341
36983B402111k46125l22389r7079J63307J40014o1781j23386J6713J57783J52559
36973B181727K9272r7045j14941r244J05315J49703K04602K83711J48150l05800
36963B575450o29145l07587L69419N41881J2723l84617L2651Q01694R68246L57564
$$ plain form
37032 10039509 9230442 8873817 9009866 9196277 9033592 8688886 8483106 8202281 7445597
37023 7445597 6498721 6077804 6185449 6043878 5342091 4724088 4695388 4818597 4501806 3944427
37013 3944427 3694016 3734094 3630910 3273743 2916875 2709193 2643487 2755395 2951592 2875276
37003 2875276 2383900 1950343 2124398 2744947 3140118 3012046 2691046 2560927 2637716 2734227
36993 2734227 2713627 2541436 2319316 2258562 2432707 2628102 2626928 2511545 2461452 2402111
36983 2402111 2155986 1833597 1736518 1899825 2039839 1978058 1854672 1871385 2029168 2181727
36973 2181727 2210999 2113954 1999013 1989769 2095084 2244787 2449389 2733100 2881250 2575450
36963 2575450 1946305 1638718 2008137 2550018 2562741 2178124 2210775 3012469 3980715 4338279
36953D338279l16449m18451k4214L49117L23941k3275k64075p7768L51264N58610
36943D796979M22751K65436K85120K89618J36138k593m6198k17282n07133m09753
36933E013083L09636R78166P85376m9840n70010m32790k31805l84743m74701p8754
36923D863618L61850J17313o78235j103011o79788K8757K68340Q8060P1966L33475
36913C672345L58687r2889n06668l70985K1463N2642k15049j68981K87353N21797
36903C559715J94006j94109j23081J57448J48827q1734j89469k54972n07161o27600
36893B081870j46446N56180N32081k86599p80602k07414O71160O83194o4208m27920
36883B611296O3126O29651M82031j40301n31529n23711m02996k18136J89091O06334
$$ plain form
36953 4338279 4021830 3603379 3579165 3928282 4252223 4228948 3964873 3887105 4238369 4796979
36943 4796979 5219730 5485166 5770286 6059904 6196042 6193449 6147251 5929969 5422836 5013083
36933 5013083 5322719 6300885 7086261 7036421 6466411 6033621 5801816 5417073 4942372 4863618
36923 4863618 5225468 5342781 4664546 3561535 2881747 2910504 3178844 3266904 3338870 3672345
36913 3672345 4031032 3938143 3431475 3060490 3081953 3134595 2919546 2750565 3037918 3559715
36903 3559715 3753721 3559612 3436531 3593979 3742806 3661072 3471603 3216631 2709470 2081870
36893 2081870 1935424 2491604 3023685 2737086 1956484 1749070 2420230 3103424 3039216 2611296
36883 2611296 2674422 3304073 3786104 3645803 3114274 2590563 2187567 1969431 2158522 2764856
36873B764856N41459k0352m73768m07043j23375p7638j76274k6252L72481O22261
36863B996355N16935K51375O2070j9563m4192m8717j05688k47231l45313k64735
36853B751296q0957O4066K13114M27413N02403K21378j91003k98796j16149p6430
36843C416335l04253m13432j57067J96638L24588K51922J05703r4181j94048O4589
36833C196794N11577N42672j4624n31272m82756k05901k22286l21485l6066L64003
36823B800656K23453l30547m85785m0257K93119R2369j20025J37796M16444Q8613
36813C075836n22238n62432J7022L53342j9375m77924k86113K74525L44857j70764
36803B026736m07821J61964Q57100O97648j68057o10245n8142P54455Q18610J20095
$$ plain form
36873 2764856 3306315 3285963 2812195 2405152 2281777 2204139 2027865 2001613 2374094 2996355
36863 2996355 3513290 3764665 3826735 3807172 3762980 3714263 3608575 3361344 3016031 2751296
36853 2751296 2670339 2734405 2947519 3374932 3877335 4098713 3907710 3608914 3492765 3416335
36843 3416335 3112082 2698650 2541583 2738221 3062809 3314731 3420434 3326253 3132205 3196794
36833 3196794 3708371 4251043 4236419 3705147 3222391 3016490 2794204 2472719 2436653 2800656
36823 2800656 3024109 2693562 2207777 2167520 2460639 2553008 2432983 2570779 2987223 3075836
36813 3075836 2553598 1991166 2008188 2361530 2342155 1864231 1578118 1852643 2197500 2026736
36803 2026736 1618915 1780879 2637979 3335627 3167570 2557325 2499183 3253638 4072248 4192343
36793D192343n01552m40990J32568O45782O69123J77974m51239p41535n64457
36784C118017j85914J87960N99453R25311P42562J5397m99508j47415N76218N90416
36774E922497k22459q00325l95772M40288P62980N39873M62381P67130R15848
36765H392441M75292k29771o05941o01627o42005q66212q90412m89546q7984j51821
36755D302414l78893j11702N25231O51106k6717o59456m81666R5230K33519o2438
36745D086628j99420q4692q4474j56297N6121L66856K06962l34601n21740j45469
36735C189874J81336J06083M4112K79568L86012Q091m66989n16273k01545J45708
36725C155977M17868N16879K27735k67242l41473J44970M81281J89972j79433
$$ plain form
36793 4192343 3690791 3249801 3382369 4028151 4697274 4875248 4424009 3682474 3118017
36784 3118017 2932103 3120063 3719516 4644827 5387389 5402786 4903278 4755863 5332081 5922497
36774 5922497 5700038 4899713 4503941 4944229 5707209 6247082 6709463 7476593 8392441
36765 8392441 8867733 8637962 8032021 7430394 6788389 5922177 5031765 4542219 4454235 4302414
36755 4302414 3923521 3811819 4337050 4988156 4961439 4301983 3820317 3915547 4149066 4086628
36745 4086628 3887208 3802516 3718042 3561745 3617866 3984722 4191684 3857083 3335343 3189874
36735 3189874 3371210 3477293 3521405 3800973 4186985 4195076 3728087 3211814 3010269 3155977
36725 3155977 3573845 4090724 4318459 4051217 3709744 3854714 4335995 4525967 4346534
36716D346534J6906M27476L41325j17171l14823k23294k72609l90232j66672J93845
36706C841285R7366l06755k36763L72476O43841J63245l37364j61131L06464L34756
36696D717420L744o9273K26753L98896J47579k65283m29767k31876J10496K63473
36686D872162R0574j44825m5612L54755N37411J78504l67108n18154k16991P3237
36676D813953M2947q3184R8296N97465R42433O96099K3840m02834j82948K92864
36666F838931L45981p2256l27867O488N93137Q23596N64616J83300L8013J75049
36656I168988M04330M85607L11831K1609j45949j42454j01883k0686K85452P74321
36646A1041166J011178O78613P6085j96551J4863K80130K01503j05291k59531
$$ plain form
36716 4346534 4363440 4790916 5132241 5015070 4700247 4476953 4204344 3814112 3647440 3841285
36706 3841285 3938651 3631896 3395133 3767609 4411450 4574695 4237331 4076200 4382664 4717420
36696 4717420 4721164 4651891 4878644 5277540 5425119 5159836 4730069 4498193 4608689 4872162
36686 4872162 4962736 4817911 4772299 5127054 5664465 5842969 5475861 4957707 4740716 4813953
36676 4813953 4856900 4773716 4872012 5469477 6411910 7108009 7131849 6729015 6546067 6838931
36666 6838931 7184912 7112656 6784789 6791277 7384414 8208010 8772626 8955926 8993939 9168988
36656 9168988 9573318 10058925 10370756 10392365 10246416 10103962 10002079 9981393 10266845 11041166
36646 11041166 12052344 12730957 12807042 12610491 12625354 12905484 13106987 13001696 12742165
36637A2742165j42440K3458M7544O359M9169J40876J42856M0705q9383k51141
36627A2710168m27220l98514k6198L11382O0726o09871q41419l09646K21188Q6635
36617A0777231j94251J57640P14286M26041n56109r22931k04214N32913M06213
36608A1136819l4754L9956L76608L13486o509r5244j41772n09523p19505j02075
36598A0257487Q47291R84924K96507n8143M21156Q93607O49724J42264P455L1258
36588A4473530j94146l60415j9938M70529M39047L413j28612K07687M78825M05548
36578A5775468L30449M86523N53282K72632K1644L04822R16795J110154O16511
36569B0388280P7810K16745Q36509J056291N30783k7259J89300R55438J331635
$$ plain form
36637 12742165 12599725 12623183 12670727 12677086 12726255 12867131 13009987 13050692 12961309 12710168
36627 12710168 12282948 11884434 11858236 12169618 12230344 11620473 10779054 10469408 10690596 10777231
36617 10777231 10582980 10740620 11454906 11880947 11324838 10401907 10197693 10730606 11136819
36608 11136819 11102065 11142021 11518629 11832115 11825606 11730362 11588590 11079067 10359562 10257487
36598 10257487 11104778 12089702 12386209 12328066 12749222 13642829 14292553 14434817 14442272 14473530
36588 14473530 14279384 13918969 13899031 14369560 14808607 14812020 14683408 14891095 15369920 15775468
36578 15775468 16105917 16592440 17145722 17418354 17439998 17744820 18661615 19771769 20388280
36569 20388280 20466090 20682835 21519344 22575635 23106418 23079159 23268459 24223897 25555532
36560B5555532R60539M89775O21542J239348J709757J671324J247370P70797N89010
36551C4854994R09330J537387J928163J762628J355242J278632J712489K344704
36543D7683569K760567K756180K456414K306499K721110L531419M046177L922668
36535G2184603L672710L956818M699310N374449N869827O435604O970331P140232
36527A16303884P237754Q096183R857314J1540651J2301224J2546061J3249815
36520A91132886J4622314J6109568J7391178J8599128J9619665J9950960J9443606
36513C16869305J8561847J7585810J6033130J3294809R526314N431990J320413
36506C98623618l115354q004059j2697789j6236324j8255614j9216331j9779079
$$ plain form
36560 25555532 26516071 27005846 27627388 28866736 30576493 32247817 33495187 34265984 34854994
36551 34854994 35764324 37301711 39229874 40992502 42347744 43626376 45338865 47683569
36543 47683569 50444136 53200316 55656730 57963229 60684339 64215758 68261935 72184603
36535 72184603 75857313 79814131 84513441 89887890 95757717 102193321 109163652 116303884
36527 116303884 123541638 131637821 141495135 153035786 165337010 177883071 191132886
36520 191132886 205755200 221864768 239255946 257855074 277474739 297425699 316869305
36513 316869305 335431152 353016962 369050092 382344901 391871215 397303205 398623618
36506 398623618 395508264 387504205 374806416 358570092 340314478 321098147 301319068
36499C01319068k0145494k0069561j9372087j8255816j7067510j5900149j4619244
36492A75889207j3254070j2105300j1323840j0601111r556559q319107p364424
36485A03364796o775627o102459n135163m372768m313201m596898m428504l726078
36477F3914098l199306l196458l151512k526668j724484j486749j751212j790096
36469D5087613j357441j001845j134682j400687j264981p83364m23705l91305
36461C7329603m81630m62476l19047j80466j74401k77744k35362J74934O95539
36452C6068950P28372J75194j97151L28663J367557J857764J475264R94733J109022
36443D3908368J529135J638503J525608J777788K501722L164388L386965L380032
$$ plain form
36499 301319068 281173574 261104013 241731926 223476110 206408600 190508451 175889207
36492 175889207 162635137 150529837 139205997 128604886 119048327 110729220 103364796
36485 103364796 96589169 90486710 85351547 80978779 76665578 72068680 67640176 63914098
36477 63914098 60714792 57518334 54366822 51840154 50115670 48628921 46877709 45087613
36469 45087613 43730172 42728327 41593645 40192958 38927977 38144613 37720908 37329603
36461 37329603 36847973 36385497 36066450 35885984 35711583 35433839 35198477 35373411 36068950
36452 36068950 36797322 36972516 36775365 37104028 38471585 40329349 41804613 42799346 43908368
36443 43908368 45437503 47076006 48601614 50379402 52881124 56045512 59432477 62812509
36435F2812509L503933L832283M292920M851427N356739N557985N535581N801816
36427A01545193O633133P542044P812776P407026O884400O476176N757234M382188
36419A54440170K682491J208243k2887j425979l128333m736016n856011o553907
36411A36607771p152275p743685q080771p924502p375698o788189o383552o062540
36403G9096559n659948n251452n003203m785469m269031l504631l042115l175871
36395D4404839l358510k838101j778602j189529j594688k275885k205440j381487
36387B7782597p25263p79705j080986r66402n17527l19561n54864q15758p83088
36378B1239443o27535n79097m90609j57385J75204N1499m97545r00525p72794
$$ plain form
36435 62812509 66316442 70148725 74441645 79293072 84649811 90207796 95743377 101545193
36427 101545193 108178326 115720370 123533146 130940172 137824572 144300748 150057982 154440170
36419 154440170 157122661 158330904 158308017 156882038 153753705 149017689 143161678 136607771
36411 136607771 129455496 121711811 113631040 105706538 98330840 91542651 85159099 79096559
36403 79096559 73436611 68185159 63181956 58396487 54127456 50622825 47580710 44404839
36395 44404839 41046329 38208228 36429626 35240097 33645409 31369524 29164084 27782597
36387 27782597 27057334 26277629 25196643 24230241 23712714 23393153 22838289 22022531 21239443
36378 21239443 20611908 20032811 19542202 19384817 19560021 19611520 19113975 18213450 17440656
36369A7440656l60378j02039m3794O1592K63711L14744K2579m85796q57292q05642
36359A5448341l99956j09004l74011j021826j328058q72456j19742J46172j94265
36350A1175195n46452m66204j57903k4290q2482n5496J46163K77775R3295k88732
36340A0070869m42229j29683L21116L73825O1250L2027N72585J002501N66957
36331A2429218l59842o83613j39281L67711J48583l39189l89910j88351l72458
36322A0472868q94920j086105o91432j63865N9612j5499k68376o41150q68519
36313E902614n78952R6108M81056K21755k15630k58835m3894l2458j43990N7619
36303E485393M27907K80842m48525q42838k87925N04694M83441j64601l48532
$$ plain form
36369 17440656 17080278 16978239 16934445 16996037 17259748 17574492 17597071 17111275 16253983 15448341
36359 15448341 15048385 14939381 14565370 13543544 12215486 11343030 11223288 11369460 11175195
36350 11175195 10628743 10162539 10004636 9980346 9897864 9842368 9988531 10266306 10359601 10070869
36340 10070869 9628640 9498957 9820073 10193898 10255148 10287175 10859760 11862261 12429218
36331 12429218 12069376 11385763 11246482 11614193 11762776 11423587 11033677 10845326 10472868
36322 10472868 9577948 8491843 7800411 7636546 7696158 7680659 7412283 6771133 5902614
36313 5902614 5323662 5419770 5900826 6122581 5906951 5648116 5604222 5571764 5427774 5485393
36303 5485393 5913300 6194142 5745617 4902779 4614854 5119548 5602989 5438388 5089856
36294E089856J69672M25138j30918p18222n02310J08100K46733k1443o7966M6751
36284D645391k00165n93965m04449K31371L64135j61720l81895J25374M82130
36275D106207P1913l00189K29985J010016Q56308j8281l69174Q7443L57109j20416
36265E910921o36058m36759J43669L00673q8208m43613l21060J07167L14951L0268
36255D881951l91033l22160K78781O73804L25933k82790l43020P3227K01998j58493
36245D938198l79554n8548L97745M71393K15472j9778o5245P5097K99250L48558
36235F222588R5146q0377K61802P65752N79315l15599q49458l29209N56844P42784
36225G649588K03625k73596k89986r9745N6520J92068K47669J19797K564K03158
$$ plain form
36294 5089856 5259528 5684666 5553748 4835526 4333216 4441316 4688049 4666606 4598640 4645391
36284 4645391 4445226 3851261 3446812 3678183 4042318 3880598 3498703 3624077 4106207
36275 4106207 4178120 3877931 4107916 5117932 5974240 5955959 5586785 5674228 6031337 5910921
36265 5910921 5274863 4838104 4981773 5282446 5194238 4750625 4429565 4536732 4851683 4881951
36255 4881951 4490918 4168758 4447539 5121343 5447276 5164486 4821466 4894693 5096691 4938198
36245 4938198 4558644 4500096 4897841 5369234 5584706 5564928 5499683 5574780 5874030 6222588
36235 6222588 6317734 6237357 6499159 7264911 7844226 7528627 6679169 6349960 6906804 7649588
36225 7649588 7853213 7579617 7289631 7189886 7246406 7438474 7686143 7805940 7808504 8011662
36215H011662N96782P12864M24713J48669K40178N42076P15811P48211Q73261
36206A3014227J133590J308438J291811J278924J418581J493027J253830R59427
36198B3151855J115599J627525J768579J246765O98208O46263N81590j72469j175455
36189B9488460j439558j009938q68748j321751j657822j558388j604976j987324
36181A8039955j937245j114921m44607o99705j214470j018478m43201m37721q90672
36172I838935r01724l88704j62079m77922o77223l82373n1053j04266l23573l87417
36162E982601l52273l56265l65247l71626l94136k42797K23402O20941M00094
36153E144694k84559o45679k97075L20795O39454N66888K95936Q419j10440J0153
$$ plain form
36215 8011662 8608444 9321308 9746021 9894690 10134868 10676944 11392755 12140966 13014227
36206 13014227 14147817 15456255 16748066 18026990 19445571 20938598 22192428 23151855
36198 23151855 24267454 25894979 27663558 28910323 29608531 30254794 30836384 30663915 29488460
36189 29488460 28048902 27038964 26170216 24848465 23190643 21632255 20027279 18039955
36181 18039955 16102710 14987789 14543182 13843477 12629007 11610529 11167328 10729607 9838935
36172 9838935 8937211 8548507 8386428 7908506 7231283 6848910 6797857 6693591 6370018 5982601
36162 5982601 5630328 5274063 4908816 4537190 4143054 3900257 4123659 4744600 5144694
36153 5144694 4860135 4214456 3917381 4238176 4877630 5444518 5740454 5748873 5638433 5648586
36143E648586J32330K5678p4954J98232O48278P30088M16198K14489L27499M50093
36133H716517M20252L84574K94920j3684k18439J55382P02440M39635o01055j155403
36123I125139n77108J68628O5577m14923l02938J74209P4058n90719r00832n61274
36113F259817k48482l96344o23399n40457l02344j26732M0856J42869q8782n78293
36103C538709p89415m46626P6975L39497L51259K49166q2023o61207j034342p28421
36093H13572O5825O65995O94768L81989J08110k6511j16667k09155k89286l50063
36083A738577l33986j21980K53800M60859J62030m87097q49616m83803L14006
36074F52790Q33413P34539K86386j17737l61258m45175k67815J65760M98782L23700
$$ plain form
36143 5648586 5780916 5806594 5731640 5929872 6578150 7308238 7724436 7938925 8266424 8716517
36133 8716517 9136769 9521343 9816263 9802579 9584140 9739522 10441962 10881597 10280542 9125139
36123 9125139 8548031 8716659 8782236 8367313 8064375 8238584 8312642 7721923 6821091 6259817
36113 6259817 6011335 5614991 4991592 4451135 4148791 4022059 4062915 4205784 4117002 3538709
36103 3538709 2749294 2302668 2379643 2719140 3070399 3319565 3237542 2576335 1541993 813572
36093 813572 879397 1545392 2240160 2622149 2730259 2703748 2587081 2377926 2088640 1738577
36083 1738577 1404591 1282611 1536411 1997270 2159300 1672203 822587 338784 652790
36074 652790 1486203 2220742 2507128 2389391 2028133 1582958 1315143 1480903 1979685 2303385
36064B303385k63803o69926m72765O7600L24209O8539k69237j79144K53349M68452
36054A630659J85195k50883l75738j90115j1101M5056J12059K06487J51894j08830
36044A394683l85356m75220l49882j01370J35495K32581J87371J33875J20523
36035H92700L5570j00444m0550K30955K83423j06001m25896j33850M08080M37347
36025A481334L5578k1230L65072L91091k70944q44613o38772j6137L56178M44666
36015A282223M35896J37784m66315p14277j57940N42205M76740j55612m20226
36006I60478n6309L72411M99473M35171J86788l06822o51885l89349J39254J82804
35996A372014k13217l25259n7801o7808m54235m63402J55329O15760M27419J85959
$$ plain form
36064 2303385 2039582 1369656 896891 964491 1288700 1357239 1088002 908858 1162207 1630659
36054 1630659 1815854 1564971 1189233 999118 988017 1033073 1145132 1351619 1503513 1394683
36044 1394683 1009327 534107 184225 82855 218350 450931 638302 772177 892700
36035 892700 928270 827826 787276 1018231 1301654 1195653 769757 635907 1043987 1481334
36025 1481334 1516912 1495682 1860754 2251845 1980901 1136288 497516 481379 837557 1282223
36015 1282223 1718119 1855903 1389588 675311 517371 1059576 1536316 1380704 960478
36006 960478 904169 1276580 1776053 2211224 2398012 2091190 1439305 1049956 1189210 1372014
35996 1372014 1158797 833538 775737 707929 253694 -209708 -54379 561381 988800 1174759
35986A174759L65740L83442k29730o82524j19022P64605O48862k89862o37241
35977A379029j7402L73965j95372q01034l87510N75108Q65555K67970l64091m31534
35967A264684j45773Q7459J41599L6125j48030k07658m8480R6731K7685k2747
35957A081595K15075M54120K36347k10680k02189K87264M85966J7275m98422m16929
35947A449422J016J45484O227l0934P2390R3769Q0835J86896K25065j2591k31828
35936A985751p0254J80202N819l66301k67252K38046L85988r712k58125R435K63111
35925B096708O4813k34239k61517k68545m32644k97610L69261Q51824M68134k56858
35915B099327l24845K09321M17632Q015l29963j15769K66074K99085K3236k67463
$$ plain form
35986 1174759 1540499 1923941 1694211 1011687 892665 1657270 2306132 2016270 1379029
35977 1379029 1361627 1735592 1540220 739186 351676 926784 1792339 2060309 1696218 1264684
35967 1264684 1118911 1206370 1347969 1384094 1236064 1028406 979926 1076657 1104342 1081595
35957 1081595 1296670 1750790 1987137 1776457 1574268 1861532 2347498 2364773 1866351 1449422
35947 1449422 1450438 1595922 1602149 1571215 1643605 1737374 1818209 2005105 2230170 2217579 1985751
35936 1985751 1915497 2095699 2101518 1735217 1467965 1706011 2091999 2082287 1824162 1833597 2096708
35925 2096708 2161521 1927282 1665765 1397220 964576 666966 1036227 1888051 2356185 2099327
35915 2099327 1774482 1983803 2401435 2409450 2079487 1963718 2229792 2528877 2552113 2284650
35905B284650m68923n39276l44685R8255M89301N44309K77521o7773k28392r8046
35895A946941J47377J82791o6712l06334k78344n2662K18647M84885N60984J90029
35885C027602l80140m65435K479J80339l32245o24017J23377J084615R02296j40709
35875C378162n50584l0462J90560l89564o73765L3801P24182L75171l40142k61117
35865B456242L30067L59975j20443j30708M31931O04972K8657m63651k39056J90927
35855C448913J12531k95332m00357j21032J16234J36040J73516L49978M27877
35846C948368J75704k77418n77222n26435k42682J2664P8857k2662j59120j88471
35836B221583n4767J48926K53305J96823P6231j3843o6065m0557J40889L79894
$$ plain form
35905 2284650 1815727 1276451 931766 1030021 1519322 2063631 2341152 2273379 2044987 1946941
35895 1946941 2094318 2277109 2210397 1904063 1625719 1573057 1791704 2276589 2837573 3027602
35885 3027602 2647462 2182027 2184506 2364845 2032600 1408583 1531960 2616575 3518871 3378162
35875 3378162 2827578 2797116 2987676 2598112 1924347 1958148 2682330 3057501 2717359 2456242
35865 2456242 2786309 3146284 3025841 2895133 3327064 3932036 3960693 3497042 3257986 3448913
35855 3448913 3561444 3266112 2865755 2744723 2860957 2996997 3170513 3520491 3948368
35846 3948368 4124072 3846654 3269432 2742997 2500315 2512979 2591836 2569174 2410054 2221583
35836 2221583 2166816 2315742 2569047 2765870 2842101 2828258 2762193 2721636 2862525 3242419
35826C242419M28474K81638K29690L03749R7097m72796p13691j18143O33637N08579
35816D420653k69042m83507J87391O89187K90954l49621m00320j30638j62325
35807C792732k65249J02286O18431N42900L4841m5504M16536N68173j1478n92491
35797E161177l79926L40912O65896K96250k16798l13279o0474J38888J67740K50329
35787F050715M58970N16205K75879R0953L07399O05943M10239j22765k08755L51056
35777H735839P99501N83283J74903K39721N98161O47837L50624J31718J40749
35768A2402336K45273M52261P21093O79779J88775j39513K65880R20081R28516
35759A6664481M27558L68781R09207J136197O31655K10191N73847J182657J211963
$$ plain form
35826 3242419 3670893 3952531 4182221 4485970 4583067 4110271 3396580 3278437 3912074 4420653
35816 4420653 4151611 3668104 3855495 4544682 4835636 4486015 4085695 3955057 3792732
35807 3792732 3527483 3629769 4248200 4791100 4825941 4780437 5196973 5765146 5753668 5161177
35797 5161177 4781251 5122163 5788059 6084309 5867511 5554232 5493758 5632646 5800386 6050715
35787 6050715 6509685 7025890 7301769 7392722 7700121 8306064 8716303 8593538 8384783 8735839
35777 8735839 9535340 10118623 10293526 10533247 11131408 11779245 12129869 12261587 12402336
35768 12402336 12647609 13099870 13820963 14500742 14689517 14550004 14815884 15735965 16664481
35759 16664481 17092039 17460820 18370027 19506224 20137879 20348070 20921917 22104574 23316537
35750B3316537Q92086R81480J389728J347474P82134M99736Q42538J104811P45608
35741C1902132M06003R48809J955887K164270J346631P46209J285423K234135
35733D2989499K350441J670375J228774J396963J565180J377901J203741J228830
35725E5011704J099624P75010P80316J194773J295083P20978J24349O8485J44327
35716F1214649j34920m25827l50625l61553q68192j286651j026311p00944j152787
35707E4906839j908948j957344j540784j686216k292997k301411j654058j434985
35699D0130096j919972k110861j568097j161370j439140j675475j271248q56104
35691B8127829j142583j697896j714134j198412o50870k75542j56145n06978j138733
$$ plain form
35750 23316537 24208623 25190103 26579831 27927305 28709439 29209175 30051713 31156524 31902132
35741 31902132 32308135 33256944 35212831 37377101 38723732 39469941 40755364 42989499
35733 42989499 45339940 47010315 48239089 49636052 51201232 52579133 53782874 55011704
35725 55011704 56111328 56886338 57666654 58861427 60156510 60877488 61001837 61070322 61214649
35716 61214649 61079729 60653902 60303277 59941724 59073532 57786881 56760570 56059626 54906839
35707 54906839 52997891 51040547 49499763 47813547 45520550 43219139 41565081 40130096
35699 40130096 38210124 36099263 34531166 33369796 31930656 30255181 28983933 28127829
35691 28127829 26985246 25287350 23573216 22374804 21723934 21448392 21292247 20785269 19646536
35682A9646536j351792r09079m40916m18938m87792k76514l2985M9137K42018
35673A6019675M94635K11509n70355q36908j67345M38664J76703k41141N3879
35664A5579316N06213K20112l27569j41265M60247M21031j65896l10913Q2365
35655A6323641K07909o8621r1603K39979L93762L72918O03802P75396K31805n47529
35645A8441459m03497N23126Q86417L88180K23550Q77973J242003O32885L6409
35636B2848505L56190Q88336O89465K14286L26302P02480N45785Q6891O0658L02889
35626B7021787J54193j99787m0672N44674Q12671O40953N60923O62802N30291
35617C0687835J89735R4041J73637q0781n30557m13932L48118Q56389N69093K7290
$$ plain form
35682 19646536 18294744 17385665 16944749 16525811 16038019 15761505 15728520 15777657 16019675
35673 16019675 16514310 16725819 16155464 15318556 15151211 15589875 15766578 15525437 15579316
35664 15579316 16085529 16305641 15978072 15836807 16297054 16718085 16552189 16241276 16323641
35655 16323641 16531550 16462929 16371326 16611305 17005067 17377985 17981787 18757183 18988988 18441459
35645 18441459 18037962 18561088 19447505 19835685 20059235 20937208 22179211 22812096 22848505
35636 22848505 23204695 24093031 24782496 24996782 25323084 26025564 26571349 26658240 26718898 27021787
35626 27021787 27175980 26976193 26935521 27480195 28292866 28933819 29494742 30157544 30687835
35617 30687835 30877570 30971611 31145248 31064467 30533910 30119978 30468096 31324485 31893578 31920868
35607C1920868j79159l09178p32766j023675n85730K39766N01972o5719p58044
35598B9008335r07130o05630l09802k12945k59539m31908o90215q00522n53858
35589B4236786j26187N1490j84506n67793q04965q77506q41925o44501l59222
35580A9881671l05439n90894q08257o25495m24843p44881j238103r83864N4044
35571A4213939P31395K75829o12650q09555l12937J3064j64866l72441l00795
35562A2660983k08898k67453k37646m2257m3969m04493o43796k79778L91348O19947
35552A1543988J90231l44491m46181k44118k12604m38608n31936k43301J45156
35543I418136K14796j8345j88399j24973j2106k0768q8643j24774j58482j90867
$$ plain form
35607 31920868 31741709 31432531 30699765 29676090 29090360 29330126 29832098 29766379 29008335
35598 29008335 28101205 27495575 27185773 26972828 26713289 26281381 25591166 24790644 24236786
35589 24236786 24110599 24162089 23977583 23409790 22604825 21727319 20885394 20240893 19881671
35580 19881671 19576232 18985338 18177081 17551586 17126743 16381862 15143759 14159895 14213939
35571 14213939 14945334 15221163 14608513 13798958 13486021 13499085 13334219 12961778 12660983
35562 12660983 12452085 12184632 11946986 11904729 11860760 11456267 10812471 10532693 10924041 11543988
35552 11543988 11734219 11389728 10943547 10699429 10486825 10048217 9516281 9272980 9418136
35543 9418136 9632932 9614587 9426188 9301215 9289109 9268341 9179698 9054924 8896442 8705575
35533H705575j41275l7353k9122j31996j93998j82471k28956l29476l29855k84562
35523F816511m25626o39195m50173K08413O84606M53264j30760l82497k54132
35514E880411k28339m72653o48145m78169n6097L66410N36841K47811m01724q84479
35504C861867p53093j97255K32367L34976L35193L71076L15071O8578k97357o47903
35494C623520p78217m67460J56236N28465L10676r2443j24093P2801l1918l89103
35484B808464m14459K4408L55231J66761k53710m36989l17356j17728k1112q3732
35474A709778j75587l543M75670P67264M13647k50784m76457j62514R8547M2292
35464B438313P0671M10906O37793L41187k70860p14784p37330l26348K92206N72571
$$ plain form
35533 8705575 8564300 8526947 8497825 8365829 8171831 7989360 7760404 7430928 7101073 6816511
35523 6816511 6390885 5751690 5301517 5509930 6194536 6647800 6517040 6134543 5880411
35514 5880411 5652072 5179419 4531274 4053105 3997008 4363418 4900259 5148070 4746346 3861867
35504 3861867 3108774 2911519 3143886 3478862 3814055 4185131 4500202 4568780 4271423 3623520
35494 3623520 2845303 2377843 2534079 3062544 3373220 3280777 3156684 3229485 3197567 2808464
35484 2808464 2394005 2418413 2773644 2940405 2686695 2249706 1932350 1814622 1793510 1709778
35474 1709778 1534191 1530648 2006318 2773582 3187229 2936445 2459988 2297474 2396021 2438313
35464 2438313 2508984 2919890 3557683 3898870 3628010 2913226 2175896 1849548 2141754 2714325
35454B714325J51102m70302m24036K14986M44388r5894n18641j42892L98280K63855
35444B535171j90563r1592M25416M51957j75607o23905l55652J79881L41180J39661
35434B635947J8484J77680L65097K01969l40350p65933n38533J83842O29636M03925
35424B971764j7680p4285O7575n8757l83440m68521k61886j07996j34977j36555
35414A395242m440J30571J50103N2305j07414j94625j08265k9874k09481m06216
35404F67906j13410M62089M32228l28558o81017P9435R11474N24242n28204o60661
35394G65524K18204N86686k22133r95708n91189L97922P26932L11954L2394K64040
35384A494626M86970J97579m13538p47129m74734J07856L74681Q5519l08945k70732
$$ plain form
35454 2714325 2865427 2395125 1971089 2186075 2630463 2534569 2015928 1873036 2271316 2535171
35444 2535171 2344608 2253016 2678432 3130389 2954782 2330877 1975225 2155106 2496286 2635947
35434 2635947 2654431 2832111 3197208 3399177 3058827 2292894 1754361 1938203 2567839 2971764
35424 2971764 2954084 2879799 2947374 2888617 2505177 2036656 1774770 1666774 1531797 1395242
35414 1395242 1390802 1521373 1671476 1723781 1616367 1421742 1313477 1283603 1074122 667906
35404 667906 554496 1016585 1448813 1120255 439238 518673 1430147 1954389 1426185 765524
35394 765524 983728 1570414 1348281 352573 -238616 159306 886238 1198192 1230586 1494626
35384 1494626 1981596 2179175 1765637 1018508 543774 651630 1026311 1111830 802885 532153
35374E32153J21409L95184L69531J74730j56602n56806o16736r0240M65306L08549
35364I46478l25785m99616K3129N08500M54764J72879J461j69198l22816j20195
35354F69601L66728M92983L344n21557n35641j96383J39655M05109M96218J78972
35344A499029l23681l57371J80022N72886L60819m3463j65359j30232j23530J8457
35334A487577K62262K31744O04J21300M71954J98114o39762o87666N21714J357750
35324C325591L94632j212189j309552P9502R89768N31076j85236j64091J49390
35315B598891N7918k72990m38742m79449m39128j02086M05738N14635R3734k45760
35305A692761p5432K48866K43636o388j42358o4733J12030K82851L40384K24686
$$ plain form
35374 532153 653562 1048746 1418277 1593007 1436405 879599 262863 172623 637929 946478
35364 946478 620693 121077 144206 652706 1107470 1280349 1281810 1112612 789796 669601
35354 669601 1036329 1529312 1532656 1011099 475458 279075 418730 823839 1320057 1499029
35344 1499029 1175348 817977 997999 1570885 1931704 1888241 1722882 1592650 1469120 1487577
35334 1487577 1749839 1981583 1982187 2103487 2575441 2773555 2133793 1446127 1967841 3325591
35324 3325591 3720223 2508034 1198482 1277984 2267752 2798828 2613592 2449501 2598891
35315 2598891 2656809 2383819 1945077 1465628 1026500 924414 1330152 1844787 1938521 1692761
35305 1692761 1617329 1866195 2109831 2103443 1961085 1896352 2008382 2291233 2631617 2856303
35295B856303M8393p5771k29330m17075l61733J2821K42923K4204j63658J50539
35285B087616M67281R8722m81174k63940N24509O40846j50030o90647l64071J4399
35275A883511k14556m36223l4716M16200K25235j42512M8631M45202K87001j67137
35265B310636j09940L24872K81970k75439m44332J18795O44697M73760m4014k57695
35255C023310j35788l0453l0448k3180o8084k44911l11429M5331O37398Q39144
35245C700890L57569l27413n22884j62220K23056L04025L03634M27621M18251
35236D722529L6686l74650l10595J36499M52273M73794M34480L63675P8873k46590
35226E766974j75902K44908M62621K65210L8606L3270K3841r6476m7129K33251
$$ plain form
35295 2856303 2904696 2828925 2599595 2182520 1820787 1833608 2076531 2100735 1937077 2087616
35285 2087616 2554897 2653619 2172445 1908505 2433014 3073860 2923830 2233183 1869112 1883511
35275 1883511 1668955 1232732 1198016 1614216 1839451 1696939 1745570 2190772 2477773 2310636
35265 2310636 2200696 2525568 2807538 2532099 2087767 2206562 2851259 3325019 3281005 3023310
35255 3023310 2887522 2857069 2826621 2803441 2735357 2490446 2179017 2224348 2861746 3700890
35245 3700890 4058459 3731046 3208162 3045942 3268998 3573023 3876657 4304278 4722529
35236 4722529 4759215 4384565 4073970 4210469 4662742 5136536 5571016 5934691 6013564 5766974
35226 5766974 5591072 5835980 6298601 6563811 6602417 6635687 6659528 6563052 6515923 6749174
35216F749174L47618J28603m9154K2201P051k52060l12700O2197L21182l3802
35206F990310n69893n71246j34593P5526j54420m65287n73688m57882j27758K58380
35196D269449K95043j43489n46869m31526m1392J20648O9161M7553j06946n66169
35186B965463q54128m52646K04959K82079r7358o7862M30935M71947k59706q06040
35176A817643m03021L32863M01872j06530l60465j39165K3873j44180l03726k13618
35166I05546j30915k76935l80590q6800M39438O68158M03138L0110j8110J73871
35156A726911J80567j23167l80010k71676L4154J45726o635j27897k1287J17936
35146A274622n1494n42599q86178n51960L91560J160312J027884J66837n62675
$$ plain form
35216 6749174 7096792 7225395 7176241 7198442 7205493 6953433 6640733 6702930 7024112 6990310
35206 6990310 6420417 5849171 5714578 5790104 5635684 5170397 4596709 4138827 4011069 4269449
35196 4269449 4564492 4421003 3874134 3442608 3401216 3521864 3591025 3638578 3531632 2965463
35186 2965463 2111335 1658689 1863648 2145727 2048369 1980507 2411442 2883389 2623683 1817643
35176 1817643 1414622 1747485 2149357 2042827 1682362 1543197 1567070 1422890 1119164 905546
35166 905546 774631 497696 117106 30306 469744 1137902 1541040 1571150 1553040 1726911
35156 1726911 1907478 1784311 1404301 1132625 1166779 1312505 1305870 1177973 1156686 1274622
35146 1274622 1223128 680529 -205649 -757609 -366049 794263 1822147 1988984 1426309
35137A426309o40741l40339j18242j9585J03395K00659J72679J12096J07243N8603
35127A062077p5316j36847q5739j08959j97086m9637L16272L88263n527k52644
35117H54857Q5826M36653R2937n40537n26195O1161K29795l03291o39868j16272
35107c64934P09881R23997M30584j92275n01502m15828k9267L92573M99297K52716
35097A705242J9927O1972J86913J07942j27502k93280l35403l28785k49116j8012
35087G29898K85972M15918J90443k52923m74578j76715L28770L94169o6475l43947
35077A030532Q5468P56716Q63121L34459k95538p27224r08939n80481L03084R36873
35067A798071N03183m29446m86672M33170R08675J75352p32698o96076j73992
$$ plain form
35137 1426309 785568 445229 326987 307402 410797 611456 784135 896231 1003474 1062077
35127 1062077 986761 849914 764175 655216 458130 408493 724765 1113028 1107501 854857
35117 854857 940683 1377336 1470273 929736 403541 464702 694497 391206 -248662 -364934
35107 -364934 344947 1268944 1699528 1507253 1005751 589923 560656 953229 1452526 1705242
35097 1705242 1725169 1787141 1974054 2081996 1954494 1661214 1325811 997026 747910 729898
35087 729898 1015870 1431788 1622231 1369308 894730 718015 1046785 1440954 1374479 1030532
35077 1030532 1116000 1872716 2735837 3070296 2774758 2047534 1138595 558114 861198 1798071
35067 1798071 2301254 1871808 1385136 1818306 2726981 2902333 2169635 1473559 1299567
35058A299567j74429n25513l82679J74354L35784L9068P614L56424L19976m01171
35048A048995r97830o86762K04912P68954O77945L61429K70905L73868L50243
35039B372659N7769k91686m06298k86286j81889k03443k18326j70560j62034j00826
35029D09080L00027R25938J127907N83198j34397l39163j92252k64735m91883
35020A923720l44897J27645K92951J2244j08925K26549M64113R4898n21157p10914
35010A456227m12146m6882J86018L68545M21894J35503l82302o84923m89540L7328
35000E89722N12859O62032M22064n9040m68115n15040j64203L45634P05456P34161
34990B765530M42280J236l53604m72139l87716k55950j75109o7848K09664N85578
$$ plain form
35058 1299567 1125138 599625 216946 391300 727084 766152 773766 1130190 1450166 1048995
35048 1048995 51165 -635597 -430685 338269 1016214 1377643 1648548 2022416 2372659
35039 2372659 2430428 2138742 1732444 1446158 1264269 1060826 842500 671940 509906 409080
35029 409080 709107 1635045 2762952 3346150 3211753 2872590 2680338 2415603 1923720
35020 1923720 1578823 1706468 1999419 2011663 1902738 2129287 2593400 2688298 2167141 1456227
35010 1456227 1044081 997199 1183217 1551762 1973656 2109159 1726857 1041934 552394 589722
35000 589722 1102581 1764613 2186677 2127637 1659522 1144482 980279 1325913 2031369 2765530
34990 2765530 3207810 3209046 2855442 2383303 1995587 1739637 1564528 1496680 1706344 2291922
34980B291922O78492J88445n87562r04440m19309L47882O78333N40875M03908
34971C218546L59248N4867m67911n69457L1260O71199O07776M9330k47930j08126
34961C598802l585j42982k02505k9054M1852k03691m49858l37743L7384L71857
34951B680477N33170M56038N0881m89720o71211l28703O9129J09404N0079K90000
34941B749544N91463M27985j29820n06340m67971k75015r4415J06339J48730j88370
34931B362130n85988m73603M3553K77051O9882N559L03779L91330m4361m31496
34921A917836k75017L7447J0719r6398J10527L36623J73732o9857O7308L27433
34911B540353K67969J46451L43515M22603j50457p92160n50877K20425L10852
$$ plain form
34980 2291922 2970414 3158859 2571297 1666857 1247548 1595430 2273763 2814638 3218546
34971 3218546 3577794 3632661 3164750 2595293 2626553 3297752 3905528 3954858 3706928 3598802
34961 3598802 3595217 3452235 3249730 3220676 3262528 3058837 2608979 2271236 2308620 2680477
34951 2680477 3213647 3669685 3720566 3230846 2559635 2230932 2300061 2409465 2459544 2749544
34941 2749544 3341007 3768992 3639172 3132832 2664861 2389846 2295431 2401770 2550500 2362130
34931 2362130 1776142 1302539 1346092 1623143 1693025 1698584 2002363 2393693 2349332 1917836
34921 1917836 1642819 1680266 1690985 1594587 1705114 2041737 2215469 2145612 2212920 2540353
34911 2540353 2808322 2954773 3298288 3720891 3570434 2778274 2227397 2447822 2758674
34902B758674l28354m82518K40941P18207J85869n44335m80146O4779K31675j8949
34892B345843j77490j46698j16599o753K43518K85672r4071m66876l73103k3036
34882A470407J30078P1004n817j14199j93067M3958M85141M72847j64307o22272
34872A573773l27913J01984p5050m44481k34796K52778K22280r5737J46005P38236
34862A857079N86021m16980j069149o86004Q509K27416J98285L28997L33490p0094
34852A297570l95706j21348L87841M29697J0077l35852m15113m10340k97300J10833
34842B60359O27820P66362L83597j31742l53852k28463J6920J49312J00238r357
34832A581194k1371M9556N5882l3674j11209j63266k66357l12202p4526L33948
$$ plain form
34902 2758674 2430320 1947802 2188743 2906950 3092819 2548484 2068338 2133117 2364792 2345843
34892 2345843 2168353 2021655 1905056 1898303 2141821 2427493 2333422 1866546 1493443 1470407
34882 1470407 1600485 1671489 1665672 1551473 1358406 1402364 1887505 2360352 2196045 1573773
34872 1573773 1245860 1347844 1272794 828313 593517 846295 1068575 972838 1118843 1857079
34862 1857079 2443100 2026120 956971 270967 279476 506892 705177 1034174 1367664 1297570
34852 1297570 901864 780516 1168357 1598054 1608131 1272279 857166 446826 149526 260359
34842 260359 888179 1654541 2038138 1906396 1552544 1324081 1341001 1490313 1590551 1581194
34832 1581194 1559823 1609379 1665261 1631587 1520378 1357112 1090755 778553 704027 1037975
34822A037975M44910R3531k59491j68696J44334J65540j22204k84610j60844n6859
34812H33586j67235k38109J698L70973M47624J11648l23546m67688k16293J90476
34802E43134L74738J53333k35481l21112M6147M25445K91226k39721n01142j65699
34792C70868L12851L56986L2604j84515j43014o7632m4624L7562J07377k045j07779
34781F68639J05125L97806J79770m66133p06312k07930K97618J86918p0701J89978
34771E74778N87267K85373n35686q18826j91167N19231M99325l0750l06489m6269
34761E36787L17623K24882l46371p69919m65317K55769M41241j90701p49382m18592
34751a163980L88033P62014O15753M32305K23509k32719n17449j21106L81090
$$ plain form
34822 1037975 1482885 1576416 1316925 1148229 1292563 1458103 1335899 1051289 890445 833586
34812 833586 666351 428242 429940 800913 1248537 1360185 1036639 568951 352658 543134
34802 543134 917872 1071205 835724 514612 560759 986204 1277430 1037709 536567 370868
34792 370868 683719 1040705 1073309 888794 745780 678148 633524 671086 778463 776418 668639
34781 668639 773764 1171570 1351340 885207 178895 -29035 268583 455501 384800 574778
34771 574778 1162045 1447418 911732 92906 -98261 420970 920295 889545 583056 536787
34761 536787 854410 1079292 732921 -36998 -502315 -246546 194695 3994 -745388 -1163980
34751 -1163980 -775947 -13933 601820 1034125 1257634 1024915 507466 386360 767450
34742G67450J2656q40599q01570K26909P22922n2722q54493m66992M53893O44852
34732a87694K14905R2461L28463L04263R6382K87839O80543M62868l59114q14083
34722A106833m03801K28418L13305q7070m24852m28781k27654l9867M4169R3482
34712A74182J72265J29174k04599n44958l56120K55934M62908m4746m15376Q3551
34702b87785P82815N60222l77726p83707k56786L12895K56099j6785L9697K54155
34692D83094K63576J38398L9649j30166l28016j93984L09225O00500K67914k93228
34682A156962m78623l24065k78622m18843l86876Q41M66769N96612K75020j73565
34672D35610k69658N4341K71197m8589n04704l67563K36840L84350k23700p14627
$$ plain form
34742 767450 780106 -60493 -862063 -635154 87768 35046 -819447 -1286439 -832546 -187694
34732 -187694 27211 119672 448135 752398 848780 1136619 1817162 2280030 1920916 1106833
34722 1106833 703032 931450 1244755 1157685 732833 304052 76398 36531 80700 174182
34712 174182 346447 475621 271022 -273936 -630056 -374122 88786 44040 -371336 -287785
34702 -287785 495030 1055252 677526 -106181 -362967 -50072 206027 189242 228939 483094
34692 483094 746670 885068 924717 794551 466535 272551 581776 1182276 1450190 1156962
34682 1156962 678339 354274 75652 -343191 -730067 -729226 -262457 334155 609175 435610
34672 435610 165952 220293 491490 442901 -61803 -429366 -192526 191824 -31876 -746503
34662g46503l71909K68600L49091P0149K14846O99875O75353q49m42943j22202
34652E93508L37561J91931l17653m73172j95446l623j26870k70185j91412m151
34642d59512J24101J80743J54248n376j97301k11288l2499J30709J77552K26016
34632H7393L29556L46231J89294m0066k59596m65950n05431j67256L21316L54499
34622A89990j65361m72229K3195P61446P94221J99570j32065Q601j07569p52305
34612C47494j124044o03900K42239N53453L65049K14870J65949J011r9532R5488
34602A58077K30279q3218m17302j51524L50843K39951l10714k77771M59855P88068
34592I86544J39928n67692m14939J17432P9498l82177l88221J87249N77896L37999
$$ plain form
34662 -746503 -1118412 -849812 -500721 -430572 -215726 484149 1159502 1158653 715710 593508
34652 593508 931069 1123000 805347 332175 136729 133106 6236 -263949 -455361 -459512
34642 -459512 -335411 -154668 -420 -5796 -203097 -414385 -446884 -316175 -138623 87393
34632 87393 416949 763180 952474 912408 652812 186862 -318569 -485825 -164509 189990
34622 189990 24629 -447600 -424405 337041 1131262 1330832 1198767 1207368 1099799 347494
34612 347494 -776550 -1380450 -1138211 -584758 -219709 -4839 161110 162121 62589 158077
34602 158077 388356 305138 -112164 -263688 87155 327106 16392 -261379 198476 986544
34592 986544 1126472 558780 143841 261273 340771 -41406 -429627 -242378 335518 673517
34582F73517j20396k47990k1496K09580J46501k33224o16971n85813j08897L55781
34572e49408M60321L94597M38865M30585R9040l51221m93993l38413k38448k75089
34562d23164k18980k4106J23364K03991L51683M67692L04133o0322k60204j79176
34552B84911m1687K9577J19750J78224L1374k04223j77672J34140L53069K79964
34542I87427J05992m6893k98879n72643n07120o3082K71363J82228k2454k137
34532C3802N3419j09628k19910P0106M55529L42827j98866m83451k10902J56881
34522a10193J54527n6787p2994J06676J58003q010q8306J61084M98252L96427
34512A138679k85313r84807j004913l51733K86108M25087K79298K27240K33644
$$ plain form
34582 673517 553121 305131 283635 493215 639716 406492 -210479 -796292 -905189 -549408
34572 -549408 -89087 305510 744375 1174960 1274000 922779 428786 90373 -148075 -423164
34562 -423164 -642144 -666250 -542886 -338895 12788 480480 784613 724291 464087 284911
34552 284911 243224 272801 392551 570775 602149 397926 220254 354394 707463 987427
34542 987427 1093419 1046526 747647 175004 -332116 -395198 -123835 58393 35939 33802
34532 33802 87221 -22407 -242317 -172211 283318 626145 427279 -56172 -267074 -110193
34522 -110193 44334 -12453 -85447 21229 179232 171222 82916 244000 742252 1138679
34512 1138679 853366 -131441 -1136354 -1488087 -1201979 -776892 -497594 -270354 -36710
34503c6710J27809N3095J72014K33297l3175l37891k47671K5637m1538k91830
34493c76963q1670M82634M70689l70959r77870m56889N43810P75177J60255l05512
34483a37298j31586J65914J14743o7199p8398m5318j09542p7947J61650L21599
34473A16618J61323j03672j71605j19645j53904j65170P1371M17621M84491J74943
34463G12371j93701l07476j64294K5972N7566j30814l54469k69864K26813P20966
34453C23070O56972L9787m95730m44314l2306J56289j6895j52016j55J55358O258
34442A96318k32381j69935O9474K9924k39801j69593L14388M41675k28695q80808
34432h69434m85295N85552R61293K29355n54660n39680k08415k75577m09378L9919
$$ plain form
34503 -36710 91099 144194 316208 549505 516330 178439 -69232 -43595 -85133 -376963
34493 -376963 -458633 24001 494690 123731 -854139 -1311028 -767218 7959 168214 -137298
34483 -137298 -268884 -102970 11773 -55426 -133824 -179142 -288684 -366631 -204981 116618
34473 116618 277941 174269 2664 -116981 -270885 -436055 -364684 52937 537428 712371
34463 712371 518670 211194 46900 72872 130438 -376 -354845 -624709 -397896 323070
34453 323070 980042 1019829 524099 79785 47479 203768 186873 34857 34702 190060 196318
34442 196318 -36063 -205998 -136524 -106600 -346401 -515994 -201606 240069 11374 -869434
34432 -869434 -1354729 -769177 192116 421471 -133189 -672869 -881284 -1156861 -1566239 -1526320
34422a526320O95522O45102j8139k69472K19601N91739K20231l34154l05054R0483
34412I539J41760j67584k33691J17437L89154K50255j410L100J50873J37261j2276
34401G84418n5799K11p7156k70768k21218K21775O26614M63905j51042n48184
34391G72756l54010R2807K86235J55735q6160l31597m73251k60309K52134L96591
34381D50931l01740j159496r93730J61924Q91494L30838n87824n12029M05477
34372a314155R04239N23229J7953m7038j4663j99559k36622J22283L60707J2024
34362A28398m73912m09279K7733J56809l7666K9536M22053N21116J07550k26272
34352B46066m5807K59628J86254j21968k97251l90081n26085l96385K30399Q29214
$$ plain form
34422 -1526320 -830798 -185696 -203835 -473307 -253706 338033 558264 224110 -80944 9539
34412 9539 151299 -16285 -249976 -132539 256615 506870 505460 508560 659433 796694 784418
34401 784418 728619 728830 651674 380906 159688 381463 1008077 1471982 1320940 772756
34391 772756 418746 511553 797788 953523 867363 535766 62515 -197794 54340 450931
34381 450931 149191 -1010305 -2004035 -1842111 -950617 -619779 -1207603 -1719632 -1314155
34372 -1314155 -409916 113313 131266 84228 69565 -129994 -366616 -244333 116374 128398
34362 128398 -345514 -754793 -727060 -570251 -607917 -578381 -156328 364788 472338 246066
34352 246066 200259 459887 646141 524173 226922 -163159 -689244 -1085629 -855230 -26016
34342b6016P01750M9753k91507j02286L7167j59646k66376n2210K2681l34508
34332d21198o04275k59116L35618M85092K18955P9283J42094K711l81240n66631
34322i68707l80520j55651j07457n8091P6978R2888r050J22975N49410P59109
34312g8116M13117o7949j23198R5479L8576l06524m23668j59249L6284q8227j27114
34301g90589K71533O82354M37577l07697o51774j61728N32208O31763K12178p6096
34291G79729k8361l187j30767r2156J75160K11616j83360m72735j74680L17367
34281C98626L00887j72723m50225k83225o218J70803L31454L38557q8051o63287
34271a23402o60451O216N19564L14889j59489k50815l9493O2761R2891K66501
$$ plain form
34342 -26016 675734 725487 433980 331694 368861 209215 -57161 -109371 -86690 -421198
34332 -421198 -1025473 -1284589 -948971 -463879 -244924 -165641 -23547 -20836 -402076 -968707
34322 -968707 -1349227 -1504878 -1612335 -1670426 -1593448 -1500560 -1509610 -1386635 -837225 -78116
34312 -78116 335001 267052 143854 239333 277909 -28615 -452283 -611532 -575248 -663475 -790589
34301 -790589 -519056 163298 600875 293178 -358596 -520324 11884 643647 855825 779729
34291 779729 751368 748181 617414 525258 700418 912034 728674 255939 81259 398626
34281 398626 699513 526790 76565 -206660 -212878 -42075 289379 627936 539885 -123402
34271 -123402 -783853 -777637 -258073 56816 -102673 -353488 -392981 -330220 -237329 29172
34261B9172L53153L5022l71576k60148L11198O39728L31904k90308p19079p16281
34251f57215k73108L87762P59440M90350o0263j61543L03389O36874K69475m92363
34241A202798q89004n95850L8404M60379M21581J00701j53229j79212q2849J0771
34231C34490R2857J00324j03330l93392l48119J52037N88173M51164l4679k69152
34221E70373j15596J00387K05414K48892J52312j30639k83035p6954N2221l68781
34211C54594q44727m75198N11194Q65547J73761m88967k11538M61051N52916J13422
34201A012055j65108j42964j89818l60893l86511k13696M7993M30470Q29031P84447
34191A645006J08431o20190p44206l73137j9904J89694L66434L66264J06429n4361
$$ plain form
34261 29172 382325 417347 45771 -214377 96821 736549 1068453 778145 59066 -657215
34251 -657215 -930323 -542561 216879 707229 646966 485423 788812 1425686 1695161 1202798
34241 1202798 313794 -282056 -243652 216727 638308 739009 585780 406568 323719 334490
34231 334490 427347 527671 424341 30949 -317170 -165133 423040 874204 839525 570373
34221 570373 454777 555164 760578 1009470 1161782 1031143 748108 671154 723375 354594
34211 354594 -490133 -965331 -454137 411410 585171 96204 -115334 345717 898633 1012055
34201 1012055 846947 703983 514165 153272 -233239 -446935 -398942 31528 860559 1645006
34191 1645006 1753437 1133247 389041 15904 -4000 185694 552128 918392 1024821 970460
34181I70460P6751K7494m70454o80074P8730J050954R38768j05358o82976k79868
34171I24427J62209l0330l11331j22345J45299J7473k06241j30120m278j46127
34161B98636k96927j64266r049j20977k55413j26027O1980P1010R9716K98456
34151a42861L48234M6953j92522K4677M09346M85779L08057J63922J8371k20716
34141A249240l33102k13678k10141m92221n72885o1180N79986O76430L07598j9520
34131I10527k07255l80266l27045P8122L05458j21880o94880n90151K2543L01944
34121g02883J34675J63411M95982M80375q5120n08898k80238K13046L80234K07414
34111D97998L4072M4522K07258L43419J92862k28990m59032k20269K7365k12597
$$ plain form
34181 970460 1047211 1074705 604251 -75823 2907 1053861 1992629 1887271 1204295 924427
34171 924427 1086636 1056306 744975 622630 767929 785402 579161 449041 444763 298636
34161 298636 1709 -162557 -171606 -292583 -547996 -674023 -612043 -541033 -441317 -142861
34151 -142861 205373 252326 59804 84481 493827 979606 1287663 1451585 1469956 1249240
34141 1249240 916138 702460 492319 98 -572787 -633967 -53981 622449 930047 910527
34131 910527 703272 323006 -4039 74083 379541 257661 -437219 -1027370 -1004827 -702883
34121 -702883 -568208 -404797 91185 571560 486440 -22458 -302696 -89650 290584 497998
34111 497998 532070 576592 783850 1127269 1320131 1091141 632109 411840 439205 226608
34101B26608n34225k22364M70372O49006K46530L6227J69833m1897o73651q23218
34091d96779j77882L07297j8518l94022K4524P14594O88063P5189k70922k08978
34081B42566k72632n28244m81446j3225M14084M66870K46570m4244k45410j84610
34071c99721Q1528J65168j14080l58335j70737K18412L53930K39180J35969M0198
34061A91512j23340j44242P6797J33742k74204o75592m35061K43909N98817L74793
34051c2869l5474l07430l85139j65001L39955O71780M29762l6732r2812J84594
34041E70634J88815j59667l18599q2849J15306l3405l04222m09115l26546q7596
34031h47244K51848L98748R7946l73238m84342j94725P7006J35388J25001Q9147
$$ plain form
34101 226608 -307617 -529981 -59609 589397 835927 872154 1041987 1000090 326439 -496779
34091 -496779 -674661 -367364 -385882 -779904 -755380 -40786 647277 722466 451544 242566
34081 242566 -30066 -558310 -1039756 -1052981 -638897 -172027 74543 30299 -215111 -399721
34071 -399721 -318193 -153025 -267105 -625440 -796177 -577765 -223835 15345 151314 191512
34061 191512 68172 -76070 727 134469 -139735 -815327 -1250388 -1006479 -407662 -32869
34051 -32869 -68343 -375773 -760912 -925913 -585958 85822 515584 478852 386040 570634
34041 570634 759449 599782 281183 198334 313640 280235 -23987 -433102 -759648 -847244
34031 -847244 -595396 -196648 -98702 -471940 -956282 -1151007 -1074001 -938613 -813612 -724465
34021g24465o531M8305L87143O03054K94986j41168o9554K63690J20875l81160
34011C95175m25499L5187J74987k09302l66761m7750K3551l81696l80228M42420
34001g39916J068851O07909k49115l93339j2707J9991k64536k04657J41934J62730
33991A37145r5158l0540L52038M36780P7123k50951l18691l10711k01470J78356
33981b6079N14609L16265j66297j95546K48415L96900n4280m88322l98474q2779
33971F4412J5201k4451L0533O6493j12979l90697m85262k52345K43576O81882
33961a63637N96192n0538n48303k64628L63795L93539j70112m00287l883K06121
33951d1741k53018o70122l48276K18668K09415j72537j54428K57525L73266M2629
$$ plain form
34021 -724465 -730996 -682691 -295548 307506 602492 461324 391770 655460 776335 395175
34011 395175 -30324 4863 179850 -29452 -396213 -443963 -420412 -802108 -1182336 -739916
34001 -739916 328935 936844 687729 294390 281683 301674 37138 -167519 -25585 137145
33991 137145 41987 11447 363485 800265 877388 626437 307746 -2965 -204435 -26079
33981 -26079 488530 804795 638498 442952 691367 1088267 1033987 545665 147191 64412
33971 64412 79613 55162 85695 152188 39209 -351488 -836750 -1089095 -845519 -163637
33961 -163637 432555 382017 -166286 -430914 -67119 326420 156308 -243979 -247862 -41741
33951 -41741 -294759 -964881 -1313157 -1094489 -885074 -1057611 -1212039 -954514 -581248 -538619
33941e38619j62788J8337J67516m44j66022j7729K12214J65881n5461p6874J69417
33930b84572L51428J94150j64075l43829j94752L3087P2049M2092K11146M39421
33920C56145K95115j99822m45910j48835J69296l3613m46309m02068O2323L20767
33910d72911J76381N1659J52839J47188j53092m04298l10287q1162Q598Q3093
33900h01992L12425M57428K06679k49196m07052j26090K32467L07201J03455j28663
33890i3338j62299M9719L02672K52680k01979o59743n58679J35417P59464O43172
33880D67086r2008o25625l99227K11969M17981P5868j87345R902J99552j25651
33870d7498n54615l08548M53436P23192J38256m56524l07804J54247J32992k32518
$$ plain form
33941 -538619 -701407 -683070 -515554 -515998 -682020 -699749 -487535 -321654 -377115 -453989 -284572
33930 -284572 66856 261006 96931 -246898 -441650 -408563 -336514 -294422 -83276 356145
33920 356145 651260 451438 5528 -143307 25989 -7624 -453933 -856001 -793678 -472911
33910 -472911 -296530 -244871 -92032 55156 -97936 -502234 -812521 -893683 -885085 -801992
33900 -801992 -489567 -32139 174540 -74656 -481708 -607798 -375331 -68130 35325 -93338
33890 -93338 -255637 -205918 96754 349434 147455 -512288 -1070967 -935550 -176086 467086
33880 467086 375078 -250547 -649774 -437805 -19824 56044 -131301 -121399 78153 -47498
33870 -47498 -602113 -910661 -457225 265967 404223 -52301 -360105 -205858 -72866 -305384
33860c05384j96106K97381N18246J18910l75608l90021o453L47777M33249K28974
33850F70965j38522l20286k8313M19099L07370m39514r19225l94627O02637R01074
33840F60658K42989m28061k91395L19862N02318m88n90429o73903l03162R8419
33830d63192K97976L14961J47385k17693n49609m76731J2147M13557K69729k57501
33820e08971n81016l75058J15201M00853K39943j56346l14508J9990N30820O27955
33810a137J81241k91564l20912n9976Q6598O8682N1220j5107k00196k34790Q5060
33799f50881L43106K3716n29548m43076L60318R52958P13796R9253k00383j67712
33789E01547j07794k3111J52795J96869j9771j97519j10177k8465j92336l06403
$$ plain form
33860 -305384 -501490 -204109 314137 433047 57439 -332582 -339035 8742 441991 670965
33850 670965 532443 212157 183844 602943 910313 470799 -448426 -843053 -240416 660658
33840 660658 903647 475586 184191 504053 1006371 1005883 415454 -258449 -561611 -463192
33830 -463192 -165216 149745 297130 79437 -470172 -946903 -934756 -521199 -251470 -508971
33820 -508971 -1089987 -1465045 -1349844 -948991 -709048 -865394 -1179902 -1159912 -629092 -1137
33810 -1137 180104 -111460 -432372 -492348 -405750 -337068 -285848 -300955 -501151 -735941 -650881
33799 -650881 -307775 -284059 -813607 -1256683 -896365 56593 770389 869642 669259 501547
33789 501547 393753 370642 523437 720306 700535 503016 392839 364374 172038 -134365
33779a34365q3444J40865n0868l66623k42671J81026K50736j41854l88125q6820
33769i22143M45753O92959N07938P2966l36683m73036k96608o6420j9843m0107
33759d35224R6433K80690K23875m6972k12293j43614l9547p9382j93595j87563
33749g37192M2167L48000L59659q1217m91740k08353N72678Q12130M2895q50863
33739a91836q21736o8397M40153L85842K30074K28879J75065J256j08618j48952
33729A21730k17044j49280J71371L70318R4527k93519k46114M0942K2982j84578
33719b68665r7332J30364L662k51291l8000L89926K81483j65649o9849M46785
33709C61434L55930l25850l49361N39113Q89510j10077j173669r25871J713K25438
$$ plain form
33779 -134365 -217809 -76944 -127812 -494435 -737106 -556080 -305344 -447198 -835323 -922143
33769 -922143 -476390 216569 724507 797473 460790 -12246 -308854 -375274 -395117 -435224
33759 -435224 -338791 -58101 165774 118802 -93491 -237105 -276652 -356034 -549629 -737192
33749 -737192 -695025 -347025 12634 -68583 -560323 -768676 -195998 616132 659027 -191836
33739 -191836 -1013572 -1081969 -641816 -255974 -25900 202979 378044 379300 270682 121730
33729 121730 -95314 -244594 -73223 297095 391622 98103 -148011 -107069 -84087 -268665
33719 -268665 -365997 -235633 -231971 -483262 -521262 -131336 150147 -15502 -85351 361434
33709 361434 717364 391514 42153 581266 1470776 1360699 187030 -738841 -737128 -511690
33699e11690j50344n7621N36071O95185J92648k57174k77888j84578j42847J3722
33689a44516J52590q5253n51965o63341k44496K57640L91575J12101k90757l47000
33679a413422K08139Q92840Q08231r1436o85797k15826N51676M60571l37716p54390
33669e77130l94194J48838L58707K77974J04045M4611L41000P91983O56281k63993
33659A488122r81553o42570R4063Q2398m44309l60234L51501N77507J313m28640
33649b62402j51013K53428K85549K44837L13025J09313l52832l90105J14723K84805
33639D49328k95596p42880k83672M43907M50271j2949k009M86421N69028j6607
$$ plain form
33699 -511690 -662034 -719655 -183584 511601 704249 447075 169187 -15391 -158238 -144516
33689 -144516 8074 -77179 -629144 -1292485 -1536981 -1279341 -887766 -775665 -1066422 -1413422
33679 -1413422 -1205283 -312443 495788 404352 -281445 -497271 54405 514976 177260 -577130
33669 -577130 -971324 -822486 -463779 -185805 -81760 -37149 303851 1095834 1752115 1488122
33659 1488122 506569 -136001 -41938 40460 -403849 -764083 -412582 164925 166238 -262402
33649 -262402 -413415 -159987 125562 370399 683424 792737 439905 49800 164523 449328
33639 449328 153732 -589148 -872820 -428913 21358 8409 6400 492821 1061849 1045242
$$ [...]
##END NTUPLES=NMR SPECTRUM
##END=
