##TITLE=31Pdec_ESa0609A
 CDCl3 24 sc
 7.9.2023
##JCAMPDX= 6.0         $$ Bruker NMR JCAMP-DX V2.0
##DATA TYPE= NMR SPECTRUM
##DATA CLASS= NTUPLES
##ORIGIN= UXNMR, Bruker Analytische Messtechnik GmbH
##OWNER= root
$$ XWIN-NMR		Version 3.5
$$ Thu Sep  7 14:04:08 2023 Russian Standard Time (UT+4h)  she@DPX200
##.OBSERVE FREQUENCY= 81.013821
##.OBSERVE NUCLEUS= ^31P
##.ACQUISITION MODE= SIMULTANEOUS
##.ACQUISITION SCHEME= undefined
##.AVERAGES= 24
##.DIGITISER RES= 16
##SPECTROMETER/DATA SYSTEM= spect
##.PULSE SEQUENCE= zgpg30
##.SOLVENT NAME= DMSO
##.SHIFT REFERENCE= (INTERNAL, DMSO, 0, 248.564)
##AUDIT TRAIL= $$ (NUMBER, WHEN, WHO, WHERE, WHAT)
$$ ##TITLE= Audit trail, XWIN-NMR		Version 3.5
$$ ##JCAMPDX= 5.01
$$ ##ORIGIN= Bruker BioSpin GmbH
$$ ##OWNER= she
$$ F:/spectra/data/she/nmr/P31/1/pdata/1/auditp.txt
$$ ##AUDIT TRAIL=  $$ (NUMBER, WHEN, WHO, WHERE, WHAT)
(   1,<2023-09-07 14:03:08.12 +0400>,<she>,<DPX200>,
      <created by zg, POWCHK disabled, PULCHK disabled
       configuration hash MD5:
       00 E9 B6 7A A2 85 ED C7 34 08 36 98 17 FE 4E 26
       data hash MD5: 32K
       E0 39 91 E2 2D 4B 49 23 00 E3 35 35 26 E4 D3 67>)
(   2,<2023-09-07 14:03:10.75 +0400>,<she>,<DPX200>,
      <Start of raw data processing
       efp BC_mod = 2 LB = 5 FT_mod = 6 PKNL = 1 PHC0 = -10597.42 PHC1 = -13.31499 SI = 64K 
       data hash MD5: 64K
       D1 10 4F 99 E1 7F 02 0D 5D E0 25 6E 7B 8F D6 61>)
(   3,<2023-09-07 14:03:31.64 +0400>,<she>,<DPX200>,
      <pk PHC0 = -11.76998 PHC1 = 0 
       data hash MD5: 64K
       5C BB B5 2F BB 08 6E 41 3B 09 6B A1 44 1C C8 3C>)
(   4,<2023-09-07 14:03:36.48 +0400>,<she>,<DPX200>,
      <abs ABSG = 5 
       data hash MD5: 64K
       64 B3 E3 AE 63 D4 B0 5B B0 6B 72 8A 52 C5 4E F3>)
$$ ##END=
$$ 
$$ hash MD5
$$ 26 1D 47 F1 11 F3 64 92 25 C1 19 43 F3 E8 C5 71
##$RELAX= 
##$RELAX= 
##$RELAX= 
##$RELAX= 
##$RELAX= 
##$RELAX= 
##$RELAX= 
##$RELAX= 
##$RELAX= 
$$ Bruker specific parameters
$$ --------------------------
##$DU= <F:/spectra>
##$EXPNO= 1
##$NAME= <P31>
##$PROCNO= 1
##$TYPE= <nmr>
##$USER= <she>
##$AMP= (0..31)
100 100 100 100 100 100 100 100 100 100 100 100 100 100 100 100 100 100 
100 100 100 100 100 100 100 100 100 100 100 100 100 100 
##$AQSEQ= 0
##$AQ_mod= 1
##$AUNM= <au_zg>
##$AUTOPOS= <>
##$BF1= 81.014009
##$BF2= 200.13
##$BF3= 200.13
##$BF4= 200.13
##$BF5= 200.13
##$BF6= 200.13
##$BF7= 200.13
##$BF8= 200.13
##$BYTORDA= 1
##$CFDGTYP= 0
##$CFRGTYP= 5
##$CHEMSTR= <none>
##$CNST= (0..31)
1 1 145 1 1 1 1 1 1 1 1 1 1 1 1 1 1 1 1 1 1 1 1 1 1 1 1 1 1 1 1 1 
##$CPDPRG= <waltz16>
##$CPDPRG1= <>
##$CPDPRG2= <waltz16>
##$CPDPRG3= <>
##$CPDPRG4= <mlev>
##$CPDPRG5= <mlev>
##$CPDPRG6= <mlev>
##$CPDPRG7= <mlev>
##$CPDPRG8= <mlev>
##$CPDPRGB= <>
##$CPDPRGT= <>
##$D= (0..31)
0 1 0 0 0 0 0 0 0 0 0 0.03 2e-05 3e-06 0 0 0 0 0 0 0 0 0 0 0 0 0 0 0 0 
0 0 
##$DATE= 1694080987
##$DBL= (0..7)
120 120 120 11 120 120 24 19 
##$DBP= (0..7)
150 150 150 150 150 150 150 150 
##$DBP07= 0
##$DBPNAM0= <>
##$DBPNAM1= <>
$$ [...]
##$SUBNAM3= <"">
##$SUBNAM4= <"">
##$SUBNAM5= <"">
##$SUBNAM6= <"">
##$SUBNAM7= <"">
##$SUBNAM8= <"">
##$SUBNAM9= <"">
##$SW= 501.771253377433
##$SWIBOX= (0..15)
0 1 3 0 0 0 0 0 0 0 0 0 0 0 0 0 
##$SW_h= 40650.406504065
##$TD= 32768
##$TD0= 1
##$TE= 0
##$TE2= 300
##$TE3= 300
##$TEG= 300
##$TL= (0..7)
0 120 53 12 22 120 120 120 
##$TP= (0..7)
150 150 150 150 150 150 150 150 
##$TP07= 0
##$TPNAME0= <>
##$TPNAME1= <>
##$TPNAME2= <>
##$TPNAME3= <>
##$TPNAME4= <>
##$TPNAME5= <>
##$TPNAME6= <>
##$TPNAME7= <>
##$TPOAL= (0..7)
0.5 0.5 0.5 0.5 0.5 0.5 0.5 0.5 
##$TPOFFS= (0..7)
0 0 0 0 0 0 0 0 
##$TUNHIN= 0
##$TUNHOUT= 0
##$TUNXOUT= 0
##$USERA1= <user>
##$USERA2= <user>
##$USERA3= <user>
##$USERA4= <user>
##$USERA5= <user>
##$V9= 5
##$VALIST= <valist>
##$VCLIST= <CCCCCCCCCCCCCCC>
##$VD= 0
##$VDLIST= <DDDDDDDDDDDDDDD>
##$VPLIST= <PPPPPPPPPPPPPPP>
##$VTLIST= <TTTTTTTTTTTTTTT>
##$WBST= 1024
##$WBSW= 4
##$XGAIN= (0..3)
0 0 0 0 
##$XL= 0
##$YL= 0
##$YMAX_a= 2938
##$YMIN_a= -3549
##$ZGOPTNS= <>
##$ZL1= 120
##$ZL2= 120
##$ZL3= 120
##$ZL4= 120
##$ABSF1= 248.5645
##$ABSF2= -253.2056
##$ABSG= 5
##$ABSL= 3
##$ALPHA= 0
##$AQORDER= 0
##$ASSFAC= 0
##$ASSFACI= 0
##$ASSFACX= 0
##$ASSWID= 0
##$AUNMP= <proc_1d>
##$AZFE= 0.1
##$AZFW= 0.5
##$BCFW= 0
##$BC_mod= 2
##$BYTORDP= 0
##$COROFFS= 0
##$CY= -3
##$DATMOD= 1
##$DC= 0
##$DFILT= <>
##$DTYPP= 0
##$F1P= 0
##$F2P= 0
##$FCOR= 1
##$FTSIZE= 65536
##$FT_mod= 6
##$GAMMA= 0
##$GB= 0
##$INTBC= 1
##$INTSCL= 6.047779e-11
##$ISEN= 30
##$LB= 5
##$LEV0= 0
##$LPBIN= 0
##$MAXI= 10000
##$MC2= 0
##$MEAN= 0
##$ME_mod= 0
##$MI= 50
##$NCOEF= 0
##$NC_proc= -10
##$NLEV= 6
##$NOISF1= 182.463
##$NOISF2= 159.3651
##$NSP= 0
##$NTH_PI= 0
##$NZP= 0
##$OFFSET= 248.5645
##$PC= 4
##$PHC0= -10609.19
##$PHC1= -13.31499
##$PH_mod= 1
##$PKNL= yes
##$PPARMOD= 0
##$PSCAL= 0
##$PSIGN= 0
##$REVERSE= no
##$SF= 81.0140089999694
##$SI= 65536
##$SIGF1= 159.3651
##$SIGF2= -187.1042
##$SINO= 113.3802
##$SIOLD= 16384
##$SREGLST= <1H.CDCl3>
##$SSB= 0
##$STSI= 65536
##$STSR= 0
##$SW_p= 40650.406504065
##$SYMM= 0
##$S_DEV= 0
##$TDeff= 32768
##$TDoff= 0
##$TI= <>
##$TILT= no
##$TM1= 0
##$TM2= 0
##$TOPLEV= 0
##$USERP1= <user>
##$USERP2= <user>
##$USERP3= <user>
##$USERP4= <user>
##$USERP5= <user>
##$WDW= 1
##$XDIM= 65536
##$YMAX_p= 551835021
##$YMIN_p= -94321086
$$ End of Bruker specific parameters
$$ ---------------------------------
##NTUPLES= NMR SPECTRUM
##VAR_NAME=  FREQUENCY,     SPECTRUM/REAL,   SPECTRUM/IMAG
##SYMBOL=    X,             R,               I
##VAR_TYPE=  INDEPENDENT,   DEPENDENT,       DEPENDENT
##VAR_FORM=  AFFN,          ASDF,            ASDF
##VAR_DIM=   65536,         65536,           65536
##UNITS=     HZ,            ARBITRARY UNITS, ARBITRARY UNITS
##FACTOR=    0.620285442955139, 1,           1
##FIRST=     20137.2065510682, 0,            0
##LAST=      -20513.1999529968, 0,           0
##MIN=       -20513.1999529968, -94321086,   0
##MAX=       20137.2065510682, 551835021,    0
$$ Real data points
##PAGE= N=1
##DATA TABLE= (X++(R..R)), XYDATA
$$ [...]
44226F826147R06788P17511K63986m66037j312864j943642k028853j578408r99687
$$ 6826147 7732935 8450446 8714432 8248395 6935531 4991889 2963036 1384628 384941
44217C84941o78685n84164m14020l0322M29013P99641J032472J087547R03677
$$ 384941 -293744 -877908 -1291928 -1322250 -893237 -93596 938876 2026423 2930100
44208B930100N48490K40633J35018K01688L73165O45674R02992P80551p3054j582330
$$ 2930100 3478590 3719223 3854241 4055929 4429094 5074768 5977760 6758311 6685257 5102927
44198E102927l202623m296659m508433l864691k678819j361728k00751P08223
$$ 5102927 1900304 -2396355 -6904788 -10769479 -13448298 -14810026 -15010777 -14302554
44190a4302554J272883J265636N77064m25365j067553j014332n58238j51651J38229
$$ -14302554 -13029671 -11764035 -11186971 -11612336 -12679889 -13694221 -14252459 -14404110 -14265881
44181a4265881N16313R93880J346110J489728J603676J815810K020295K123455
$$ -14265881 -13749568 -12755688 -11409578 -9919850 -8316174 -6500364 -4480069 -2356614
44173b356614K256836K553124K835911K754325K204607J436482P24998J11588
$$ -2356614 -99778 2453346 5289257 8043582 10248189 11684671 12409669 12521257
44165A2521257m66224r72000j365493j788901k421496l141276l552821l425788
$$ 12521257 12055033 11083033 9717540 7928639 5507143 2365867 -1186954 -4612742
44157d612742k899996k149402j105776K29758J416029J913971J761506J530159
$$ -4612742 -7512738 -9662140 -10767916 -10538158 -9122129 -7208158 -5446652 -3916493
44149c916493J580301J743949J823987J949818K192102K233766J809322J206288
$$ -3916493 -2336192 -592243 1231744 3181562 5373664 7607430 9416752 10623040
44141A0623040R36484J087594J358040J549032J619804J415190Q07214L7941n33250
$$ 10623040 11559524 12647118 14005158 15554190 17173994 18589184 19396398 19434339 18901089
44132A8901089r77518j611427k290846k462631k029207j584674j547800j582230
$$ 18901089 17923571 16312144 14021298 11558667 9529460 7944786 6396986 4814756
44124D814756j219294o07010k09687q6966Q5828M99212J115837J910311K784858
$$ 4814756 3595462 2988452 2778765 2691799 2777627 3276839 4392676 6302987 9087845
44115I087845L346601L160300K228633R88756q4930o72537o20507j31706J69528
$$ 9087845 12434446 15594746 17823379 18812135 18727205 18054668 17434161 17302455 17471983
44106A7471983k35554j151738j874786j980643j643741j249998j045776j149935
$$ 17471983 17236429 16084691 14209905 12229262 10585521 9335523 8289747 7139812
44098G139812j518618j795494j514802o11505M51599J124330J158604N91085l51226
$$ 7139812 5621194 3825700 2310898 1699393 2150992 3275322 4433926 5025011 4673785
44089D673785j248664j681065j587451j284819j078951j053319j259021j803144
$$ 4673785 3425121 1744056 156605 -1128214 -2207165 -3260484 -4519505 -6322649
44081f322649k592736l225702l328685k874723k069717j113077k00859M29509
$$ -6322649 -8915385 -12141087 -15469772 -18344495 -20414212 -21527289 -21728148 -21298639
44073b1298639O61352O27068N59252N95431P78264J086239J372568J444772J326206
$$ -21298639 -20637287 -20010219 -19450967 -18855536 -18077272 -16991033 -15618465 -14173693 -12847487
44064a2847487J276125J411819J468954J109790L56792m37787r57765j122643
$$ -12847487 -11571362 -10159543 -8690589 -7580799 -7224007 -7661794 -8619559 -9742202
44056i742202j036858r00806q83227r27093p58228k29746M22226Q11628Q12675
$$ -9742202 -10779060 -11679866 -12563093 -13490186 -14248414 -14478160 -14055934 -13244306 -12431631
44047a2431631N96140L55630J80098J22982J85991K55381K42272K70587N27768
$$ -12431631 -11835491 -11479861 -11299763 -11176781 -10990790 -10735409 -10493137 -10222550 -9694782
44038i694782R21284J101074R01666N92139N83181J004175J654318K238861K518091
$$ -9694782 -8773498 -7672424 -6770758 -6178619 -5595438 -4591263 -2936945 -698084 1820007
44029A820007K322195J623206O27650l42024j147011j942551k894701l831471
$$ 1820007 4142202 5765408 6393058 6051034 4904023 2961472 66771 -3764700
44021c764700m313176m078889l288277k238016r91760N06001K026172L060889
$$ -3764700 -8077876 -12156765 -15445042 -17683058 -18674818 -18168817 -16142645 -13081756
44013a3081756L335233L101875K770274K401650J772191Q40480q4777o52862p69161
$$ -13081756 -9746523 -6644648 -3874374 -1472724 299467 1139947 1055170 402308 -366853
44004c66853n54626j70142K43444N75711Q13917J053896J356154J611925J628166
$$ -366853 -921479 -1091621 -848177 -272466 541451 1595347 2951501 4563426 6191592
43995F191592J344078Q85411L71381k50363j066878j915659k399559k309689j959121
$$ 6191592 7535670 8421081 8792462 8542099 7475221 5559562 3160003 850314 -1108807
43986a108807j926073k428751l059713l183958k526211j341795j13308Q35345
$$ -1108807 -3034880 -5463631 -8523344 -11707302 -14233513 -15575308 -15688616 -14853271
43978a4853271J465468J852907J955579J633242R48777L36876K82430Q21656J524238
$$ -14853271 -13387803 -11534896 -9579317 -7946075 -6997298 -6660422 -6377992 -5556336 -4032098
43969d032098J996195K226511K388504K509645K474029K197207J654716Q72068
$$ -4032098 -2035903 190608 2579112 5088757 7562786 9759993 11414709 12286777
43961A2286777L5059n33510p08133p75347j098652j616601j879912j573160q17178
$$ 12286777 12321836 11788326 11080193 10304846 9206194 7589593 5709681 4136521 3319343
43952C319343L4545P09376J111170J285150J335965J255413Q38264o2880j198995
$$ 3319343 3353888 4063264 5174434 6459584 7795549 9050962 9889226 9826346 8627351
43943H627351k051528k347607k236100j880298j153570L6862J314393K032570
$$ 8627351 6575823 4228216 1992116 111818 -1041752 -1004890 309503 2342073
43935B342073J896171J177760L47725k79562n37564l64037N2258K85920R0840
$$ 2342073 4238244 5416004 5763729 5484167 4946603 4582566 4634824 4920744 5011584
43926E011584k68051l27765n5559Q1330k45690p36316p95196k50421M55513P68306
$$ 5011584 4743533 4415768 4360209 4441539 4195849 3459533 2664337 2413916 2869429 3637735
43916C637735N45967O0847l58955n85694o67566o85829o97021p77147j004385
$$ 3637735 4183702 4244549 3885594 3299900 2632334 1946505 1249484 472337 -532048
43907e32048j293427j319312q32624j19841R9580n33365j465773j737933r73090
$$ -532048 -1825475 -3144787 -3977411 -4097252 -3997672 -4531037 -5996810 -7734743 -8707833
43898h707833L79503J685585K643936L172907L235192K987802K778894K723526
$$ -8707833 -8328330 -6642745 -3998809 -825902 2409290 5397092 8175986 10899512
43890A0899512K498457J805116Q51820J29918j32809p1956O3995k0813o54881
$$ 10899512 13397969 15203085 16054905 16184823 16052014 15980058 16044053 16023240 15368359
43881A5368359j830926k894260l019377k125297j052364p05751j194299j871233
$$ 15368359 13537433 10643173 7623796 5498499 4446135 3740384 2546085 674852
43873F74852k034922j519857p73413m43210p71965j348286j555559j256282q70578
$$ 674852 -1360070 -2879927 -3653340 -4096550 -4868515 -6216801 -7772360 -9028642 -9899220
43864i899220p71732q14854n60412J82987J151905J886870K125845J982921J762255
$$ -9899220 -10670952 -11485806 -12046218 -11863231 -10711326 -8824456 -6698611 -4715690 -2953435
43855b953435J586085J285823P29822J19295k14409j85873J01846O59889J489380
$$ -2953435 -1367350 -81527 648295 767590 553181 367308 469154 1129043 2618423
43846B618423K164449J980822P33772r32094k163274k668066k654746k265910
$$ 2618423 4782872 6763694 7497466 6565372 4402098 1734032 -920714 -3186624
43838c186624j435583k50773Q59800J406102J214177N28604j68794m66934k67007
$$ -3186624 -4622207 -4872980 -4013180 -2607078 -1392901 -864297 -1033091 -1500025 -1767032
43829a767032K30179P59505J169232J393562J386685J149959P40982K09332m01744
$$ -1767032 -1536853 -777348 391884 1785446 3172131 4322090 5063072 5272404 4870660
43820D870660r81354j398521j648581j823820j917852j816625j521449j203924
$$ 4870660 3889306 2490785 842204 -981616 -2899468 -4716093 -6237542 -7441466
43812g441466r75627p77973n67798m22426l82471l92945m75525p05543r09439
$$ -7441466 -8417093 -9195066 -9762864 -10185290 -10567761 -10960706 -11436231 -12141774 -13051213
43803a3051213p08216r0375L57849J19232n79113j106704j245303j227188j074884
$$ -13051213 -13759429 -13849804 -13491955 -13372723 -13951836 -15058540 -16303843 -17531031 -18605915
43794a8605915m36677Q04979K175735L066896L281110K947301K146483Q85148
$$ -18605915 -19042592 -18237613 -16061878 -12994982 -9713872 -6766571 -4620088 -3734940
43786c734940o53772k046486k850918k862345k194152j138107O6910J273217K196736
$$ -3734940 -4388712 -6435198 -9286116 -12148461 -14342613 -15480720 -15413810 -14140593 -11943857
43777a1943857K339716J405542k37812j766858k625695k851906k695511k222293
$$ -11943857 -9604141 -8198599 -8436411 -10203269 -12828964 -15680870 -18376381 -20598674
43769b0598674j424597m60642M44671J204510J797348K108190K038540J718736
$$ -20598674 -22023271 -22483913 -22039242 -20834732 -19037384 -16929194 -14890654 -13171918
43761a3171918J442013J397010J565256J824668K008470J878494J215574N6072
$$ -13171918 -11729905 -10332895 -8767639 -6942971 -4934501 -3056007 -1840433 -1784361
43753a784361j183488j904796j741922q44245K44119J008764J278613J175280
$$ -1784361 -2967849 -4872645 -6614567 -7458812 -7214693 -6205929 -4927316 -3752036
43745c752036R05727O83665O81148Q28772P31465N2467r79878j683427j631487
$$ -3752036 -2846309 -2162644 -1481496 -652724 78741 131208 -848670 -2532097 -4163584
43736d163584j069368n42031k98711j86469L4985M25338Q09700R04188O26653
$$ -4163584 -5232952 -5774983 -6073694 -6260163 -6225178 -5799840 -4990140 -4085952 -3459299
43727c459299L50684O48663J632609K712288L155799K724531J620898Q7231j612390
$$ -3459299 -3108615 -2459952 -827343 1884945 5040744 7765275 9386173 9473404 7861014
43718G861014k968997l407177k775951j476404j25399P26791O87151k66037j565299
$$ 7861014 4892017 1484840 -1291111 -2767515 -2892914 -2166123 -1478972 -1745009 -3310308
43709c310308k350850k166840j256476j71186O88266J134870J141241R12060P94231
$$ -3310308 -5661158 -7827998 -9084474 -9255660 -8567394 -7432524 -6291283 -5379223 -4584992
43700d584992R17359J051084R34224N72472R6229m37508q94491r38689l70810
$$ -4584992 -3667633 -2616549 -1682325 -1109853 -1013624 -1451132 -2345623 -3284312 -3655122
43691c655122N05734J141745J321308J242685J093297Q58876N65418L69644K68520
$$ -3655122 -3149388 -2007643 -686335 556350 1649647 2508523 3073941 3443585 3712105
43682C712105j3135o24642j226571j251748n09319N91035J387612J454727Q13004
$$ 3712105 3698970 3074328 1847757 596009 86690 677725 2065337 3520064 4333068
43673D333068j81073j085618j577979j532826j022869k95012L42286P32177R54582
$$ 4333068 4151995 3066377 1488398 -44428 -1067297 -1362309 -1020023 -287846 666736
43664F66736J108951J073825O49761p8127p28208j015848r60719o52673q0314
$$ 666736 1775687 2849512 3499273 3421146 2692938 1677090 716371 63698 -16616
43655a6616O42036J127880J084599O97400L70779J75527j45591o64380j113165
$$ -16616 625420 1753300 2837899 3535299 3906078 4081605 3936014 3271634 2158469
43646B158469j317957j454623j686119j790599j410888n66663L08074Q11755Q96805
$$ 2158469 840512 -614111 -2300230 -4090829 -5501717 -6068380 -5760306 -4948551 -4051746
43637d051746P53237N17644J64847l37008p94199p89676o0114J097305J946793
$$ -4051746 -3298509 -2780865 -2616018 -2953026 -3747225 -4536901 -4597015 -3499710 -1552917
43628a552917J954036J227225K69080n49062j134521j476323j577503j551800
$$ -1552917 401119 1628344 1897424 1348362 213841 -1262482 -2839985 -4391785
43620d391785j524344j372706p87328K67423J284898J590026R92202j0109o90678
$$ -4391785 -5916129 -7288835 -8076163 -7808740 -6523842 -4933816 -3941614 -3951723 -4642401
43611d642401p41064m74103m22196p65050j181896j240645q25665j34147O10657
$$ -4642401 -5383465 -5857568 -6279764 -7044814 -8226710 -9467355 -10293020 -10427167 -9816510
43602i816510J274324J709159J778410J564654J387865J471973J652740J522721
$$ -9816510 -8542186 -6833027 -5054617 -3489963 -2102098 -630125 1022615 2545336
43594B545336Q42128k63197j477133k567498l449559m024113m045974l263425
$$ 2545336 3387464 3124267 1647134 -920364 -4369923 -8394036 -12440010 -15703435
43586a5703435j739499M4984J525647K479207L021558L232529K985360K229657
$$ -15703435 -17442934 -17397950 -15872303 -13393096 -10371538 -7139009 -4153649 -1923992
43578a923992J271824N87962L81072M28827L41945j17525r20158j798559k334992
$$ -1923992 -652168 -64206 316866 745693 1087638 970113 49955 -1748604 -4083596
43569d083596k164493j281359j92375L61541J1106q60867j446727j307370p64314
$$ -4083596 -6248089 -7529448 -7721823 -7360282 -7349176 -8210043 -9656770 -10964140 -11728454
43560a1728454m06467l23319n0174P43557J781781K511978K703489K555668K372743
$$ -11728454 -12134921 -12458240 -12508414 -11764857 -9983076 -7471098 -4767609 -2211941 160802
43551A60802K335157K483139K681673K611311J996103Q85380m01927j585721k522649
$$ 160802 2495959 4979098 7660771 10272082 12268185 13153565 12751638 11165917 8643268
43542H643268l027549k842667j915550n96572N52948J128258J065828N72145q9450
$$ 8643268 5615719 2773052 857502 260930 813878 1942136 3007964 3580109 3490659
43533C490659q11315j633790k428254k666554j796613K2283J782957K469640J979924
$$ 3490659 2679344 1045554 -1382700 -4049254 -5845867 -5823584 -4040627 -1570987 408937
43524D08937J078806N47858N66166Q28002R72474Q26239M41823M6322j37684j20382
$$ 408937 1487743 2035601 2601767 3429769 4402243 5228482 5670305 5716627 5578943 5458561
43514E458561j38737l59367o48076p05906m03101O8916L56646K45710j35056l77459
$$ 5458561 5319824 4960457 4312381 3606475 3203374 3272290 3628936 3874646 3739590 3362131
43504C362131j26711N82542J331470J670630J440626P73358r1202r10522j460013
$$ 3362131 3235420 3817962 5149432 6820062 8260688 9034046 8942844 8032322 6572309
43495F572309j592314j298541o74750J28672Q74314J256834J129904P29182N14295
$$ 6572309 4979995 3681454 3006704 3135376 4009690 5266524 6396428 7125610 7639905
43486G639905O99911J022803J049781O56557J30595j40354Q350M48792Q74289
$$ 7639905 8339816 9362619 10412400 11068957 11199552 11059198 11067548 11516340 12390629
43477A2390629R80669O92597K96589K25412N55712P81550L02779p98348j659773
$$ 12390629 13371298 14063895 14360484 14585896 15141608 15923158 16225937 15427589 13767816
43468A3767816j495698m66120N02404P48407N21904N37985J077280J689677J703971
$$ 13767816 12272118 11805998 12308402 13056809 13578713 14116698 15193978 16883655 18587626
43459A8587626Q85853l67909j362965j655152j382328j072043j090320j343680
$$ 18587626 19473479 19105570 17742605 16087453 14705125 13633082 12542762 11199082
43451A1199082j559567j679777j776724j706971j167871j42505R68136J742899
$$ 11199082 9639515 7959738 6183014 4476043 3308172 3165667 4133803 5876702
43443E876702K052911J907187J281535L11499n74119j015075j132892j341322
$$ 5876702 7929613 9836800 11118335 11429834 10855715 9840640 8707748 7366426
43435G366426j800727k281194k511772k416098k013858j356241o31465j23872
$$ 7366426 5565699 3284505 772733 -1643365 -3657223 -5013464 -5644929 -5768801
43427e768801L7392l5438j87672l51699m57794m33032l80831n52659r86649j332095
$$ -5768801 -5731409 -5766847 -5954519 -6306218 -6764012 -7197044 -7577875 -8130534 -9117183 -10449278
43417a0449278j207785o22796J20358Q16710J429113J835208J784137J199328
$$ -10449278 -11657063 -12279859 -12159501 -11342791 -9913678 -8078470 -6294333 -5095005
43409e095005L66042k87725n24502l75447j4745L26469L98806P9319m29904o34854
$$ -5095005 -4728963 -5016688 -5541190 -5916637 -5931382 -5604913 -5206107 -5126788 -5556692 -6191546
43399f191546j40612R15677J877584K099009J472993M22135n64391j286068j771136
$$ -6191546 -6332158 -5416481 -3538897 -1439888 33105 455240 -109151 -1395219 -3166355
43390c166355k040448k029424j680112j036172k63892M11212Q50217J109023J343686
$$ -3166355 -5206803 -7236227 -8916339 -9952511 -10216403 -9805191 -8954974 -7845951 -6502265
43381f502265J593163J725701J606141J217885O05249j73069r81726j633220k045977
$$ -6502265 -4909102 -3183401 -1577260 -359375 245874 72805 -908921 -2542141 -4588118
43372d588118k242231k120330j446276k79042P53422R15164J21982r67370j640527
$$ -4588118 -6830349 -8950679 -10396955 -10675997 -9922575 -9007411 -8885429 -9852799 -11493326
43363a1493326j718229j438062j025795n68289j65807L4045k338j11065p3728
$$ -11493326 -13211555 -14649617 -15675412 -16243701 -16409508 -16375463 -16377801 -16488866 -16562594
43354a6562594J76056N12618P72109R04101R31701P99361L78388l22634j052431
$$ -16562594 -16386538 -15873920 -15101811 -14197710 -13266009 -12466648 -12088260 -12410894 -13463325
43345a3463325j521244j650472j528845j202185o51942N9944P90322J465944K095347
$$ -13463325 -14984569 -16635041 -18163886 -19366071 -20018013 -19958069 -19167747 -17701803 -15606456
43336a5606456K621333K913331K942705K815708K560913K014779J034157k26821
$$ -15606456 -12985123 -10071792 -7129087 -4313379 -1752466 262313 1296470 1069649
43328A069649j326586j822440j588374r57406n44792p72129j472816k036089j983584
$$ 1069649 -256937 -2079377 -3667751 -4625157 -5169949 -5942078 -7414894 -9450983 -11434567
43319a1434567j335595m26263M57759J158777J533990J466423J000093L73498
$$ -11434567 -12770162 -13196425 -12738666 -11579889 -10045899 -8579476 -7579383 -7205885
43311g205885j06309k39508o5571J51471J54129n5605k65933l39341k89054o4025
$$ -7205885 -7312194 -7551702 -7617273 -7465802 -7311673 -7367278 -7633211 -7972552 -8261606 -8325631
43301h325631M82492J248313J717590J408197M21428o50089j298832j403431j062217
$$ -8325631 -7843139 -6594826 -4877236 -3469039 -3047611 -3697700 -4996532 -6399963 -7462180
43292g462180m30700K39057O60634P49445O73529O17071O34851P72915J125513
$$ -7462180 -7892880 -7653823 -6993189 -6243744 -5570215 -4953144 -4318293 -3545378 -2419865
43283b419865J640304K012825J934889J378942N27356m80780j568907k537161
$$ -2419865 -779561 1233264 3168153 4547095 5074451 4593671 3024764 487603
43275D87603l054552k920153k257209j385810n33138K88184J123054J839495K108555
$$ 487603 -2566949 -5487102 -7744311 -9130121 -9663259 -9375075 -8252021 -6412526 -4303971
43266d303971J671509O39096n03058j205331j189837n65370K68066Q23669P93828
$$ -4303971 -2632462 -1993366 -2496424 -3701755 -4891592 -5456962 -5188896 -4365227 -3571399
43257c571399K67092l13723m91593j40872N08645J147111J648753K092988K572082
$$ -3571399 -3304307 -3618030 -4109623 -4250495 -3741850 -2594739 -945986 1147002 3719084
43248C719084K976780K969690K243515Q94532m85551j222964j158860p99144p95669
$$ 3719084 6695864 9665554 11909069 12803601 12318050 11095086 9936226 9137082 8341413
43239H341413j286942j818561j902541j530470j058249p03080l53789J06264M95437
$$ 8341413 7054471 5235910 3333369 1802899 744650 41570 -312219 -205955 289482
43230B89482N03431O8701n70353j155925j581099j793424j726462j419434j077497
$$ 289482 792913 861614 291261 -864664 -2445763 -4239187 -5965649 -7385083 -8462580
43221h462580q95481q79372r12606r10584q04229m57418K21044J072972J750325
$$ -8462580 -9358061 -10237433 -11150039 -12060623 -12864852 -13322270 -13101226 -12028254 -10277929
43212a0277929K047771K083241K083933K080408J908634J466956Q71363L74834
$$ -10277929 -8230158 -6146917 -4062984 -1982576 -73942 1393014 2264377 2639211
43204B639211K17648N17131J148630J698154J707751J124425M32188J84397M40837
$$ 2639211 2856859 3373990 4522620 6220774 7928525 9052950 9485138 9669535 10110372
43195A0110372Q18854J048988J223466J428625J419600R14492P2708o12069q91838
$$ 10110372 10929226 11978214 13201680 14630305 16049905 16964397 17037105 16425036 15533198
43186A5533198r94713j221602j525564j625332j427249j213110j427033k277085
$$ 15533198 14538485 13316883 11791319 10165987 8738738 7525628 6098595 3821510
43178C821510l457544m272368m193298l356675k371702j594767q08401K47950
$$ 3821510 363966 -3908402 -8101700 -11458375 -13830077 -15424844 -16233245 -15985295
43170a5985295J281685J708826J432286R97411Q72120Q55580M19510n08349j350685
$$ -15985295 -14703610 -12994784 -11562498 -10565087 -9692967 -8837387 -8417877 -8926226 -10276911
43161a0276911j480313q53828J0542N89420Q00279R20734J159891J381826J260099
$$ -10276911 -11757224 -12611052 -12600510 -12011090 -11210811 -10290077 -9130186 -7748360 -6488261
43152f488261O71684p9101m20387O7859J294153K659499L488685L551410L153673
$$ -6488261 -5816577 -5895678 -6316065 -6248206 -4954053 -2294554 1194131 4745541 7899214
43143G899214K684475K143115J209049k71192k002596l447030m183949m058161
$$ 7899214 10583689 12726804 13935853 13664661 11662065 8215035 4031086 -27075
43135b7075l145230j699523o8932J446258K639359L295075L189858K364205J343095
$$ -27075 -3172305 -4871828 -4940760 -3494502 -855143 2439932 5629790 7993995 9337090
43126I337090Q45991J124035J650686J606540O99208n60402j409809j579515j423339
$$ 9337090 10183081 11307116 12957802 14564342 15263550 14703148 13293339 11713824 10290485
43117A0290485j383836j498399j502119j282353j053234j080917j372547j680176
$$ 10290485 8906649 7408250 5906131 4623778 3570544 2489627 1117080 -563096
43109e63096j722140j376287p70926k47124j16543l38785m89817j53563O68734
$$ -563096 -2285236 -3661523 -4432449 -4679573 -4796116 -5134901 -5624718 -5778281 -5109547
43100e109547J578007K122890K052637J367048L40366n15761p64812m79516k72958
$$ -5109547 -3531540 -1408650 643987 2011035 2351401 1835640 1070828 591312 318354
43091C18354p60503j985086l396036m324240m428073l782863k713771j601095
$$ 318354 -442149 -2427235 -5823271 -10147511 -14575584 -18358447 -21072218 -22673313
43083b2673313p50205k98106j37954O8455O92099J828203L182125M326579N035293
$$ -22673313 -23423518 -23721624 -23859578 -23791123 -23099024 -21270821 -18088696 -13762117 -8726824
43074h726824N260105M856808L611837J671466k70510j474317j815990j788965
$$ -8726824 -3466719 1390089 5001926 6673392 6402882 4928565 3112575 1323610
43066A323610j891938k186129k415450k334529j870510j158606n06799j64639
$$ 1323610 -568328 -2754457 -5169907 -7504436 -9374946 -10533552 -11040351 -11204990
43058a1204990k4233L12868J066179K001167K722312L074113L086826K701221
$$ -11204990 -11229223 -10916355 -9850176 -7849009 -5126697 -2052584 1034242 3735463
43050C735463J850836P90838M3064j00210J55247M14211N00448M57276L19929
$$ 3735463 5586299 6377137 6420201 6319991 6475238 6889449 7389897 7847173 8167102
43041H167102Q1160j87751l66767m55353o01148r28209j379443j727179j727458
$$ 8167102 8248262 8060511 7693744 7238391 6637243 5709034 4329591 2602412 874954
43032H74954j326275p56647l47883j62324Q2955O13736J217482J458198J228180
$$ 874954 -451321 -1207968 -1555851 -1718175 -1635220 -1021484 195998 1654196 2882376
43023B882376Q42370N37440J31971o50009j693852k550164k896277k746318k251840
$$ 2882376 3724746 4262186 4394157 3744148 2050296 -499868 -3396145 -6142463 -8394303
43014h394303j515763o39503K23890R42119J422898J538643J198317N85013J65721
$$ -8394303 -9910066 -10549569 -10325679 -9383560 -7960662 -6422019 -5223702 -4638689 -4472968
43005d472968K86765P98742J211282J201638Q68866N10611K72673M5364l74990
$$ -4472968 -4186203 -3387461 -2176179 -974541 -105675 404936 677609 722973 347983
42996C47983j048954j768948k178765k089549j678500j302945j123303j003802
$$ 347983 -700971 -2469919 -4648684 -6738233 -8416733 -9719678 -10842981 -11846783
42988a1846783p94337n82964n82270q24404j047901q83612j62422Q68770J597079
$$ -11846783 -12641120 -13224084 -13806354 -14630758 -15678659 -16562271 -16724693 -15855923 -14258844
42979a4258844J437742L47294j025970j774466j363277J02367K072083L866059
$$ -14258844 -12821102 -12473808 -13499778 -15274244 -16637521 -16535154 -14463071 -10597012
42971a0597012M878374M738324L480809J573643l14028j669740k368036k622489
$$ -10597012 -5718638 -980314 2500495 4074138 3760110 2090370 -277666 -2900155
42963b900155k700156k626381k173491j192273O1539J024776J302583J016976
$$ -2900155 -5600311 -8226692 -10400183 -11592456 -11530917 -10506141 -9203558 -8186582
42955h186582O64234O65236J065157J602688K002369K208251K379895K679056
$$ -8186582 -7522348 -6857112 -5791955 -4189267 -2186898 21353 2401248 5080304
42947E080304L061094L288183L154230K682791K096333J604542J234189Q64422
$$ 5080304 8141398 11429581 14583811 17266602 19362935 20967477 22201666 23066088
42939B3066088M18107j5296k94533m57759p55122j394309k306410l215765l863743
$$ 23066088 23484195 23468899 23174366 22716607 21961485 20567176 18260766 15045001 11181258
42930A1181258m076412l718614k787916j568055n07036J35842M17598M75048L43330
$$ 11181258 7104846 3386232 598316 -969739 -1476775 -1340933 -923335 -448287 -104957
42921a04957R3285m4283J14651M42561N81196K56028n31963j479169k037244j716119
$$ -104957 -11672 -55955 58696 501257 1082453 1338481 806518 -672651 -2709895 -4426014
42911d426014o07281M91534P78095K72291l12392m95377m78802n95021o98720
$$ -4426014 -5033295 -4541761 -3763666 -3491375 -3803767 -4299144 -4777946 -5372967 -6071687
42902f071687l88581M02359J342973K099143K517349K519628K134207J632566
$$ -6071687 -6460268 -6057909 -4714936 -2615793 -98444 2421184 4555391 6187957
42894F187957J362515J381921J449047J397995J304840J234451J066798P02163
$$ 6187957 7550472 8932393 10381440 11779435 13084275 14318726 15385524 16087687
42886A6087687K48417j44904m85940q17157j029650r91867p80867n98510n07437
$$ 16087687 16336104 16191200 15705260 14888103 13858453 12866586 12085719 11487209 10979772
42877A0979772m30257l75900m64698p07757r47563j086791j232209j517433j866467
$$ 10979772 10549515 10173615 9708917 9001160 8053597 6966806 5734597 4217164 2350697
42868B350697k004906j667573q13550K39133Q89693O76274k27266j047833j109893
$$ 2350697 345791 -1321782 -2135332 -1896199 -1006506 -330232 -557498 -1605331 -2715224
42859b715224m60443K96029O85336P08976N62593K77551k24879q59822j337769
$$ -2715224 -3175667 -2879638 -2194302 -1485326 -922733 -645182 -870061 -1729883 -3067652
42850c067652j411659j083429n33457J07415Q37755J604343K131448K105959J584484
$$ -3067652 -4479311 -5562740 -6096197 -5988782 -5151027 -3546684 -1415236 690723 2275207
42841B275207J045126Q78214R32484P56950K16073l81531p54036r65288j198858
$$ 2275207 3320333 4198547 5131031 5887981 6104054 5722523 4968487 4003199 2804341
42832B804341j484044j789597k131211k359698k060985r91622M72338J626267
$$ 2804341 1320297 -469300 -2600511 -4960209 -7021194 -8012816 -7540478 -5914211
42824e914211K165266K371320K600736K880721L044005K941175K398878J271423
$$ -5914211 -3748945 -1377625 1223111 4103832 7147837 10089012 12487890 13759313
42816A3759313k49408j596213k341356k600603k694896k572265j896592o78962
$$ 13759313 13509905 11913692 9572336 6971733 4276837 1704572 -192020 -870982
42808h70982N06853J046279Q32182K23118l59769o93835p76240p49222p70350
$$ -870982 -364129 682150 1514332 1737450 1377681 683846 -92394 -841616 -1611966
42799a611966q77796r93692j039212r44897n60051K60556J383739K364025K836641
$$ -1611966 -2489762 -3483454 -4522666 -5467563 -6027614 -5767058 -4383319 -2019294 817347
42790H17347K863421K749333K592331K196169J420598M46588l63251p69037p91050
$$ 817347 3680768 6430101 9022432 11218601 12639199 13085787 12722536 11953499 11162449
42781A1162449o59574o94362j137427j972130k869407l353105l099993k194947
$$ 11162449 10502875 9808513 8671086 6698956 3829549 476444 -2623549 -4818496
42773d818496j156862o12246p62161j143111j059737l25667N37921R17919P90980
$$ -4818496 -5975358 -6587604 -7349765 -8492876 -9552613 -9878280 -9340359 -8422440 -7631460
42764g631460O44505Q15892J140276J281527J189416J068177J004423Q36052M20906
$$ -7631460 -6986955 -6171063 -5030787 -3749260 -2559844 -1491667 -487244 348808 769714
42755G69714j10542m68385n12192l59506k06147j23857n0676R6291L43877O29007
$$ 769714 659172 190787 -321405 -680911 -887058 -1010915 -1061591 -965300 -621423 7584
42745G584P57904M46895m44217j642504k514852k539516j783893q67327l96951
$$ 7584 765488 1212383 768166 -874338 -3389190 -5928706 -7712599 -8579926 -8976877
42736h976877m43531n90450m51508m5448L47891N44848N16215J86659n30193j390447
$$ -8976877 -9420408 -10010858 -10462366 -10507814 -10159923 -9615075 -9098860 -8912201 -9442394 -10832841
42726a0832841j770291j224009q32J225282K062915K574520K821560K659752K117050
$$ -10832841 -12603132 -13827141 -13827973 -12602691 -10539776 -7965256 -5143696 -2483944 -366894
42717c66894J595445J414000J388906J146097O49311J11579m35118j100148j763456
$$ -366894 1228551 2642551 4031457 5177554 5826865 5938444 5503326 4403178 2639722
42708B639722k150249k252466k262818k059543j223495K56372J704067K447834
$$ 2639722 489473 -1762993 -4025811 -6085354 -7308849 -7052477 -5348410 -2900576
42700b900576K474123K129879J515885N76759m40474j107507j352508j458112
$$ -2900576 -426453 1703426 3219311 3796070 3355596 2248089 895581 -562531
42692e62531j482601j065940L7303J503977K710341L309761L412367L303509L111586
$$ -562531 -2045132 -3111072 -3073769 -1569792 1140549 4450310 7862677 11166186 14277772
42683A4277772K711847J891642O33134p57523j837600k337424k281100j903070
$$ 14277772 16989619 18881261 19514395 18756872 16919272 14581848 12300748 10397678
42675A0397678j517279j336216j267739r89803l86667K13968M53440M50114N76345
$$ 10397678 8880399 7544183 6276444 5286641 4899974 5113942 5567382 6017496 6593841
42666F593841Q21463Q09016M97326L91811Q13875J316610J171775K40890r37868
$$ 6593841 7415304 8224320 8721646 9113457 9927332 11243942 12415717 12656607 11718739
42657A1718739j775811k047582j800635j195284m48272L10242J149379K122403
$$ 11718739 9942928 7895346 6094711 4899427 4451155 4761397 5910776 8033179
42649H033179K953472L168901K611504J670462R22400O24441N79386M04408j01423
$$ 8033179 10986651 14155552 16767056 18437518 19359918 19984359 20563745 20968153 20866730
42640B0866730p96381j370056j655062j686023j464515q80333N045Q09357J200738
$$ 20866730 20070349 18700293 17045231 15359208 13894693 13014360 13019405 13828762 15029500
42631A5029500J260714J189380P95297k92709j891429l192439l619571l421923
$$ 15029500 16290214 17479594 18274891 17982182 16090753 12898314 9278743 5856820
42623E856820l181259l036453k725580k171796j596137j091259m95995J89824
$$ 5856820 2675561 -360892 -3086472 -5258268 -6854405 -7945664 -8441659 -8251835
42615h251835N90488L94209j49505m25441j44762L23367L65023k23977j045808
$$ -8251835 -7661347 -7267138 -7416643 -7842084 -7986846 -7663479 -7298456 -7522433 -8568241
42606h568241j482729j191671k99580O98798J179160P41311m00074j380613j309755
$$ -8568241 -10050970 -11242641 -11542221 -10843423 -9664263 -8922952 -9323026 -10703639 -12013394
42597a2013394j11854J333613K010298J676794R01570L27576J07103L7381j0901
$$ -12013394 -12125248 -10791635 -8781337 -7104543 -6202973 -5875397 -5768294 -5730913 -5741814
42588e741814N735N6892r0419o47691j517572k331545k773415k784644k439368
$$ -5741814 -5736079 -5679187 -5769606 -6417297 -7934869 -10266414 -13039829 -15824473 -18263841
42579a8263841j747909p14831M51939J347517J652984J369478P81266K71252J51905
$$ -18263841 -20011750 -20726581 -20274642 -18927125 -17274141 -15904663 -15123397 -14852145 -14700240
42570a4700240N08008J101002J514211J497831J141151O69037J72297l56449q05526
$$ -14700240 -14192232 -13091230 -11577019 -10079188 -8938037 -8269000 -8096703 -8453152 -9258678
42561i258678r30814n79554J66607J074742J890891K378083K349739J777484Q77331
$$ -9258678 -10189492 -10769046 -10602439 -9527697 -7636806 -5258723 -2908984 -1131500 -254169
42552b54169N2783l02348m7262N61489R93191Q45523K20134l29242k97163K93016
$$ -254169 -201386 -503734 -550996 10493 1003684 1849207 2069341 1740099 1442936 1735952
42542A735952R14694J042305O11495k2798n19163q28518j017841r73720m80886
$$ 1735952 2650646 3692951 4304446 4281648 3762485 2933967 1916126 942406 461520
42533D61520M05040J246450J572113J241895M47967m51913r95052p51406K82015
$$ 461520 866560 2113010 3685123 4927018 5374985 4923072 3928020 3176614 3458629
42524C458629J463663J980912J635220R77612O01513N08657L12666j12879m41840
$$ 3458629 4922292 6903204 8538424 9516036 10117549 10626206 10938872 10825993 10384153
42515A0384153l38785R5106M01093K18760l88562j023014j302477j105046n27690
$$ 10384153 10045368 10140474 10541567 10760327 10371765 9348751 8046274 6941228 6413538
42506F413538K64704J061439J573816J583124J176377O90004L29214l3008n55440
$$ 6413538 6678242 7739681 9313497 10896621 12072998 12763002 13092216 13059208 12503768
42497A2503768j047060j101438o13190M1918M42554O07613Q97968J471509J990810
$$ 12503768 11456708 10355270 9742080 9783998 10226552 10834165 11732133 13203642 15194452
42488A5194452J944100J187714Q4377q74979j486907j846096k059498k093869
$$ 15194452 17138552 18326266 18410643 17535664 16048757 14202661 12143163 10049294
42480A0049294j907332j598797j334320j156198r23069m46810L04070J106246
$$ 10049294 8141962 6543165 5208845 4052647 3129578 2682768 2986838 4093084
42472D093084J607927J629131J336449J025779P26010J66509p84051j792454k323482
$$ 4093084 5701011 7330142 8666591 9692370 10418380 10584889 9800838 8008384 5684902
42463E684902k142740j416092m18178O18415J394821J600479J244362P66130O31181
$$ 5684902 3542162 2126070 1707892 2326307 3721128 5321607 6565969 7332099 7963280
42454G963280Q67542J105531R89478M32258m33198j351545k004139k179838j998675
$$ 7963280 8830822 9936353 10925831 11358089 10924891 9573346 7569207 5389369 3390694
42445C390694j878725k179066k870587l554661l753657l198238j961042m14159
$$ 3390694 1511969 -667097 -3537684 -7092345 -10846002 -14044240 -16005282 -16419441
42437a6419441R80491J939648K471332K740714K857724K794989K439827J677625
$$ -16419441 -15438950 -13499302 -11027970 -8287256 -5429532 -2634543 -194716 1482909
42429A482909N00053q57351j909041k198950j673662p22008K23801J081225K032758
$$ 1482909 1982962 1125611 -783430 -2982380 -4656042 -5378050 -5154249 -4073024 -2040266
42420b040266L081937L826426L762037K794728J404446K93739j32974J539K64330
$$ -2040266 1041671 4868097 8630134 11424862 12829308 13123047 12990073 12991612 13255942
42411A3255942L36777K56760K86549N82722J020814J326777J333139J093533P86623
$$ 13255942 13592719 13849479 14136028 14718750 15739564 17066341 18399480 19493013 20279636
42402B0279636N33844K91241p5778n58768q58238n97548K30485J130401J545757
$$ 20279636 20813480 21104721 21028943 20470175 19611937 19014389 19244874 20375275 21921032
42393B1921032J367478Q64173K05094o79200j741310k632297l055294l091306
$$ 21921032 23288510 24152683 24357777 23678577 21937267 19304970 16249676 13158370
42385A3158370k947280k549830j692096n17595M68433R24089R47831P58630L72615
$$ 13158370 10211090 7661260 5969164 5451569 5920002 6844091 7791922 8550552 8923167
42376H923167k33827q52322j176478j132188r01276o70945m97440l53439j69362
$$ 8923167 8689340 7837018 6660540 5528352 4627076 3956131 3458691 3105252 2935890
42367B935890J14695M08082M71652K40726N8503L24285R06962J188741P95415
$$ 2935890 3050585 3458667 3930319 4171045 4229548 4553833 5460795 6649536 7444951
42358G444951N1594m42801m99838m18035n19184q47332j252725j515172j367421
$$ 7444951 7496545 7053744 6553906 6135871 5616687 4769355 3516630 2001458 634037
42349F34037o42189M77134J488054J977520J935258J586558J019864J41834j006973
$$ 634037 -8152 468982 1957036 3934556 5869814 7456372 8476236 8618070 7611097
42340G611097k055500k538660k314350j686201j104388p74583n61279k21100L25651
$$ 7611097 5555597 3016937 702587 -983614 -2088002 -2862585 -3423864 -3644964 -3319313
42331c319313R40748J406065J572530J426102J087498P45055N15113L41385Q8215
$$ -3319313 -2378565 -972500 600030 2026132 3113630 3858685 4373798 4715183 4803398
42322D803398k30735l80904j49709L52602P28446O70998K56535j74111l67547
$$ 4803398 4572663 4191759 4042050 4394652 5123098 5794096 6050631 5876520 5508973
42313E508973l37397k58467k91977n00722q14172j041741j021279p97258n44343
$$ 5508973 5171576 4913109 4621132 4120410 3306238 2264497 1243218 445960 -98383
42304i8383k67740K52139J072072J801164J965794J616815J295243J357157J615184
$$ -98383 -366123 -113984 958088 2759252 4725046 6341861 7637104 8994261 10609445
42295A0609445J752462J776676J813468J694245J124692J95679o19059j002915
$$ 10609445 12361907 14138583 15952051 17646296 18770988 18966667 18347608 17344693
42287A7344693j048171r35709o99291m58034n66568j221484k046022k358980j864321
$$ 17344693 16296522 15360813 14661522 14203488 13636920 12415436 10369414 8010434 6146113
42278F146113r07476q1990K40060K0646n51570j170221j552458j606668j433995
$$ 6146113 5238637 5156647 5396707 5417353 4865783 3695562 2143104 536436 -897559
42269h97559j115923n52650M21327J764662L097183L859983L676314K647915J301961
$$ -897559 -2013482 -2566132 -2144805 -380143 2717040 6577023 10253337 12901252 14203213
42260A4203213J69507o10945j230440j780393k024130j682665q64952p2489K53057
$$ 14203213 14372720 13761775 12531335 10750942 8726812 7044147 6179195 6106706 6359763
42251F359763J13575j45247k50190k40815l12225n18995o99469o35856j92381
$$ 6359763 6473338 6328091 6077901 5837086 5524861 5005866 4306397 3670541 3478160
42242C478160O70244J846872K966270L452013K909234J512764l9632r82241r31559
$$ 3478160 4148404 5995276 8961546 12413559 15322793 16835557 16795925 15813684 14882125
42233A4882125o3300R76308J406300Q28291m41947j623188k105661j813678j025143
$$ 14882125 14818825 15795133 17201433 18029724 17587777 15964589 13858928 12045250 11020107
42224A1020107o5370P59986J189827J207077J118383J221685J428827J401852
$$ 11020107 10954737 11714723 12904550 14111627 15230010 16451695 17880522 19282374
42216A9282374J037574O03908L58465K41518N8288k08851m59700p60469j328825
$$ 19282374 20319948 20923856 21282321 21523839 21582127 21373276 20913576 20153107 18824282
42207A8824282k170747k911951l161018k975634k763432k680060k359179j452385
$$ 18824282 16653535 13741584 10580566 7604932 4841500 2161440 -197739 -1650124
42199a650124k93679L24090J01457l54017k68021L80172R54494J018101P40144
$$ -1650124 -1943803 -1619713 -1518256 -1872273 -2140294 -1760122 -805628 212473 952617
42190I52617M89561M05086M77571P34700J113016J324369J072493L32751p02564
$$ 952617 1442178 1847264 2324835 3059535 4172551 5496920 6569413 6902164 6199600
42181F199600j830377k831994l383611l195471k244887p64962R29954K475854
$$ 6199600 4369223 1537229 -1846382 -5041853 -7286740 -8051702 -7121748 -4645894
42173d645894L431789L491028K777256J766476Q68141K21882q9555J12502Q43299
$$ -4645894 -1214105 2276923 5054179 6820655 7688796 7910678 7821123 7933625 8776924
42164H776924J666515J920782J309644J75372q50945j403071j563801j606363
$$ 8776924 10443439 12364221 13673865 13849237 12998292 11595221 10031420 8425057
42156H425057j676065j719922j603836j213655n07401M02918J205595J537696
$$ 8425057 6748992 5029070 3425234 2211579 1704178 2107096 3312691 4850387
42148D850387J267029O18363R812k08876R4536P91009J517186J853489J607165
$$ 4850387 6117416 6735779 6745591 6536715 6631251 7422260 8939446 10792935 12400100
42139A2400100R20949Q6031o61446j112689j022892k82443Q61477J899452K399834
$$ 12400100 13321049 13407080 12745634 11632945 10610053 10327610 11189087 13088539 15488373
42130A5488373K207385J414658L27437n77775r17981p53916n52770o85889j024495
$$ 15488373 17695758 19110416 19437853 18860078 17942097 17188181 16635411 15949522 14925027
42121A4925027j110892o81439M3859N61824N40196J08621k66420k06723K62326
$$ 14925027 13814135 13132696 13176555 13738379 14278575 14387196 14120776 13914053 14176379
42112A4176379P78419R20361L99287q22121k374875l527688l672123k854382j686399
$$ 14176379 14954798 15875159 16274446 15452325 13077450 9549762 5877639 3023257 1336858
42103A336858p22564r7371K53500L27712J43886j50098m31392o87470q12835n51668
$$ 1336858 614294 516923 770423 1098135 1242021 1091923 660531 -26939 -839774 -1391442
42093a391442J46485R18385J387347J590136J706344J540514P13622o28577j721993
$$ -1391442 -1244957 -326572 1060775 2650911 4357255 5897769 6611391 5982814 4260821
42084D260821j954227j442091o96143R999P07974J380032J848251K005655J945835
$$ 4260821 2306594 864503 168360 178359 886333 2266365 4114616 6120271 8066106
42075H066106J797392J528912R91260J51493p46108j314136j366013j080107p66770
$$ 8066106 9863498 11392410 12383670 12535163 11789055 10474919 9108906 8028799 7262029
42066G262029n74063n60226r25412j846799l017642l656732l212655j940846o19243
$$ 7262029 6687966 6127740 5202328 3355529 337887 -3318845 -6531500 -8472346 -9091589
42057i091589J99772N08835N73605O10103P26187R59422J280215J642498K052844
$$ -9091589 -8891817 -8382982 -7809377 -7199274 -6473087 -5513665 -4233450 -2590952 -538108
42048e38108K505699K850250K831510K310264J393413L41838n93664j256289j596556
$$ -538108 1967591 4817841 7649351 9959615 11353028 11694866 11101202 9844913 8248357
42039H248357j650400j484220j160721p65909m04537r5251K76147P80478J234163
$$ 8248357 6597957 5113737 3953016 3187107 2782570 2687319 2963466 3743944 4978107
42030D978107J300487Q54787J59550l78747n59710m61406k71117j47299j80801
$$ 4978107 6278594 7133381 7292931 6914184 6354474 5893068 5621951 5474652 5293851
42021E293851l43415m61214l75460k07628l53944j050218j935849k215578j387663
$$ 5293851 4950436 4489222 4113762 3906134 3552190 2501972 566123 -1649455 -3037118
42012c037118K23110J741573K516509K541996K194344J772929J369800R83841
$$ -3037118 -2814008 -1072435 1444074 3986070 6180414 7953343 9323143 10306984
42004A0306984N47931r4695j025343k017544k625033k592828k099975j526504
$$ 10306984 10854915 10760220 9734877 7717333 5092300 2499472 399497 -1127007
41996a127007j061108o31465j54043L00557O21372Q12400R33581R39998P10576
$$ -1127007 -2188115 -2819580 -2973623 -2673066 -2051694 -1239294 -305713 634285 1344861
41987A344861K81907k5121J97115J094376K387672L509619L899436L287095J840217
$$ 1344861 1626768 1601647 1798762 2893138 5280810 8790429 12689865 15976960 17817177
41978A7817177N4549j580209k843199l718985m171380m104719l498833k418890
$$ 17817177 17871726 16291517 13448318 9729333 5557953 1453234 -2045599 -4464489
41970d464489r17158Q52960K395946L050003K627537J716857J114475J049777
$$ -4464489 -5381647 -4528687 -2132741 917262 3544799 5261656 6376131 7425908
41962G425908J164211J120046R30621P30136N40355L38855J11175k41404q06375
$$ 7425908 8590119 9710165 10640786 11370922 11911277 12250132 12361307 12119903 11313528
41953A1313528j376020j512726j066955m30784r1647j10110k41890l90989o38223
$$ 11313528 9937508 8424782 7357827 6927043 6835396 6725286 6483396 6092407 5454184
41944E454184r02164r04672n31670J4191N08183R55857J431869J805883J782231
$$ 5454184 4552020 3647348 3115678 3129869 3638052 4593909 6025778 7831661 9613892
41935I613892J196591K22502o98135j153349j089830q60992q48903j018955r66464
$$ 9613892 10810483 11032985 10334850 9181501 8091671 7230679 6381776 5362821 4396357
41926D396357m39263L34994R39907J259096J516533J889718K259259K371818K125010
$$ 4396357 3957094 4292088 5231995 6491091 8007624 9897342 12156601 14528419 16653429
41917A6653429J624445J034196M56872m6235l79489m11913q5199M71031R60820
$$ 16653429 18277874 19312070 19768942 19722707 19343218 18931305 18846106 19317137 20277957
41908B0277957J093649P48083j2351j021247k054524k831110l075439k659296
$$ 20277957 21371606 22119689 22107338 21086091 19031567 16200457 13125018 10465722
41900A0465722j694230m72753O81265J522471J919523J880081J579666J296064
$$ 10465722 8771492 8298739 8980004 10502475 12421998 14302079 15881745 17177809
41892A7177809J194096J130818P58123p5875j041425j551979j322416o31729K5868
$$ 17177809 18371905 19502723 20260846 20184971 19143546 17591567 16269151 15637422 15663290
41883A5663290M66765Q67478J316801J514779J073041O6632q72925j085256m61759
$$ 15663290 16130055 16997533 18314334 19829113 20902154 20968786 20095861 19010605 18548846
41874A8548846M90592J058863P83896k76794j514049k052420j360251K73575J985788
$$ 18548846 19039438 20098301 20882197 20605403 19091354 17038934 15678683 15952258 17938046
41865A7938046L150112L824150M325729M604053M293765L273683J846373L61179
$$ 17938046 21088158 24912308 29238037 33842090 38135855 41409538 43255911 43617090
41857D3617090j007796k008134k198949j423636k40876M70617L84717j0834p9315
$$ 43617090 42609294 40601160 38402211 36978575 36737699 37208316 37593033 37582199 37502884
41848C7502884K30784M27031J09789o05915j287867j649669j715982j590407j242007
$$ 37502884 37733668 38160699 38270488 37664573 36376706 34727037 33011055 31420648 30178641
41839C0178641o49066o3694R6989k86659q28277j020663p49291l08038R626J78578
$$ 30178641 29529575 29465881 29562870 29276211 28447934 27427271 26677980 26369942 26379568 26558146
41829B6558146L47237O48037J118978J684179K190623K562921K904421L303831
$$ 26558146 26905383 27553420 28672398 30356577 32547200 35110121 38014542 41318373
41821D1318373L543714L194128K096256O37173n51007j092386j032857o62340
$$ 41318373 44862087 48056215 50152471 50789644 50238637 49146251 48113394 47451054
41813D7451054l13006k35400m72156q08800r51003q09971n86953n59184p94422
$$ 47451054 47138048 46902648 46430492 45621692 44670689 43860718 43273765 42714581 41920159
41804D1920159j067198j038860n41916K66039R96481J274433R47121J70555o41650
$$ 41920159 40852961 39814101 39272185 39538224 40534705 41809138 42756259 42926814 42285164
41795D2285164j055465r70960p56864r02306j482579k053355k102680j521431
$$ 42285164 41229699 40258739 39501875 38599569 37116990 35063635 32960955 31439524
41787C1439524o18008J95992O74014Q27138Q76355J058333J382542J595267J415246
$$ 31439524 30821516 31017508 31691522 32518660 33395015 34453348 35835890 37431157 38846403
41778C8846403P70280j74981j103090j642489j556641r47783j85957M26573Q28933
$$ 38846403 39616683 39441702 38338612 36696123 35139482 34191699 34005742 34432315 35261248
41769C5261248J042876J048817Q97510P11237M29465k00977j155360j870749j761689
$$ 35261248 36304124 37352941 38250451 38961688 39391153 39190176 38034816 36164067 34402378
41760C4402378q64912L06037J383636K273792K827261K896204K743480K896353
$$ 34402378 33537466 33843503 35227139 37500931 40328192 43224396 45967876 48864229
41752D8864229L422666L756654L449750K728363K063639J548596J047655O90669
$$ 48864229 52286895 56043549 59493299 62221662 64285301 65833897 66881552 67572221
41744F7572221P98862J416829K229888K864898L032325K543152J542767O30040
$$ 67572221 68371083 69787912 72017800 74882698 77915023 80458175 82000942 82630982
41736H2630982L36822M68305L24168l55554j020430j034973m66030R5877L22429
$$ 82630982 82967804 83436109 83760277 83404723 82384293 81349320 80883290 80979167 81301596
41727H1301596N15410J250738K797742M823555O548728P260974O833299N792579
$$ 81301596 81817006 83067744 85865486 90689041 97237769 104498743 111332042 117124621
41719A17124621M871824M493109M599772M821641M767276M319942L764280L546604
$$ 117124621 121996445 126489554 131089326 135910967 140678243 144998185 148762465 152309069
41711A52309069L842077M433168N034800N583849O134308O664029P173254P845386
$$ 152309069 156151146 160584314 165619114 171202963 177337271 184001300 191174554 199019940
41703A99019940Q866945J0108902J1195148J1925592J2485575J3205290J4246178
$$ 199019940 207886885 217995787 229190935 241116527 253602102 266807392 281053570
41696B81053570J5561728J7020326J8453463J9630954K0279504K0183015J9346211
$$ 281053570 296615298 313635624 332089087 351720041 371999545 392182560 411528771
41689D11528771J8115716J7031924J6378947J5880088J4994193J3523209J1758007
$$ 411528771 429644487 446676411 463055358 478935446 493929639 507452848 519210855
41682E19210855J0016695Q290504O456197M569860K693672N97238k038114n116195
$$ 519210855 529227550 537518054 543974251 548544111 551237783 551835021 549796907 544680712
41674E44680712q072246j0364731j1856534j2730851j3270210j3771304j4439680
$$ 544680712 536608466 526243735 514387201 501656350 488386140 474614836 460175156
41667D60175156j5223649j5872511j6229651j6331021j6181408j5658080j4755375
$$ 460175156 444951507 429078996 412849345 396518324 380336916 364678836 349923461
41660C49923461j3720123j2790673j1992829j1361170j1127912j1411739j1886093
$$ 349923461 336203338 323412665 311419836 300058666 288930754 277519015 265632922
41653B65632922j2086265j1948520j1695665j1249367j0191871q415037o426409
$$ 265632922 253546657 241598137 229902472 218653105 208461234 200046197 193619788
41646A93619788m797990l582691k507763j528073q96688p62609r27660j015795
$$ 193619788 188821798 185239107 182731344 181203271 180306583 179543974 178616314 177600519
41638A77600519p97700m06979k98348q68627k001173l079580l557162l414687
$$ 177600519 176802819 176395840 176097492 175228865 173227692 170148112 166590950 163176263
41630A63176263k966675k376101j548463m21620Q35827J919367K586446K801042
$$ 163176263 160209588 157833487 156285024 155863404 156699231 158618598 161205044 164006086
41622A64006086K762983K736147K787205K778349K642030K482976K335810K070417
$$ 164006086 166769069 169505216 172292421 175070770 177712800 180195776 182531586 184602003
41614A84602003J708802J574113J844688K177215K135490J850529J844393K262416
$$ 184602003 186310805 187884918 189729606 191906821 194042311 195892840 197737233 199999649
41606A99999649K721336K946250L115259L455638L916158M429434N109775N917100
$$ 199999649 202720985 205667235 208782494 212238132 216154290 220583724 225693499 231610599
41598B31610599O446998O387084N953081N541026N137915M454635L535140K817303
$$ 231610599 238057597 244444681 250397762 255938788 261076703 265531338 269066478 271883781
41590B71883781K535126K375196J847018Q06148m69159j566182k239354k565808
$$ 271883781 274418907 276794103 278641121 279447269 278978110 277411928 275172574 272606766
41582B72606766k877568l448322m195662m752091m834681m482973l985071l707409
$$ 272606766 269729198 266280876 262085214 257333123 252498442 248015469 244030398 240322989
41574B40322989l969638m877259o171210p357217q097220q429732q547825q438738
$$ 240322989 236353351 231476092 225304882 217947665 209850445 201420713 192872888 184434150
41566A84434150p861299o689427n197789l933392l270964l102110l000897k707029
$$ 184434150 176572851 169883424 164685635 160752243 157481279 154379169 151378272 148671243
41558A48671243k395575k439004k966228l723846m321539m521549m322077l891781
$$ 148671243 146275668 143836664 140870436 137146590 132825051 128303502 123981425 120089644
41550A20089644l469671l241444l230156l303646l299747l145467k897114k719374
$$ 120089644 116619973 113378529 110148373 106844727 103544980 100399513 97502399 94783025
41542I4783025k790750l127255l468557l411573k726518j563947l86578K70850
$$ 94783025 91992275 88865020 85396463 81984890 79258372 77694425 77307847 77578697
41534G7578697O0926r61997k275496l125027l003823k007791p34844J79408M62972
$$ 77578697 77639623 76677626 74402130 71277103 68273280 66265489 65530645 65710053 66173025
41525F6173025K31539k75791r04006j534758j958219j971159j675598j560621
$$ 66173025 66404564 66128773 65224767 63690009 61731790 59760631 58085033 56524412
41517E6524412k099246l201397m148821m162413l068973j443758j41934L37351
$$ 56524412 54425166 51223769 47074948 42912535 39843562 38399804 38257870 38595221
41509C8595221J44998j45212n2650M39498R34456R90876M79844l05319q10932
$$ 38595221 38740219 38595007 38542357 38981855 39916311 40907187 41387031 41081712 40270780
41500D0270780n67784M52469J736841K545633K424249J458789Q8179j252394k307517
$$ 40270780 39702996 40155465 41892306 44437939 46862188 48320977 48409156 47156762 44849245
41491D4849245k973444l251986l239407l054207k709866k094069j140010m0651
$$ 44849245 41875801 38623815 35384408 32330201 29620335 27526266 26386256 26345605
41483B6345605P46171P94461J05343p79794j159378p80259p8632K53981l9805
$$ 26345605 27091776 27886237 27991580 27211786 26052408 25272149 25193517 25447498 25407693
41474B5407693n86126q66685p67295n36486l07345J05644Q60815J718563K203114
$$ 25407693 24821567 23954882 23187587 22651101 22343756 22449400 23310215 25028778 27231892
41465B7231892K104304J665646J245002R16315M92964j30513p87111j211322j329873
$$ 27231892 29336196 31001842 32246844 33163159 33656123 33525610 32738499 31527177 30197304
41456C0197304j314047j351992j430775j387177j143021q14364n63125l93811
$$ 30197304 28883257 27531265 26100490 24713313 23570292 22755928 22192803 21798992
41448B1798992j37150L91199J218879K120326K645062K359095J227260k26191
$$ 21798992 21661842 22053041 23271920 25392246 28037308 30396403 31623663 31397472
41440C1397472j255430j469736j075305n67663k33563M8962N53400J249107J645123
$$ 31397472 30142042 28672306 27597001 27029338 26795775 26844737 27398137 28647244 30292367
41431C0292367J235851J59295p86289r66358n90249l16958l51305l60235k60980
$$ 30292367 31528218 31687513 30901224 29934866 29344617 29027659 28676354 28316119 28055139
41422B8055139n31707j456514k481949k766113k161562j231965m17751L40941
$$ 28055139 27523432 26066918 23584969 20818856 18657294 17425329 17007578 17348519
41414A7348519J107842J520675J112448j15598j609930k656670k784759j931921
$$ 17348519 18456361 19977036 21089484 20973886 19363956 16707286 13922527 11990606
41406A1990606l85525J410884L021931M061741M266392L704714K834693K131531
$$ 11990606 11605081 13015965 16037896 20099637 24366029 28070743 30905436 33036967
41398C3036967J651525J113353L50212n45737j479980k421135l119266l082361
$$ 33036967 34688492 35801845 36152057 35606320 34126340 31705205 28585939 25503578
41390B5503578k073854m76977J021624J994568K395342K311864J847538J181197
$$ 25503578 23429724 22952747 23974371 25968939 28364281 30676145 32523683 33704880
41382C3704880N35497Q3962j3097M13216J329876K313007K795783K588525K059451
$$ 33704880 34240377 34324339 34311242 34724458 36054334 38367341 41163124 43751649 45811100
41373D5811100J764581J957985K449432K849512K944142K890420L030839L456991
$$ 45811100 47575681 49533666 51983098 54832610 57776752 60667172 63698011 67155002
41365F7155002L807753L610599K808929J834570J139008P58333L95421j34281
$$ 67155002 70962755 74573354 77382283 79216853 80355861 81114194 81509615 81375334
41357H1375334o08051n46425L46025J863100L397708M355152M486997L913657
$$ 81375334 80767283 80220858 80566883 82429983 85827691 90182843 94669840 98583497
41349I8583497K965952K032376J396742J067506Q02852M01698q2637n19455j005402
$$ 98583497 101549449 103581825 104978567 106046073 106848925 107250623 107167986 106648531 105643129
41340A05643129j793087k889615l900739m387414m312001m051687l996190m177763
$$ 105643129 103850042 100960427 97059688 92672274 88360273 84308586 80312396 76134633
41332G6134633m290107m058004l579816l252066l312232l529326l457237k949852
$$ 76134633 71844526 67786522 64206706 60954640 57642408 54113082 50655845 47705993
41324D7705993k267767j666962j077462l13174N26574J052391R94915N26602J54304
$$ 47705993 45438226 43771264 42693802 42380628 42907202 43959593 44954508 45481110 45635414
41315D5635414L17249J030308J821021K035763J350580Q0847j039119j444936
$$ 45635414 45952663 46982971 48803992 50839755 52190335 52271182 51232063 49787127
41307D9787127j134262n08218Q4231N85077J097112J674004K279811K836497L213919
$$ 49787127 48652865 48144647 48228878 48813955 49911067 51585071 53864882 56701379 59915298
41298E9915298L242523K863480K271933J834879J864442K499670L694969N137351
$$ 59915298 63157821 66021301 68293234 70128113 71992555 74492225 78187194 83324545
41290H3324545O218381O392197N749855N085701N182818O081398P192674Q024214
$$ 83324545 89542926 95935123 101684978 106770679 111953497 118034895 125227569 133251783
41282A33251783Q540609Q824421Q696589P877414O401831M677625L119448J810313
$$ 133251783 141792392 150616813 159313402 167190816 173592647 178270272 181389720 183200033
41274A83200033N17892j032631k916384m959834o835270q164406q607294q027806
$$ 183200033 183717925 182685294 179768910 174809076 167973806 159809400 151202106 143174300
41266A43174300o693063n238770m274692l966791m036510m117046m009504l658398
$$ 143174300 136481237 131242467 126967775 123000984 118964474 114847428 110837924 107179526
41258A07179526l099281k513429k168969k161052k283825k284488k205915k364220
$$ 107179526 104080245 101566816 99397847 97236795 94952970 92668482 90462567 88098347
41250H8098347k978803l880396m582896m635901l981775l029624k320110k042853
$$ 88098347 85119544 81239148 76656252 72020351 68038576 65008952 62688842 60645989
41242F0645989j924695j641619j241027j036871j173943j494496j836973k251261
$$ 60645989 58721294 57079675 55838648 54801777 53627834 52133338 50296365 48045104
41234D8045104k808415l346211l568152l349515k826632k221687j705691j409255
$$ 48045104 45236689 41890478 38322326 34972811 32146179 29924492 28218801 26809546
41226B6809546j385010j462279j255287m87249O55173J563593J663923Q62726
$$ 26809546 25424536 23962257 22706970 22219721 22874894 24438487 26102410 26965136
41218B6965136l97036j454882j834567j465241o32865K54169Q86188J101328Q13732
$$ 26965136 26568100 25113218 23278651 21813410 21180545 21434714 22320902 23422230 24235962
41209B4235962J2112j128250k214447k828050k787662k226914j462745q28828
$$ 24235962 24248074 23119824 20905377 18077327 15289665 13062751 11600006 10771178
41201A0771178n65631p21074j078761j237154q61530P3906J262467K280227K857972
$$ 10771178 10205547 9484473 8405712 7168558 6307028 6380934 7643401 9923628 12781600
41192A2781600K985102K780297K309768J592277P65108J17989j42818j29681j80822
$$ 12781600 15766702 18546999 20856767 22449044 23214152 23332141 23189323 23059642 22878820
41183B2878820n16298j013024j302301j082325m08755K83558N44789L63487J26455
$$ 22878820 22362522 21349498 20047197 18964872 18556117 18839675 19384464 19747951 19874406
41174A9874406J4984l65542j477246l065976m238352m371527l644544k602971
$$ 19874406 19889390 19523848 18046602 14980626 10742274 6370747 2726203 123232
41166A23232j572233p03796k26204k36398l93642k09340L77542R93186J352886
$$ 123232 -1449001 -2152797 -2379001 -2615399 -3009041 -3218381 -2840839 -1847653 -494767
41157d94767J506082J593143J684615J892356K303885K695743K623255J987386
$$ -494767 1011315 2604458 4289073 6181429 8485314 11181057 13804312 15791698
41149A5791698J279817J044503J250139J401653J159925O48659K06769J0665o4996
$$ 15791698 17071515 18116018 19366157 20767810 21927735 22576394 22783163 22793828 22728832
41140B2728832l03631q36548j447708j792938j839444j892444k092385k142978
$$ 22728832 22425201 21588653 20140945 18348007 16508563 14616119 12523734 10380756
41132A0380756j771274j248949j116303j467009j834482j769898j215509l04726
$$ 10380756 8609482 7360533 6244230 4777221 2942739 1172841 -42668 -347394
41124c47394Q14408J809061K179218J766167J094193R30457J529796K449080L014236
$$ -347394 467014 2276075 4455293 6221460 7315653 8246110 9775906 12224986 15239222
41115A5239222K824965J934291P87789k3336j79996R2437K52227k8393o17007
$$ 15239222 18064187 19998478 20786267 20762931 20582935 20675372 20927599 20899206 20282199
41106B0282199j159823j430908j433617j292927j124486r51452o95013k59078
$$ 20282199 19122376 17691468 16257851 14964924 13840438 12888986 12193973 11934895
41098A1934895L74843J143837J927187K503496K565049J933813P69646n69156
$$ 11934895 12309738 13453575 15380762 17884258 20449307 22383120 23152766 22583610
41090B2583610j884028l199779m431602n198993n158968m433949l504279k669834
$$ 22583610 20699582 17499803 13068201 7869208 2710240 -1723709 -5227988 -7897822
41082g897822j788165o07444P84211J977795K660826K871653K809344K526618
$$ -7897822 -9685987 -10293431 -9509220 -7531425 -4870599 -1998946 810398 3337016
41074C337016J946176J137006L92842n3860k85804n38580q38802r50803o82960
$$ 3337016 5283192 6420198 6813040 6759180 6473376 5934796 5095994 4145191 3462231
41065C462231j11509N23066J004164J177803R67607M85332L1098j68386j91671
$$ 3462231 3350722 3873788 4877952 6055755 7023362 7508694 7539792 7371406 7179735
41056G179735k81276n08844p04050o87124m24204M5173O49844J182253J333050
$$ 7179735 6898459 6389615 5685565 4998441 4574237 4619410 5269254 6451507 7784557
41047G784557J015947N86843N31165Q93127J181077R48200L55851l922J83559
$$ 7784557 8800504 9387347 9918512 10811639 11992716 12940916 13296767 13292845 13476404
41038A3476404O10123P73347N88619M08682N06046P44096Q09010O05290L06323
$$ 13476404 14086527 14859874 15448493 15857175 16363221 17107317 17916327 18521617 18827940
41029A8827940R7022j2093j33864l53212o34402q39694q41288o25932k72234J53535
$$ 18827940 18924962 18912869 18779005 18425793 17791391 16951697 16110409 15484477 15212243 15365778
41019A5365778O12039J019427J277054J389266J419019J302110R04398L63000
$$ 15365778 15977817 16997244 18274298 19663564 21082583 22384693 23289091 23652091
41011B3652091J32673M57440R61421J066881P31553M30013M11625L57454j00628
$$ 23652091 23784764 24242204 25203625 26270506 27002059 27432072 27843697 28201151 28100523
41002B8100523q47286j475361j759110j702774j325183o90761n7654K79534K87026
$$ 28100523 27253237 25777876 24018766 22315992 20990809 20300048 20242394 20521928 20808954
40993B0808954J54900J1798j35753k25457j19489K14485O59429J090379J416632
$$ 20808954 20963854 20975652 20839899 20614442 20494953 20709438 21368867 22459246 23875878
40984B3875878J503323J229577O46341o5712p86919j445069j842853j749690j237120
$$ 23875878 25379201 26608778 27255119 27189407 26402488 24957419 23114566 21364876 20127756
40975B0127756o99816m12695k27890J66884Q39220J592315K206283K529744K441231
$$ 20127756 19427940 19015245 18787355 18954239 19793459 21385774 23592057 26121801 28563032
40966B8563032J923183J158712M24259r9372l39626k58197Q4163M52954O11350
$$ 28563032 30486215 31644927 32069186 31969814 31630188 31371991 31456154 31909108 32520458
40957C2520458N65055M87926M03077J04886n41290j341972j894155j897039j314205
$$ 32520458 33085513 33573439 33976516 34081402 33540112 32198140 30303985 28406946 27092741
40948B7092741l25370P88181J739983K321553K477567K342825K163762K068391
$$ 27092741 26767371 27555552 29295535 31617088 34094655 36437480 38601242 40669633
40940D0669633J875580J253645J58603j005375j798213k191713k399179k370960
$$ 40669633 42545213 43798858 43957461 42952086 41153873 38962160 36562981 34192021
40932C4192021j798199o66924N17191J230049J425298J355363J137666P74621
$$ 34192021 32393822 31726898 32244089 33474138 34899436 36254799 37392465 38167086
40924C8167086M47761M50723Q27937J322584J691605J867872J839704J640937
$$ 38167086 38614847 39065570 39893507 41216091 42907696 44775568 46615272 48256209
40916D8256209J492276J649028J963215J841994Q58274p26790k214177l110809
$$ 48256209 49748485 51397513 53360728 55202722 56060996 55334206 53120029 50009220
40908E0009220l363896l118418k520790j743260r70146k99660K30597N47380O15351
$$ 50009220 46645324 43526906 41006116 39262856 38292710 37993050 38223647 38771027 39386378
40899C9386378N65268N55047N12877K45936j54739k73922J21374P31321J063159
$$ 39386378 39951646 40506693 41019570 41265506 41110767 40836845 40958219 41689540 42752699
40890D2752699R87113P67379O57096P04511R32377J463691K376715L555332M750937
$$ 42752699 43739812 44507191 45164287 45868798 46801175 48264866 50641581 54196913 58947850
40881E8947850N732870O375253O687439O782958O769632O708943O765003P293622
$$ 58947850 64680720 71055973 77743412 84526370 91296002 98004945 104769948 112063570
40873A12063570Q553910J0303252J1910239J3009953J3912630J5241073J7298703
$$ 112063570 120617480 130920732 142830971 155840924 169753554 184994627 202293330
40866B02293330J9949416K2971784K6227907K9416127L1862334L2716168L1323280
$$ 202293330 222242746 245214530 271442437 300858564 332720898 365437066 396760346
40859C96760346K7375924K0848231J2023801J699105q760879j7831209k4498219
$$ 396760346 424136270 444984501 457008302 458707407 449946528 432115319 407617100
40852D07617100k8571387l0335827l0030103k7818315k4159393j9858512j5600082
$$ 407617100 379045713 348709886 318679783 290861468 266702075 246843563 231243481
40845B31243481j1623359p993605m957382k767531j317884l09528K12428k12500
$$ 231243481 219620122 211626517 206669135 203901604 202583720 202274192 202486620 202274120
40837B02274120j905441m617964p699167j0479329j2448112j3347993j3302496
$$ 202274120 200368679 195750715 188051548 177572219 165124107 151776114 138473618
40830A38473618j2717452j1899811j0860718r552517q106029o705838n435125
$$ 138473618 125756166 113856355 102995637 93443120 85337091 78631253 73196128
40823G3196128m425820l949771m078098m381967m294867l744260l149388k817818
$$ 73196128 68770308 64820537 60742439 56360472 52065605 48321345 45171957 42354139
40815D2354139k651070k476440k331683k272050k165624j894603j591891j477440
$$ 42354139 39703069 37226629 34894946 32622896 30457272 28562669 26970778 25493338
40807B5493338j572514j747283j941753k141593k198920j893502j207254m09563
$$ 25493338 23920824 22173541 20231788 18090195 15891275 13997773 12790519 12380956
40799A2380956J68568L84994L36437K54539L54031P02104J207180J740867K215327
$$ 12380956 12549524 12934518 13270955 13525494 13879525 14581629 15788809 17529676 19745003
40790A9745003K498510K353758J616009M42350p13261j425712j592096j441259
$$ 19745003 22243513 24597271 26213280 26655630 25942369 24516657 22924561 21483302
40782B1483302j307947j360204j472108j375051r77699m81134j02832K30663P59335
$$ 21483302 20175355 18815151 17343043 15967992 14990293 14509159 14406327 14636990 15396325
40773A5396325J482648K068931K241840K109285J993568K037428K125916K156656
$$ 15396325 16878973 18947904 21189744 23299029 25292597 27330025 29455941 31612597
40765C1612597K221332K462251K852740L222065L477917L718789M098584M636761
$$ 31612597 33833929 36296180 39148920 42370985 45848902 49567691 53666275 58303036
40757E8303036N210801N701351O086962O419850O770576P153540P391933P086358
$$ 58303036 63513837 69215188 75302150 81722000 88492576 95646116 103038049 110124407
40749A10124407N915326M045395K067537M03730j043790k479301l681457m257889
$$ 110124407 116039733 120085128 122152665 122556395 121512605 119033304 115351847 111093958
40741A11093958m355938m652061n459838o198409o026883m794551l095680j573948
$$ 111093958 106738020 102085959 96626121 90427712 84400829 79606278 76510598 74936650
40733G4936650n09452L0704P7459j14065j87617j50120m73973j475420k723179
$$ 74936650 74427198 74457902 74535361 74421296 74233679 74083559 73609586 72134166 69410987
40724F9410987l356159l007506k214508j859490k344844l351291m215562m403790
$$ 69410987 66054828 63047322 60832814 58973324 56628480 53277189 49061627 44657837
40716D4657837l768009k614183j554189j055409r78104o89948J86786J239288
$$ 44657837 40889828 38275645 36721456 35666047 34687943 33997995 34184781 35424069
40708C5424069J689169J287821M88977k95971j206607k418132l436474l434767
$$ 35424069 37113238 38401059 38890036 38594065 37387458 34969326 31532852 28098085
40700B8098085k324900j068343p07001j314592k088372k276584j787820j027295
$$ 28098085 25773185 24704842 23997841 22683249 20594877 18318293 16530473 15503178
40692A5503178m29475j84432k27717l86039n51860p18162q60749r10045r07387
$$ 15503178 15073703 14889271 14661554 14275515 13723655 13005493 12144744 11234699 10327312
40683A0327312j036024j334081j488080j127922k87671O22192J256918J526067
$$ 10327312 9291288 7957207 6469127 5341205 5053534 5675726 6932644 8458711
40675H458711J388344P95312n6332p12746r03019q07459p41537p94835r61638
$$ 8458711 9847055 10642367 10586035 9873289 8970270 8162811 7421274 6626439 5664801
40666E664801j345983j898768k142640j594345m44271N56265R12175P44095L18850
$$ 5664801 4318818 2420050 277410 -1316935 -1761206 -1204941 -292766 451329 770179
40657G70179l15511j026516j353253r53060r4391O19899Q83042P63543L40492
$$ 770179 454668 -571848 -1925101 -2878161 -2972552 -2352653 -1469611 -706068 -365576
40648c65576l42897j017809j292440j101763p46773l96309J34896R40986J636865
$$ -365576 -708473 -1726282 -3018722 -4120485 -4867258 -5263567 -5128671 -4187685 -2550820
40639b550820J700263J090486K86845k48087m32566l80448o2977O76356J791899
$$ -2550820 -850557 239929 526774 278687 -153879 -534327 -597304 79052 1870951
40630A870951K864367L389406L243865K753022K251403J734819J095120N44656
$$ 1870951 4735318 8124724 11368589 14121611 16373014 18107833 19202953 19747609
40622A9747609N02551J033887J658748J816182J339451M25911o05583j388237
$$ 19747609 20250160 21284047 22942795 24758977 26098428 26524339 25918756 24530519
40614B4530519j596271j221865o44873k14192J36359O46516J217792J422147J014677
$$ 24530519 22934248 21712383 21067510 20853318 20989677 21636193 22853985 24276132 25290809
40605B5290809K07523n86795j087426j208519j018444p29165n74918o16110p63516
$$ 25290809 25498332 24911537 23824111 22615592 21597148 20867983 20293065 19676955 18913439
40596A8913439j011866j475846k117669k606792k595071k054653j254116n08874
$$ 18913439 17901573 16425727 14308058 11701266 9106195 7051542 5797426 5288552
40588E288552q0974k06377r62306k024734k726334k560991j679419p88010m58370
$$ 5288552 5207578 5001201 4038895 2014161 -712173 -3273164 -4952583 -5740593 -6198963
40579f198963n44460l54678N95441K076153L380746L940688L666542K862151J979169
$$ -6198963 -6743423 -7098101 -6502660 -4426507 -1045761 2894927 6561469 9423620 11402789
40570A1402789J366628J053327P63556K73149k78795n70758n34631m05814l51876
$$ 11402789 12769417 13822744 14586300 14859449 14580654 14009896 13475265 13069451 12717575
40561A2717575k98428j86905j54672k97121m15614j80111N33585J564870K605231
$$ 12717575 12419147 12232242 12077570 11780449 11364835 11184724 11718309 13283179 15888410
40552A5888410L306732L404956K914204K127404J289848L73878o77325j622831
$$ 15888410 19195142 22600098 25514302 27641706 28931554 29305432 28628107 27005276
40544B7005276k086645j991018j579479j030492l38510L56665O35223K26762n77440
$$ 27005276 24918631 22927613 21348134 20317642 19979132 20335797 20971020 21197782 20620342
40535B0620342j174420j260999j020418p55691n68424m47015m49982o18917p90869
$$ 20620342 19445922 18184923 17164505 16408814 15840390 15393375 14943393 14324476 13533607
40526A3533607o82334j88832N04712J133060J557300J714578J501654Q75283M4621
$$ 13533607 12851273 12662441 13167153 14300213 15857513 17572091 19073745 19949028 19993649
40517A9993649o06494q78410r69314j248204j827701k417861k616194k308382
$$ 19993649 19387155 18508745 17539431 16291227 14463526 12045665 9429471 7121089
40509G121089j745469j236576q50959m97864k09851j32678j86444L2069Q20711
$$ 7121089 5375620 4139044 3288085 2790221 2580370 2447692 2261248 2293317 3114028
40500C114028J967367K937417L324453K929795J636600l61707k270563l147826
$$ 3114028 5081395 8018812 11343265 14273060 15909660 15547953 13277390 10129564
40492A0129564k829833k048556j472056j029166m13190K25818N71593P98310J319181
$$ 10129564 7299731 5251175 3779119 2749953 2336763 2562581 3134174 3932484 5251665
40483E251665J960564J982667J045928k97455j253298j562509j442567j111539
$$ 5251665 7212229 9194896 10240824 9943369 8690071 7127562 5684995 4573456
40475D573456o85918l46025k55433l22162k46836J48464P19151J127002J135329
$$ 4573456 3887538 3541513 3286080 2963918 2717082 2865546 3584697 4711699 5847028
40466E847028P94574L38438j12281o47288j272550j659677j439930p14765L03
$$ 5847028 6641602 6980040 6867759 6220471 4947921 3288244 1848314 1133549 1133852
40457A133852L70463N00965N42469L81767o5238n27587o50258m58476k80542k75005
$$ 1133852 1504315 2005280 2547749 2929516 2864278 2336691 1686433 1227957 947415 672410
40447F72410k74383q0006K89071O54874Q36249P26676L38322j80602o05535p30547
$$ 672410 398027 318021 607092 1261966 2098215 2824891 3163213 2982611 2377076 1646529
40437A646529m67906J4748K70795q1397q71169j422890j260615o19245q5269J07726
$$ 1646529 1178623 1193371 1464166 1382769 511600 -911290 -2171905 -2791150 -2876419 -2768693
40427b768693K01450M75528R71746J578503K080065K115221J396748J06670j101526
$$ -2768693 -2567243 -2091715 -1119969 458534 2538599 4653820 6050568 6157238 5055712
40418E055712j627342j404492q61209m92381m48882m49374j31761M36973P33544
$$ 5055712 3428370 2023878 1162669 670288 221406 -227968 -359729 77244 810788
40409H10788M12043k09049n62726n85559o60468q56781p10044R6580J247420K233385
$$ 810788 1222831 1013782 451056 -134503 -794971 -1651752 -2361796 -2265216 -1017796 1215589
40399A215589K939434L494754L801656L578728K763183J594734L91170n41729
$$ 1215589 4155023 7649777 11451433 15030161 17793344 19388078 19779248 19237519
40391A9237519r35533p99736n48582n83152q00747q30271p12296r46926j750428
$$ 19237519 18301986 17502250 16953668 16370516 15569769 14739498 14027202 13080276 11329848
40382A1329848k606733k801770k233357j486150j190538j444509j785376j602408
$$ 11329848 8723115 5921345 3687988 2201838 1011300 -433209 -2218585 -3820993
40374c820993o34722Q09890K103477K770265K696477J980127Q08252m60807j349922
$$ -3820993 -4455715 -3645825 -1542348 1227917 3924394 5904521 6712773 6251966 4902044
40365D902044j629579j542314j472727j446703j140187l62075O61038J516375
$$ 4902044 3272465 1730151 257424 -1189279 -2329466 -2691541 -2030503 -514128
40357e14128J969315K041164J855284J509083J056081N60058J76242J37585N39363
$$ -514128 1455187 3496351 5351635 6860718 7916799 8476857 8653099 8790684 9330047
40348I330047J106682J306516Q00499k59216j443627k470721l309401l937197
$$ 9330047 10436729 11743245 12543744 12284528 10840901 8370180 5060779 1123582
40340A123582m191063l927877l214762k255002j180422l1601J057550J781243
$$ 1123582 -3067481 -6995358 -10210120 -12465122 -13645544 -13677145 -12619595 -10838352
40332a0838352J875712J406005P64915L47137K48924L03511L52703M10154N74831
$$ -10838352 -8962640 -7556635 -6791720 -6444583 -6195659 -5892148 -5539445 -5129291 -4554460
40323d554460Q69165J189337J364033J256707Q85488M58953J91429L5059k75558
$$ -4554460 -3685295 -2495958 -1131925 124782 1010270 1469223 1660652 1695711 1420153
40314A420153p95566j108233p12337L25824J313061J616263J287894R24485J014419
$$ 1420153 624587 -483646 -1195983 -870159 442902 2059165 3347059 4271544 5285963
40305E285963J531817K081607K286984K034972J469502Q22150K37300k72432p41707
$$ 5285963 6817780 8899387 11186371 13221343 14690845 15512995 15750295 15477863 14736156
40296A4736156j164256j466400j507144j136891l78224M37605Q65099P59895L92936
$$ 14736156 13571900 12105500 10598356 9461465 9083241 9520846 10385945 11145840 11538776
40287A1538776Q3840j22932k86213k57069J78924Q85259J386011J384685J078197
$$ 11538776 11622616 11499684 11213471 10956402 11135326 12020585 13406596 14791281 15869478
40278A5869478Q45918P80202O54005K35326n16140j483664k442461l080377l152630
$$ 15869478 16715396 17495598 18149603 18384929 17868789 16385125 13942664 10862287 7709657
40269G709657k721292k161214j811727j626327j257480n11124L82090J032341
$$ 7709657 4988365 2827151 1015424 -610903 -1868383 -2379507 -1997417 -965076
40261i65076J353687J619128K061786K581101K899829K864011K487967J832142
$$ -965076 388611 2007739 4069525 6650626 9550455 12414466 14902433 16734575
40253A6734575R78718N3461q42249j635730k121882j965844j091520L1310P55833
$$ 16734575 17713293 17766754 16924505 15288775 13166893 11201049 10109529 10140839 10896672
40244A0896672Q95915P59351N77780K15395m81963j336593j990853k212528j935391
$$ 10896672 11792587 12551938 13129718 13345113 12863150 11526557 9535704 7323176 5387785
40235E387785j216917l19991L47319N64671M62443K37928j15389o34678j136693
$$ 5387785 4170868 3850877 4198196 4762867 5225310 5463238 5347849 4713171 3576478
40226C576478j396974j493451j727592k199130k605371k460575j461780K41073
$$ 3576478 2179504 686053 -1041539 -3240669 -5846040 -8306615 -9768395 -9527322
40218i527322K016882L113842L198956K479673J288295j59015j441717j812093
$$ -9527322 -7510440 -4396598 -1197642 1282031 2570326 2411311 969594 -842499
40210h42499r13377N32190J297583R61023K15387j69415j98457k90109n43251
$$ -842499 -1755876 -1223686 73897 1034920 1250307 1080892 882435 592326 49075
40201D9075p31517p42532o53387n22414m09815m76688p50793q55475k76947J053072
$$ 49075 -682442 -1424974 -2078361 -2600775 -3010590 -3487278 -4238071 -5093546 -5370493 -4317421
40191d317421K624146L807105M300909M153614L545546K634341J538621M34827
$$ -4317421 -1693275 2113830 6414739 10568353 14113899 16748240 18286861 18721688
40183A8721688l54667n16796j11756L50673M08523J65985R8738L65981N76650
$$ 18721688 18367021 17850225 17738469 18089142 18497665 18663650 18762388 19128369 19705019
40174A9705019L19816k94175p79004q32926o03883m63406o47450j089288j494866
$$ 19705019 20024835 19730660 18951656 18118730 17514847 17051441 16403991 15314703 13819837
40165A3819837j586287j361111j124252j186862j498367j638081j244147m35602
$$ 13819837 12233550 10872439 9748187 8561325 7062958 5424877 4180730 3745128
40157C745128K85190O01612P65546J268991K149687K830280K773843K142250J590472
$$ 3745128 4030318 4631930 5397476 6666467 8816154 11646434 14420277 16562527 18152999
40148A8152999J484747J583611J492884J120702N35736l23956j461038k455050
$$ 18152999 19637746 21221357 22714241 23834943 24370679 24046723 22585685 20130635
40140B0130635k681116k007173j033585m90938n52220q64443j085983j173065
$$ 20130635 17449519 15442346 14408761 13917823 13365603 12501160 11415177 10242112
40132A0242112j213991j229868j193966j090383q76519m78478J19799Q41300J583121
$$ 10242112 9028121 7798253 6604287 5513904 4637385 4158907 4278706 5120006 6703127
40123F703127K237025K637190K612840K158211J463515P22660O912o04958r02158
$$ 6703127 8940152 11577342 14190182 16348393 17811908 18534568 18541480 17936522 17034364
40114A7034364p18866k25760R1899j70345r49038j713548j895887j419453q10757
$$ 17034364 16315498 16089738 16181637 16011292 15062254 13348706 11452819 10033366 9222609
40105I222609o69891r99889j204824q07359K1805P68244J189444J396952J490224
$$ 9222609 8552718 7552829 6348005 5540646 5562451 6330695 7520139 8917091 10407315
40096A0407315J423645J184535P95633J35738r30663k166535k984721k998180
$$ 10407315 11830960 13015495 13811128 13946866 13016203 10849668 7864947 4866767
40088D866767k358240j460221n48631K55325P89626R65336R34728R59109J172851
$$ 4866767 2508527 1048306 499675 755000 1544626 2509962 3444690 4403799 5576650
40079E576650J565706K041257K359406K207398J542695P44480K24463N067j18570
$$ 5576650 7142356 9183613 11543019 13750417 15293112 16037592 16262055 16267122 16148552
40070A6148552j69472n9835K5824k78972r66438j510374j448006r09410m29884
$$ 16148552 15979080 15919245 15945069 15666097 14699659 13189285 11741279 10831869 10401985
40061A0401985m02205q41484j514810k107719k358969k235920j978651j841949
$$ 10401985 9999780 9158296 7643486 5535767 3176798 940878 -1037773 -2879722
40053b879722j788418j545585r94209m10218k39620o22827j174123j282191o72213
$$ -2879722 -4668140 -6213725 -7207934 -7618152 -7857772 -8480599 -9654722 -10936913 -11609126
40044a1609126L30400J121518J396513J378228J483652J829596K117787K004064
$$ -11609126 -11278726 -10157208 -8760695 -7382467 -5898815 -4069219 -1951432 52632
40036E2632J537962J177548J331846J920222K441183K448613J885160J009207
$$ 52632 1590594 2768142 4099988 6020210 8461393 10910006 12795166 13804373
40028A3804373J82296k48915j06941M03078P80191P14548L85394J12620j25488
$$ 13804373 13986669 13737754 13630813 14033891 14814082 15528630 15914024 16026644 15901156
40019A5901156n54822j105369j431024j465545j589712k083057k704335l042036
$$ 15901156 15346334 14240965 12809941 11344396 9754684 7671627 4967292 1925256
40011A925256l050052k945394k708425k023928p64363O95004J753782K094150
$$ 1925256 -1124796 -4070190 -6778615 -8802543 -9566906 -8871902 -7118120 -5023970
40003e023970J875454J510662J297457J214214J020613N49378r2337n80777n87708
$$ -5023970 -3148516 -1637854 -340397 873817 1894430 2443808 2351471 1770694 1182986
39994A182986M6613J238007K654498L799240M189146L564210K040246J17748j543963
$$ 1182986 1229599 2467606 5122104 8921344 13110490 16674700 18714946 18832694 17288731
39985A7288731k523094k874859k952704l023290l109660l100714k816241k004863
$$ 17288731 14765637 11890778 8938074 5914784 2805124 -295590 -3111831 -5116694
39977e116694n65682J107300K224848K255094J398174K98090n91110j209808j612422
$$ -5116694 -5682376 -4575076 -2350228 -95134 1303040 1601130 1010020 -199788 -1812210
39968a812210j738710j483613q48083J1856Q30249J367015J563444J505539J209872
$$ -1812210 -3550920 -5034533 -5882616 -5870760 -5040511 -3673496 -2110052 -604513 605359
39959F05359O12795j32526n91124n47840m27103q68087j898272k838358l051355
$$ 605359 1218154 1085628 494504 -53336 -480439 -1348526 -3246798 -6085156 -9136511
39950i136511k478946j390121J5275J527681K740282L269003L085959K450632
$$ -9136511 -11615457 -13005578 -12990303 -11462622 -8722340 -5453337 -2367378 83254
39942H3254J619817Q03069K60505J65178L69407M90120K26805n01565j597049
$$ 83254 1703071 2506140 2766645 2931823 3301230 3791350 4018155 3516590 1919541
39933A919541k725218l319858k999006k049540j214041q70325o60437p7048Q28612
$$ 1919541 -805677 -4125535 -7124541 -9174081 -10388122 -11258447 -11918884 -11995932 -11167320
39924a1167320J549129J736233J429606P95838q469o86298q32193k96745O00019
$$ -11167320 -9618191 -7881958 -6452352 -5656514 -5664983 -6351281 -7183474 -7480219 -6880200
39915f880200J321627J519636J199205O51050K67267K48102L84897K53062l01542
$$ -6880200 -5558573 -4038937 -2839732 -2188682 -1921415 -1673313 -1288416 -1035354 -1336896
39906a336896r88433j420467j437108j011468j41594R17613J575012J461951R90861
$$ -1336896 -2325329 -3745796 -5182904 -6194372 -6335966 -5418353 -3843341 -2381390 -1390529
39897a390529R62704J592697K272741K352108J786513R00564q6249j031963j706403
$$ -1390529 -427825 1164872 3437613 5789721 7576234 8476798 8390549 7358586 5652183
39888E652183k039550k369250l063032l928790m295196l679932k170991k23609
$$ 5652183 3612633 1243383 -1819649 -5748439 -10043635 -13723567 -15894558 -16118167
39880a6118167J625253K859530L164507K684226J931643J323761R04022N29666
$$ -16118167 -14492914 -11633384 -8468877 -5784651 -3853008 -2529247 -1625225 -1095559
39872a095559J33233k66251o07467p36387n03522m8501J98807J849l22631k46007
$$ -1095559 -962326 -1228577 -1836044 -2572431 -3075953 -3124454 -2925647 -2923798 -3246429 -3492436
39862c492436L43155J074067J618894K013443K376906K558974K291778J617538
$$ -3492436 -3149281 -2075214 -456320 1557123 3934029 6493003 8784781 10402319
39854A0402319R42466N94031M39453M8271p97319j841496k607434k826179k568919
$$ 10402319 11344785 11938816 12378269 12426540 11629221 9787725 7180291 4354112 1785193
39845A785193k033937j334716n39730J66669M93661K94278j94742m40624m7824
$$ 1785193 -248744 -1583460 -2123190 -1956521 -1462860 -1168582 -1363324 -1803948 -1851772
39836a851772Q44948J626620J705532R51564k87010j486689k248281k448819k241950
$$ -1851772 -1006824 619796 2325328 3276892 2989882 1503193 -745088 -3193907 -5435857
39827e435857j875810j423433p37431K49973J262668J857787J842536J392250
$$ -5435857 -7311667 -8735100 -9472531 -9222558 -7959890 -6102103 -4259567 -2867317
39819b867317P79048J22132n88900j350046k045145k414279k171368j305162k45343
$$ -2867317 -2088269 -1966137 -2555037 -3905083 -5950228 -8364507 -10535875 -11841037 -12086380
39810a2086380M44952N72591L88084J88824M1852j02627k60413m39302o04974
$$ -12086380 -11641428 -11068837 -10680753 -10491929 -10450077 -10552704 -10813117 -11252419 -11857393
39801a1857393n66503j45951M45502O90267M10593Q5421K87128R93317J685903
$$ -11857393 -12423896 -12569847 -12124345 -11434078 -11023485 -10938064 -10650936 -9657619 -7971716
39792g971716J936582J638815Q83089k6998n69699m39930J5461J60686j09916
$$ -7971716 -6035134 -4396319 -3513230 -3540228 -4109927 -4549857 -4534396 -4373710 -4483626
39783d483626k74377L6343N30430O72829K99260l56996r66244j218512q88925
$$ -4483626 -4758003 -4721660 -4191230 -3518401 -3219141 -3576137 -4542381 -5760893 -6649818
39774f649818o5960Q08623J340515J530145J579642J529541J315673J046932R18091
$$ -6649818 -6715778 -5907155 -4566640 -3036495 -1456853 72688 1388361 2435293 3353384
39765C353384Q46221M52940m88469j706727k603350k738054k173730j406838r17445
$$ 3353384 4199605 4652545 4164076 2457349 -146001 -2884055 -5057785 -6464623 -7382068
39756g382068p15406l80174L79526J292651J782148J610760J133180R05315J156526
$$ -7382068 -8097474 -8477648 -8098122 -6805471 -5023323 -3412563 -2279383 -1374068 -217542
39747b17542J667445K068717K181578K051908J686223Q94161m21174j835358k544848
$$ -217542 1449903 3518620 5700198 7752106 9438329 10332490 9911316 8075958 5531110
39738E531110k128704j033364j26112J21781j49226o05803j047732j354158j408406
$$ 5531110 3402406 2369042 2242930 2364711 2215485 1609682 561950 -792208 -2200614
39729b200614j175034p13751j12554M61623P36657O19178M76806Q22237J641451
$$ -2200614 -3375648 -4089399 -4201953 -3740330 -3003673 -2384495 -1907689 -1085452 555999
39720E55999K313201K297177J631351O35401n31129j735899k558353k509642j562687
$$ 555999 2869200 5166377 6797728 7433129 6902000 5166101 2607748 98106 -1464581
39711a464581k42318P81037J039897L75362r68869k331847k988872k666188j647801
$$ -1464581 -1706899 -925862 114035 489397 -479472 -2811319 -5800191 -8466379 -10114180
39702a0114180m12291O84829J416957J632952J317152O06924k76358j013626j163258
$$ -10114180 -10526471 -9841642 -8424685 -6791733 -5474581 -4867657 -5144015 -6157641 -7320899
39693g320899m14145J007369K339403K850489K376987J293419J13444p82388j194294
$$ -7320899 -7735044 -6727675 -4388272 -1537783 839204 2132623 2246067 1463679 269385
39684B69385j115990p27543k65052J51214N59201J061669J688305K265174K410792
$$ 269385 -846605 -1574148 -1839200 -1687986 -1128785 -67116 1621189 3886363 6297155
39675F297155J813316O21531n37276j057430q34709k00089M72442R32327R79026
$$ 6297155 8110471 8732002 8194726 7137296 6302587 6102498 6574940 7507267 8486293
39666H486293N40523j27887n75986o19193n04124n00358n05160k52207J96704
$$ 8486293 9026816 8898929 8322943 7703750 7199626 6699268 6194108 5941901 6138605
39657F138605M27761J77501l27309o20324m74205m6088L59873N52464N03531K63107
$$ 6138605 6566366 6743867 6416558 5796234 5322029 5275941 5635814 6188278 6691809 6954916
39647F954916j09198n50034r65099j216654j174858q32100l81316j34171k87068
$$ 6954916 6845718 6295684 5330585 4113931 2939073 2106973 1725657 1591486 1304418
39638A304418p27163j093735j085805p25772k89393K1902K61614N41542P40195
$$ 1304418 577255 -516480 -1602285 -2328057 -2617450 -2595548 -2333934 -1792392 -1052197
39629a052197N47606j89969j288647k418349l333316l822880l592583k442518
$$ -1052197 -504591 -694560 -1983207 -4401556 -7734872 -11557752 -15150335 -17592853
39621a7592853o04533J260925K513153K947692K775763K320616J819779J434227
$$ -17592853 -18197386 -16936461 -14423308 -11475616 -8699853 -6379237 -4559458 -3125231
39613c125231J292525J461859J896656K434784K864783L043904K971849K717261
$$ -3125231 -1832706 -370847 1525809 3960593 6825376 9869280 12841129 15558390
39605A5558390K265542J499828L69086r72814k236910l173156l657457l682215
$$ 15558390 17823932 19323760 19692846 18720032 16483122 13309966 9652509 5970294
39597E970294l327852k703483j867980q62684J41945Q50563J120992J156473J246338
$$ 5970294 2642442 -61041 -1929021 -2791705 -2649760 -1799197 -678205 478268 1724606
39588A724606J352872J180180P05859M08656P72844J664487K386694K338896J502501
$$ 1724606 3077478 4257658 4963517 5372173 6145017 7809504 10196198 12535094 14037595
39579A4037595L31619o40679j067246q95800m07738o8223j39652m04168l79733
$$ 14037595 14369214 13728535 12661289 11765489 11357751 11289528 11149876 10745708 10365975
39570A0365975J51655R19077J485610J663137J517520J096584L59647o22598j580626
$$ 10365975 10517630 11436707 12922317 14585454 16102974 17199558 17559205 16936607 15355981
39561A5355981k242105k521454k469779k160168j712833j324632j129211j055272
$$ 15355981 13113876 10592422 8122643 5962475 4249642 2925010 1795799 740527
39553G40527r22242o50380l01698J8967J74184m4120p65279j780154k557369k636507
$$ 740527 -181715 -832095 -1133793 -1114826 -940642 -984762 -1750041 -3530195 -6087564 -8724071
39543h724071j995845j011931j12183N04205Q84305J170557J456418J737621J931109
$$ -8724071 -10719916 -11731847 -11844030 -11339825 -10455520 -9284963 -7828545 -6090924 -4159815
39534d159815J899104J498944P17904k06383q97068j151131j095537r96225j008918
$$ -4159815 -2260711 -761767 -43863 -250246 -1147314 -2298445 -3393982 -4390207 -5399125
39525e399125j168109j446455j653588j414875n11153P86665J943652K703726
$$ -5399125 -6567234 -8013689 -9667277 -11082152 -11593305 -10806640 -8862988 -6159262
39517f159262L177677L415259L213225K466218J449570N78154L9663k27180l75775
$$ -6159262 -2981585 433674 3646899 6113117 7562687 8140841 8180504 7953324 7577549
39508G577549n79798r00642j085442p29744J62328R93834J185617P94939L00589
$$ 7577549 6997751 6097109 5011667 4281923 4444251 5438085 6623702 7418641 7719230
39499G719230o893j07842O2302N63133J135900J373537J251665J107309J009534
$$ 7719230 7712337 7604495 7666797 8229930 9365830 10739367 11991032 13098341 14107875
39490A4107875N50254n46128j918527k906503l175489k825484k123240j381493
$$ 14107875 14658129 14112001 12193474 9286971 6111482 3285998 1162758 -218735
39482b18735r25866q81582j029218j060032r29290q16663q18341q31773o71434
$$ -218735 -1144601 -2026183 -3055401 -4115433 -5044723 -5861386 -6679727 -7511500 -8182934
39473h182934j61668P69978J886802K600766K385761J293952n6665j015185j330653
$$ -8182934 -8344602 -7574624 -5687822 -3087056 -701295 592657 535992 -479193 -1809846
39464a809846j126743o32541L2664R14710K060171L214633L782746L305953J993654
$$ -1809846 -2936589 -3569130 -3536466 -2621756 -561585 2653048 6435794 9741747 11735401
39455A1735401N93996l07761p16157r53029j194336j394929j483848j431359j176383
$$ 11735401 12329397 12021636 11305479 10352450 9158114 7763185 6279337 4847978 3671595
39446C671595o44361J32058R40381J421548J232844L56719o93089j177226q37973
$$ 3671595 3027234 3159292 4099673 5521221 6754065 7110784 6417695 5240469 4402496
39437D402496k15432p9878n97731j225402j374998r69939l38071K05482N64386
$$ 4402496 4187064 4107186 3509455 2284053 909055 -60884 -398955 -193473 370913
39428C70913Q29163J179939J707095K198171K200545J455571K44094q05785j220386
$$ 370913 1200076 2380015 4087110 6285281 8485826 9941397 10185491 9379706 8159320
39419H159320r21572j00639R25865J750843K018255J673837R86561K45866m83399
$$ 8159320 7237748 7137109 8062974 9813817 11832072 13505909 14492470 14738336 14254937
39410A4254937j270606k124704k984702l771651m298681m227836l336896j855725
$$ 14254937 12984331 10859627 7874925 4103274 -195407 -4423243 -7760139 -9615864
39402i615864l76343O45455J220594J639171K067044K398814K434599K115939
$$ -9615864 -9992207 -9346752 -8126158 -6486987 -4419943 -2021129 413470 2529409
39394B529409J607302J188784J039180J078562J036522P08051J49665l62295n45854
$$ 2529409 4136711 5325495 6364675 7443237 8479759 9187810 9337475 8975180 8429326
39385H429326l30265N0393J87201j48942p11573r39290n26295K17728O85091O02030
$$ 8429326 8099061 8149454 8336655 8187713 7476140 6536850 6010555 6228283 6913374 7515404
39375G515404K11288j38749l66671n20865m67730K2622Q75820J613433J777786
$$ 7515404 7726692 7587943 7221272 6700407 6232677 6255299 7131119 8744552 10522338
39366A0522338J369937P70857L02916r195k89623n96286r13128j239040j576570
$$ 10522338 11892275 12663132 12966048 12956853 12667230 12070944 11157816 9918776 8342206
39357H342206j865769k008891j964024j781461j555444j351492j152166q73093
$$ 8342206 6476437 4467546 2503522 722061 -833383 -2184875 -3337041 -4210134
39349d210134m95264j93238k24155o15642j064897j269440j276165j327443j399862
$$ -4210134 -4705398 -4898636 -5122791 -5738433 -6803330 -8072770 -9348935 -10676378 -12076240
39340a2076240j137855l41624O68711J357944J561695J585080J728152J897142
$$ -12076240 -13214095 -13555719 -12887008 -11529064 -9967369 -8382289 -6654137 -4756995
39332d756995J784251J335281Q90316Q20070J091482J273505R84664K83570m12937
$$ -4756995 -2972744 -1637463 -747147 72923 1164405 2437910 3422574 3706144 3293207
39323C293207p44398o74073l89609o8557K12209M41850O62843R57720J327664
$$ 3293207 2548809 1874736 1485127 1416570 1628779 2070629 2733472 3691192 5018856
39314E018856J549832J252813K48833j185858k421668k930277k652719j931320
$$ 5018856 6568688 7821501 8070334 6884476 4462808 1532531 -1120188 -3051508
39306c051508j132410l96363K75188Q21558J109342J075864P99125M15695J0452
$$ -3051508 -4183918 -4580281 -4305093 -3483535 -2374193 -1298329 -499204 -83509 -73057
39297g3057m08278q36205j157658j127192n89433K03729O08966J05946j178678
$$ -73057 -481335 -1317540 -2475198 -3602390 -4191823 -3988094 -3379128 -3273182 -4451860
39288d451860k548685l330893l318930k714446j850557j038595n00759k65752
$$ -4451860 -7000545 -10331438 -13650368 -16364814 -18215371 -19253966 -19754725 -20020477
39280b0020477j34079J62656P21410J351356J666995J358712M82423n19921j174609
$$ -20020477 -20154556 -19991900 -19270490 -17919134 -16252139 -14893427 -14411004 -14930925 -16105534
39271a6105534j335849j115563n59788L65776J458811K230642K338226J915965
$$ -16105534 -17441383 -18556946 -19116734 -18750958 -17292147 -15061505 -12723279 -10807314
39263a0807314J353840R00905O26082N95728Q58915J315564J765703K030752J899824
$$ -10807314 -9453474 -8552569 -7926487 -7330759 -6471844 -5156280 -3390577 -1359825 539999
39254E39999J102757l93012k070752l096636k969926j880325m68819O27475J069844
$$ 539999 1642756 1249744 -821008 -3917644 -6887570 -8767895 -9236714 -8609239 -7539395
39245g539395R28031N93321M36445M76316M77595L66369L69657O85712J187623
$$ -7539395 -6611364 -6018043 -5581598 -5105282 -4627687 -4261318 -3891661 -3205949 -2018326
39236b018326J560780J612636J350644Q81301L70551J8432r3051j23103l19427
$$ -2018326 -457546 1155090 2505734 3387035 3757586 3776018 3682967 3559864 3240437
39227C240437p03450r76285p93298j29250O57154J153829J293470J366652J596132
$$ 3240437 2536987 1560702 767404 638154 1295308 2449137 3742607 5109259 6705391
39218F705391J770420J413313L05668j252710k668698l422187l271100k362891
$$ 6705391 8475811 9889124 10194792 8942082 6273384 2851197 -419903 -2782794
39210b782794j268748o92588q79889j331481j289978n45728L66768Q08230P40886
$$ -2782794 -4051542 -4744130 -5624019 -6955500 -8245478 -8791206 -8424438 -7616208 -6875322
39201f875322P06585J177854K050018K766305K823836K107831Q64168m65636j384967
$$ -6875322 -6168737 -4990883 -2940865 -174560 2649276 4757107 5621275 5155639 3770672
39192C770672j555898j078916n08319l99885p74914j100443q31639N0035R94338
$$ 3770672 2214774 1135858 627539 227654 -547260 -1647703 -2479342 -2429307 -1434969
39183a434969J302455O43136p11488k125860l120880l631019l730282l294197
$$ -1434969 -132514 510622 -200866 -2326726 -5447606 -9078625 -12808907 -16103104
39175a6103104k173231o18897P87957J702736K239804K533312K389733J625191
$$ -16103104 -18276335 -18895232 -18107275 -16404539 -14164735 -11631423 -9241690 -7616499
39167g616499N40159k50302m06171q1295L64176O58632P05071O20968O75591R69910
$$ -7616499 -7076340 -7326642 -7732813 -7814108 -7449932 -6791300 -6086229 -5465261 -4789670 -3819760
39157c819760J194567R39221K52145l58252n37896m59054m75061o37914p29591
$$ -3819760 -2625193 -1685972 -1433827 -1792079 -2329975 -2789029 -3264090 -3902004 -4631595
$$ [...]
##END NTUPLES=NMR SPECTRUM
##END=
