##TITLE=31Pdec_ESa0609A-1
 CDCl3 24 sc
 8.9.2023
##JCAMPDX= 6.0         $$ Bruker NMR JCAMP-DX V2.0
##DATA TYPE= NMR SPECTRUM
##DATA CLASS= NTUPLES
##ORIGIN= UXNMR, Bruker Analytische Messtechnik GmbH
##OWNER= root
$$ XWIN-NMR		Version 3.5
$$ Fri Sep  8 14:23:52 2023 Russian Standard Time (UT+4h)  she@DPX200
##.OBSERVE FREQUENCY= 81.013821
##.OBSERVE NUCLEUS= ^31P
##.ACQUISITION MODE= SIMULTANEOUS
##.ACQUISITION SCHEME= undefined
##.AVERAGES= 24
##.DIGITISER RES= 16
##SPECTROMETER/DATA SYSTEM= spect
##.PULSE SEQUENCE= zgpg30
##.SOLVENT NAME= DMSO
##.SHIFT REFERENCE= (INTERNAL, DMSO, 0, 248.564)
##AUDIT TRAIL= $$ (NUMBER, WHEN, WHO, WHERE, WHAT)
$$ ##TITLE= Audit trail, XWIN-NMR		Version 3.5
$$ ##JCAMPDX= 5.01
$$ ##ORIGIN= Bruker BioSpin GmbH
$$ ##OWNER= she
$$ F:/spectra/data/she/nmr/P31/1/pdata/1/auditp.txt
$$ ##AUDIT TRAIL=  $$ (NUMBER, WHEN, WHO, WHERE, WHAT)
(   1,<2023-09-08 14:22:24.98 +0400>,<she>,<DPX200>,
      <created by zg, POWCHK disabled, PULCHK disabled
       configuration hash MD5:
       00 E9 B6 7A A2 85 ED C7 34 08 36 98 17 FE 4E 26
       data hash MD5: 32K
       98 4E 9E C7 0D B3 4E F2 C9 56 37 1C B5 2B 89 B1>)
(   2,<2023-09-08 14:22:27.76 +0400>,<she>,<DPX200>,
      <Start of raw data processing
       efp BC_mod = 2 LB = 5 FT_mod = 6 PKNL = 1 PHC0 = -10609.19 PHC1 = -13.31499 SI = 64K 
       data hash MD5: 64K
       50 56 31 82 AC 1F DD E8 C1 55 79 97 49 7B 7A DA>)
(   3,<2023-09-08 14:22:42.64 +0400>,<she>,<DPX200>,
      <pk PHC0 = -0.2654687 PHC1 = 0 
       data hash MD5: 64K
       19 41 5E AE A5 E9 EC B6 64 09 7E C4 6C 9F 25 92>)
(   4,<2023-09-08 14:23:10.75 +0400>,<she>,<DPX200>,
      <pk PHC0 = -292.5189 PHC1 = 800.2015 
       data hash MD5: 64K
       D8 D8 77 6A 2B 73 CB CF D5 21 9F E6 EA FF A4 F6>)
(   5,<2023-09-08 14:23:14.39 +0400>,<she>,<DPX200>,
      <abs ABSG = 5 
       data hash MD5: 64K
       EB F2 04 B0 F3 DD C3 3F AB D6 44 EB 4A 90 EE 60>)
$$ ##END=
$$ 
$$ hash MD5
$$ B4 D4 50 91 1A A8 30 B2 BE F6 62 CC 62 18 19 6F
##$RELAX= 
##$RELAX= 
##$RELAX= 
##$RELAX= 
##$RELAX= 
##$RELAX= 
##$RELAX= 
##$RELAX= 
##$RELAX= 
$$ Bruker specific parameters
$$ --------------------------
##$DU= <F:/spectra>
##$EXPNO= 1
##$NAME= <P31>
##$PROCNO= 1
##$TYPE= <nmr>
##$USER= <she>
##$AMP= (0..31)
100 100 100 100 100 100 100 100 100 100 100 100 100 100 100 100 100 100 
100 100 100 100 100 100 100 100 100 100 100 100 100 100 
##$AQSEQ= 0
##$AQ_mod= 1
##$AUNM= <au_zg>
##$AUTOPOS= <>
##$BF1= 81.014009
##$BF2= 200.13
##$BF3= 200.13
##$BF4= 200.13
##$BF5= 200.13
##$BF6= 200.13
##$BF7= 200.13
##$BF8= 200.13
##$BYTORDA= 1
##$CFDGTYP= 0
##$CFRGTYP= 5
##$CHEMSTR= <none>
##$CNST= (0..31)
1 1 145 1 1 1 1 1 1 1 1 1 1 1 1 1 1 1 1 1 1 1 1 1 1 1 1 1 1 1 1 1 
##$CPDPRG= <waltz16>
##$CPDPRG1= <>
##$CPDPRG2= <waltz16>
##$CPDPRG3= <>
##$CPDPRG4= <mlev>
##$CPDPRG5= <mlev>
##$CPDPRG6= <mlev>
##$CPDPRG7= <mlev>
##$CPDPRG8= <mlev>
##$CPDPRGB= <>
##$CPDPRGT= <>
##$D= (0..31)
$$ [...]
##$SUBNAM3= <"">
##$SUBNAM4= <"">
##$SUBNAM5= <"">
##$SUBNAM6= <"">
##$SUBNAM7= <"">
##$SUBNAM8= <"">
##$SUBNAM9= <"">
##$SW= 501.771253377433
##$SWIBOX= (0..15)
0 1 3 0 0 0 0 0 0 0 0 0 0 0 0 0 
##$SW_h= 40650.406504065
##$TD= 32768
##$TD0= 1
##$TE= 0
##$TE2= 300
##$TE3= 300
##$TEG= 300
##$TL= (0..7)
0 120 53 12 22 120 120 120 
##$TP= (0..7)
150 150 150 150 150 150 150 150 
##$TP07= 0
##$TPNAME0= <>
##$TPNAME1= <>
##$TPNAME2= <>
##$TPNAME3= <>
##$TPNAME4= <>
##$TPNAME5= <>
##$TPNAME6= <>
##$TPNAME7= <>
##$TPOAL= (0..7)
0.5 0.5 0.5 0.5 0.5 0.5 0.5 0.5 
##$TPOFFS= (0..7)
0 0 0 0 0 0 0 0 
##$TUNHIN= 0
##$TUNHOUT= 0
##$TUNXOUT= 0
##$USERA1= <user>
##$USERA2= <user>
##$USERA3= <user>
##$USERA4= <user>
##$USERA5= <user>
##$V9= 5
##$VALIST= <valist>
##$VCLIST= <CCCCCCCCCCCCCCC>
##$VD= 0
##$VDLIST= <DDDDDDDDDDDDDDD>
##$VPLIST= <PPPPPPPPPPPPPPP>
##$VTLIST= <TTTTTTTTTTTTTTT>
##$WBST= 1024
##$WBSW= 4
##$XGAIN= (0..3)
0 0 0 0 
##$XL= 0
##$YL= 0
##$YMAX_a= 2705
##$YMIN_a= -3274
##$ZGOPTNS= <>
##$ZL1= 120
##$ZL2= 120
##$ZL3= 120
##$ZL4= 120
##$ABSF1= 248.5645
##$ABSF2= -253.2056
##$ABSG= 5
##$ABSL= 3
##$ALPHA= 0
##$AQORDER= 0
##$ASSFAC= 0
##$ASSFACI= 0
##$ASSFACX= 0
##$ASSWID= 0
##$AUNMP= <proc_1d>
##$AZFE= 0.1
##$AZFW= 0.5
##$BCFW= 0
##$BC_mod= 2
##$BYTORDP= 0
##$COROFFS= 0
##$CY= -3
##$DATMOD= 1
##$DC= 0
##$DFILT= <>
##$DTYPP= 0
##$F1P= 0
##$F2P= 0
##$FCOR= 1
##$FTSIZE= 65536
##$FT_mod= 6
##$GAMMA= 0
##$GB= 0
##$INTBC= 1
##$INTSCL= 6.047779e-11
##$ISEN= 30
##$LB= 5
##$LEV0= 0
##$LPBIN= 0
##$MAXI= 10000
##$MC2= 0
##$MEAN= 0
##$ME_mod= 0
##$MI= 50
##$NCOEF= 0
##$NC_proc= -9
##$NLEV= 6
##$NOISF1= 182.463
##$NOISF2= 159.3651
##$NSP= 0
##$NTH_PI= 0
##$NZP= 0
##$OFFSET= 248.5645
##$PC= 4
##$PHC0= -10901.98
##$PHC1= 786.8865
##$PH_mod= 1
##$PKNL= yes
##$PPARMOD= 0
##$PSCAL= 0
##$PSIGN= 0
##$REVERSE= no
##$SF= 81.0140089999694
##$SI= 65536
##$SIGF1= 159.3651
##$SIGF2= -187.1042
##$SINO= 113.3802
##$SIOLD= 16384
##$SREGLST= <1H.CDCl3>
##$SSB= 0
##$STSI= 65536
##$STSR= 0
##$SW_p= 40650.406504065
##$SYMM= 0
##$S_DEV= 0
##$TDeff= 32768
##$TDoff= 0
##$TI= <>
##$TILT= no
##$TM1= 0
##$TM2= 0
##$TOPLEV= 0
##$USERP1= <user>
##$USERP2= <user>
##$USERP3= <user>
##$USERP4= <user>
##$USERP5= <user>
##$WDW= 1
##$XDIM= 65536
##$YMAX_p= 336568175
##$YMIN_p= -20994088
$$ End of Bruker specific parameters
$$ ---------------------------------
##NTUPLES= NMR SPECTRUM
##VAR_NAME=  FREQUENCY,     SPECTRUM/REAL,   SPECTRUM/IMAG
##SYMBOL=    X,             R,               I
##VAR_TYPE=  INDEPENDENT,   DEPENDENT,       DEPENDENT
##VAR_FORM=  AFFN,          ASDF,            ASDF
##VAR_DIM=   65536,         65536,           65536
##UNITS=     HZ,            ARBITRARY UNITS, ARBITRARY UNITS
##FACTOR=    0.620285442955139, 1,           1
##FIRST=     20137.2065510682, 0,            0
##LAST=      -20513.1999529968, 0,           0
##MIN=       -20513.1999529968, -20994088,   0
##MAX=       20137.2065510682, 336568175,    0
$$ Real data points
##PAGE= N=1
##DATA TABLE= (X++(R..R)), XYDATA
$$ [...]
43952H236255K16288j03640n42705j099879j642862j982890k017869j791886j438485
43943b167673j097152q41654o21136l00775J58793N87861P72065P17901O42616
43934b149154O98940Q38051R64930J074057J152618J085754P86132L44807o0428
43925D735707l61159o13007q65197j110646j323883j451168j395311j111681p03561
43916d199906l27719j0897L56041Q46034J393059J845867K042900J863890J331465
43907E140734O72340J53762j76469m67964p43412p58714l29930L01611O25216
43898D417174L79436k41872r09984j484654j905269j946499j351832k28748Q91284
43889b380964J493428J488752J133227O77480K19905k01322n63621r05259j263343
$$ plain form
43952 8236255 8452543 8348903 7806198 6706319 5063457 3080567 1062698 -729188 -2167673
43943 -2167673 -3264825 -4106479 -4727615 -5028390 -4869597 -4281736 -3509671 -2791770 -2149154
43934 -2149154 -1450214 -612163 352767 1426824 2579442 3665196 4451328 4796135 4735707
43925 4735707 4374548 3761541 2896344 1785698 461815 -989353 -2384664 -3496345 -4199906
43916 -4199906 -4527625 -4538522 -4182481 -3336447 -1943388 -97521 1945379 3809269 5140734
43907 5140734 5813074 5966836 5790367 5322403 4578991 3820277 3490347 3791958 4417174
43898 4417174 4796610 4554738 3644754 2160100 254831 -1691668 -3043500 -3272248 -2380964
43889 -2380964 -887536 601216 1734443 2411923 2631828 2430506 1866885 961626 -301717
43880c01717j537995j540154j210916o86589j14764M73380J055735J515642J747221
43871f00157J778272J692386J504430J213564R05520O71599M59091J27036l47623
43862G404118q10224j071943j041571p44980l18918J7439R5417n5906k48111l28601
43852B896720k88748j97197j11145o2153n0290k7962N2429J62033K23677K25251
43842B822615K47088L64826N69795P76104Q52164O77399K67997j56816l48041
43833F073131l00371k60845m31839p59217j053098j206400j216630j090458q44903
43824a090630n57312l02440n0471K78664O50747Q87846Q40083N41590J55907k08157
43814A145827n66225r17300j089627q45366j98198M58524O65412L38297j83646
$$ plain form
43880 -301717 -1839712 -3379866 -4590782 -5277371 -5392135 -4918755 -3863020 -2347378 -600157
43871 -600157 1178115 2870501 4374931 5588495 6494015 7165614 7624705 7751741 7404118
43862 7404118 6593894 5521951 4480380 3735400 3416482 3433921 3529338 3473432 3225321 2896720
43852 2896720 2607972 2410775 2299630 2237477 2187187 2159225 2211654 2373687 2597364 2822615
43842 2822615 3069703 3434529 4004324 4780428 5632592 6309991 6577988 6421172 6073131
43833 6073131 5772760 5511915 5080076 4320859 3267761 2061361 844731 -245727 -1090630
43824 -1090630 -1647942 -1950382 -2000853 -1722189 -1071442 -183596 656487 1198077 1353984 1145827
43814 1145827 579602 -337698 -1427325 -2272691 -2470889 -2012365 -1346953 -1008656 -1192302
43805a192302n06151m87630k06477J94521N53889P29476P26433P21119Q52757
43796A385635J042650J106154R79413P33494M26743P6653k47629m45934n25838
43787D531341o18455q16668j061315j210745j170708r44973o13772k83038k0820
43778b209153J68196L01634L95290N08633P35507J055364J247795J090401O44987
43769C938654K25284N0530L6245l1855k21687m24604n29866n47877n80074p04233
43759A210517q69342r02785o77655k79352P0291K71020M27817O33508P82654P04205
43749A370878M07582Q1753j13989j51828n8212J33956L28037L58951J11660l76060
43739B092728r30333j322252j359757j001315m26011O2093K51269J46527r5643
$$ plain form
43805 -1192302 -1698453 -2186083 -2392560 -2198039 -1644150 -914674 -188241 532878 1385635
43796 1385635 2428285 3534439 4513852 5247346 5674089 5750742 5503113 5057179 4531341
43787 4531341 3912886 3096218 2034903 824158 -346550 -1291523 -1905295 -2188333 -2209153
43778 -2209153 -2040957 -1739323 -1344033 -835400 -99893 955471 2203266 3293667 3938654
43769 3938654 4163938 4214468 4250713 4218858 3997171 3572567 3042701 2494824 1914750 1210517
43759 1210517 341175 -561610 -1239265 -1518617 -1448326 -1177306 -749489 -115981 666673 1370878
43749 1370878 1778460 1860213 1746224 1594396 1536184 1670140 1998177 2357128 2468788 2092728
43739 2092728 1162395 -159857 -1519614 -2520929 -2946940 -2884847 -2633578 -2487051 -2582694
43730b582694k95774l30638j95341m1503p3194l24574n84566o16731m26763k47126
43720e718904k82928n36709q49869j031869r69832p12098m46831k99074j39042
43711a0987156K90337J011933J692921J954581J711316J143085M71075j02290
43703b814198l52560j65715K74754O03678O18738L93675O0338l34553p05497q65127
43693c286467p26766m40671j83662Q5880N06426J020400J375705J397963J116292
43684H65100O36753M8592n22986r14422j040771r47736p32518m85684k98294k17093
43674c609059j84514j32794j43035l74399p98152j140145j157753q61203l99467
43665h800521J32726O62896J040565J137621J011810Q41605P12667N62294L10279
$$ plain form
43730 -2582694 -2878468 -3209106 -3404447 -3445950 -3519144 -3843718 -4428284 -5045015 -5471778 -5718904
43720 -5718904 -6001832 -6538541 -7388410 -8420279 -9390111 -10102209 -10549040 -10848114 -10987156
43711 -10987156 -10696819 -9684886 -7991965 -6037384 -4326068 -3182983 -2711908 -2814198
43703 -2814198 -3166758 -3332473 -3057719 -2454041 -1835303 -1441628 -1381290 -1715843 -2421340 -3286467
43693 -3286467 -4013233 -4453904 -4637566 -4551686 -4045260 -3024860 -1649155 -251192 865100
43684 865100 1501853 1550445 1027459 113037 -927734 -1875470 -2607988 -3093672 -3391966 -3609059
43674 -3609059 -3793573 -3926367 -4069402 -4443801 -5241953 -6382098 -7539851 -8401054 -8800521
43665 -8800521 -8667795 -8004899 -6964334 -5826713 -4814903 -3973298 -3260631 -2698337 -2388058
43656b388058m2990m19576o83059p01389m93592k72565k24123k76468k21296l2824
43646e755940J10107J37307K25726N28475R19314J143925J125814R81012Q02251
43637B17991N91924L86619K81167K83493K61652R6806j85716m84226p44270r52900
43627b47460j070475j044702q61676n23503k1524N79359J065213J220341J090321
43618A85894R78491J086261J230128J031258L63455m86344j092780j229890r52641
43609A113832m97401j72876k21361o36312j130210j382117j327422j147031r91535
43600f392433q09138m70425J3421M57807O69748O10778M05844K18002J19448P2425
43590e104523J8383l1048P788K14944N86535J008229J308436J364015J162886
$$ plain form
43656 -2388058 -2431048 -2850624 -3533683 -4235072 -4728664 -5001229 -5225352 -5501820 -5723116 -5755940
43646 -5755940 -5645833 -5508526 -5282800 -4754325 -3835011 -2691086 -1565272 -584260 217991
43637 217991 809915 1196534 1477701 1761194 2022846 2119652 1933936 1449710 705440 -247460
43627 -247460 -1317935 -2362637 -3224313 -3747816 -3769340 -3189981 -2124768 -904427 185894
43618 185894 1164385 2250646 3480774 4512032 4875487 4389143 3296363 2066473 1113832
43609 1113832 616431 443555 222194 -414118 -1544328 -2926445 -4253867 -5400898 -6392433
43600 -6392433 -7201571 -7671996 -7658575 -7200768 -6531020 -5920242 -5514398 -5296396 -5176948 -5104523
43590 -5104523 -5086140 -5117188 -5109400 -4894456 -4307921 -3299692 -1991256 -627241 535645
43581E35645P62139K31956l05180o45158o63515n23646n50718p94241q63609l74464
43571c190791N17306J215259J295559Q52466K48318k66936o17267p71715p09906
43562a427707m52565l5903M91653R94259J256177J152285P65270K78894j80187
43553B842176n40175p20132o85229n33930m33246m63400n66325o16934n08481
43544b225676k24028J15277L16780K88368J08079j03601k94546m11587l43411
43535b774345o4545K34885L07716J10308k07502n18714p75579q86487p32676l60734
43525e667673j6907Q4222n5539k90221m84795n65373n20591m05545k71438p5315
43515h269175K41537N77013P15919O12680M85544N34226O83064P16948N66409
$$ plain form
43581 535645 1297784 1529740 1224560 579402 -84113 -607759 -1158477 -1952718 -2816327 -3190791
43571 -3190791 -2673485 -1458226 -162667 689799 938117 671181 53914 -717801 -1427707
43562 -1427707 -1880272 -1916175 -1424522 -430263 825914 1978199 2743469 3022363 2842176
43553 2842176 2302001 1581869 896640 362710 -70536 -533936 -1100261 -1717195 -2225676
43544 -2225676 -2449704 -2334427 -2017647 -1729279 -1621200 -1724801 -2019347 -2430934 -2774345
43535 -2774345 -2838890 -2604005 -2296289 -2185981 -2393483 -2912197 -3687776 -4574263 -5306939 -5667673
43525 -5667673 -5684580 -5600358 -5655897 -5946118 -6430913 -6996286 -7516877 -7922422 -8193860 -8269175
43515 -8269175 -8027638 -7450625 -6734706 -6122026 -5636482 -5102256 -4419192 -3702244 -3135835
43506c135835L22258N3520k18987l98560l37968l8050K83313L78525J86168j51090
43496c056706m37747n88006o77766q41717j101980j319659j335945j123051p74992
43487a1257569m19001j85751j77090l50066m73419l17030J12406N96519R34891
43478a1536110J061645R84231P56255N16939M02740L60089J68876k64883p27758
43469h277976q94482o44193j15268M79488R89484J318918J405526J246756R04032
43460c587715M63565J2716l54570n48680n23679l13178l4226J62882J93905J04390
43450d424590P756l6838m1113Q003J76391M80698Q30758J121920J314730J364860
43440H02575J166016O88995J41780j52420p2162J96872L96408M39252L82757K79856
$$ plain form
43506 -3135835 -2813577 -2760057 -2979044 -3377604 -3715572 -3753622 -3470309 -3091784 -2905616 -3056706
43496 -3056706 -3494453 -4082459 -4760225 -5601942 -6703922 -8023581 -9359526 -10482577 -11257569
43487 -11257569 -11676570 -11862321 -12039411 -12389477 -12862896 -13179926 -13067520 -12471001 -11536110
43478 -11536110 -10474465 -9490234 -8733979 -8217040 -7814300 -7454211 -7285335 -7550218 -8277976
43469 -8277976 -9172458 -9816651 -9931919 -9452431 -8462947 -7144029 -5738503 -4491747 -3587715
43460 -3587715 -3124150 -3111434 -3466004 -4014684 -4538363 -4851541 -4885767 -4722885 -4528980 -4424590
43450 -4424590 -4416834 -4453672 -4494785 -4486782 -4310391 -3829693 -2998935 -1877015 -562285 802575
43440 802575 1968591 2657586 2799366 2646946 2574784 2771656 3168064 3607316 3990073 4269929
43430D269929J68962J49125L19690O16986Q08012P05463L44511r3290m82899q22009
43420E984480j124646j331659j352085j150577p75941l42672j717J23740K7071
43411E5994j71282l35641m25964m83175n47014o27906p14219p45396o19589l14464
43401d928656K6443K33741L30629M86345P34680Q92533Q35709P05590O93824P21803
43391G32641N26034L9948m93985q27714r63363j031843j052534r43882p13911
43382d728609n11924m75744n90168p09243o84999m70927j21591K94916P52932
43373g245357J192684J416623J188833N20306k21128o09252n65503l81752l49246
43364e053792m76577n98515o28559n92868m90240k72664J6199K05720J80795M8026
$$ plain form
43430 4269929 4438891 4588016 4907706 5524692 6332704 7038167 7382678 7289388 6806489 5984480
43420 5984480 4859834 3528175 2176090 1025513 249572 -93100 -94817 28923 55994
43411 55994 -115288 -450929 -876893 -1360068 -1907082 -2534988 -3249207 -3994603 -4614192 -4928656
43401 -4928656 -4902213 -4668472 -4337843 -3851498 -3116818 -2224285 -1388576 -682986 10838 732641
43391 732641 1258675 1298623 804638 -23076 -986439 -2018282 -3070816 -4014698 -4728609
43382 -4728609 -5240533 -5716277 -6306445 -7015688 -7700687 -8171614 -8293205 -7998289 -7245357
43373 -7245357 -6052673 -4636050 -3447217 -2926911 -3148039 -3757291 -4322794 -4704546 -5053792
43364 -5053792 -5530369 -6128884 -6757443 -7350311 -7840551 -8113215 -8097016 -7891296 -7710501 -7662475
43354g662475M6659L06309P35044J118097J257433J023066L75184n70685j510943
43345d882311k065253j993224j351318m71291K25465M68543K87076m7820k55594
43336a0085727k51234j31363J6223K39489O32251J144886J538645J561255J164958
43327d170617N37911p1811n38799q73505j111647j247811j264801j165718r60368
43318a0867166o69500l64308j44317k4850J20350M48570R87266J607207K118030
43309f788718K347821K182664J630645Q63874J34465l74440n96159n27457k21754
43300a349059J71353M69091N99126O09715N22106K80579r8913m41912n74178m93081
43290c05173k87724K9692M77431R37473J197980J181371J004686P85458N07904
$$ plain form
43354 -7662475 -7615816 -7309507 -6574463 -5456366 -4198933 -3175867 -2800683 -3371368 -4882311
43345 -4882311 -6947564 -8940788 -10292106 -10763397 -10537932 -10069389 -9782313 -9830133 -10085727
43336 -10085727 -10336961 -10468324 -10452101 -10212612 -9580361 -8435475 -6896830 -5335575 -4170617
43327 -4170617 -3632706 -3704517 -4243316 -5116821 -6228468 -7476279 -8741080 -9906798 -10867166
43318 -10867166 -11536666 -11900974 -12045291 -12070141 -11949791 -11501221 -10513955 -8906748 -6788718
43309 -6788718 -4440897 -2258233 -627588 236286 370751 -3689 -599848 -1127305 -1349059
43300 -1349059 -1177706 -708615 -109489 500226 1022332 1302911 1203998 762086 187908 -305173
43290 -305173 -592897 -563205 -85774 851699 2049679 3231050 4235736 5021194 5529098
43281E529098J28816k97985o78936r75754j157895j127730q00298k48878K91549
43272F61987N63283M18495j05280p57329j173591j130031p29898k87777k7942
43263b568083N5047P5762J15474K19798M15177O37281P09132M99519R9800k34223
43253B4684l32709k54259j70169j67364k05415k27097k43836k99042l90538m67260
43243b733005m94152m85491m60122l89455k24200K7918K85678M75942O07261P25701
43233b663925Q06749P46898M97159J71123l8007n0288M2764J31788K46847N08033
43223C99141R43978J415926J714971J685588J273008N45450k85584r36738j224790
43214E530950j166794q96761n42580k35765j59726m37452r38329j307552j277484
$$ plain form
43281 5529098 5657914 5359929 4680993 3705239 2547344 1419614 619316 370438 661987
43272 661987 1225270 1643765 1538485 781156 -392435 -1522466 -2252364 -2540141 -2568083
43263 -2568083 -2513036 -2437274 -2321800 -2102002 -1686825 -1049544 -340412 159107 258907 24684
43253 24684 -308025 -562284 -732453 -899817 -1105232 -1332329 -1576165 -1875207 -2265745 -2733005
43243 -2733005 -3227157 -3712648 -4172770 -4562225 -4786425 -4758507 -4472829 -3996887 -3389626 -2663925
43233 -2663925 -1857176 -1110278 -613119 -441996 -480003 -530291 -487527 -355739 -108892 399141
43223 399141 1343119 2759045 4474016 6159604 7432612 7978062 7692478 6755740 5530950
43214 5530950 4364156 3467395 2924815 2689050 2529324 2091872 1153543 -154009 -1431493
43205a431493r22766n55843l95664l92796l65212k32513p4279J0859M0106J12517
43195d207084K73987M68120O17701O94140O87145N80850M23503L60418M96171
43186C94951P40263Q86501Q46857P10210N59661L47997J0042l87669o72625o88626
43176B747562l77359J52693N93021O17094K26831j71205j74283J86985N43048
43167D344387O18808L99311o0934p31055j452532j915323j917565j539894r92471
43158c247268m20018O9777L50716L94777L34878K75469J46023j01893k58047l7958
43148b493544N11995R97057J098780Q60754N21180K39026P5898R9461L49332P39388
43138B999327J093182J265350J189985Q70568M02248k5024k29488j68491M3987
$$ plain form
43205 -1431493 -2354259 -2910102 -3305766 -3698562 -4063774 -4296287 -4370566 -4359707 -4319601 -4207084
43195 -4207084 -3933097 -3464977 -2847276 -2153136 -1465991 -885141 -461638 -101220 394951
43186 394951 1135214 2021715 2868572 3578782 4138443 4486440 4496482 4108813 3436188 2747562
43176 2747562 2370203 2522896 3115917 3733011 3959842 3788637 3614354 3801339 4344387
43167 4344387 4963195 5362506 5301572 4570517 3117985 1202662 -714903 -2254797 -3247268
43158 -3247268 -3667286 -3597509 -3246793 -2852016 -2517138 -2241669 -2095646 -2197539 -2455586 -2493544
43148 -2493544 -1981549 -984492 114288 975042 1496222 1735248 1811146 1910607 2259939 2999327
43138 2999327 4092509 5357859 6547844 7418412 7820660 7795636 7566148 7397657 7441644
43129G441644K29481K44073M0840l06704o52370q84178r87933j014381j026910
43120C083562j087028j220812j355522j347578j133590q09709m98654j86488K16411
43111d339408O72651R81677R74974O83519K93196k523q8179M7456K94132M59763
43101b2742M02262J46859j42705l17422l75613m62209p31475j174664j575308
43092d253017j677939j428564j016950o55715l60207J323M70691Q96999J095412
43083f927967J050718R10472P95608O74227M42951R6126k36181m25668m77584
43074d097298m89913n12689n13334m82191m87011n60601n81829l56642J67014
43065g914494Q05874J267586J350168J057636N98949K70753K46114M28992N68776
$$ plain form
43129 7441644 7671125 7915198 7956038 7649334 6996964 6112786 5124853 4110472 3083562
43120 3083562 1996534 775722 -579800 -1927378 -3060968 -3870677 -4369331 -4555819 -4339408
43111 -4339408 -3666757 -2685080 -1710106 -1026587 -733391 -735914 -824093 -776637 -482505 -22742
43101 -22742 379520 526379 383674 66252 -309361 -771570 -1503045 -2677709 -4253017
43092 -4253017 -5930956 -7359520 -8376470 -9032185 -9392392 -9391069 -8920378 -8023379 -6927967
43083 -6927967 -5877249 -4966777 -4171169 -3496942 -3053991 -2957865 -3194046 -3619714 -4097298
43074 -4097298 -4587211 -5099900 -5613234 -6095425 -6582436 -7143037 -7724866 -8081508 -7914494
43065 -7914494 -7108620 -5841034 -4490866 -3433230 -2834281 -2563528 -2317414 -1888422 -1319646
43056a319646N48626M92421N41998O18535N14203J86128j54100k52418k9841M12540
43046A558446R00205J253142J334022J110009O53494O5236n58568j078711j333337
43037C903938j282189j069762q59452o46979l31830N7749L32764L55540J80403
43028F40182n8658l03129n32557o40798m73300r882N60192R85802J149799J098609
43018B416260R15159O15540J78216l67050r18167j364044j643591j745450j685089
43009c598216j500108j245850r73894p19127m98508k81541M0612N76289J252119
43000f948224J756364J771773J293228O53340K06338K8505o3135k69609o32238
42991b203658j033442j293926j276904r64617m74325K269K98237L59240K88035
$$ plain form
43056 -1319646 -771020 -278599 263399 881934 1396137 1582265 1428165 1175747 1145906 1558446
43046 1558446 2458651 3711793 5045815 6155824 6809318 6874554 6315986 5237275 3903938
43037 3903938 2621749 1551987 692535 45556 -286274 -228525 104239 459779 640182
43028 640182 581524 278395 -254162 -894960 -1368260 -1378142 -817950 167852 1317651 2416260
43018 2416260 3331419 3946959 4125175 3758125 2839958 1475914 -167677 -1913127 -3598216
43009 -3598216 -5098324 -6344174 -7318068 -8037195 -8535703 -8817244 -8776632 -8200343 -6948224
43000 -6948224 -5191860 -3420087 -2126859 -1473519 -1267181 -1238676 -1301811 -1571420 -2203658
42991 -2203658 -3237100 -4531026 -5807930 -6772547 -7246872 -7244603 -6946366 -6587126 -6299091
42982f299091K96003N35394R32239J224140J209900R38602O19974L90266K27693
42973G5120P4297l8471q851K24548N92697Q87985Q72855M73028j17346n77383
42963B458479p34318o67866n52231m80431m78972n90624q23247j049741j090545
42954d009496r29853p49682o82037n99524k53526L90265J040336J332064J151893
42945c309560P00519K86220Q4342N3555K8789j05688l03328m02608k85866K6419
42935c227206M38647Q78524J276782J490593J361523R03086L68263M8626L832
42926C542670L3936p9049l44154n83190o29183m61871j70559J54569M65480P22306
42916B650955Q62415Q18187N61582J41592l11715o47669q04562q56014r02269
$$ plain form
42982 -6299091 -6003088 -5467694 -4535455 -3311315 -2101415 -1162813 -542839 -152573 75120
42973 75120 149417 110946 102095 326643 919340 1807325 2680180 3153208 3035862 2458479
42963 2458479 1724161 1056295 504064 23633 -455339 -1045963 -1869210 -2918951 -4009496
42954 -4009496 -4939349 -5689031 -6371068 -6970592 -7224118 -6833853 -5793517 -4461453 -3309560
42945 -3309560 -2609041 -2322821 -2238479 -2184924 -2156135 -2261823 -2565151 -2967759 -3253625 -3227206
42935 -3227206 -2788559 -1910035 -633253 857340 2218863 3121949 3490212 3538838 3542670
42926 3542670 3576606 3497557 3153403 2570213 1941030 1479159 1308600 1463169 1928649 2650955
42916 2650955 3513370 4331557 4893139 5034731 4723016 4075347 3270785 2414771 1512502
42907A512502r11927p33349k92733K76593P48534R96077J012504Q06372L91662
42898C806235j19192n20019o54608n08292j58432K76139O10788O33209K70114
42889C635942l12048q38749j142466j213746j102751q66103n97730m10812l44367
42880c192830l34920l15889l08908l70256m59352m21197j47411K55618N16320
42871d778825M52436J50022j42297k57735j96134j7800K26786M52083N48918N10286
42861c052260M64711N14329O04922O23047N53887M63994L91326L43679L45836
42852A253471L73522K78688q9146o79698j250498j567720j510960j028637j68391
42843d389369P98531J434583J442830Q90476R8007o28787j137747j418247j547800
$$ plain form
42907 1512502 600575 -132774 -425507 -148914 599620 1595697 2608201 3414573 3806235
42898 3806235 3687043 3167024 2512416 2004124 1845692 2121831 2732619 3365828 3635942
42889 3635942 3323894 2485145 1342679 128933 -973818 -1839921 -2437651 -2848463 -3192830
42880 -3192830 -3527750 -3843639 -4152547 -4522803 -4982155 -5403352 -5550763 -5295145 -4778825
42871 -4778825 -4326389 -4176367 -4318664 -4576399 -4772533 -4790333 -4563547 -4111464 -3562546 -3052260
42861 -3052260 -2587549 -2073220 -1468298 -845251 -291364 172630 563956 907635 1253471
42852 1253471 1626993 1905681 1816535 1136837 -113661 -1681381 -3192341 -4220978 -4389369
42843 -4389369 -3590838 -2156255 -713425 177051 275058 -353729 -1491476 -2909723 -4457523
42834d457523j604787j562971j302373p72835j07990M72120Q38302R95350R99779
42825f502928Q96142P08835M44131J12539k24040m60979n45429n36208n35535
42816f643472n84024o42890o39633n05423k19086J42153M37877N95867O74089
42807g384542P59309Q58731R39814J011396J081799J078065R05854N87343K61211
42798I8980L4771j05901k30979l67017m82012n38396n40882n30356n18724m42762
42788c623278k39957J6807J43965O6266n7069n623K52614N64986P87719Q61607
42778a231963P33536L54403k01531p04358r03736o79423j07988N31867Q71540
42769a337653P26575K89075o3270j62217j32433q7254N7257L70727O88301P69475
$$ plain form
42834 -4457523 -6062310 -7625281 -8927654 -9700489 -9808479 -9336359 -8498057 -7502707 -6502928
42825 -6502928 -5606786 -4897951 -4453820 -4341281 -4565321 -5026300 -5571729 -6107937 -6643472
42816 -6643472 -7227496 -7870386 -8510019 -9015442 -9234528 -9092375 -8654498 -8058631 -7384542
42807 -7384542 -6625233 -5766502 -4826688 -3815292 -2733493 -1655428 -749574 -162231 98980
42798 98980 133751 27850 -203129 -570146 -1052158 -1590554 -2131436 -2661792 -3180516 -3623278
42788 -3623278 -3863235 -3846428 -3702463 -3636197 -3693266 -3698889 -3446275 -2881289 -2093570 -1231963
42778 -1231963 -498427 -144024 -345555 -1049913 -1953649 -2633072 -2741060 -2209193 -1337653
42769 -1337653 -611078 -322003 -385273 -547490 -679923 -767177 -709920 -339193 349108 1118583
42759A118583N85200K96279J5614k52150m81473o11742o70372p59727q82182q96404
42749b538374o96598l42550L1282L44362N54411O06720M96013L41777L14248M74251
42739d14458P17643Q68072Q06194N45098K25359J4646m1586p2146k46493n85854
42729A816475r31186j084812r46388n38098N889M39987N04511J53542l23790n27878
42719a431748l42345l4323P0950p2207k76202l94928m11393l00369J0839M83303
42709b698423Q92443J009320Q03331M08973m0854m69540p94281r13571p82586
42700b585188m69813j33642O3160O6889j0252N525J52428K88352K80536J79895
42690b162110J52143K93081N73304Q97984J133856J141019R05539O25183N46593
$$ plain form
42759 1118583 1703783 2000062 2015676 1763526 1282053 670311 -61 -759788 -1641970 -2538374
42749 -2538374 -3234972 -3577522 -3546240 -3201878 -2647467 -2040747 -1544734 -1202957 -888709 -414458
42739 -414458 303185 1171257 1977451 2522549 2747908 2762554 2720968 2648822 2402329 1816475
42729 1816475 885289 -199523 -1145911 -1684009 -1678120 -1238133 -733622 -580080 -903870 -1431748
42719 -1431748 -1774093 -1808416 -1737466 -1809673 -2085875 -2480803 -2892196 -3192565 -3181726 -2698423
42709 -2698423 -1805980 -796660 6671 415644 374790 -94750 -889031 -1802602 -2585188
42700 -2585188 -3055001 -3188643 -3125483 -3058594 -3068846 -3063321 -2910893 -2622541 -2342005 -2162110
42690 -2162110 -2009967 -1716886 -1143582 -245598 888258 2029277 2934816 3559999 4106592
42681D106592P02581Q87852Q80596N98282P0747n87568j154083j404330j335994
42672B764675j196588j205361j315683j324345j143130q65869o07502l78845j26735
42663e399383J72421M91227Q00431J106605J404362J578304J422715Q57334J06143
42654B540159m55425o57989o50036o48495p25061q93622j227588j722128k132364
42645f572549k134032j641140q52103j6298P13626J226981J428474J327603J057351
42636e462087P56807M95863L14595K33075J92332Q5910r3403k08812j35411Q8743
42626c732388L04448L74250K55948j862k89075n04738o41580p61487q55273p85270
42616f637027m32453J26381O52173R58688J061685J114307J221553J331113J304596
$$ plain form
42681 4106592 4809173 5697025 6577621 7175903 7246650 6659082 5504999 4100669 2764675
42672 2764675 1568087 362726 -952957 -2277302 -3420432 -4286301 -4893803 -5272648 -5399383
42663 -5399383 -5226962 -4735735 -3935304 -2828699 -1424337 153967 1576682 2434016 2540159
42654 2540159 2084734 1426745 776709 128214 -596847 -1490469 -2718057 -4440185 -6572549
42645 -6572549 -8706581 -10347721 -11199824 -11216122 -10502496 -9275515 -7847041 -6519438 -5462087
42636 -5462087 -4705280 -4209417 -3894822 -3661747 -3469415 -3383505 -3476908 -3685720 -3821131 -3732388
42626 -3732388 -3427940 -3053690 -2797742 -2799604 -3088679 -3593417 -4234997 -4996484 -5851757 -6637027
42616 -6637027 -7069480 -6943099 -6290926 -5332238 -4270553 -3156246 -1934693 -603580 701016
42607G01016J084275P60631M62259K24934K1489j17737j07690O0585K77157M32535
42597C799454N09766N19721M14812J35098k87190p18286j009064j077780r44574
42588A341957p11686m83942k93845j32064m1916j13684l62056o72792r04266r88701
42578c362995r14630o91324l78217p1560K03404N19542Q97232J198466J270433
42569a329649J150036J019706R77684R50736Q37740O54489N10980M88449N43273
42560E803444N10832K44019k03645n78919o78825n54240l92932k71602j48552
42551C729580m6463n9272j58550j70422k1228J39701J69985J68949L36144O49965
42541D738389Q32869O45877J22397n00854r98581j273164j334743j246105j094003
$$ plain form
42607 701016 1785291 2545922 3008181 3233115 3254604 3136867 3029177 3089762 3366919 3799454
42597 3799454 4309220 4828941 5243753 5378851 5091661 4373375 3364311 2286531 1341957
42588 1341957 630271 146329 -147516 -279580 -321496 -435180 -797236 -1470028 -2374294 -3362995
42578 -3362995 -4277625 -4968949 -5347166 -5418726 -5215322 -4695780 -3798548 -2600082 -1329649
42569 -1329649 -179613 840093 1817777 2768513 3606253 4260742 4771722 5260171 5803444
42560 5803444 6314276 6558295 6354650 5775731 5096906 4542666 4149734 3878132 3729580
42551 3729580 3683117 3623845 3465295 3294873 3273645 3413346 3583331 3752280 4088424 4738389
42541 4738389 5571258 6217135 6339532 5838678 4840097 3566933 2232190 986085 -107918
42532a07918r70906r33958r52497r11391p09677l69042j8874K31999L80497M90712
42522c871055O20560P98610J015193J200238J253695J138691R11561O29843K83405
42513C980741j26055m85000o40504n73328m18959k92634j64743L6140K43620K65452
42503A824730J354m02002o72177o88697n92155n87439o75137o38813l01181K62998
42493b468519P95521J093163J138359J026812Q38115O04355L61630J64666K0739
42484C574841j56621m62720q45494j079980r54031m77516J18682N70723P37633
42475A025517O18664L11140l4836k95223m43030n03000m41383j91058J77969M15608
42465F40368L21476k1343l36878m67834n05001n93340p04345o72582m19985n7834
$$ plain form
42532 -107918 -1078824 -2012782 -2965279 -3876670 -4586347 -4955389 -4974263 -4742264 -4361767 -3871055
42522 -3871055 -3250495 -2451885 -1436692 -236454 1017241 2155932 3067493 3697336 3980741
42513 3980741 3854686 3369686 2729182 2155854 1736895 1444261 1279518 1315658 1559278 1824730
42503 1824730 1826084 1424082 751905 63208 -528947 -1116386 -1791523 -2430336 -2731517 -2468519
42493 -2468519 -1672998 -579835 558524 1585336 2423451 3027806 3389436 3554102 3574841
42484 3574841 3418220 2955500 2110006 1030026 75995 -401521 -282839 287884 1025517
42475 1025517 1644181 1955321 1920485 1625262 1182232 679232 237849 46791 224760 640368
42465 640368 961844 940501 603623 135789 -369212 -962552 -1666897 -2339479 -2759464 -2817298
42455b817298K61457N35377Q76977J289277J567380J505270J159574Q11482O68322
42446E857818O87817O91986N34004J24086n51106j305989j751410j593539r56664
42437A737003l06566l6447j92081n70044r46847j164901j114005p64208k37475
42428c595571K11530L52643J71767q8802j42163M8788K40358K19400O8365K3910
42418b489775J47079K95719M01125N69545Q42378J036682R65474P07359N00922
42409B976508M21954L10247P219m51764q86326j112252j029011o74150k33267
42400f70842P2121J47728N0659j29485l35508m98581n50901n31177n70611o92318
42390c708915p13983m60457r963M02656O88951R47995J191228J216981Q77439
$$ plain form
42455 -2817298 -2555841 -2020464 -1143487 145790 1713170 3218440 4378014 5189496 5857818
42446 5857818 6545635 7237621 7771625 7895711 7344605 6038616 4287206 2693667 1737003
42437 1737003 1430437 1393990 1201909 631865 -314982 -1479883 -2593888 -3358096 -3595571
42428 -3595571 -3384041 -3031398 -2859631 -2948433 -3090596 -3041808 -2801450 -2582050 -2513685 -2489775
42418 -2489775 -2342696 -2046977 -1645852 -1076307 -233929 802753 1768227 2475586 2976508
42409 2976508 3398462 3708709 3715928 3264164 2377838 1265586 236575 -437575 -670842
42400 -670842 -598721 -450993 -400334 -529819 -865327 -1363908 -1914809 -2445986 -3016597 -3708915
42390 -3708915 -4422898 -4883355 -4893318 -4490662 -3801711 -2853716 -1662488 -445507 431932
42381D31932L45227m7119j82702k22960l13612l97906l68502k47853j01460J27804
42371i77151N41088J051148J365009J261346Q34270M19974L02693N02598Q10569
42362F111544R89257R44286P34999M65592K07685J9976l6244K7523O6325r1327
42352I439616m43735p75073q55330o61181l76285j99131j83809k54106l22751
42343E368215l60972l59183k70012n1686K18951L36348J37886l13244p59864r72939
42333B973500r18730p29162n73202n62013o91949q14420p08748k71272L59671
42324a936325R17899J256063J433342J551453J573863J372809R32377M24767M5182
42315G571430j93804m52684q46928j274749j491067j353995r83112o55123n33418
$$ plain form
42381 431932 777159 730040 547338 324378 10766 -387140 -755642 -1003495 -1104955 -977151
42371 -977151 -436063 615085 1980094 3241440 4075710 4495684 4798377 5300975 6111544
42362 6111544 7100801 8045087 8780086 9245678 9453363 9473339 9437095 9464618 9530943 9439616
42352 9439616 8995881 8220808 7365478 6704297 6328012 6128881 5945072 5690966 5368215
42343 5368215 5007243 4648060 4378048 4326362 4545313 4881661 5019547 4706303 3946439 2973500
42333 2973500 2054770 1325608 752406 190393 -501556 -1315976 -2024724 -2295996 -1936325
42324 -1936325 -1018426 237637 1670979 3222432 4796295 6169104 7101481 7526248 7571430
42315 7571430 7377626 6924942 6078014 4803265 3312198 1958203 975091 319968 -213450
42306b13450n18370l96317j23690J07225J19171j1113n8921M4750J49184J44032
42296g57499J43937L19829O33354Q55830Q16359N33180J27586k77429n66229o53340
42286A175578n56750l92904k55575j38748q489R8561J05119P940r1297r7517m5895
42275a99977o7643k06172l12591k02707R3227L46232M22461M27182M66284M10064
42265A176360Q7786l50028n04697k13117K31765M36985L40780J78221J35960J86131
42255A706146K09981J54100O1327K3612J08501K92978M82298O11467O89675P33199
42245E073284P23633O61321N76803M40765J55004k84719o85217q03716n60825
42236E296333o2427M97810Q78167Q51469L97236k00599n89974o80918o41987o18885
$$ plain form
42306 -213450 -731820 -1128137 -1251827 -1144602 -1025431 -1036544 -1095465 -1050715 -901531 -757499
42296 -757499 -613562 -293733 339621 1195451 2011810 2544990 2672576 2395147 1828918 1175578
42286 1175578 618828 225924 -29651 -168399 -176888 -78327 26792 34732 -56565 -154082 -199977
42275 -199977 -267620 -473792 -786383 -989090 -895863 -549631 -127170 300012 766296 1176360
42265 1176360 1264146 914118 409421 196304 428069 865054 1205834 1384055 1520015 1706146
42255 1706146 1916127 2070227 2131554 2155166 2263667 2556645 3038943 3650410 4340085 5073284
42245 5073284 5796917 6458238 7035041 7475806 7630810 7346091 6660874 5857158 5296333
42236 5296333 5233906 5731716 6609883 7461352 7858588 7657989 7068015 6387097 5745110 5126225
42226E126225o07697n85802n88442o14627o03628n55207n38179n24501l64685
42217A43457k9613K48140K12693j01949m21424n49999n18670m36913l29327j60039
42207a943644O0882K51848L19963K31283M2943j25394j71562q0512P0992J64164
42197a179037J11152p0439k45183k76440j82717j24829k01365l21975l53929l42467
42187c187229m78342q42288j268859j493516j379035r81601m64125J4744L86427
42178i693824P13031J114461J596842J972363K014843J698133J225787Q20532
42170A462168N48950L68673K53431J90651J19331l866p9676N9366L86744N96348
42160C902120L90826j75777p32490r54661q17480n10362k15354j2356Q6366R9875
$$ plain form
42226 5126225 4518528 3932726 3344284 2729657 2126029 1570822 1032643 508142 143457
42217 143457 113844 361984 574677 472728 51304 -498695 -1017365 -1454278 -1783605 -1943644
42207 -1943644 -1882762 -1630914 -1310951 -1079668 -1036725 -1162119 -1333681 -1414193 -1343201 -1179037
42197 -1179037 -1067885 -1138324 -1383507 -1659947 -1842664 -1967493 -2168858 -2490833 -2844762 -3187229
42187 -3187229 -3665571 -4507859 -5776718 -7270234 -8649269 -9630870 -10094995 -10080251 -9693824
42178 -9693824 -8980793 -7866332 -6269490 -4297127 -2282284 -584151 641636 1462168
42170 1462168 2011118 2379791 2633222 2823873 2943204 2939338 2859662 2919028 3305772 3902120
42160 3902120 4292946 4117169 3384679 2430018 1612538 1102176 886822 874466 960832 1060707
42150A060707P0100M0130K2313j4043j24932l32378n43522n58243k44235K72487
42140c51616O66679P13863M87074K20933M6438p1680j93041l14157m34519o14367
42130A55607r02388j229530j415017j288592q20697j57945M69289Q98126J100704
42121c190443J106833R10349N12448K9786l43850n20593n81498n97284m69175
42112c143427o6044N11703R49556J041795Q83232O72990M43012J10848k71968
42103A131697n10244n29551m92063n59642o41192m80379N1205Q18780J525350
42094C13961J874210J707025J116413M22552n7333k31533j90208j6522K27703
42085E166268L75714K23982j98541n83380o82909o02856o38799q88115j148106
$$ plain form
42150 1060707 1130807 1170937 1193250 1179207 1054275 721897 178375 -379868 -624103 -351616
42140 -351616 315063 1028926 1516000 1736933 1783371 1711691 1518650 1204493 769974 155607
42130 155607 -746781 -1976311 -3391328 -4679920 -5500617 -5658562 -5189273 -4291147 -3190443
42121 -3190443 -2083610 -1173261 -660813 -631027 -974877 -1495470 -2076968 -2674252 -3143427
42112 -3143427 -3209471 -2697768 -1748212 -706417 176815 849805 1292817 1403665 1131697
42103 1131697 621453 91902 -400161 -959803 -1600995 -2081374 -2030169 -1211389 313961
42094 313961 2188171 3895196 5011609 5434161 5376828 5145295 4955087 4938565 5166268
42085 5166268 5541982 5765964 5567423 4984043 4301134 3698278 3059479 2171364 1023258
42076A023258j173335r30769o06826m37463n11858o63205n69401n3754P02981
42067c220372J321598J607301J709310J881510K144522K225430J820270R18012
42059A0407581j16950q11721r85103q75986q43890r82274j085945r42084n36964
42050C226664j789M87096P14256M94860j32108q53925j340780j513663j473088
42041c92477j232041o75883J94308J109518J706638J817165J549542J129909P05927
42032E912606K83905j91804p25554j243689j663613j939881k017240j803971j281596
42023d670837o23042r7775J68606K60424K74642J68459j13955m51958o20325n33065
42013f238826k99120k8139L00144P22656J146138J401969J411262J231901R70079
$$ plain form
42076 1023258 -150077 -1080846 -1687672 -2125135 -2636993 -3300198 -3869599 -3923353 -3220372
42067 -3220372 -1898774 -291473 1417837 3299347 5443869 7669299 9489569 10407581
42059 10407581 10290631 9478910 8493807 7617821 6773931 5791657 4705712 3763628 3226664
42050 3226664 3224875 3711971 4426227 4921087 4788979 3935054 2594274 1080611 -392477
42041 -392477 -1624518 -2300401 -2106093 -996575 710063 2527228 4076770 5206679 5912606
42032 5912606 6196511 6004707 5279153 4035464 2371851 431970 -1585270 -3389241 -4670837
42023 -4670837 -5293879 -5391654 -5223048 -4962624 -4687982 -4519523 -4633478 -5085436 -5705761 -6238826
42013 -6238826 -6537946 -6566085 -6265941 -5543285 -4397147 -2995178 -1583916 -352015 618064
42004F18064P04740M76026K77260N3962k31952n18724o67346n95944l77738j92542
41994d54194j84816l56811n74278o77630o15418m79261l96737l94781l84157k63351
41984d781434n962L41545O96790R63061J060699R75115P66775N26598L35961K58696
41974A137844L19468M64589N80988N85593M74509K70225k9523m02028p33562q72305
41964A795798p52490m26699J2031M77586Q56863J015415R07099O47783M10068
41955D943454K40568L7626k70325n79472o98605n63962l07811j01681K0238J51968
41945B871998L66016O14468P63388O88531L50468j75897p32176j163250j389609
41936B193937j400897j218866r12441o22623m90054n22264n66279m35673n6994
$$ plain form
42004 618064 1322804 1798830 2076090 2130052 1898100 1379376 712030 116086 -261652 -454194
41994 -454194 -639010 -995821 -1570099 -2247729 -2863147 -3342408 -3739145 -4133926 -4518083 -4781434
41984 -4781434 -4787396 -4445851 -3749061 -2786000 -1725301 -750186 16589 543187 879148 1137844
41974 1137844 1457312 1921901 2502889 3088482 3562991 3833216 3803693 3401665 2668103 1795798
41964 1795798 1043308 616609 628640 1106226 1963089 2978504 3885603 4533386 4943454
41955 4943454 5184022 5221648 4951323 4371851 3673246 3109284 2801473 2699792 2720030 2871998
41945 2871998 3238014 3852482 4615870 5304401 5654869 5478972 4746796 3583546 2193937
41936 2193937 793040 -425826 -1338267 -1960890 -2450944 -2973208 -3539487 -3975160 -4032154
41927d032154M81079R69111J190569J088990Q40805O74785N94194L84046n2694
41918B138731m89272o18459m16822j32412L2658P4536N7630K3405O6328L17263
41908A053586P33614J018273Q87732L90340j31534l74094l08770j41197j33434
41899B994516m47047j044099j681636k041641j921612j334314m66265M29901J136599
41890d375598J536952J615893J405185R61537M28063O4976J09360N48754J073210
41881C368332J313931J148345P63266M29077K41307R3901j30738m06123o08022
41872F213276o51341n22787k30869J60435M44180L62415j06332o20350p53090
41863D295537l85405K52632Q75138J337877J560580J452463J039252N63451L12722
$$ plain form
41927 -4032154 -3551075 -2581964 -1391395 -302405 538400 1213185 1807379 2191425 2138731
41918 2138731 1649459 1031000 614178 481766 514424 588960 646590 669995 736323 1053586
41908 1053586 1787200 2805473 3693205 4083545 3952011 3577917 3269147 3127950 2994516
41899 2994516 2547469 1503370 -178266 -2219907 -4141519 -5475833 -5942098 -5512197 -4375598
41890 -4375598 -2838646 -1222753 182432 1143969 1572032 1637008 1746368 2295122 3368332
41881 3368332 4682263 5830608 6593874 7022951 7264258 7358159 7227421 6821298 6213276
41872 6213276 5561935 5039148 4808279 4968714 5412894 5775309 5668977 5048627 4295537
41863 4295537 3910132 4162764 5037902 6375779 7936359 9388822 10428074 10991525 11304247
41854A1304247L62231N74875Q27017J120712J462074J741519J808253J626223
41846B0827151J311198J031340Q86127Q44159P68723N34493J56548k09662m24170
41837B5725907n08610o17183q72852j244933j569060j673634j515115j214104
41829A6510416r32178o90041l51787J62095O93682R70250R03254O76321N20228
41820A8462240M93003N21353N54135N77447N45171M28842L37965M66627Q49786
41811B3236569J223433J197568N88525m10408j366586j923974k021989j820125
41803A8703013j419690p26413L46211J596069K597046L079974L142884L035101
41795C0354195K853016K548421K130907J692845J251149P12340K1769p58163j528500
$$ plain form
41854 11304247 11666478 12241353 13068370 14189082 15651156 17392675 19200928 20827151
41846 20827151 22138349 23169689 24055816 24899975 25668698 26203191 26359739 26150077 25725907
41837 25725907 25217297 24600114 23727262 22482329 20913269 19239635 17724520 16510416
41829 16510416 15578238 14888197 14536410 14698505 15392187 16362437 17265691 17942012 18462240
41820 18462240 18955243 19476596 20030731 20608178 21153349 21582191 21920156 22386783 23236569
41811 23236569 24460002 25657570 26246095 25835687 24469101 22545127 20523138 18703013
41803 18703013 17283323 16556910 16903121 18499190 21096236 24176210 27319094 30354195
41795 30354195 33207211 35755632 37886539 39579384 40830533 41542873 41564642 40806479 39277979
41786C9277979k187495k560675k463826j950564j387261j136512j209491j342176
41778B5039979j357188j305014j279304j272369j251790j224769j156682r67595
41770A5225268p14677o52663r51737j406571j578642j227827m95421L13875R78383
41761I489988J367550J380618J014353M41212p5802l41455k81503Q4363O31785
41752A3711109J122490J309377J103485O33250J47616j31921j12556J45148M87176
41743A8415174P75039R42981R55905P63755L50772j87736o74739r72798j058896
41734A9309457r91905q37368o12813k68654K70927J000438J751057K255708K342626
41725B4219473K086787J772571J685464J896568K226860K438246K468883K459267
$$ plain form
41786 39277979 37090484 34529809 32065983 30115419 28728158 27591646 26382155 25039979
41778 25039979 23682791 22377777 21098473 19826104 18574314 17349545 16192863 15225268
41770 15225268 14510591 13857928 12906191 11499620 9920978 8693151 8197730 8511605 9489988
41761 9489988 10857538 12238156 13252509 13693721 13617919 13276464 12994961 13079324 13711109
41752 13711109 14833599 16142976 17246461 17879711 18027327 17895406 17782850 17927998 18415174
41743 18415174 19190213 20133194 21089099 21852854 22203626 22015890 21341151 20368353 19309457
41734 19309457 18317552 17480184 16867371 16598717 16869644 17870082 19621139 21876847 24219473
41725 24219473 26306260 28078831 29764295 31660863 33887723 36325969 38794852 41254119
41717D1254119K553225K733747K878317K902330K784707K511442K090291J607163
41709F1315341J186218Q91467P27551P25874R54716J433814K088780K781579L339780
41700G5445120L603156L547723L358261L276301L370248L548119L774456M116785
41692A04040169M543721M847882M870622M680594M428920M153706L861673L684057
41684A39111344L753856L967686M056173L902043L631791L363449L013854K425196
41676A67225392J574888N87823l73157j149450j590474j631677j388421j122258
41668A62132666j077694j331056j777919k263522k722797l166875l539334l680276
41660A42573193l511713l189229k942678k787983k535699k102169j668992j468885
$$ plain form
41717 41254119 43807344 46541091 49419408 52321738 55106445 57617887 59708178 61315341
41709 61315341 62501559 63393026 64120577 64846451 65801167 67234981 69323761 72105340 75445120
41700 75445120 79048276 82595999 85954260 89230561 92600809 96148928 99923384 104040169
41692 104040169 108583890 113431772 118302394 122982988 127411908 131565614 135427287 139111344
41684 139111344 142865200 146832886 150889059 154791102 158422893 161786342 164800196 167225392
41676 167225392 168800280 169388103 169014946 167865496 166275022 164643345 163254924 162132666
41668 162132666 161054972 159723916 157945997 155682475 152959678 149792803 146253469 142573193
41660 142573193 139061480 135872251 132929573 130141590 127605891 125503722 123834730 122365845
41652A22365845j527900j704321j891742k083775k296895k524297k730318k819688
41644A04786909k669188k290650j931423j902228k288378k888278l420638l724458
41636H3671668l786540l685160l528221l354669l055951k465168j577014o43639
41628F1575306j9650P0668l64172j114779j860762k315647k391357k235149k076499
41619D9267959k044378k125444k218651k173695j856184j296978p60298n39698
41611C6252633o57567q70306j009541j191633j583171k056024k250586j989896
41603B4643909j490009j107167r78565r72247q90640o23597j68095L72118Q04343
41594A9590050R64693Q56675O34953M49082L34754K28196K7574l24300p29028
$$ plain form
41652 122365845 120837945 119133624 117241882 115158107 112861212 110336915 107606597 104786909
41644 104786909 102117721 99827071 97895648 95993420 93705042 90816764 87396126 83671668
41636 83671668 79885128 76199968 72671747 69317078 66261127 63795959 62218945 61575306
41628 61575306 61555656 61626324 61262152 60147373 58286611 55970964 53579607 51344458 49267959
41619 49267959 47223581 45098137 42879486 40705791 38849607 37552629 36792331 36252633
41611 36252633 35595066 34724760 33715219 32523586 30940415 28884391 26633805 24643909
41603 24643909 23153900 22046733 21068168 20095921 19205281 18581684 18413589 18785707 19590050
41594 19590050 20554743 21411418 22046371 22495453 22830207 23058403 23085977 22761677 22032649
41585B2032649r35511p86125m73479m07915p66618j295728j632790j688492j589277
41576A2456714j381885j008985n35066j72482l0114N523P4744J62150J80124J11415
41566I862138k1914k20626m22773m49149j93319J62786K78826L2975l39224n16534
41556H173186m03852j27256J71995M25296N65173N02516K23240j61257n13365
41547H855676p73925r09197q04232l40005L78229R84626J169879R96950P73576
41538A0331577O23346L55671j65787o95142q27882m90550k0441K46840K89168
41529I646800K42376J17623j63994n34291p48882o18925j86080L32834O93545
41520H781006P30245M41912L3949k09744j82006n6505r0840l56480p02751r35815
$$ plain form
41585 22032649 21097138 20311013 19837534 19429619 18663001 17367273 15734483 14045991 12456714
41576 12456714 11074829 10065844 9530778 9358296 9328182 9333705 9408449 9570599 9750723 9862138
41566 9862138 9840224 9619598 9196825 8747676 8554357 8717143 8995969 9028944 8689720 8173186
41556 8173186 7769334 7642078 7814073 8239369 8804542 9307058 9530298 9369041 8855676
41547 8855676 8081751 7172554 6368322 6028317 6406546 7391172 8561051 9558001 10331577
41538 10331577 10954923 11310594 11144807 10449665 9621783 9131233 9110792 9357632 9646800
41529 9646800 9889176 10006799 9842805 9308514 8559632 7940707 7754627 8087461 8781006
41520 8781006 9511251 9953163 9987112 9777368 9595362 9538857 9448017 9091537 8388786 7452971
41510G452971r57416p59452l90913L2948L51206M34648K33416k32127q55893j409308
41500C900080j618863j371330q23342k54660J70336M64213O93706Q74026R67387
41491C001553R11077O47489J94807l00820o35595o78056m03245J42546Q03000
41482C682756J273267J283111R00968N31799N06691P58583R96363J088840J120347
41473A2142725J137901J050605Q05988M99346K40136K7979j72170l35826m37859
41464A4958825n19562o10484o50224n80120m66077m35528n14583o10408o41010
41455I930829o02143n08940l55562j60741L572O5310P726j47436l88951p26317
41445G117347j152067j592633j895937j892884j505122q01304M9261Q55244J437829
$$ plain form
41510 7452971 6495555 5736103 5345190 5378138 5729344 6163992 6397408 6165281 5309388 3900080
41500 3900080 2281217 909887 86545 -168115 2221 466434 1160140 2034166 3001553
41491 3001553 3912630 4560119 4754926 4454106 3818511 3140455 2737210 2879756 3682756
41482 3682756 4956023 6239134 7140102 7671901 8178592 8937175 9933538 11022378 12142725
41473 12142725 13280626 14331231 15137219 15636565 15876701 15904680 15732510 15396684 14958825
41464 14958825 14439263 13828779 13178555 12598435 12132358 11696830 11182247 10571839 9930829
41455 9930829 9328686 8819746 8464184 8303443 8307015 8372325 8380051 8232615 7843664 7117347
41445 7117347 5965280 4372647 2476710 583826 -921296 -1722600 -1673339 -818095 619734
41436F19734J658398J493232J083600O56761L70773K44069K15621K27789K48065
41427F818042K57513K46496K09028J37125M3807m117Q5082L23674N65503N72635
41417I254788K21470l26194o94830o06378j33054M03065P73949J003246J160889
41408A1056951J136241P57235R7461m80637o30605k99789L00034Q94792J274766
41399A4106449J319967J026034N33445Q4579j05021J5175K97392N36730O87215
41390A8501965R03171J310559J778623K007963J828359J319404O65280K9922m17835
41381B7927411n41847m09536k92940l52460l92767q4940N92318J268363J550255
41372B9263857J380708J017194P40797O03322L92106j69885j118384k107439k617955
$$ plain form
41436 619734 2278132 3771364 4854964 5511725 5882498 6126567 6342188 6569977 6818042
41427 6818042 7075555 7322051 7531079 7668204 7712011 7707894 7792976 8116650 8682153 9254788
41417 9254788 9476258 9150064 8455234 7848856 7715802 8118867 8892816 9896062 11056951
41408 11056951 12193192 12950427 13047888 12567251 11936646 11636857 11936891 12831683 14106449
41399 14106449 15426416 16452450 16985895 17070474 16965453 16980628 17278020 17814750 18501965
41390 18501965 19405136 20715695 22494318 24502281 26330640 27650044 28315324 28345246 27927411
41381 27927411 27385564 26976028 26683088 26330628 25937861 25852921 26445239 27713602 29263857
41372 29263857 30644565 31661759 32402556 33005878 33397984 33228099 32109715 30002276 27384321
41363B7384321k348147j422520k77923O08936R64176Q45551N72988M43465M68202
41354B7239049M37420K39472J5133m0077P5951J96629J86242K8782k24615m83799
41344B7670187o05631m66779j07344K46737L64364K25345N0820J10172M71789
41335B7959660R21837J141177R86185N94092K14802j4101q9879m533L00880Q11741
41325C2821861J366288J797316K111596K430909K752787K880822K664116K239276
41317E1064971J935032J954560K246830K689747L272936M026128M859128N595286
41309G7644618O149643O582892O977567P341516P648966P904111Q133196Q370512
41301A36753021Q689590R207093J0011511J1087579J2299161J3412957J4170616
$$ plain form
41363 27384321 25036174 23613654 23335731 23944667 24908843 25754394 26327382 26770847 27239049
41354 27239049 27676469 27915941 27931074 27890997 27966948 28163577 28349819 28378601 28153986 27670187
41344 27670187 27064556 26597777 26490433 26737170 27101534 27326879 27377699 27487871 27959660
41335 27959660 28881497 30022674 31008859 31602951 31817753 31803652 31713773 31709240 32010120 32821861
41325 32821861 34188149 35985465 38097061 40527970 43280757 46161579 48825695 51064971
41317 51064971 53000003 54954563 57201393 59891140 63164076 67190204 72049332 77644618
41309 77644618 83794261 90377153 97354720 104696236 112345202 120249313 128382509 136753021
41301 136753021 145442611 154649704 164661215 175748794 188047955 201460912 215631528
41294B15631528J4441535J4347378J4158081J3998154J3701170J3002412J1802438
41287C11082696J0148375Q019246N299146K018712j488694m773995p583568r911836
41279C12810082j1773444j3039676j3574001j3485413j3140524j2864496j2662521
41272B22270007j2300188j1656209j0923959j0424565j0270711j0276891j0178294
41265A46239190r866348r400838q861897q244182p478322o521141n430570m373096
41257H6062796l546943l066402k906028k955871l116183l321452l492677l524668
41249F0132572l360821l061300k753393k511147k319160k153790k032159j932056
41241D0008746j720185j264893o37763j20479M2671j39733m68918p71328r83545
$$ plain form
41294 215631528 230073063 244420441 258578522 272576676 286277846 299280258 311082696
41287 311082696 321231071 329250317 334549463 336568175 335079481 330305486 322721918 312810082
41279 312810082 301036638 287996962 274422961 260937548 247797024 234932528 222270007
41272 222270007 209969819 198313610 187389651 176965086 166694375 156417484 146239190
41265 146239190 136372842 126972004 118110107 109865925 102387603 95866462 90435892 86062796
41257 86062796 82515853 79449451 76543423 73587552 70471369 67149917 63657240 60132572
41249 60132572 56771751 53710451 50957058 48445911 46126751 43972961 41940802 40008746
41241 40008746 38288561 37023668 36385905 36265426 36308097 36168364 35699446 34928118 33944573
41232C3944573j075808j016150q44073o90215o52441o93297p25842p76055r78835
41223B6491857j392157j871183k165289k116183j745451j199048o59827k74875
41215A5067844p2624O8546K90017N47087O04455L11656j68089n04284n56609m75429
41205A5112570m32516l80085j60600K28994N97968P62410O90955M60352J68991
41196A7049039p3838j60266o4345J08105K02219J51583J1006j44489l28751o37910
41186A6112353j131237j716714k164490k258725j956677j401849p83119j96433
41178D503109L43933P82809R75670Q16281M02358M972j73872j80774j98858k86481
41168F989147l08214j31164J94225M84621N80187M04167l8109o01008r77374q86523
$$ plain form
41232 33944573 32868765 31852615 31008542 30318327 29665886 28972589 28246747 27470692 26491857
41223 26491857 25099700 23228517 21063228 18947045 17201594 16002546 15342719 15067844
41215 15067844 14995220 15063766 15353783 15900870 16505325 16816981 16648892 16144608 15587999 15112570
41205 15112570 14680054 14299969 14139369 14368363 14966331 15728741 16419696 16880048 17049039
41196 17049039 16975201 16814935 16750590 16858695 17060914 17212497 17223503 17079014 16750263 16112353
41186 16112353 14981116 13264402 11099912 8841187 6884510 5482661 4699542 4503109
41178 4503109 4847042 5629851 6605521 7421802 7824160 7829132 7655260 7474486 7275628 6989147
41168 6989147 6680933 6549769 6743994 7228615 7808802 8212969 8174860 7573852 6596478 5709955
41158E709955l52636K64697N72253M55916Q9422k95062n79703p39827p50218n78226
41148C796571k59214Q0265L19435M45613N07944M81525K74747p9164l36167k65610
41138D965945P7249M23365O14411P06856P32292N38738M185o93104j173344j205047
41128D991546q58310l53653J07624L73254L66996J76880L5970J22828L98198O76052
41118F037385Q14364P87888O19751L31114k6834l56074n80043p23440q91654j149137
41108D863320j418339j516935j313292q44712k75797K42838O47330R09093R76405
41099B269911Q14764M86576J41970q6791j67262j42420n2981Q7496K44273L27968
41089C923504K55008N2152j34799j78463j18246j44914m27422r63929j589614
$$ plain form
41158 5709955 5357319 5622016 6194269 6650185 6739607 6444545 5864842 5125015 4374797 3796571
41148 3796571 3537357 3617622 3937057 4382670 4890614 5372139 5646886 5567722 5231555 4965945
41138 4965945 5043194 5466559 6080970 6787826 7520118 8058856 8063041 7369937 6196593 4991546
41128 4991546 4133236 3779583 3887207 4260461 4627457 4804337 4840307 4963135 5361333 6037385
41118 6037385 6851749 7639637 8259388 8590502 8563668 8207594 7627551 6904111 6012457 4863320
41108 4863320 3444981 1928046 614754 -229958 -505755 -262917 384413 1293506 2269911
41099 2269911 3084675 3571251 3713221 3626430 3459168 3316748 3263767 3351263 3595536 3923504
41089 3923504 4178512 4230664 4095865 3917402 3799156 3654242 3226820 2262891 673277
41080F73277k090047k296927k125249j583351p71436J38592R36168J418254J467333
41071d233386J134990O38200K27266L3623M2180J81954L97134O27796P74742P33957
41061E58456M75373Q1459k92391n06523n13299l62527j33333J27043L83986N67296
41051C85540O08008N41322N16116O52632R13131J148613J245608J182072R71273
41042H164315O36727K67995L6967Q9676M05396P71090R06908O52151P6453n77206
41032A1430472j079844j361570j483632j514524j477306j379525j212835r29865
41024I91371n13852q7246J53331J62579J11438J50364J99951R1550j55088l49693
41014G54705m07044m36612n16364n28232l16106Q6691M89797P47798Q39242P95091
$$ plain form
41080 673277 -1416770 -3713697 -5838946 -7422297 -8193733 -8055141 -7118973 -5700719 -4233386
41071 -4233386 -3098396 -2460196 -2232930 -2199307 -2157127 -1975173 -1578039 -950243 -175501 558456
41061 558456 1033829 1115288 822897 316374 -196925 -559452 -692785 -565742 -181756 385540
41051 385540 993548 1534870 2050986 2703618 3616749 4765362 6010970 7193042 8164315
41042 8164315 8801042 9069037 9106004 9195680 9601076 10372166 11279074 11931225 12007678 11430472
41032 11430472 10350628 8989058 7505426 5990902 4513596 3134071 1921236 991371
41024 991371 477519 390273 543604 706183 817621 967985 1167936 1259486 1104398 754705
41014 754705 347661 -88951 -605315 -1133547 -1449653 -1362962 -873165 -125367 713875 1508966
41004A508966O59130N11072M29304M00166L18881J04559k13928n24868p12219
40995B481063p22062o08960n22288n88459p78398r25274q93311p00245m62765
40986c720699k65309j11924L1192J93631L84871N70398O57735N49622K44531j21990
40976a587942l58293l53832j48413J17023L06351L58171K88362J59511M9671J8497
40966a150894P0977J48004J64652P1253j07378k76679l22403j92192M2271K12645
40956a339744J72509r5106m81529q49122j116764j269357j310433j212606r16618
40947h418770m00669K31206P52573R52115P88586M04501o679l28304n26497n75899
40937g127837m25810n8477M29147Q37552J003187R39443Q13415P65777P79098
$$ plain form
41004 1508966 2168096 2679168 3108472 3508638 3827519 3932078 3718150 3193282 2481063
40995 2481063 1759001 1150041 627753 39294 -739104 -1664378 -2557689 -3257934 -3720699
40986 -3720699 -3986008 -4097932 -4066740 -3873109 -3488238 -2917840 -2260105 -1710483 -1465952 -1587942
40976 -1587942 -1946235 -2300067 -2448480 -2331457 -2025106 -1666935 -1378573 -1219062 -1169391 -1150894
40966 -1150894 -1079917 -931913 -767261 -696008 -803386 -1080065 -1402468 -1594660 -1552389 -1339744
40956 -1339744 -1167235 -1262341 -1743870 -2592992 -3709756 -4979113 -6289546 -7502152 -8418770
40947 -8418770 -8819439 -8588233 -7835660 -6883545 -6094959 -5690458 -5697137 -6025441 -6551938 -7127837
40937 -7127837 -7553647 -7612124 -7182977 -6345425 -5342238 -4402795 -3589380 -2823603 -2044505
40928b044505P41594O02086M19804K85119K36269K37316J94718K0401k59937m78999
40918d6134m90983l73471l83896o73296j097528j347682j217699p15465J2734
40909f333420P81692J412691J764133J770768J480931J076330Q15226Q54960J093100
40900D716411J258050J198925J007784Q11799N68877J92897k12743m31792m31933
40891H678275m06912m80567n25226l61684k4014K85795M44724N16204O50625R55064
40881I732284J424359J921546K248122K311915K229877K220120K405644K767398
40873B7261265L255541L857785M539718N187393N666350N938958O119418O426921
40865F8253349P080315Q201316R775252J1668228J3664046J5510654J6988238
$$ plain form
40928 -2044505 -1302911 -700825 -281021 4098 240367 477683 672401 692802 432865 -46134
40918 -46134 -537117 -910588 -1294484 -1967780 -3065308 -4412990 -5630689 -6346154 -6333420
40909 -6333420 -5551728 -4139037 -2374904 -604136 876795 1953125 2768351 3623311 4716411
40900 4716411 5974461 7173386 8181170 8992969 9561846 9754743 9542000 9110208 8678275
40891 8678275 8271363 7790796 7265570 6903886 6879872 7165667 7610391 8126595 8777220 9732284
40881 9732284 11156643 13078189 15326311 17638226 19868103 22088223 24493867 27261265
40873 27261265 30516806 34374591 38914309 44101702 49768052 55707010 61826428 68253349
40865 68253349 75333664 83534980 93310232 104978460 118642506 134153160 151141398
40858A51141398J7957060J8316102J7913512J6544829J4065536J0489727O011935
40851B52440099J034382l807868p802340j0509245j1972050j2527031j2446839
40844A94409108j1838659j0801260r498076q044439o460313m800398l237427j951150
40836A37777386j004116l80339p2143o2240k90846p35858j490107k655935m145139
40827A26940663n644659o812072p493668p756417p731925p443751o804199n801387
40819G1452585m658821l728321l197496k966378k836804k725266k616034k415577
40811D6307888k027397j562010j297479j349736j495195j433638j169166j003810
40803C4969457j148935j452032j565968j328037q99476n53959m09142l88517l77628
$$ plain form
40858 151141398 169098458 187414560 205328072 221872901 235938437 246428164 252440099
40851 252440099 253474481 249666613 241864273 231355028 219382978 206855947 194409108
40844 194409108 182570449 171769189 162271113 154226674 147766361 142965963 139728536 137777386
40836 137777386 136773270 136392931 136320788 136258548 135967702 135231844 133741737 131085802 126940663
40827 126940663 121296004 114483932 106990264 99233847 91501922 84058171 77253972 71452585
40819 71452585 66793764 63065443 59867947 56901569 54064765 51339499 48723465 46307888
40811 46307888 44280491 42718481 41421002 40071266 38576071 37142433 35973267 34969457
40803 34969457 33820522 32368490 30802522 29474485 28575009 28021050 27611908 27223391 26845763
40794B6845763l45001l18586l07118k77773j94009n6697R1837K09301L06867M44679
40784B6399263O55451Q97992J121126J337781J561577J683063J517320J031232
40776C6204805M60404J35347K15490O20577J163978J693776K148856K558093K983143
40767D8184469L415209L733900L790913L499925K820806J739313L62051j011093
40759F6535493k041888k620031k909393l112547l252541l201789k853632k223905
40751D4319767j428203o02176J63465Q14449J256596J339871R96082L82792j97345
40742D7045298n52191p31995r11903j213366j640826k097270k423817k503822
40734C4970108k377197k192950k020363j789789j462290j153733j001204r84202
$$ plain form
40794 26845763 26500762 26182176 25875058 25597285 25403276 25346579 25438416 25647717 25954584 26399263
40784 26399263 27054714 27952706 29073832 30411613 31973190 33656253 35173573 36204805
40776 36204805 36665209 36800556 37016046 37636623 38800601 40494377 42643233 45201326 48184469
40767 48184469 51599678 55333578 59124491 62624416 65445222 67184535 67546586 66535493
40759 66535493 64493605 61873574 58964181 55851634 52599093 49397304 46543672 44319767
40751 44319767 42891564 42289388 42452853 43267302 44523898 45863769 46859851 47242643 47045298
40742 47045298 46493107 45761112 44849209 43635843 41995017 39897747 37473930 34970108
40734 34970108 32592911 30399961 28379598 26589809 25127519 23973786 22972582 21988380
40726B1988380r86725r84784j052709j202179j328619j328455j186759r50322
40718A2967828p04911n83576o87143r46017j136979j094238q58335n83102l59524
40709F014003j85796n2461L0068P8809J44618K58278M06521N61068O91793P47500
40699H694401O71662M72027K61802K02531L85707P49120J093493J198779R69393
40690A4698915M92626m9412n21859q72100j042079r25535m77061J64007P29531
40681A2197033J013943R77108O86131K45470k00223n00392o19305o74341p80703
40672A2344721q91214q56416o07536k07940K29869N71801O39087L10163l04939
40663A1227596q94286j202617j190956r29173m68713R3198N43462O95124N69550
$$ plain form
40726 21988380 21001655 20016871 18964162 17761983 16433364 15104909 13918150 12967828
40718 12967828 12262917 11679341 10992198 10046181 8909202 7814964 6956629 6373527 6014003
40709 6014003 5828207 5775746 5805814 5884623 6029241 6287519 6694040 7255108 7946901 8694401
40699 8694401 9366063 9838090 10099892 10302423 10688130 11437250 12530743 13729522 14698915
40690 14698915 15191541 15142129 14620270 13748170 12706091 11780556 11303495 11467502 12197033
40681 12197033 13210976 14188084 14874215 15119685 14919462 14419070 13799765 13125424 12344721
40672 12344721 11453507 10597091 9989555 9781615 10011484 10583285 11222372 11532535 11227596
40663 11227596 10333310 9130693 7939737 7010564 6541851 6635049 7178511 7873635 8443185
40654H443185L41312J43426K5911N2649K83389O37910R03980R39683P97728O15198
40644A3184371M53478K86100P1637k17163n76607r17961j077183r64493o94535
40635I547644m89605m37960m15371k82132r5064m3549j87984l50025l02833j4512
40625F928609L45408N88962O28781M61099J42287k10627m94392p18828r44432
40616F726867j106019j024880o63592k53494o2031j08753k09532k21289j24369
40607B952908O1276K86931M38063M37363L69317L61747L70824K60083Q8987J03909
40597E731408L68881O04929N28568J99865j19948l45075o20885j048520j507948
40588C791275j755799j605149j040429k67289L62589N89409M41461J54439p3059
$$ plain form
40654 8443185 8784497 8927923 8953834 9006483 9289872 9927782 10831762 11771445 12569173 13184371
40644 13184371 13637849 13923949 13995586 13778423 13201816 12283855 11206672 10242179 9547644
40635 9547644 9058039 8620079 8204708 7922576 7827512 7783963 7595979 7245954 6943121 6928609
40625 6928609 7274017 7862979 8491760 8952859 9095146 8884519 8390127 7671299 6726867
40616 6726867 5620848 4595968 3932376 3678882 3616851 3508098 3298566 3077277 2952908
40607 2952908 3014184 3301115 3739178 4176541 4545858 4907605 5278429 5538512 5627499 5731408
40597 5731408 6100289 6705218 7233786 7433651 7313703 6968628 6347743 5299223 3791275
40588 3791275 2035476 430327 -610102 -877391 -514802 74607 516068 670507 597448
40579E97448j78442j51817K307J99302K86338J82538m0927k39052k93133j32149
40569B32413K40611O81381R48429R16674P37009O94580Q84337J085997J000118
40560G421549N68515J1436m15045o02940n30444j64023M40295R97673J138871
40551H865887P52012P7349n77538j098563j481943j638772j439758r02530k02211
40542B353933M81721J028169J331081J334663J113089P97201M14833q5728o52797
40533H116165j106380j332182j377247j297394j028712n05702J63670P32657J002591
40524C367466R43089O86032M43354L63530M05258L91794K25805o542j73590k47189
40514F399007k46234j22214J87661O31566J055613J317124J330196J080373P03614
$$ plain form
40579 597448 419006 267189 269496 468798 755136 937674 896747 657695 364562 232413
40569 232413 473024 1154405 2102834 3019508 3756517 4451097 5335434 6421431 7421549
40560 7421549 7990064 8001500 7586455 6983515 6453071 6289048 6729343 7727016 8865887
40551 8865887 9617899 9695248 9117710 8019147 6537204 4898432 3458674 2556144 2353933
40542 2353933 2835654 3863823 5194904 6529567 7642656 8439857 8854690 8768962 8116165
40533 8116165 7009785 5677603 4300356 3002962 1974250 1468548 1632218 2364875 3367466
40524 3367466 4310555 4996587 5439941 5803471 6208729 6600523 6826328 6819786 6646196 6399007
40514 6399007 6152773 6030559 6218220 6849786 7905399 9222523 10552719 11633092 12336706
40505A2336706M74326N42776O89500N06361j33084r09544j400968j454989j172870
40496I478214p04493k12657Q1412M3347j68333k05737R2857N22552P50401O44363
40486A0321926L09164j07559n25869q78768j070801j041525q15493m49582K3497
40477E764990N43830R48011J038495P79126L80179J24867J09186J95648K21163
40468A0105495J84286J92518K86950L97142M47702M23207L17542J06577j83430
40459A2277989m52193o40185q18322j078450j358807j473242j324236j009837
40451D122717p05186n18087m83742n97019p65564p91654n07453O0266P00016J172788
40441A687082J332098J153715P46460L25732Q0166K6228L5230P836l3173k7145
$$ plain form
40505 12336706 12811032 13353808 14043308 14549669 14416585 13507041 12106073 10651084 9478214
40496 9478214 8773721 8561064 8642476 8685823 8517490 8311753 8404610 8927162 9677563 10321926
40486 10321926 10631090 10523531 9997662 9118894 8048093 7006568 6191075 5741493 5764990
40477 5764990 6308820 7256831 8295326 9074452 9454631 9579498 9688684 9884332 10105495
40468 10105495 10289781 10482299 10769249 11166391 11614093 12037300 12354842 12461419 12277989
40459 12277989 11825796 11185611 10367289 9288839 7930032 6456790 5132554 4122717
40451 4122717 3417531 2899444 2415702 1818683 1053119 261465 -245988 -185722 514294 1687082
40441 1687082 3019180 4172895 4919355 5245087 5325253 5351481 5386711 5394547 5361374 5334229
40431E334229K0370N3621M1059J727j1058O6940K68941N57919Q52898J092113
40421H278759J227929J172963Q41508K84896k85483o72040q48579r03077q83537
40412H213339p76418o02899m46046l72801l86882m66340n92769p20871p59837
40403C088476o27618l30183K6762L24084N38698P48012J000282J212552J261466
40394G242531J157039J023111Q78451N51486j00829r58755j709897k100353k043536
40385C939248j567822q02190Q157O14580R26828R89673Q25323M23243j14950n69535
40375D672555p94781q05882o34228k36752L54415R04292J133485R70040N64454
40366F127598J16349k14587k91744n9693L42542O23987N61342J63483l68995p96562
$$ plain form
40431 5334229 5354599 5408220 5449279 5451006 5439948 5506888 5775829 6333748 7186646 8278759
40421 8278759 9506688 10679651 11521159 11806055 11520572 10848532 9999953 9096876 8213339
40412 8213339 7436921 6834022 6387976 6015175 5628293 5161953 4569184 3848313 3088476
40403 3088476 2460858 2130675 2157437 2481521 3020219 3768231 4768513 5981065 7242531
40394 7242531 8399570 9422681 10301132 10852618 10751789 9793034 8083137 5982784 3939248
40385 3939248 2371426 1569236 1577393 2191973 3118801 4108474 4933797 5357040 5242090 4672555
40375 4672555 3877774 3071892 2437664 2200912 2555327 3459619 4593104 5563144 6127598
40366 6127598 6243947 6029360 5737616 5677923 6020465 6644452 7205794 7369277 7000282 6203720
40356F203720r62577q41821n18574j09610K99575O46983Q66234R16899Q31969
40347G332798O90706N45300M04693K74038J63093O2050l9534j02775n6292J13032
40337I387109L09644L86923K51343p5012m61840p38931p93165o25180l17569L9326
40327G362648L77111O25052P01255N62294K70271j1051j40421j56746k68736o07203
40317H714474j002164j114253q20600l71534j10117j30490k81294l98023m18879
40308D067120l58133l02784l70973n25422m93772p2450N10607P65639N26819J60936
40298C907587R5110L26922N46055N79105N13853M65791M21675L06702O6265l11668
40288F917397p35533r83898q68644m47761R679K76868L19794K26486R5953o231
$$ plain form
40356 6203720 5241143 4399322 3880748 3771138 4070713 4717696 5583930 6500829 7332798
40347 7332798 8023504 8568804 8973497 9247535 9410628 9472678 9433144 9330369 9274077 9387109
40337 9387109 9696753 10083676 10335019 10260007 9798167 9059236 8266071 7640891 7323322 7362648
40327 7362648 7739759 8364811 9066066 9628360 9898631 9887580 9747159 9590413 9321677 8714474
40317 8714474 7712310 6598057 5777457 5405923 5295806 5165316 4884022 4485999 4067120
40308 4067120 3708987 3406203 3035230 2509808 2016036 1943586 2454193 3219832 3746651 3907587
40298 3907587 4002697 4329619 4875674 5454779 5968632 6434423 6856098 7162800 7229065 6917397
40288 6917397 6181864 5197966 4329322 3881561 3891240 4168108 4487902 4714388 4810341 4804110
40278D804110q8117k34995m76475o56464n61860k01403J74801L76686M62257N62494
40268D161034O68314P13946P46403Q32181Q55403O10885J17917l36667n43057
40259G826359o14837p78654j022060j107684r04528n39517j81542J73744N87159
40250C438440R37802R76760O40854J79645j04139j58366j49981k09106l24252
40241E227657m56067o06810p38533p41719n64312k97393n3846J73169M33052O48970
40231C024168O60356M43985J71103j945r7302k07129l28876m20320n34628p34113
40221A975299q90912p67315l59008J1245O8461p4044j13751o850l65k29592n11616
40210h98448o12374n26229l67570j45848J74481M84940N97814M78448K57425K1290
$$ plain form
40278 4804110 4715993 4480998 4004523 3348059 2786199 2584796 2759597 3136283 3598540 4161034
40268 4161034 4829348 5543294 6289697 7121878 7977281 8588166 8706083 8369416 7826359
40259 7826359 7211522 6432868 5410808 4303124 3398596 2859079 2677537 2851281 3438440
40250 3438440 4376242 5353002 5993856 6173501 6069362 5910996 5761015 5551909 5227657
40241 5227657 4771590 4164780 3426247 2684528 2120216 1822823 1768977 1942146 2375198 3024168
40231 3024168 3684524 4128509 4299612 4297667 4200365 3993236 3664360 3244040 2709412 1975299
40221 1975299 1084387 317072 -41936 -30691 37770 -36274 -150025 -156875 -157240 -386832 -898448
40210 -898448 -1510822 -2037051 -2404621 -2550469 -2375988 -1891048 -1293234 -814786 -557361 -536071
40200e36071k52231n34432o85008o30353m95465m67432n77101o71969n68983k13108
40190e632153K55060N65782N31676K41424j3871m1894Q7961K04777K45606K24911
40180c330721J08840j18559k92078j36892M29462J148279J628499J659231J297359
40171B393420P38353J91089j66570k49747j58093j41474l69752p23827q91831
40162F21568p09104l38379o3520K0341K0809K7973M8757J63416N44581J189432
40152A525874J747520J783072J198479L00274n24667j086823j370435j389481
40144B183813j153539p20076k11335K24194M74869N37113N35797O26058Q42578
40135C339472J061577J119029R49761O24487K91751P6148k2807j42227m11569
$$ plain form
40200 -536071 -788302 -1322734 -2007742 -2638095 -3133560 -3600992 -4178093 -4850062 -5419045 -5632153
40190 -5632153 -5377093 -4811311 -4279635 -4038211 -4052082 -4093976 -4006015 -3801238 -3555632 -3330721
40180 -3330721 -3221881 -3340440 -3632518 -3769410 -3339948 -2191669 -563170 1096061 2393420
40171 2393420 3131773 3322862 3156292 2906545 2748452 2606978 2237226 1513399 621568
40162 621568 -87536 -425915 -489435 -469094 -448285 -420312 -371555 -208139 336442 1525874
40152 1525874 3273394 5056466 6254945 6555219 6030552 4943729 3573294 2183813
40144 2183813 1030274 310198 98863 323057 797926 1335039 1870836 2496894 3339472
40135 3339472 4401049 5520078 6469839 7094326 7386077 7462225 7439418 7297191 6885622
40126F885622p74204j005582r44910o65436l73162j79285l4258J39388L31858
40117C380031M77966N28934M41027J43839l91804j040550j541146j678013j437093
40108a116809r78279m96880j32869N5463J20279K15245M72762Q68535J255200
40099B62647J515244J597157J414306Q59175L309q21652j264841j245206r33158
40090A386981n20585j20932J66507K61118J97880J11184R1574J29685J90075K34012
40080B127499J72660o4239l76360n47993n29807n44268q06968j236970j562335
40071c368781j642174j550499j385428j151370q46207n29005k35772R0769N17385
40062a0101082J003612J417116J642801J642463J428194J022322M61453j65082
$$ plain form
40126 6885622 6111418 5105836 4160926 3495490 3122328 2943043 2908785 3048173 3380031
40117 3380031 3857997 4386931 4827958 4971797 4579993 3539443 1998297 320284 -1116809
40108 -1116809 -2095088 -2591968 -2724837 -2669374 -2549095 -2333850 -1861088 -992553 262647
40099 262647 1777891 3375048 4789354 5648529 5651838 4830186 3565345 2320139 1386981
40090 1386981 866396 745464 911971 1173089 1370969 1482153 1573727 1703412 1893487 2127499
40080 2127499 2300159 2235920 1859560 1311567 781760 237492 -569476 -1806446 -3368781
40071 -3368781 -5010955 -6561454 -7946882 -9098252 -9944459 -10473464 -10709236 -10618467 -10101082
40062 -10101082 -9097470 -7680354 -6037553 -4395090 -2966896 -1944574 -1483121 -1648203
40054a648203o93782r34134p75863k67456M11179J045710J457453J524373J208575
40045A327852O02773p1687n60877p15607n66998k83823m9307M1106r160j43811
40035d29539k78214l07449j67605P7057K60405K81803K22000K41788L81779N15987
40025G98012M98229L02968K2228k16585l10192k14130K9901L08905N05422N57006
40015B281764M69215L04623J51561N1741n1652k38687m67628n78926m96908l58975
40005A066128l59705n18463p10708q86149j085201j212991j003248l66703L43077
39996d733963O19085L39940j49033m84337o03456n58218k59038L67211J078001
39987d383808J445761J330600J038345R29239J008355J006080P54482L36234j01639
$$ plain form
40054 -1648203 -2341985 -3276119 -4051982 -4319438 -3908259 -2862549 -1405096 119277 1327852
40045 1327852 1930625 1858938 1298061 582454 15456 -268367 -317674 -276568 -285728 -429539
40035 -429539 -707753 -1015202 -1182807 -1105750 -845345 -563542 -341542 -99754 282025 798012
40025 798012 1296241 1599209 1621437 1404852 1094660 880530 910431 1219336 1724758 2281764
40015 2281764 2750979 3055602 3207163 3258904 3207252 2968565 2500937 1922011 1425103 1066128
40005 1066128 706423 187960 -522748 -1408897 -2494098 -3707089 -4710337 -5077040 -4733963
39996 -4733963 -4114878 -3774938 -3923971 -4408308 -5011764 -5569982 -5829020 -5461809 -4383808
39987 -4383808 -2938047 -1607447 -569102 360137 1368492 2374572 3129054 3465288 3363649
39978C363649n25646r54044j309583j428343j217895p67450k95229p156O828j95120
39968c329989m25165m61168k28992Q3580J87636L6091o7535J94367P49324J191080
39958b070771J238669J008259P83785O44640M33576L7091m24104p04829o77146
39949B69170m39913k09306j10021p2766N7532L24188N92825O65564M21848j22856
39939A376265q07165j361564j560979j406512j100996q03991m85678p6293L40277
39930e886636N99425O68939O56352O10528M45844J10618k55747m03247j89943
39921c643867K97133Q09647J117577J160601J049876R21897Q07501O59578M66493
39912C646436K74735J10138n4461k31195l59447l44488j44947J77509M86085O66428
$$ plain form
39978 3363649 2838003 1883959 574376 -853967 -2071862 -2839312 -3134541 -3141697 -3134869 -3329989
39968 -3329989 -3755154 -4216322 -4445314 -4361734 -4174098 -4138007 -4205542 -4011175 -3261851 -2070771
39958 -2070771 -832102 176157 959942 1604582 2038158 2075249 1651145 946316 269170
39949 269170 -170743 -380049 -490070 -562836 -505304 -181116 411709 1077273 1499121 1376265
39939 1376265 569100 -792464 -2353443 -3759955 -4860951 -5664942 -6150620 -6226913 -5886636
39930 -5886636 -5287211 -4618272 -3961920 -3351392 -2905548 -2794930 -3050677 -3453924 -3643867
39921 -3643867 -3346734 -2537087 -1419510 -258909 790967 1712864 2520365 3179943 3646436
39912 3646436 3921171 4031309 3976848 3745653 3386206 3041718 2896771 3074280 3560365 4226793
39902D226793P21160P52682Q39421R64876J080615J160285J132988Q55752K84472
39893A2019044l61982p56206q04951p21702p28144q04242p93028o39132m24075
39884E985582k35181j05405n5400j07104k52400m53081o60998q14125q56332q04520
39874A641036p43065o81634m68072M0135P04928J120084R80827M16492j04640
39865B906091k05703R1467M69384O48228N66974K95850r2128n02317p76952q13287
39855B587607p13923o94187q02267q30504n64873m8742M66745P74145Q40788P42778
39845A757567N60434L27217J8935l91667q19223j045789r09405n12747j61827
39836a176505p6260k16191l95127m74423m07869j84179J71679N52354Q08815Q74150
$$ plain form
39902 4226793 4947953 5700635 6540056 7504932 8585547 9745832 10878820 11734572 12019044
39893 12019044 11657062 10900856 10095905 9374203 8646059 7841817 7048789 6409657 5985582
39884 5985582 5750401 5644996 5589596 5482492 5230092 4777011 4116013 3301888 2445556 1641036
39874 1641036 897971 216337 -251735 -211600 493328 1613412 2594239 3010731 2906091
39865 2906091 2700388 2791855 3261239 3909467 4476441 4772291 4680163 4177846 3400894 2587607
39855 2587607 1873684 1179497 377230 -453274 -1018147 -1066889 -600144 174001 1014789 1757567
39845 1757567 2318001 2645218 2664153 2272486 1453263 407474 -501931 -1014678 -1176505
39836 -1176505 -1252765 -1468956 -1864083 -2338506 -2746375 -2930554 -2758875 -2206521 -1397706 -523556
39826e23556Q11128P04547N32172J94677l17036q35691j146943j186473j060246
39817b827421q84686o83678m64107l07013l03417m26076n30355m81773k53282
39808g161808P2567L49588M51093L86382L34212M91368Q70640J290905J556594
39799a358459J579522J336030Q30913J85522l13857l79896L6083P05492J312405
39790C933755J638548J590877J158068M15825m53708j215831j681353j755118
39782C631063j437598q54053k81367l9609k54841p36156j149478j309529j250223
39773c681791j045169o89975k10378K31526M58354M62200L65507K25850J955k70884
39763d152805l97100j99283K68365P56983J058165J150480J116009R69092O24549
$$ plain form
39826 -523556 287572 992119 1524291 1718968 1401932 566241 -580702 -1767175 -2827421
39817 -2827421 -3712107 -4395785 -4859892 -5166905 -5470322 -5896398 -6426753 -6908526 -7161808
39808 -7161808 -7089241 -6739653 -6288560 -5902178 -5567966 -5076598 -4205958 -2915053 -1358459
39799 -1358459 221063 1557093 2388006 2573528 2259671 1879775 1915858 2621350 3933755
39790 3933755 5572303 7163180 8321248 8737073 8283365 7067534 5386181 3631063
39782 3631063 2193465 1339412 1058045 1018436 763595 27439 -1122039 -2431568 -3681791
39773 -3681791 -4726960 -5416935 -5627313 -5395787 -4937433 -4475233 -4109726 -3883876 -3881921 -4152805
39763 -4152805 -4549905 -4749188 -4480823 -3723840 -2665675 -1515195 -399186 569906 1194455
39754A194455N8581n29712p97199n57965J4532N34651P38944O37779L93470J62973
39744A850509N5660R7731J50521m0227n84609j251454j626394j488244r83697
39735c820204m36163m7393J94134L77275N17897N61008M95524M12540M19778N20156
39725h05448O15637O23362N45547M36373L64986M09118N86036P44102O23166J30017
39715D272896m82318q04550o37658j22671M44175Q32396R51141Q41504O36812
39706E931727M45569K38114q1067m69485p14559o70550m57662l41793m40959o08143
39696B831192n88888k57437K76378P49902R48051Q50925N85177K57719r7091m23545
39686E132383o36582p79308j060502j584396k101454k200316j766607j121739
$$ plain form
39754 1194455 1253036 723324 -73875 -631840 -617308 -82657 656287 1294066 1687536 1850509
39744 1850509 1906169 2003900 2154421 2114194 1529585 278131 -1348263 -2836507 -3820204
39735 -3820204 -4256367 -4303760 -4109626 -3732351 -3214454 -2653446 -2157922 -1745382 -1325604 -805448
39725 -805448 -189811 433551 979098 1415471 1780457 2189575 2775611 3519713 4142879 4272896
39715 4272896 3790578 2986028 2348370 2225699 2669874 3502270 4453411 5294915 5931727
39706 5931727 6377296 6615410 6534343 6064858 5350299 4679749 4222087 3880294 3439335 2831192
39696 2831192 2242304 1984867 2261245 3011147 3959198 4810123 5395300 5653019 5555928 5132383
39686 5132383 4495801 3716493 2655991 1071595 -1029859 -3230175 -4996782 -6118521
39678f118521o76428n63792o49234p56883p70041n88313j33501N64090J323509
39669h369114J872220J975655J592105R43112L68848N6719n2595q0803m4354N6384
39659a681823J02361k9623k63184l94957l66791l13010l25141l41116l20729l46631
39649d280644m27843l58694L4783N80887Q92265Q07335N37273L53247K92287K43023
39639a326081J81328J93556L27389N30507P21246Q44421Q65965P73776N88894
39630C701001L43852N9119k36927m92773o69243p57900p35926n65799l08863j75105
39620A61436l28961o46026p97126o27768l45457k48072l53924m14791k47027Q1345
39610c766371L93690O11087P67692R05436J020611J077630J034448Q88210P22055
$$ plain form
39678 -6118521 -6794949 -7358741 -8007975 -8764858 -9534899 -10123212 -10256713 -9692623 -8369114
39669 -8369114 -6496894 -4521239 -2929134 -1986022 -1617174 -1560455 -1613050 -1693853 -1738207 -1681823
39659 -1681823 -1579462 -1609085 -1872269 -2267226 -2634017 -2947027 -3272168 -3613284 -3934013 -4280644
39649 -4280644 -4708487 -5067181 -5032398 -4451511 -3559246 -2751911 -2214638 -1861391 -1569104 -1326081
39639 -1326081 -1144753 -951197 -623808 -93301 627945 1472366 2338331 3112107 3701001
39630 3701001 4044853 4103972 3867045 3374272 2705029 1947129 1211203 645404 336541 161436
39620 161436 -167525 -813551 -1610677 -2238445 -2583902 -2831974 -3185898 -3600689 -3847716 -3766371
39610 -3766371 -3372681 -2761594 -1993902 -1088466 -67855 1009775 2044223 2932433 3654488
39601C654488O53727O91702O90064N07159J73607j62366m20638o28322p84480
39592D374941q00567o27813l70882k07463k24484l70981n27766n74274m36929
39583B33782j59356Q0351J03303q7031k95579l28556j63175P6876K49299K53110
39573c6976K0231m47779j001518j365783j323097r09087m11398j50922k45992
39564e872321n65136q67959r66131p84579l54937J94567O79152R66129J070151
39555f501064J107095J138078J095721Q90456N52818K22020J1034n7973J6277
39546a525538K65470O67706J054477J201794J048510P65477N59166M44069K68577
39537D749708n4325m17295o34244o23663m45262k11477k2884M2498l3865j49709
$$ plain form
39601 3654488 4308215 4999917 5689981 6197140 6370747 6208381 5787743 5159421 4374941
39592 4374941 3574374 2946561 2575679 2368216 2143732 1772751 1244985 670711 233782
39583 233782 74426 154777 258080 171049 -124530 -453086 -616261 -539385 -290086 -36976
39573 -36976 -16745 -464524 -1466042 -2831825 -4154922 -5064009 -5475407 -5626329 -5872321
39564 -5872321 -6437457 -7305416 -8271547 -9056126 -9411063 -9216496 -8537344 -7571215 -6501064
39555 -6501064 -5393969 -4255891 -3160170 -2269714 -1716896 -1494876 -1483842 -1541815 -1525538
39546 -1525538 -1260068 -592362 462115 1663909 2712419 3477896 4037062 4481131 4749708
39537 4749708 4695383 4278088 3643844 3020181 2574919 2363442 2340558 2383056 2349191 2199482
39527B199482j08537K20492P36328J114339J029066M23242m22642j105641j406120
39518B680009j391331j252015j096351r14205o67773l47716K8939M02062O54622
39509a903759O89233N44202L83910L39324L82172L78999K49419M9617r0907j00251
39499I21959k5700M6364J25968L20740O55986R43287R26818N68365J01329k24325
39489D360791l69415m44409n25327o24507p75828j012464j248426j287867j011119
39480b938571n15588m4497J97818J57662p8128l51954n16007m98906l24251p2647
39470d985069J66630L13638L08795J57146k5722n6005J68718N44338Q19787Q12472
39460a775272N54808K26784l456m0900J53866N34358R39542J204472J305583J292638
$$ plain form
39527 2199482 2090945 2311437 3047765 4162104 5191170 5614412 5191770 4086129 2680009
39518 2680009 1288678 36663 -1059688 -1973893 -2641666 -2989382 -2960443 -2558381 -1903759
39509 -1903759 -1214526 -670324 -286414 52910 435082 814081 1063500 1113117 1022210 921959
39499 921959 896259 942623 1068591 1389331 2045317 2988604 3915422 4483787 4585116 4360791
39489 4360791 3991376 3546967 3021640 2397133 1621305 608841 -639585 -1927452 -2938571
39480 -2938571 -3454159 -3498656 -3300838 -3143176 -3221304 -3573258 -4089265 -4588171 -4912422 -4985069
39470 -4985069 -4818439 -4504801 -4196006 -4038860 -4064582 -4120587 -3951869 -3407531 -2587744 -1775272
39460 -1775272 -1220464 -993680 -997136 -1038036 -884170 -349812 589730 1794202 3099785 4392423
39450D392423J084563N07420l84754j191387j525491j400609j106732p92410l80650
39441g97627J30070N28585O41291N50565M56603M38424M49677M47397M08638K85904
39431C539527N7791k06887m12867n31857n73986n28246m19007l74761n31765q65533
39421h47591j181750j271719j047662n81353q0006K28273K86453K72121L93554
39412c829680O52543Q92504J027527J082951J027032P45928K59451j78056l14046
39403A366154j72590J862L5354k1479j073J95463N10307P67936Q07905O26331
39393D116170L84544K47485K26224K06824J05767n1002j86966k55828k54747j98290
39383D340181j03547O833R5916J20063P1666J0872R17j4468k05194o56320j211376
$$ plain form
39450 4392423 5476986 5984406 5599652 4408265 2882774 1482165 375433 -416977 -797627
39441 -797627 -667557 -138972 502319 1052884 1509487 1947911 2397588 2844985 3253623 3539527
39431 3539527 3597318 3390431 2977564 2445707 1871721 1343475 924468 549707 17942 -847591
39421 -847591 -2029341 -3301060 -4348722 -4930075 -5010081 -4781808 -4495355 -4223234 -3829680
39412 -3829680 -3177137 -2284633 -1257106 -174155 852877 1598805 1858256 1680200 1366154
39403 1366154 1193564 1195426 1230780 1209301 1208228 1403691 1913998 2681934 3489839 4116170
39393 4116170 4500714 4748199 4974423 5181247 5287014 5236012 5049046 4793218 4538471 4340181
39383 4340181 4236634 4243467 4339383 4459446 4531112 4541984 4542901 4528433 4323239 3666919 2455543
39372B455543j598729j701196j608067j404346j050562n54606j43089q5925l50304
39363f041281n79837m81772j25950K28307M96489P93675J122021J243329R79388
39354b365631N15180K33049K70429L94168L37852J20050n5922j09600j53565k85251
39344a099241m39193m83148l76289j74424P1528L50665O30538Q16178Q00648N48329
39334F45591J23007l51387p47436r67346r52141o88769k30222K85201O62673P59805
39324a461024O12099M31109M24254O03596Q01579Q62486P47819M38893j53234
39315C307577j061471k064018k723316k687688j960387r02020j436M23852M35978
39306g232929M28923P90651J544353K328010K713470K506745J799959Q85056J46295
$$ plain form
39372 2455543 856814 -844382 -2452449 -3856795 -4907357 -5461963 -5605052 -5690977 -6041281
39363 -6041281 -6621118 -7102890 -7228840 -7000533 -6504044 -5710369 -4588348 -3345019 -2365631
39354 -2365631 -1850451 -1617402 -1346973 -952805 -614953 -494903 -550825 -660425 -813990 -1099241
39344 -1099241 -1538434 -2021582 -2397871 -2572295 -2500767 -2150102 -1519564 -703386 97262 645591
39334 645591 768598 417211 -330225 -1297571 -2249712 -2938481 -3168703 -2883502 -2220829 -1461024
39324 -1461024 -848925 -417816 6438 610034 1411613 2274099 3021918 3460811 3307577
39315 3307577 2246106 182088 -2541228 -5228916 -7189303 -8091323 -8092759 -7668907 -7232929
39306 -7232929 -6804006 -6013355 -4469002 -2140992 572478 3079223 4879182 5764238 5910533
39297E910533j32560P368K30044K55230J28520P3549J69968L00644L45783K72702
39287G561781O2665k87906o81190r77681j167269j344401j488154j433346j132096
39278h87597p76954n35342l02423R8852N55266P19963M40993n0828m33028o07271
39268a778369o36143n19654k10377K02574N04276N86748N53741N42083N37011
39259b18110M40106K40957J3419k17671m80440p20140p82763n94685k80293m0309
39249b639929K5776p0562k75831m61810l90996J16183R38056J678839J996711
39240I16437J858508J463855J014391O14517L17881J60406J31309J51768R7403
39231F726475j44280n89002j100655j466633j581617j542372j520478j556927
$$ plain form
39297 5910533 5777973 5785341 6015385 6270615 6399135 6472684 6642652 6943296 7289079 7561781
39287 7561781 7624446 7336540 6655350 5677669 4510400 3165999 1677845 244499 -887597
39278 -887597 -1664551 -2199893 -2502316 -2403464 -1848198 -1128235 -687242 -738070 -1171098 -1778369
39268 -1778369 -2414512 -2934166 -3144543 -2941969 -2437693 -1850945 -1297204 -755121 -218110
39259 -218110 221996 462953 476372 258701 -221739 -941879 -1724642 -2319327 -2599620 -2639929
39249 -2639929 -2614153 -2684715 -2960546 -3422356 -3813352 -3697169 -2759113 -1080274 916437
39240 916437 2774945 4238800 5253191 5867708 6185589 6345995 6477304 6629072 6726475
39231 6726475 6582195 5993193 4892538 3425905 1844288 301916 -1218562 -2775489
39223b775489j532781j343006j036925p38813m59984p2114M92540J075477J418750
39214d972345J449538J336133J236517J118610R17980P49012P83416R61554J012011
39205D592426P81666L85573j2292l95641p79332j047657j063011q68677o55356
39196I37699n59768n86864o81591p74250p88385p04702o03169n67562n80067n86058
39186e494717o11437p05892q02133p59834n52471k93381n7446K08926N54548Q95363
39176g618474J090202J096634R95705Q83593P77540O34040M58932L82187N57012
39167g42629R44525J271782J287268J000010N68130L7537o17094j212166j368534
39158A168829r32710k26794K77652M45783N02546O50871Q37603Q78565O51632
$$ plain form
39223 -2775489 -4308270 -5651276 -6688201 -7427014 -7886998 -7959112 -7466572 -6391095 -4972345
39214 -4972345 -3522807 -2186674 -950157 168453 1086433 1835445 2618861 3580415 4592426
39205 4592426 5374092 5759665 5747373 5351732 4572400 3524743 2461732 1593055 937699
39196 937699 377931 -208933 -890524 -1664774 -2453159 -3157861 -3761030 -4328592 -4908659 -5494717
39186 -5494717 -6106154 -6812046 -7614179 -8374013 -8926484 -9219865 -9277311 -9068385 -8513837 -7618474
39176 -7618474 -6528272 -5431638 -4435933 -3552340 -2774800 -2140760 -1681828 -1299641 -742629
39167 -742629 201896 1473678 2760946 3760956 4329086 4366623 3749529 2537363 1168829
39158 1168829 236119 9325 286977 732760 1235306 1886177 2723780 3602345 4253977
39149D253977J36519n88488j299594j668473j478545q24133n3460N03081P47443
39140b71673P87377P48775O48869M47598J77202l3903q2298n811N0408j7729j71071
39129B277744k71662k20747m7049J43219K81457L53223K93303m1616o83342j356838
39119G27692j619405j279302o10112o7592J69548L02532N91896J038470J400278
39110F54005J434738J069475M07901l24859q47749r65544p50850n48446o80901
39101e52230j108474j447519j365632q97578l30929J28762M78468P71099R98616
39092c325417J131064J150883J018765P14589L55373J64348K48338M81839O80756
39083B620538Q15189R63984J121060J158435R70848N76968P9632m11779q16809
$$ plain form
39149 4253977 4390496 3802008 2502414 833941 -644604 -1468737 -1522197 -1019116 -271673
39140 -271673 515704 1264479 1913348 2360946 2538148 2504245 2421947 2416136 2466544 2448815 2277744
39129 2277744 2006082 1785335 1738286 1881505 2162962 2516185 2809488 2767872 2084530 727692
39119 727692 -891713 -2171015 -2781127 -2848719 -2679171 -2376639 -1784743 -746273 654005
39110 654005 2088743 3158218 3566119 3241260 2393511 1427967 677117 128671 -552230
39101 -552230 -1660704 -3108223 -4473855 -5371433 -5702362 -5573600 -5095132 -4324033 -3325417
39092 -3325417 -2194353 -1043470 -24705 689884 1045257 1209605 1457943 1939782 2620538
39083 2620538 3435727 4399711 5520771 6679206 7650054 8227022 8306654 7894875 7078066
39074G078066j084762j160831r45614l52344N31003J382034J844062J805792J447442
39065A0544848J030293O92778M27146J69730j15624m06747o60387q90217j177440
39056I614380j560443j936856k128998k038558j699976j213972o92635k47524
39048a904582N0503K10357K64659J83360q2700m67086p79963q69498p32278m34760
39038d561988M738N89734J231651J733127J913997J747463J365978R31349N08257
39029E464306Q7528k77871m33449k76159Q9410M07162M63643J94461l29729r20222
39019D469080j311346j321280j005429n74711j67701J99415M85740O09168O35949
39010B018885Q13155J273668J809329K075179J951960J576682J082676M82863
$$ plain form
39074 7078066 5993304 4832473 3886859 3534515 4065518 5447552 7291614 9097406 10544848
39065 10544848 11575141 12267919 12695065 12864795 12749171 12342424 11682037 10791820 9614380
39056 9614380 8053937 6117081 3988083 1949525 249549 -964423 -1657058 -1904582
39048 -1904582 -1854079 -1643722 -1379063 -1195703 -1278403 -1745489 -2525452 -3394950 -4127228 -4561988
39038 -4561988 -4557250 -3967516 -2735865 -1002738 911259 2658722 4024700 4956049 5464306
39029 5464306 5551834 5273963 4840514 4564355 4653765 5060927 5524570 5719031 5389302 4469080
39019 4469080 3157734 1836454 831025 256314 88613 288028 773768 1382936 2018885
39010 2018885 2832040 4105708 5915037 7990216 9942176 11518858 12601534 13084397
39002A3084397j97116q42267j364707j785010k133759k350728k343862k097341
38994c0393j675341j162353o36845j59953K52113O17817R29644J140844J234238
38985E09771J254211J230989J116854Q48561M42967j8444m68753q54808j079654
38976B981694j041487p70602m68802l47443m28630n37956m90985k60193M3454
38967a320950L17638N56030P79128R15533Q19378M48746j105k13385l4353L80987
38957B647647P28345Q32771P46343O15479N25010M75235M39588L99766L56275
38948G766459L37195L66257L89438K73999n7520n10037r03884j186343j480216
38939D995348j879075k246691k285686j804017q91699J34485R18909J241975J118150
$$ plain form
39002 13084397 12887281 12045014 10680307 8895297 6761538 4410810 2066948 -30393
38994 -30393 -1705734 -2868087 -3504932 -3664885 -3412772 -2794955 -1865311 -724467 509771
38985 509771 1763982 2994971 4111825 4960386 5403353 5384909 4916156 4061348 2981694
38976 2981694 1940207 1169605 700803 353360 -75270 -613226 -1104211 -1364404 -1320950
38967 -1320950 -1003312 -447282 331846 1247379 2066757 2515503 2514398 2301013 2266660 2647647
38957 2647647 3375992 4208763 4955106 5570585 6095595 6570830 7010418 7410184 7766459
38948 7766459 8103654 8469911 8859349 9133348 9075828 8565791 7661907 6475564 4995348
38939 4995348 3116273 869582 -1416104 -3220121 -4111820 -3977335 -3058426 -1816451 -698301
38930f98301P77741N03175M07284L57656J48091k51348o42852q05445p17333n49566
38920a470898m67108m83657n06735m59991l20183q0572K42221N56935P24800O89802
38910a575386N52441M61886M44855L95191K40768O1460j889P8828J93984K37915
38900A090053K18614K11435K56368L40484M50692N96445P83704R89632J148365
38891F085792J144299Q62175L03971l54741q75941j120215j064851p25565j85543
38882D069381L00191L91931l2070p21074j274280j466240j308655r04784l71651
38873a317251J60684O26732J086024J567986J868048J668506R17859m1046p88792
38864E748750j169138j258661j142106q51109m48705l2703L33113O04503P03163
$$ plain form
38930 -698301 79440 582615 989899 1347555 1495646 1244298 601446 -203999 -921332 -1470898
38920 -1470898 -1938006 -2421663 -2928398 -3388389 -3708572 -3789144 -3546923 -2989988 -2265188 -1575386
38910 -1575386 -1022945 -561059 -116204 278987 519755 581215 579326 658154 852138 1090053
38900 1090053 1308667 1520102 1776470 2116954 2567646 3164091 3947795 4937427 6085792
38891 6085792 7230091 8092266 8396237 8041496 7165555 6045340 4980489 4254924 4069381
38882 4069381 4369572 4761503 4729433 4008359 2734079 1267839 -40816 -945600 -1317251
38873 -1317251 -1156567 -529835 556189 2124175 3992223 5660729 6578588 6537542 5748750
38864 5748750 4579612 3320951 2178845 1327736 879031 846328 1179441 1783944 2487107
38855B487107N69840K56414j11289m41451o76138p31755n63807k88889j15390
38846C84642j13535j55971j34493j32248k92787n85227q03258p76556m99552o5864
38836c174849M21772Q42771J048371R52730O32283K82383O2894R993Q3767K31865
38826A393980L68793L55011R3315l39504p21905q80244q14582o20999l61974p8618
38816a606727J13308M0710l73003r92457j517661j647862j248187m27993N24128
38807g135744J311799J760689J808890J453215P83827L8133m92139o55434n06713
38798a633477j84976K00376N46377P21385O39156L41756l6146l53932m95241l98986
38788f53708j50993J0201r7883l86459n89499n75198m45055k96235l8782M32048
$$ plain form
38855 2487107 3056947 3313361 3202072 2760621 2084483 1352728 788921 500032 384642
38846 384642 271107 115136 -19357 -151605 -444392 -1029619 -1832877 -2609433 -3108985 -3174849
38836 -3174849 -2753077 -1910306 -861935 90795 723078 1005461 1068355 1078348 1162115 1393980
38826 1393980 1762773 2117784 2211099 1871595 1149690 269446 -545136 -1166135 -1528109 -1606727
38816 -1606727 -1493419 -1452709 -1825712 -2818169 -4335830 -5983692 -7231879 -7659872 -7135744
38807 -7135744 -5823945 -4063256 -2254366 -801151 -17324 20809 -471330 -1126764 -1633477
38798 -1633477 -1818453 -1618077 -1071700 -350315 288841 630597 594451 240519 -254722 -653708
38788 -653708 -804701 -794500 -892383 -1278842 -1868341 -2443539 -2888594 -3184829 -3223611 -2791563
38778b791563R79898J305357J262062R63544N85040K16276n3519q9252J03811
38769B481654K50926N4473m25903p76733o49297q6067N74684R93182R84373N30205
38759C931497k15028r69139j491912j727398j732806j516591j057271m73815l7108
38750e289571P1835m9912j62439j71829j92406l14833m12074k64223J46227N60433
38740f078792P10778O05957M85235N28980P03071Q66249Q97136O79009J15888
38731d86489o92262j365826j509741j082849m01832K22014P32468J205896J631693
38722a746928J905617J950885J753190J339506Q18387L98739K60174L92742O20658
38713G692970P76350P98106O75986L86957p8477o55315j195047j526393j559466
$$ plain form
38778 -2791563 -1811665 -506308 755754 1719298 2304338 2520614 2467095 2377843 2481654
38769 2481654 2732580 2787053 2361150 1584417 935120 849053 1423737 2416919 3401292 3931497
38759 3931497 3716469 2747330 1255418 -471980 -2204786 -3721377 -4778648 -5252463 -5289571
38750 -5289571 -5217736 -5267648 -5430087 -5601916 -5794322 -6109155 -6521229 -6785452 -6639225 -6078792
38740 -6078792 -5368014 -4762057 -4276822 -3747842 -3044771 -2178522 -1281386 -602377 -486489
38731 -486489 -1178751 -2544577 -4054318 -5137167 -5538999 -5316985 -4584517 -3378621 -1746928
38722 -1746928 158689 2109574 3862764 5202270 6020657 6419396 6679570 7072312 7692970
38713 7692970 8469320 9267426 9943412 10330369 10251892 9596577 8401530 6875137 5315671
38704E315671j361309j101328q81396o44800k98163J12907M28341N62628N79432
38695B711983N57875M75132K81426K5967j83510l35283n42430q74338j195288
38686I21534j230457q26744j49825L98985M91305J23352m15308q00412r02108
38677b389678p99787o22545l98062n9295M02917Q22656R56699P31892L47329P5859
38667i32015j001K195j2650k9427l8024j14436k98974m83246n24937m35739l58612
38656c226866l75027m25596m24282l66669k99599k45948j89606r0655J08327M52803
38646e083118R29451J467911J978371K340722K381779J978750J238593M81167
38638G713626n1082m18261q30277j320197j695047j795241j650217j337105q49947
$$ plain form
38704 5315671 3954362 2853034 1971638 1326838 1028675 1141582 1569923 2132551 2711983
38695 2711983 3269858 3744990 4026416 4052383 3868873 3533590 2991160 2116822 921534
38686 921534 -308923 -1135667 -1285492 -886507 -395202 -271850 -687158 -1487570 -2389678
38677 -2389678 -3189465 -3812010 -4210072 -4269367 -3866450 -3043794 -2087095 -1355203 -1007874 -932015
38667 -932015 -933016 -930821 -943471 -972898 -1010922 -1125358 -1424332 -1907578 -2432515 -2868254 -3226866
38656 -3226866 -3601893 -4027489 -4451771 -4818440 -5118039 -5363987 -5553593 -5644248 -5535921 -5083118
38646 -5083118 -4153667 -2685756 -707385 1633337 4015116 5993866 7232459 7713626
38638 7713626 7662544 7244283 6414006 5093809 3398762 1603521 -46696 -1383801 -2233748
38629b233748k33959K73525M38198L52579L75429O78816R95129R24889M13523
38620A984381j91871n13692m64338k29466n5021o4117j87618k43582j41052L992
38610a02384L6156J5171J50383M45479N83156K88795l16412q85472j277047j607280
38600b669455j887195j846443j244434k42340O64606J068580R60927O72645N54463
38591c968646O83595Q48756Q29153O55446N22684M75791L29598m3902m85713p27047
38581h80285p21415o78257q04305j122906j523838j865213k002170j817209j293097
$$ plain form
38629 -2233748 -2467707 -2194182 -1755984 -1403405 -1027976 -349160 645969 1570858 1984381
38620 1984381 1792510 1278818 814480 585014 529993 465876 278258 34676 -106376 -102384
38610 -102384 -66228 -51057 99326 544805 1127961 1416756 1100344 214872 -1062175 -2669455
38600 -2669455 -4556650 -6403093 -7647527 -7889867 -7225261 -6156681 -5195754 -4523109 -3968646
38591 -3968646 -3285051 -2436295 -1607142 -951696 -429012 46779 376377 332475 -153238 -880285
38581 -880285 -1601700 -2279957 -3084262 -4207168 -5731006 -7596219 -9598389 -11415598 -12708695
$$ [...]
##END NTUPLES=NMR SPECTRUM
##END=
