##TITLE=31Pdec_E5a0609
 CDCl3 24 sc
 7.9.2023
##JCAMPDX= 6.0         $$ Bruker NMR JCAMP-DX V2.0
##DATA TYPE= NMR SPECTRUM
##DATA CLASS= NTUPLES
##ORIGIN= UXNMR, Bruker Analytische Messtechnik GmbH
##OWNER= root
$$ XWIN-NMR		Version 3.5
$$ Thu Sep  7 13:45:57 2023 Russian Standard Time (UT+4h)  she@DPX200
##.OBSERVE FREQUENCY= 81.013821
##.OBSERVE NUCLEUS= ^31P
##.ACQUISITION MODE= SIMULTANEOUS
##.ACQUISITION SCHEME= undefined
##.AVERAGES= 24
##.DIGITISER RES= 16
##SPECTROMETER/DATA SYSTEM= spect
##.PULSE SEQUENCE= zgpg30
##.SOLVENT NAME= DMSO
##.SHIFT REFERENCE= (INTERNAL, DMSO, 0, 248.564)
##AUDIT TRAIL= $$ (NUMBER, WHEN, WHO, WHERE, WHAT)
$$ ##TITLE= Audit trail, XWIN-NMR		Version 3.5
$$ ##JCAMPDX= 5.01
$$ ##ORIGIN= Bruker BioSpin GmbH
$$ ##OWNER= she
$$ F:/spectra/data/she/nmr/P31/1/pdata/1/auditp.txt
$$ ##AUDIT TRAIL=  $$ (NUMBER, WHEN, WHO, WHERE, WHAT)
(   1,<2023-09-07 13:45:03.53 +0400>,<she>,<DPX200>,
      <created by zg, POWCHK disabled, PULCHK disabled
       configuration hash MD5:
       00 E9 B6 7A A2 85 ED C7 34 08 36 98 17 FE 4E 26
       data hash MD5: 32K
       B4 D6 30 0B 38 51 A6 C9 EE AD 1E B6 BC 13 BA 64>)
(   2,<2023-09-07 13:45:06.92 +0400>,<she>,<DPX200>,
      <Start of raw data processing
       efp BC_mod = 2 LB = 5 FT_mod = 6 PKNL = 1 PHC0 = -10599.06 PHC1 = -13.31499 SI = 64K 
       data hash MD5: 64K
       7C DD C4 5E B1 32 FE B1 BE 4E E5 99 D7 E7 6F 3E>)
(   3,<2023-09-07 13:45:22.48 +0400>,<she>,<DPX200>,
      <pk PHC0 = -11.60685 PHC1 = 0 
       data hash MD5: 64K
       59 E6 7F 06 6B 7A A1 12 86 6D FB 76 06 F9 12 88>)
(   4,<2023-09-07 13:45:28.06 +0400>,<she>,<DPX200>,
      <abs ABSG = 5 
       data hash MD5: 64K
       52 CF 05 05 9B 82 36 85 45 44 3F 67 27 30 26 9A>)
$$ ##END=
$$ 
$$ hash MD5
$$ 17 39 1E 71 D7 8C 09 DF F9 8A 54 37 9C B6 1D 26
##$RELAX= 
##$RELAX= 
##$RELAX= 
##$RELAX= 
##$RELAX= 
##$RELAX= 
##$RELAX= 
##$RELAX= 
##$RELAX= 
$$ Bruker specific parameters
$$ --------------------------
##$DU= <F:/spectra>
##$EXPNO= 1
##$NAME= <P31>
##$PROCNO= 1
##$TYPE= <nmr>
##$USER= <she>
##$AMP= (0..31)
100 100 100 100 100 100 100 100 100 100 100 100 100 100 100 100 100 100 
100 100 100 100 100 100 100 100 100 100 100 100 100 100 
##$AQSEQ= 0
##$AQ_mod= 1
##$AUNM= <au_zg>
##$AUTOPOS= <>
##$BF1= 81.014009
##$BF2= 200.13
##$BF3= 200.13
##$BF4= 200.13
##$BF5= 200.13
##$BF6= 200.13
##$BF7= 200.13
##$BF8= 200.13
##$BYTORDA= 1
##$CFDGTYP= 0
##$CFRGTYP= 5
##$CHEMSTR= <none>
##$CNST= (0..31)
1 1 145 1 1 1 1 1 1 1 1 1 1 1 1 1 1 1 1 1 1 1 1 1 1 1 1 1 1 1 1 1 
##$CPDPRG= <waltz16>
##$CPDPRG1= <>
##$CPDPRG2= <waltz16>
##$CPDPRG3= <>
##$CPDPRG4= <mlev>
##$CPDPRG5= <mlev>
##$CPDPRG6= <mlev>
##$CPDPRG7= <mlev>
##$CPDPRG8= <mlev>
##$CPDPRGB= <>
##$CPDPRGT= <>
##$D= (0..31)
0 1 0 0 0 0 0 0 0 0 0 0.03 2e-05 3e-06 0 0 0 0 0 0 0 0 0 0 0 0 0 0 0 0 
0 0 
##$DATE= 1694079903
##$DBL= (0..7)
120 120 120 11 120 120 24 19 
##$DBP= (0..7)
150 150 150 150 150 150 150 150 
##$DBP07= 0
##$DBPNAM0= <>
##$DBPNAM1= <>
##$DBPNAM2= <>
$$ [...]
##$SUBNAM3= <"">
##$SUBNAM4= <"">
##$SUBNAM5= <"">
##$SUBNAM6= <"">
##$SUBNAM7= <"">
##$SUBNAM8= <"">
##$SUBNAM9= <"">
##$SW= 501.771253377433
##$SWIBOX= (0..15)
0 1 3 0 0 0 0 0 0 0 0 0 0 0 0 0 
##$SW_h= 40650.406504065
##$TD= 32768
##$TD0= 1
##$TE= 0
##$TE2= 300
##$TE3= 300
##$TEG= 300
##$TL= (0..7)
0 120 53 12 22 120 120 120 
##$TP= (0..7)
150 150 150 150 150 150 150 150 
##$TP07= 0
##$TPNAME0= <>
##$TPNAME1= <>
##$TPNAME2= <>
##$TPNAME3= <>
##$TPNAME4= <>
##$TPNAME5= <>
##$TPNAME6= <>
##$TPNAME7= <>
##$TPOAL= (0..7)
0.5 0.5 0.5 0.5 0.5 0.5 0.5 0.5 
##$TPOFFS= (0..7)
0 0 0 0 0 0 0 0 
##$TUNHIN= 0
##$TUNHOUT= 0
##$TUNXOUT= 0
##$USERA1= <user>
##$USERA2= <user>
##$USERA3= <user>
##$USERA4= <user>
##$USERA5= <user>
##$V9= 5
##$VALIST= <valist>
##$VCLIST= <CCCCCCCCCCCCCCC>
##$VD= 0
##$VDLIST= <DDDDDDDDDDDDDDD>
##$VPLIST= <PPPPPPPPPPPPPPP>
##$VTLIST= <TTTTTTTTTTTTTTT>
##$WBST= 1024
##$WBSW= 4
##$XGAIN= (0..3)
0 0 0 0 
##$XL= 0
##$YL= 0
##$YMAX_a= 3602
##$YMIN_a= -3954
##$ZGOPTNS= <>
##$ZL1= 120
##$ZL2= 120
##$ZL3= 120
##$ZL4= 120
##$ABSF1= 248.5645
##$ABSF2= -253.2056
##$ABSG= 5
##$ABSL= 3
##$ALPHA= 0
##$AQORDER= 0
##$ASSFAC= 0
##$ASSFACI= 0
##$ASSFACX= 0
##$ASSWID= 0
##$AUNMP= <proc_1d>
##$AZFE= 0.1
##$AZFW= 0.5
##$BCFW= 0
##$BC_mod= 2
##$BYTORDP= 0
##$COROFFS= 0
##$CY= -3
##$DATMOD= 1
##$DC= 0
##$DFILT= <>
##$DTYPP= 0
##$F1P= 0
##$F2P= 0
##$FCOR= 1
##$FTSIZE= 65536
##$FT_mod= 6
##$GAMMA= 0
##$GB= 0
##$INTBC= 1
##$INTSCL= 6.047779e-11
##$ISEN= 30
##$LB= 5
##$LEV0= 0
##$LPBIN= 0
##$MAXI= 10000
##$MC2= 0
##$MEAN= 0
##$ME_mod= 0
##$MI= 50
##$NCOEF= 0
##$NC_proc= -9
##$NLEV= 6
##$NOISF1= 182.463
##$NOISF2= 159.3651
##$NSP= 0
##$NTH_PI= 0
##$NZP= 0
##$OFFSET= 248.5645
##$PC= 4
##$PHC0= -10610.67
##$PHC1= -13.31499
##$PH_mod= 1
##$PKNL= yes
##$PPARMOD= 0
##$PSCAL= 0
##$PSIGN= 0
##$REVERSE= no
##$SF= 81.0140089999694
##$SI= 65536
##$SIGF1= 159.3651
##$SIGF2= -187.1042
##$SINO= 113.3802
##$SIOLD= 16384
##$SREGLST= <1H.CDCl3>
##$SSB= 0
##$STSI= 65536
##$STSR= 0
##$SW_p= 40650.406504065
##$SYMM= 0
##$S_DEV= 0
##$TDeff= 32768
##$TDoff= 0
##$TI= <>
##$TILT= no
##$TM1= 0
##$TM2= 0
##$TOPLEV= 0
##$USERP1= <user>
##$USERP2= <user>
##$USERP3= <user>
##$USERP4= <user>
##$USERP5= <user>
##$WDW= 1
##$XDIM= 65536
##$YMAX_p= 376717200
##$YMIN_p= -149957122
$$ End of Bruker specific parameters
$$ ---------------------------------
##NTUPLES= NMR SPECTRUM
##VAR_NAME=  FREQUENCY,     SPECTRUM/REAL,   SPECTRUM/IMAG
##SYMBOL=    X,             R,               I
##VAR_TYPE=  INDEPENDENT,   DEPENDENT,       DEPENDENT
##VAR_FORM=  AFFN,          ASDF,            ASDF
##VAR_DIM=   65536,         65536,           65536
##UNITS=     HZ,            ARBITRARY UNITS, ARBITRARY UNITS
##FACTOR=    0.620285442955139, 1,           1
##FIRST=     20137.2065510682, 0,            0
##LAST=      -20513.1999529968, 0,           0
##MIN=       -20513.1999529968, -149957122,  0
##MAX=       20137.2065510682, 376717200,    0
$$ Real data points
##PAGE= N=1
##DATA TABLE= (X++(R..R)), XYDATA
$$ [...]
42770c244132K58153R54765J529122J748602J584965J232529Q48924M44607N5539
$$ -3244132 -2985979 -2031214 -502092 1246510 2831475 4064004 4912928 5357535 5413074
42761E413074j74573j95396j84413l30889n65227o45150m78042k35434j42976
$$ 5413074 5238501 5043105 4858692 4527803 3962576 3317426 2839384 2603950 2460974
42752B460974k42320l82286m03035l14489k94722m86612p95617r45259p56790
$$ 2460974 2218654 1836368 1433333 1118844 824122 337510 -458107 -1403366 -2160156
42743b160156l24492R6622L00991K15156j06275m78197o63171n65432l19201j17106
$$ -2160156 -2484648 -2388026 -2087035 -1871879 -1978154 -2456351 -3119522 -3684954 -4004155 -4121261
42733d121261j897J04527K42452L89173N28072O17471N36409K06305k42427n57498
$$ -4121261 -4123158 -4018631 -3776179 -3387006 -2858934 -2241463 -1705054 -1498749 -1741176 -2298674
42723b298674o23288n18216l33614r4714J23204J86973J02700P3163K35583M41524
$$ -2298674 -2921962 -3440178 -3773792 -3868506 -3745302 -3558329 -3455629 -3382466 -3146883 -2705359
42713b705359M26812J43865j89169l40125k73836j35823r6354j85135k30344j3013
$$ -2705359 -2278547 -2134682 -2323851 -2663976 -2937812 -3073635 -3169989 -3355124 -3585468 -3598481
42703c598481M59303R05379J082872J067514J091038J168941J079579P17977K70948
$$ -3598481 -3139178 -2233799 -1150927 -83413 1007625 2176566 3256145 3974122 4245070
42694D245070m1032k33077m41030o61183p72908p64122p56941p96859p69134n85452
$$ 4245070 4204038 3970961 3529931 2868748 2095840 1331718 574777 -222082 -991216 -1576668
42684a576668l40369j93673j65471j40664m3619P9346J47025J41024J07206J14187
$$ -1576668 -1917037 -2110710 -2276181 -2416845 -2460464 -2381118 -2234093 -2093069 -1985863 -1871676
42674a871676K15033L87299M91709L58117l1428m71074o85799n57965k08999Q8085
$$ -1871676 -1656643 -1269344 -777635 -419518 -450946 -922020 -1607819 -2165784 -2374783 -2286698
42664b286698O3810l78458j039659j501608j441394r04524k18530L46561P42101
$$ -2286698 -2222888 -2601346 -3641005 -5142613 -6584007 -7488531 -7707061 -7360500 -6618399
42655f618399R80784R82610P02392L24965J66390L48457O66620Q28038P60743
$$ -6618399 -5637615 -4655005 -3952613 -3627648 -3461258 -3112801 -2446181 -1618143 -857400
42646h57400O36353O28984P22317P58024O15449L03763r1241m82390p81218q83164
$$ -857400 -221047 407937 1130254 1888278 2503727 2807490 2716249 2233859 1452641 569477
42636E69477p28779l84325o346K96705N31002P27140Q31008P38210M31333M5576
$$ 569477 -159302 -543627 -549973 -253268 277734 1004874 1835882 2574092 3005425 3051001
42626C051001k14159k16647J9447L63466O71363Q47563Q29378N64431O0729n47776
$$ 3051001 2836842 2620195 2639642 3003108 3674471 4522034 5351412 5915843 5976572 5428796
42616E428796j049135j297897j285817j073415p21643l21567q444J45814K29546
$$ 5428796 4379661 3081764 1795947 722532 889 -320678 -329122 -183308 46238
42607D6238L98483O81430R38519J019614R09296P01962M88674L04483J57827O7371
$$ 46238 444721 1126151 2064670 3084284 3993580 4695542 5184216 5488699 5646526 5713897
42597E713897N1844Q2480O4630q5414l17657m45265l23237j8561K47678L17184
$$ 5713897 5765741 5848221 5912851 5827437 5509780 5064515 4741278 4722717 4970395 5287579
42587E287579K02983J469k24531m65422p42646j088377j474205j734174j654293
$$ 5287579 5490562 5492031 5267500 4802078 4059432 2971055 1496850 -237324 -1891617
42578a891617j213954o73754l33128k38561k19697j72209j68116k64207l40369
$$ -1891617 -3105571 -3779325 -4112453 -4351014 -4570711 -4742920 -4911036 -5175243 -5515612
42569e515612k34317K1275K02532J32790j55052m97464p64739r08642r02964p10760
$$ -5515612 -5749929 -5728654 -5526122 -5393332 -5548384 -6045848 -6810587 -7719229 -8622193 -9332953
42559i332953l19835K25132Q38085J417264J848620K020084J880353J496829J031234
$$ -9332953 -9652788 -9427656 -8589571 -7172307 -5323687 -3303603 -1423250 73579 1104813
42550A104813O32957L53515J65240L9148k6659m6270o5237j16272j87590k63155
$$ 1104813 1737770 2091285 2256525 2295673 2269014 2222744 2157507 2041235 1853645 1590490
42540A590490l54880m39056l92854r4998L79177P45967P63144M50200J3277l83375
$$ 1590490 1235610 796554 403700 308702 687879 1433846 2196990 2647190 2660467 2277092
42530B277092o87437q59536q41074o28954k65677K64746R93750J752072K135112
$$ 2277092 1589655 730119 -110955 -739909 -1005586 -740840 252910 2004982 4140094
42521D140094J842939J023435J56912l90286n98889o18532n31769l78867k95506
$$ 4140094 5983033 7006468 7163380 6773094 6174205 5555673 5023904 4645037 4349531
42512D349531m58628q67456j268618j369838j119508p36847m68519l67153l37020
$$ 4349531 3890903 3023447 1754829 384991 -734517 -1471364 -1939883 -2307036 -2644056
42503b644056l29863l88113m93449m95699k68679J35044N63802R37275J239942
$$ -2644056 -2973919 -3362032 -3855481 -4351180 -4619859 -4484815 -3921013 -2983738 -1743796
42494a743796J399182J309091R86828N97652L00343J49947J52688K95010M75144
$$ -1743796 -344614 964477 1951305 2548957 2849300 2999247 3151935 3446945 3922089
42485C922089N18663L41814L4404k69619n21395o98855p26604n73852l74069l15247
$$ 3922089 4440752 4782566 4816970 4547351 4025956 3327101 2600497 2026645 1652576 1337329
42475A337329m16687n12370m50254k16498J27210N09431Q17700R10630P41486
$$ 1337329 920642 408272 -41982 -258480 -131270 378161 1195861 2106491 2847977
42466B847977M17917P6226k58088o10996q93506r02486n36068M5617N42229P94292
$$ 2847977 3265894 3342120 3084032 2473036 1579530 677044 140976 186593 728822 1523114
42456A523114Q98371J035545J236090J351015J220601Q15058K26266m06065r43587
$$ 1523114 2421485 3457030 4693120 6044135 7264736 8079794 8306060 7899995 6956408
42447F956408j293925j458329j511966j511760j451420j323559j181745j107707
$$ 6956408 5662483 4204154 2692188 1180428 -270992 -1594551 -2776296 -3884003
42439c884003j146756j288332j452681j473495j187701o30749q4749J76182J70897
$$ -3884003 -5030759 -6319091 -7771772 -9245267 -10432968 -11063717 -11148466 -10972284 -10801387
42430a0801387J49940K68593M32360M78110L95302L20611L98273O92256J147150
$$ -10801387 -10651447 -10382854 -9950494 -9472384 -9077082 -8756471 -8358198 -7665942 -6518792
42421f518792J558667J652095J304132O94692J75732k7857K9142J24400P3600
$$ -6518792 -4960125 -3308030 -2003898 -1309206 -1133474 -1161331 -1132189 -1007789 -934189
42412i34189j66271n16096q29615r37215p03994j23845O14216J203627J442285
$$ -934189 -1100460 -1616556 -2446171 -3383386 -4087380 -4211225 -3597009 -2393382 -951097
42403i51097J396385J305706J318361J357571J246424Q94672L40053l07443q83715
$$ -951097 445288 1750994 3069355 4426926 5673350 6568022 6908075 6600632 5716917
42394E716917j189732j113894p64537m08885k30766j73672n1527K09663M77653
$$ 5716917 4527185 3413291 2648754 2239869 2009103 1835431 1783904 1993567 2471220
42385B471220N56137L84121P3871k22443m30768n27005m58605j83512K06775M86334
$$ 2471220 3027357 3411478 3485349 3262906 2832138 2305133 1846528 1663016 1869791 2356125
42375B356125M79463K26432o6619k19649j96211p2177N2416J16388J19298Q9818
$$ 2356125 2835588 3062020 2995401 2775752 2579541 2507364 2559780 2676168 2795466 2885284
42365B885284J7472j56561m31561o44991n57545r5018N10335Q63610P25056K09919
$$ 2885284 2902756 2746195 2314634 1669643 1112098 1017080 1527415 2391025 3116081 3326000
42355C326000l14565n44807m78877l51693l48419m17381l76411j48288J64257
$$ 3326000 3011435 2466628 1987751 1636058 1287639 870258 493847 345559 509816
42346E09816M01941M69182L40503M4096l14211n74548o42292n74410n11603n41167
$$ 509816 911757 1380939 1721442 1765538 1451327 876779 234487 -339923 -851526 -1392693
42336a392693o56918q21339r99475j123978j092554q54563m85273j28726J40786
$$ -1392693 -2049611 -2870950 -3870425 -4994403 -6086957 -6941520 -7426793 -7555519 -7414733
42327g414733L64925N91132P58023P51537N75246L97299L82087N08595O04880
$$ -7414733 -7049808 -6458676 -5700653 -4949116 -4373870 -3976571 -3594484 -3085889 -2481009
42318b481009N46738L79679K60713L26845O00254R50992J150293J041255O94096
$$ -2481009 -1934271 -1554592 -1293879 -967034 -366780 584212 1734505 2775760 3469856
42309C469856L40468J29035N915j40807l14424m60626n94848p47742q19650o44487
$$ 3469856 3810324 3939359 3945274 3804467 3490043 3029417 2434569 1686827 867177 222690
42299B22690k39572J23663J71990j08547n09326q18364r31979q24625n35620j91150
$$ 222690 -16882 106781 278771 170224 -339102 -1157466 -2089445 -2914070 -3449690 -3640840
42289c640840N5778J49824J62305J87273K48691L09549L12550J91367r4283m75434
$$ -3640840 -3585062 -3435238 -3272933 -3085660 -2836969 -2527420 -2214870 -2023503 -2117786 -2593220
42279b593220p48349o93782k53571M04065R86154J251995J136769P51018K82745
$$ -2593220 -3341569 -4035351 -4288922 -3884857 -2898703 -1646708 -509939 241079 523824
42270E23824r3228k30904k2320N08688J120976J474613J409743J058981O33133
$$ 523824 430596 199692 177372 686060 1807036 3281649 4691392 5750373 6383506
42261F383506J73635l82768r58626j323232j359008j208966j086165j031906r49188
$$ 6383506 6557141 6174373 5215747 3892515 2533507 1324541 238376 -793530 -1742718
42252a742718p97187o33265m87819l11001o4599K05634M11981M89325M09221J87423
$$ -1742718 -2539905 -3173170 -3660989 -3971990 -4036589 -3830955 -3418974 -2929649 -2520428 -2333005
42242b333005r7260l33329m55498m77797m49872m14067l98804l93789l12630m3304
$$ -2333005 -2430265 -2763594 -3219092 -3696889 -4146761 -4560828 -4959632 -5353421 -5666051 -5709355
42232e709355M12698Q85551J174590J230648J167345J108104J062556R41780O46928
$$ -5709355 -5296657 -4411106 -3236516 -2005868 -838523 269581 1332137 2273917 2920845
42223B920845J43396m93589j075974j390393j353516j095148q58534p95811q56643
$$ 2920845 3064241 2570652 1494678 104285 -1249231 -2344379 -3202913 -3998724 -4855367
42214d855367q64700o79862k89735K10209O82755J009252J135253J080927Q98459
$$ -4855367 -5720067 -6399929 -6689664 -6479455 -5796700 -4787448 -3652195 -2571268 -1672809
42205a672809O28595L24972R5365L6175R1142M7004k49159o86553r70277r04773
$$ -1672809 -1044214 -719242 -623877 -587702 -496560 -449556 -698715 -1385268 -2355545 -3260318
42195c260318n56961j59089Q4977J08984n724q8641q695K04543L91907M35818
$$ -3260318 -3817279 -3976368 -3891391 -3782407 -3788131 -3876772 -3885467 -3680924 -3289017 -2853199
42185b853199L61701K53857J36867l607j30034j68140j18248r0013j92509m07907
$$ -2853199 -2491498 -2237641 -2100774 -2104381 -2234415 -2402555 -2520803 -2610816 -2803325 -3211232
42175c211232n96498o28491n01260l14011j32099Q1726L69669O60151Q26511Q49287
$$ -3211232 -3807730 -4436221 -4937481 -5251492 -5383591 -5301865 -4932196 -4272045 -3445534 -2596247
42165b596247Q18965P59324N67272K02051j66823l21337k56632j59955j46114
$$ -2596247 -1777282 -1017958 -450686 -248635 -415458 -736795 -993427 -1153382 -1299496
42156a299496j35454p174K42973N41904Q32568J048184J059509P55692J91287
$$ -1299496 -1434950 -1442124 -1199151 -657247 175321 1223505 2283014 3038706 3229993
42147C229993l96268p34874o82525k83422K77657P60640R59781P82189K88846
$$ 3229993 2833725 2098851 1416326 1132904 1410561 2171201 3130982 3913171 4202017
42138D202017l28348q24922r93821p38793j36906N43075R61932R63194P19469
$$ 4202017 3873669 3048747 2054926 1316133 1179227 1722302 2684234 3647428 4366897
42129D366897N49819N77788O51015O02825M52261K69155j4436m91648j043987
$$ 4366897 4916716 5494504 6145519 6748344 7200605 7469760 7455324 6963676 5919689
42120E919689j398338j436004j314374j252976j297219j311148j112512o08111
$$ 5919689 4521351 3085347 1770973 517997 -779222 -2090370 -3202882 -3810993
42112c810993J03405P48490J095069J161426J112788R72695O03741P450n43398
$$ -3810993 -3707588 -2959098 -1864029 -702603 410185 1382880 1986621 1994071 1450673
42103A450673p78272o98488m62825j36538K91077P24020R68149R18977O40834
$$ 1450673 672401 -26087 -488912 -625450 -334373 389647 1357796 2276773 2917607
42094B917607K77711m1153k55900m24264o69157r96267j227641j215118j047439
$$ 2917607 3195318 3154165 2898265 2474001 1804844 808577 -419064 -1634182 -2681621
42085b681621r18492q51608p06637m20576p1553K84383O56288R67925J045334
$$ -2681621 -3600113 -4451721 -5158358 -5578934 -5650487 -5366104 -4709816 -3741891 -2696557
42076b696557Q41852N48552L89297L96592M63563N22978N78234O18596O00850
$$ -2696557 -1854705 -1306153 -916856 -520264 -56701 466277 1044511 1663107 2263957
42067B263957M96654L05713N3787j76136k51443r7651J93357L88078K62916k24848
$$ 2263957 2760611 3066324 3120111 2943975 2692532 2594881 2788238 3176316 3439232 3214384
42057C214384q63419j307372j357199j136682r36915q94288r04549q38131o99635
$$ 3214384 2350965 1043593 -313606 -1450288 -2387203 -3281491 -4186040 -5024171 -5723806
42048e723806n27226k74213R6187M77882P02402P23596O37705N46046M75096M13893
$$ -5723806 -6251032 -6525245 -6429058 -5951176 -5248774 -4525178 -3887473 -3341427 -2866331 -2452438
42038b452438L55987L03163K74342K99174L57568L40998J31338k64492o77113
$$ -2452438 -2096451 -1793288 -1518946 -1219772 -862204 -521206 -389868 -654360 -1331473
42029a331473q81476p57095l77221N3270L72697N68998O90624P11229N83145L90215
$$ -1331473 -2212949 -2970044 -3347265 -3293995 -2921298 -2352300 -1661676 -950447 -367302 22913
42019B2913K85483K38214J0873n00348j029630j198965r49980n80862l84940l77281
$$ 22913 308396 546610 557483 57135 -972495 -2171460 -3121440 -3702302 -4087242 -4464523
42009d464523l67535j90288J50890M93543O64376O60670O52429P56569Q72546
$$ -4464523 -4832058 -5022346 -4871456 -4377913 -3713537 -3052867 -2400438 -1643869 -771323
42000g71323Q19060N62192K00868k05272o47645j040708j236551j179976r35882
$$ -771323 47737 609929 810797 605525 -42120 -1082828 -2319379 -3499355 -4435237
41991d435237n70624j26169L06505O35329Q85188J106478J159594P97889N0628
$$ -4435237 -5005861 -5132030 -4825525 -4190196 -3305008 -2198530 -1038936 -241047 -190419
41982a90419o56280r04252p09711m43697m15823o32984q68779q44244m03511L59682
$$ -190419 -846699 -1750951 -2460662 -2904359 -3320182 -3953166 -4821945 -5666189 -6069700 -5710018
41972e710018J155401J728250J988603J903424J423618O61174Q178j52957J40558
$$ -5710018 -4554617 -2826367 -837764 1065660 2489278 3150452 3158630 3005673 3146231
41963C146231M80093N54895M12726K28250P612l43507p67542j037272r95289p16253
$$ 3146231 3626324 4181219 4593945 4822195 4829807 4486300 3718758 2681486 1686197 969944
41953I69944m04631j85075k6145J56894L68888N18739N10082L15817k0197l94447
$$ 969944 565313 380238 354093 510987 879875 1398614 1908696 2224513 2204316 1809869
41943A809869o40195n84059j77488M38257J028681J399915J423065J025434K83309
$$ 1809869 1169674 585615 408127 846384 1875065 3274980 4698045 5723479 6006788
41934F006788m97628r38671r00982n89771l03838j35214L0108K64934M53804M20871
$$ 6006788 5509160 4570489 3669507 3079736 2775898 2640684 2670792 2935726 3389530 3810401
41924C810401J48345j91438m17323m98209n03861m55631l14538j10919K7859M3251
$$ 3810401 3958746 3767308 3349985 2851776 2347915 1892284 1577746 1466827 1494686 1537937
41914A537937N7464K20976M86507O33711N04639J25265l85046q96085j236469
$$ 1537937 1595401 1816377 2302884 2936595 3441234 3566499 3181453 2285368 1048899
41905A048899j226657q51963l38305M3379K20337K93561L12887J89462j46092
$$ 1048899 -177758 -1029721 -1368026 -1324647 -1104310 -810749 -497862 -308400 -454492
41896d54492n78628q51518p56372k86438L38815P85264Q17932M85400Q8132q3850
$$ -454492 -1033120 -1884638 -2641010 -2927448 -2588633 -1803369 -985437 -500037 -411905 -495755
41886d95755O025J63754J95077P5315p4141j05080N5404L36649N33236M65702
$$ -495755 -489730 -325976 -130899 -55584 -129725 -234805 -179401 157248 690484 1156186
41876A156186J85069n7164j14469j45737l96171q22130j083361r31130m79691
$$ 1156186 1341255 1284091 1169622 1023885 627714 -194416 -1277777 -2208907 -2688598
41867b688598m8731J47842R5413j07325k92719k45165J67222Q46203J513449J919204
$$ -2688598 -2737329 -2589487 -2494074 -2601399 -2894118 -3139283 -2972061 -2125858 -612409 1306795
41857A306795J966623J668991J087561L49963l30281p28066p44687m94618k40474
$$ 1306795 3273418 4942409 6029970 6379933 6049652 5321586 4576899 4082281 3841807
41848C841807j87912l17480m42079m21714k60497n922L14788N95083O19618K76232
$$ 3841807 3653895 3336415 2894336 2472622 2212125 2206203 2520991 3116074 3735692 4011924
41838D011924k63459p06402r38178j031456j006792p73981l38267J08978L94237
$$ 4011924 3748465 3042063 2103885 1072429 65637 -708344 -1046611 -937633 -543396
41829e43396N48426P07219R05709J051159J042233Q44916M92716P6981k84253
$$ -543396 5030 712249 1617958 2669117 3711350 4556266 5048982 5125963 4841710
41820D841710n18285o42475p32776q62103j052159j250525j383190j478615j680972
$$ 4841710 4323425 3680950 2948174 2086071 1033912 -216613 -1599803 -3078418 -4759390
41811d759390k031374k277354k063621j340656m40895K86093P48005R57161Q24400
$$ -4759390 -6790764 -9068118 -11131739 -12472395 -12913290 -12627197 -11879192 -10922031 -10097631
41802a0097631L14350l00366n81423l49308J73791O59635R82860J203939J373013
$$ -10097631 -9783281 -10083647 -10665070 -11014378 -10840587 -10180952 -9198092 -7994153 -6621140
41793f621140J448089J370649J153432Q82662O49791M87696L74981K85777K01410
$$ -6621140 -5173051 -3802402 -2648970 -1766308 -1116517 -628821 -253840 31937 233347
41784B33347Q1588j10487l23831m13387k66263Q4918M87983P71924Q23208O44001
$$ 233347 314935 204448 -119383 -532770 -799033 -714115 -226132 545792 1369000 2013001
41774B013001L76843K09370K09617K96991L77856M19458L78067J90951r7313l36315
$$ 2013001 2389844 2599214 2808831 3105822 3483678 3903136 4281203 4472154 4374841 4038526
41764D038526m86201o88185r94028j178206j014140o31918l77353l73591m54398
$$ 4038526 3552325 2864140 1870112 691906 -322234 -954152 -1331505 -1705096 -2159494
41755b159494m98885n60124o17882m76458n4402M05986N78694L97803M5308k95270
$$ -2159494 -2658379 -3218503 -3836385 -4312843 -4367245 -3961259 -3382565 -2984762 -2939454 -3234724
41745c234724n41854o53799o17481m74645k66450M3323N21645J143471J741611
$$ -3234724 -3776578 -4430377 -5047858 -5522503 -5788953 -5745630 -5223985 -4080514 -2338903
41736b338903K059929J873698J162324K21147m79535o42234l46166J03874M62938
$$ -2338903 -278974 1594724 2757048 2978195 2498660 1856426 1510260 1614134 2077072
41727B077072O50861O75115N56969L20464J675l24067n31212n39747m53910n14954
$$ 2077072 2727933 3403048 3960017 4280481 4282156 3958089 3426877 2887130 2433220 1918266
41717A918266q46554j308478j660568j800497j768293j589345j216510o01760
$$ 1918266 1071712 -236766 -1897334 -3697831 -5466124 -7055469 -8271979 -8873739
41709h873739K42305J211627K074501K523419K372304J715096Q54765J06716l11962
$$ -8873739 -8631434 -7419807 -5345306 -2821887 -449583 1265513 2120278 2226994 1915032
41700A915032l14978J697L75346N58402M96277K83445Q128k63517m09077l03966
$$ 1915032 1600054 1601751 1977097 2535499 3031776 3315221 3323349 3059832 2650755 2346789
41690B346789L2795M47578Q10919J075044J185338J064044P23880L05886m1219
$$ 2346789 2379584 2827162 3638081 4713125 5898463 6962507 7686387 7992273 7951054
41681G951054k61418l64989l90183m13406n04566o30516o80760o27072n71809
$$ 7951054 7689636 7324647 6934464 6521058 6016492 5385976 4705216 4078144 3506335
41672C506335n84379n77024m27925j69769M0344J17330J30436J87276L04083M15456
$$ 3506335 2921956 2344932 1917007 1747238 1787582 1904912 2035348 2222624 2526707 2942163
41662B942163M72553M95844N28130N47551M52412J62397k70383o92729j004012
$$ 2942163 3414716 3910560 4438690 4986241 5438653 5601050 5330667 4637938 3633926
41653C633926j231935j422772j501965j320395q55335l09697M7274J39155J33700
$$ 3633926 2401991 979219 -522746 -1843141 -2698476 -3008173 -2960899 -2821744 -2688044
41644b688044K05853K97465J94267j64933n68968p86291q38217q97190r57500
$$ -2688044 -2482191 -2184726 -1990459 -2155392 -2724360 -3510651 -4348868 -5246058 -6203558
41635f203558p62513j00080R30128J979965K683241K782802K177034J012952k78048
$$ -6203558 -6966071 -7066151 -6136023 -4156058 -1472817 1309985 3487019 4499971 4221923
41626D221923j183218j442417j189087p77707n08145m85678o36365p76926p06307
$$ 4221923 3038705 1596288 407201 -370506 -878651 -1364329 -2000694 -2777620 -3483927
41617c483927l37224J94818N78423N57247J63479k84168m41074k11119K17000
$$ -3483927 -3821151 -3626333 -3047910 -2490663 -2327184 -2611352 -3052426 -3263545 -3046545
41608c046545N67778O97486O56335N88500N81889N95809N23130L10616l677l58435
$$ -3046545 -2478767 -1781281 -1124946 -536446 45443 641252 1164382 1474998 1471321 1112886
41598A112886p12598r94131j065610q04981k09662N95321J397915J922309J926177
$$ 1112886 400288 -593843 -1659453 -2464434 -2674096 -2078775 -680860 1241449 3167626
41589C167626J411015P09177K38522J50884K79909L80688K97932m8318o28538
$$ 3167626 4578641 5287818 5526340 5677224 5957133 6337821 6635753 6587435 5958897
41580E958897j199186j429505j271180j076767j195268j523334j615913j213018
$$ 5958897 4759711 3330206 2059026 982259 -213009 -1736343 -3352256 -4565274
41572d565274n02569J54581O12144R62231J256272J350048J098204O49610M11402
$$ -4565274 -5067843 -4913262 -4301118 -3338887 -2082615 -732567 365637 1015247 1426649
41563A426649O23500J029293J108759O52372j8872m33838m35734k11424k1938
$$ 1426649 2050149 3079442 4188201 4840573 4821701 4387863 3952129 3740705 3718767
41554C718767m3068l51840q67653j316922j409611j086323n24840O4310N55995
$$ 3718767 3675699 3323859 2456206 1139284 -270327 -1356650 -1881490 -1817180 -1261185
41545a261185Q76149R92013R41660P71809M70491Q3705j42043O7168O45117J156780
$$ -1261185 -385036 606977 1548637 2320446 2790937 2874642 2732599 2799767 3444884 4601664
41535D601664J229997R03886M79406J59153n2413k09441l51606n30799p63440
$$ 4601664 5831661 6735547 7214953 7374106 7321693 7112252 6760646 6229847 5466407
41526E466407r40732q83669n15366O7453O83725J167019J388050J272809Q61382
$$ 5466407 4525675 3642006 3126640 3194093 3877818 5044837 6432887 7705696 8567078
41517H567078L31952q2144k43321k07328j63255k43957l93744m45784l05088m070
$$ 8567078 8899030 8816886 8573565 8366237 8202982 7959025 7565281 7119497 6814409 6810339
41507F810339L79591P40825Q82281N97513p7514q04386j259835j444319j549365
$$ 6810339 7189930 7930755 8813036 9410549 9333035 8528649 7268814 5824495 4275130
41498D275130j591981j373001q13930j55355K76849M03766L96525M06176L90752
$$ 4275130 2683149 1310148 496218 340863 617712 1021478 1418003 1824179 2214931
41489B214931K12424j54658n45661p36751o55201m42517k93863k62793k55854
$$ 2214931 2427355 2272697 1727036 990285 335084 -107433 -401296 -664089 -919943
41480i19943j74408J2645L08974O93841J059882J240182J152090Q62586M81944
$$ -919943 -1094351 -1081706 -772732 -78891 980991 2221173 3373263 4235849 4717793
41471D717793O0866l65467p06674q64080q08927n59853j34505L99701Q59590J022156
$$ 4717793 4778659 4413192 3706518 2842438 2033511 1473658 1339153 1738854 2598444 3620600
41461C620600P86973K38189m25525r76652j221314j080719o47863j30278K79556
$$ 3620600 4407573 4645762 4220237 3243585 2022271 941552 293689 163411 442967
41452D42967M82677M80630L60664K35425J27521n9788l88954p45802r48791r68427
$$ 442967 925644 1406274 1766938 2002363 2129884 2070096 1681142 935340 -13451 -981878
41442i81878r07176p68656m17982J63729P43287J081304J214038J350850J552756
$$ -981878 -1889054 -2657710 -3075692 -2911963 -2168676 -1087372 126666 1477516 3030272
41433C030272J659219J511565J110832N49795p5871o43600r99755j061408q91818
$$ 3030272 4689491 6201056 7311888 7861683 7785812 7142212 6142457 5081049 4189231
41424D189231o47379m79837m75898o06984p12169o08936k67774J73155N86234
$$ 4189231 3541852 3062015 2586117 1979133 1266964 658028 390254 563409 1149643
41415A149643R65080J313462J519111J437316J058245N06818q9167o42049j042974
$$ 1149643 2114723 3428185 4947296 6384612 7442857 7949675 7860508 7218459 6175485
41406F175485j171195r98595o34202k62983p9888k24401o45172j025087j001129
$$ 6175485 5004290 4005695 3371493 3108510 3028622 2804221 2159049 1133962 132833
41397A32833n48228l7292J87445J90679K80082N52537Q04751Q78079Q60124Q48070
$$ 132833 -415395 -452687 -265242 -74563 205519 758056 1562807 2440886 3301010 4149080
41387D149080P03084K30881m69348j021954j149302r08669n55227k94348j93519
$$ 4149080 4852164 5083045 4613697 3591743 2442441 1533772 978545 684197 490678
41378D90678k12012k43886k04705j29893j20044j50310l7680L13898P24932R29007
$$ 490678 278666 34780 -169925 -299818 -419862 -570172 -607852 -293954 430978 1359985
41368A359985R08014Q92974J022566J143965J018308O20770J46313k18029m22982
$$ 1359985 2267999 3160973 4183539 5327504 6345812 6966582 7112895 6894866 6471884
41359F471884m88116m26745k90930k16548l28580n93009q22473q56526o91597
$$ 6471884 5983768 5557023 5266093 5049545 4720965 4127956 3305483 2448957 1757360
41350A757360m01368l603M85146Q91949R52246O17005J80673k3424R304K5826
$$ 1757360 1355992 1352389 1837535 2729484 3681730 4298735 4479408 4455984 4465288 4491114
41340D491114q7792j49085N1381M63250Q27150R18065O80250K15660k73344n88012
$$ 4491114 4403322 4254237 4305618 4768868 5596018 6514083 7194333 7409993 7136649 6548637
41330F548637o71483o33842o01885n78123m81093k72397O216K76535M53145M73933
$$ 6548637 5877154 5243312 4641427 4063304 3582211 3309814 3316030 3592565 4045710 4519643
41320D519643L60031K11395R1109m7621k62896m93117n98272n18624l36045j87586
$$ 4519643 4879674 5091069 5182178 5134557 4871661 4378544 3780272 3261648 2925603 2738017
41310B738017j59028k42607l57357m28026m64331n16718n35959l74514m962L57573
$$ 2738017 2578989 2336382 1979025 1550999 1086668 569950 33991 -340523 -345485 12088
41300A2088M82080M14736L88694M52518L59834j10362q45028j485153j747324
$$ 12088 494168 908904 1297598 1750116 2109950 1999588 1154560 -330593 -2077917
41291b077917j607101j248844r12430p39729o95125o38398m87112k71814m0013
$$ -2077917 -3685018 -4933862 -5846292 -6586021 -7281146 -7919544 -8406656 -8678470 -8718483
41282h718483K02796M22123N22395M65706L61346L52861M50902N43190N25328
$$ -8718483 -8515687 -8093564 -7571169 -7105463 -6744117 -6391256 -5940354 -5397164 -4871836
41273d871836L48649j993m53527p77865p14593k19739M76754J096526J521554
$$ -4871836 -4523187 -4525180 -4978707 -5756572 -6471165 -6690904 -6214150 -5117624 -3596070
41264c596070J742051J705983J345427P23221K8553o02080j164573j638963j855849
$$ -3596070 -1854019 -148036 1197391 1920612 1949165 1347085 182512 -1456451 -3312300
41255c312300j630547j026308l85948m9240o5193j97269j69405J19253N70645
$$ -3312300 -4942847 -5969155 -6355103 -6404343 -6469536 -6666805 -6836210 -6716957 -6146312
41246f146312R98496J240857J208331Q92068L78600j47590m86917n68138m79912
$$ -6146312 -5147816 -3906959 -2698628 -1806560 -1427960 -1575550 -2062467 -2630605 -3110517
41237c110517l12818k8668M12993Q48102J001814Q24825N68096M35668L27265
$$ -3110517 -3423335 -3452003 -3039010 -2190908 -1189094 -364269 203827 639495 966760
41228I66760P1140k34626l35721k08959r4040j26939j64848m2145J97050M32119
$$ 966760 1037900 803274 467553 258594 164554 37615 -127233 -169378 27672 459791
41218D59791O66594R37581J121406J003251N40539m0562m20418m22000j17535
$$ 459791 1126385 2063966 3185372 4188623 4729162 4688600 4268182 3846182 3728647
41209C728647K36438M02860L70771L53644N50785R32163J275769J366473J128197
$$ 3728647 3965085 4367945 4738716 5092360 5643145 6575308 7851077 9217550 10345747
41200A0345747O32169N3665m05263o22472o10800m79388l76748m52977p73317
$$ 10345747 10977916 11031581 10626318 10003846 9393046 8913658 8536910 8083933 7310616
41191G310616j212640j509470j500684j272055j041097r46981r89793j088288
$$ 7310616 6097976 4588506 3087822 1815767 774670 -172311 -1162104 -2250392
41183b250392j122882r94451p27598m56296k26026J07437O54342J221532J429909
$$ -2250392 -3373274 -4367725 -5095323 -5551619 -5777645 -5670208 -5015866 -3794334 -2364425
41174b364425J121284N35087O1735p9417R1608M30471P67442R68316J002781R65325
$$ -2364425 -1243141 -708054 -646319 -725736 -634128 -203657 563785 1532101 2534882 3500207
41164C500207R90692J123556J252552J172554P61110J35648m03723o49682o85108
$$ 3500207 4490899 5614455 6867007 8039561 8800671 8936319 8532596 7882914 7197806
41155G197806p49838r39176j107895j059394p54425l34122n314R6140p33j23773
$$ 7197806 6447968 5508792 4400897 3341503 2587078 2252956 2247642 2343782 2343049 2219276
41145B219276j12270M8024K62246M47118N55638N44029M20684K95905K64277K46180
$$ 2219276 2107006 2155030 2417276 2864394 3420032 3964061 4384745 4680650 4944927 5191107
41135E191107O4987l09895p05902r36425r30926o82080k25517K79051O00859O63605
$$ 5191107 5256094 4946199 4240297 3303872 2372946 1690866 1465349 1744400 2345259 3008864
41125C008864O08184N56903M39811J58366j88691l72518k65423Q5008N23701Q24529
$$ 3008864 3617048 4173951 4613762 4772128 4583437 4210919 3945496 4030504 4554205 5378734
41115E378734P71439L79594j2121m8856K32151M39453K78797j65870o04427q32271
$$ 5378734 6150173 6529767 6517646 6468790 6700941 7140394 7419191 7253321 6648894 5816623
41105E816623q05493n90332l51531k82302m07670n03474l36122K6362K58570J62751
$$ 5816623 5011130 4420798 4069267 3786965 3379295 2875821 2539699 2566061 2824631 2987382
41095B987382q7455j59446M4474L13520M41185M75017N64814O62700N50356J68726
$$ 2987382 2899927 2740481 2784955 3098475 3539660 4014677 4579491 5242191 5792547 5961273
41085E961273k52803m68654m65866l27831q492N46236J134639J422246J362721
$$ 5961273 5708470 5239816 4773950 4446119 4437627 4983863 6118502 7540748 8903469
41076H903469J264639J342941J404830J134449N40014o9650m62365o40768o70550
$$ 8903469 10168108 11511049 12915879 14050328 14590342 14520692 14058327 13417559 12747009
41067A2747009n59995l35530o8088K21252N32278P11989M88988j80780r18145
$$ 12747009 12187014 11851484 11783396 12004648 12536926 13248915 13737903 13557123 12638978
41058A2638978j240400j040892o18807k73963m5810J27385J85872K6691k78038
$$ 12638978 11398578 10357686 9738879 9464916 9419106 9546491 9732363 9759054 9481016
41049I481016m87169m22852j20858K46489N17984N95659M24249r163o41306j310279
$$ 9481016 8993847 8570995 8450137 8696626 9214610 9810269 10234518 10225355 9584049 8273770
41039H273770j788359j891015j611727j146087p31497m48679k12707N1677L00900
$$ 8273770 6485411 4594396 2982669 1836582 1105085 656406 443699 495376 796276
41030G96276M64306N60601O39417O47163M54252L2394m68513q46808r89981q61194
$$ 796276 1260582 1821183 2460600 3107763 3562015 3594409 3125896 2279088 1289107 427913
41020D27913m35233K42756R46120J328956J186277O52291J09321j15113J6449
$$ 427913 -7320 235436 1181556 2510512 3696789 4349080 4458401 4343288 4359737
41011D359737K68224L49312J37941k55917o07858p44720o18899k89180J03372
$$ 4359737 4627961 4977273 5115214 4859297 4251439 3506719 2887820 2598640 2702012
41002B702012L62486L49704J36134j9526O9363K98333L79606J48152l11394q07686
$$ 2702012 3064498 3414202 3550336 3530810 3600173 3898506 4278112 4426264 4114870 3307184
40992C307184j189487j342937j196196q25801m71175l32506l83669m46659l90256
$$ 3307184 2117697 774760 -421436 -1247237 -1718412 -2050918 -2434587 -2881246 -3271502
40983c271502j77033K05319P16408J185755J401072J302782J002255O08747J56075
$$ -3271502 -3448535 -3243216 -2526808 -1341053 60019 1362801 2365056 2973803 3129878
40974C129878k77770n13305m15261k7851M80878R30691J151787J026737O24239
$$ 3129878 2852108 2338803 1923542 1895691 2376569 3307260 4459047 5485784 6110023
40965F110023K12830J2007l8172j50529l66288m88773l50309k0522K98014M79616
$$ 6110023 6322853 6334860 6296688 6146159 5779871 5291098 4940789 4920267 5218281 5697897
40955E697897N09442L86567J00682l04593p23208j055322j236442j201010r01872
$$ 5697897 6207339 6593906 6694588 6389995 5666787 4611465 3375023 2174013 1272141
40946A272141m24768k3012P6025p9983k03761j07873O8905O5430j27156k30450
$$ 1272141 847373 824361 900386 820403 616642 508769 577674 643104 515948 285498
40936B85498l0328L63332O71826P74105P95210R15403J164632J385955J354370
$$ 285498 255170 618502 1290328 2064433 2859643 3775046 4939678 6325633 7680003
40927G680003R58531L16305k96658o54313p01579m91680j02395L36813O29241
$$ 7680003 8638534 8954839 8658181 8003868 7302289 6810609 6708214 7045027 7674268
40918G674268O28775L51293q2394n55106r40053j074615q93933n63410l33666
$$ 7674268 8303043 8654336 8571942 8016836 7076783 6002168 5108235 4544825 4211159
40909D211159k49395j24218J71260N15277O72417N23601J15649m03814q19949
$$ 4211159 3961764 3837546 4008806 4524083 5196500 5720101 5835750 5431936 4611987
40900D611987r19481o59950k57863j9207p0870k98745n22828o57289o90151n84545
$$ 4611987 3692506 3032556 2774693 2755486 2684616 2385871 1863043 1205754 515603 -68942
40890f8942k79148J97737O55367Q42748O58681K47805j27825k87040j91931J04433
$$ -68942 -348090 -150353 505014 1347762 2006443 2254248 2126423 1839383 1647452 1751885
40880A751885M78178P42446P66219O15498M79433M19930K90476m0624m75994p79061
$$ 1751885 2230063 2972509 3738728 4354226 4833659 5253589 5544065 5503441 5027447 4248386
40870D248386q20136o61728m55659l34071l48075m13817l45578m2602L57592N92042
$$ 4248386 3428250 2766522 2310863 1976792 1628717 1214900 869322 826720 1184312 1776354
40860A776354N37989K99062N1586q8514m8464K03853N61093P74156O72986L66637
$$ 1776354 2314343 2613405 2664991 2576477 2528013 2731866 3292959 4067115 4740101 5106738
40850E106738J28332Q6302J16606N4332q5155j52990o5359J32209L70729O26716
$$ 5106738 5235070 5321372 5437978 5492310 5407155 5254165 5188806 5321015 5691744 6318460
40840F318460Q62391R83902R29915P71647O65385P05476Q44729R32172P99560
$$ 6318460 7180851 8164753 9094668 9866315 10531700 11237176 12081905 13014077 13813637
40831A3813637L58029l15853r91542j434454j553295j390658j032823o02272k77684
$$ 13813637 14171666 13855813 12864271 11429817 9876522 8485864 7453041 6850769 6573085
40822F573085j84734k60977l41959l83128m58693n22566l59303J14062O39321
$$ 6573085 6388351 6127374 5785415 5402287 4943594 4421028 4061725 4175787 4815108
40813D815108Q60700O93201L16880r9782m90097p55433p60274n18397k48602j75761
$$ 4815108 5675808 6369009 6685889 6586107 6096010 5340577 4580303 4061906 3813304 3637543
40803C637543l34769n69215o40755l65941K20236Q16485J088880R84351P24305
$$ 3637543 3302774 2733559 2092804 1726863 1947099 2763584 3852464 4836815 5561120
40794E561120N08026L70886L25551M15033N31512L95352j03362o73667r23306
$$ 5561120 6069146 6440032 6765583 7180616 7712128 8107480 8004118 7330451 6407145
40785F407145q07837o02496m97794m36655l40869k77624l26481m30704m68423
$$ 6407145 5599308 4996812 4499018 4062363 3721494 3443870 3117389 2686685 2218262
40776B218262l78644j57843J76905N53049Q37407R26475Q01542M78126j3742n52697
$$ 2218262 1839618 1681775 1858680 2411729 3249136 4175611 4977153 5455279 5441537 4888840
40766D888840r21282r72956p75885n31209l73253k87382j75827N2702M16365Q12465
$$ 4888840 3967558 2994602 2218717 1687508 1314255 1026873 851046 903748 1320113 2132578
40756B132578J058640J044698Q28925N32467J72781l09083q55105j224680j191832
$$ 2132578 3191218 4235916 5064841 5597308 5770089 5461006 4605901 3381221 2189389
40747B189389p84725k83291L0643J16047J71149L93010P45960R90574R41274O48000
$$ 2189389 1404664 1121373 1152016 1268063 1439212 1832222 2578182 3568756 4510030 5158030
40737E158030K98943O209k41625m53178n60626m86615k20948J68910N29962O36315
$$ 5158030 5456973 5463182 5221557 4768379 4207753 3721138 3500190 3669100 4199062 4835377
40727D835377L37169k43621p49895r24202q40557p35730o87474n81777l54368
$$ 4835377 5172546 4928925 4179030 3254828 2414271 1678541 991067 409290 54922
40718E4922j10067K4777M8943L5442K3266J1543j2718r1317k65233m62631m75530
$$ 54922 -55145 -30368 18575 54017 77283 88826 76108 -15209 -280442 -743073 -1218603
40707a218603j26339N60377J377912K065214K379755K165102J491509O94456J29296
$$ -1218603 -1344942 -784565 593347 2658561 5038316 7203418 8694927 9389383 9518679
40698I518679j39702l23005n88769q75144j030148j007076q60688o57602m77921
$$ 9518679 9378977 9055972 8467203 7592059 6561911 5554835 4694147 4036545 3558624
40689C558624m26826n39046p04648p75305p26348o41680n52674l69854P146N52532
$$ 3558624 3131798 2592752 1888104 1112799 386451 -255229 -807903 -1177757 -1170611 -618079
40679f18079J096057J420810J395765J054069N53465N7929l28694n32445m95588
$$ -618079 477978 1898788 3294553 4348622 4902087 4960016 4631322 4098877 3603289
40670C603289k46252O6639K73724L11778K34221J51000J88731M15441P09939P79261
$$ 3603289 3357037 3423676 3697400 4009178 4243399 4394399 4583130 4998571 5708510 6487771
40660F487771M43914j12674n04341n50374m07360l01389k81130k76882k52341
$$ 6487771 6931685 6819011 6314670 5764296 5356936 5055547 4774417 4497535 4245194
40651D245194k04547j20552l2048k9146j23827j75845o0300J51518K86496K89355
$$ 4245194 4040647 3920095 3888047 3858901 3735074 3559229 3498929 3650447 3936943 4226298
40641D226298K23170R0393j92345o20034j027312j240211j212042r72574n45280
$$ 4226298 4449468 4539861 4347516 3727482 2700170 1459959 247917 -724657 -1269937
40632a269937K969M91343P06827N75512K26663j05615k32199j00133K08844N57665
$$ -1269937 -1266968 -775625 -68798 506714 733377 627762 395563 295430 504274 1061939
40622A061939Q55909J104421J347442J580009J695230J531560J014644K89691
$$ 1061939 1917848 3022269 4369711 5949720 7644950 9176510 10191154 10480845
40614A0480845l08267m78261j91173K80387N58312M01253j73500r25583j536659
$$ 10480845 10172578 9694317 9503144 9783531 10341843 10743096 10569596 9644013 8107354
40605H107354j773954j568141r86448j94314N49652R65959R39529O32831L42875
$$ 8107354 6333400 4765259 3778811 3584497 4134149 5100108 6039637 6672468 7015343
40596G015343K39823K84657L55699L55218K13190p3880l61202m25927k02013J14611
$$ 7015343 7255166 7539823 7895522 8250740 8463930 8390050 8028848 7602921 7400908 7515519
40586G515519K55593J25097j80827n16865p76350q99909q86757p74182n54658
$$ 7515519 7771112 7896209 7715382 7198517 6422167 5522258 4635501 3861319 3306661
40577C306661j65186L75164Q78325J133920J111208R35086P12762M93252L48525
$$ 3306661 3141475 3516639 4394964 5528884 6640092 7575178 8287940 8781192 9129717
40568I129717L31770L40643J78897j81236n18412o18917n12163l67107k53641
$$ 9129717 9461487 9802130 9981027 9799791 9281379 8662462 8150299 7783192 7529551
40559G529551j25345K5964J38370J94125K51251L42684M28803M72880M95108N25872
$$ 7529551 7404206 7430170 7568540 7762665 8013916 8356600 8785403 9258283 9753391 10279263
40549A0279263N57017N57163M90212L14625K4530k96695n32732o71593q18353
$$ 10279263 10836280 11393443 11883655 12198280 12222810 11926115 11393383 10721790 9903437
40540I903437j028791j196346j167433r20371n62216j93505J35624L60914M05672
$$ 9903437 8874646 7678300 6510867 5590496 5028280 4834775 4970399 5331313 5736985
40531E736985K70797M3671k10438m90836p59225q81464p59432m86784k85384k76574
$$ 5736985 6007782 6051453 5841015 5350179 4590954 3709490 2950058 2463274 2177890 1901316
40521A901316l70694l98001l04654j87701j51951j67007r6942J15161L23456L01094
$$ 1901316 1530622 1132621 827967 640266 488315 321308 224366 339527 662983 964077
40511I64077K422l51339m92476l84281k46071l34903p31387j280891j675037j637017
$$ 964077 966499 615160 122684 -261597 -507668 -842571 -1573958 -2854849 -4529886 -6166903
40501f166903j135955m35672J35997M78585P35880J052981J411728J699315J814142
$$ -6166903 -7302858 -7738530 -7602533 -7123948 -6388068 -5335087 -3923359 -2224044 -409902
40492d09902J664558J192998N03231j12844l88504l04938m5223K17141M01512
$$ -409902 1254656 2447654 2950885 2838041 2449537 2144599 2099376 2316517 2718029
40483B718029M53147L30243P5448j92238l83879m77772m49935k59332N5063L27994
$$ 2718029 3171176 3501419 3576867 3384629 3000750 2522978 2073043 1813711 1868774 2196768
40473B196768L81801J81940j21394k70722l5615O29814J488199K110747K148302
$$ 2196768 2578569 2760509 2639115 2368393 2332778 2962592 4450791 6561538 8709840
40464H709840J561081O15782l05357r10986j117846j047030q90486p30639m91771
$$ 8709840 10270921 10886703 10581346 9670360 8552514 7505484 6614998 5884359 5392588
40455E392588q6030M30136Q93692J202131J377405J468623J463541J318479J013294
$$ 5392588 5306558 5736694 6630386 7832517 9209922 10678545 12142086 13460565 14473859
40446A4473859N41734q7271p68626j265157j361143j084205p13521n30140n91517
$$ 14473859 15015593 14928322 14159696 12894539 11533396 10449191 9735670 9205530 8614013
40437H614013p56365q48473p39610l59049K37278P99822J016271P91279L47016
$$ 8614013 7857648 7009175 6269565 5910516 6147794 6947616 7963887 8755166 9102182
40428I102182j3120k01349l46376n33430o42941m96483j27449J59320M5622m70292
$$ 9102182 9089062 8887713 8541337 8007907 7364966 6868483 6741034 6900354 6945976 6475684
40418F475684j028953j227747r75924n10368r8013J99156M69834P69863J044808
$$ 6475684 5446731 4218984 3243060 2732692 2634679 2833835 3303669 4073532 5118340
40409E118340J168397J012498N52400l6125m59524n75334n29354n42408o21719
$$ 5118340 6286737 7299235 7851635 7815510 7355986 6780652 6251298 5708890 5087171
40400E087171n96802l93850j28990O4204J51377J18272o9730l51797n35791m84126
$$ 5087171 4490369 4096519 3967529 4031733 4183110 4301382 4231652 3879855 3344064 2859938
40390B859938k70015o6019O2876J73831L12845M68171O29464P95503R22172R43414
$$ 2859938 2589923 2523904 2586780 2760611 3073456 3541627 4171091 4966594 5888766 6832180
40380F832180Q62386P62290O98902O19085M18289P3520k99720n42287o11265o10325
$$ 6832180 7694566 8456856 9155758 9774843 10193132 10266652 9966932 9424645 8813380 8203055
40370H203055o11021m74606L6440R21909J805146K216812J990525J338834O11116
$$ 8203055 7592034 7117428 7153868 8075777 9880923 12097735 14088260 15427094 16038210
40361A6038210O1643k09439k35394j38919k7232J01834L03756N42901O78907O14362
$$ 16038210 16099853 15890414 15655020 15516101 15488869 15590703 15894459 16437360 17116267 17730629
40351A7730629L90975J18935j26037l12528m31858n15498o28325p97329r72970
$$ 17730629 18121604 18240539 18114502 17801974 17370116 16854618 16226293 15428964 14455994
40342A4455994j087923j118748j064729r14056o76742m19172k21110j16312r8831
$$ 14455994 13368071 12249323 11184594 10270538 9593796 9174624 8953514 8837202 8738371
40333H738371j45628j92867j40302N0554K89398M59344N63668O82292P88002P20507
$$ 8738371 8592743 8399876 8259574 8310128 8599526 9058870 9622538 10304830 11092832 11813339
40323A1813339L93042o7677m70093p84605j116173j468272j649521j467368r60079
$$ 11813339 12206381 12138704 11668611 10884006 9767833 8299561 6650040 5182672 4222593
40314D222593l86189n237J02639K9655r1112j90886k57769k59891j22087J90716
$$ 4222593 3836404 3831167 3933806 3963461 3872349 3681463 3423694 3163803 3041716 3232432
40304C232432N95406R55763J226137J461448J658330J665792J331566P01991J549
$$ 3232432 3827838 4783601 6009738 7471186 9129516 10795308 12126874 12828865 12830414
40295A2830414n64192r09955j006738q47116n19687k15985p6868p6525j16585
$$ 12830414 12266222 11356267 10349529 9502413 8982726 8766741 8689873 8613348 8496763
40286H496763j71754k46914k26553J02304Q23787J742449K495683K802729K625155
$$ 8496763 8325009 8078095 7851542 7953846 8777633 10520082 13015765 15818494 18443649
40277A8443649K152969J648551J239432Q33213K84040l46822p82855q35035o28559
$$ 18443649 20596618 22245169 23484601 24317814 24601854 24255032 23472177 22637142 22008583
40268B2008583m44179m08989m63345n67914p49136r13345q19317l68859K02668
$$ 22008583 21564404 21155415 20692070 20124156 19375020 18461675 17642358 17273499 17476167
40259A7476167N86664P78103J015510J370700J595460J436319R50759M14412J8108
$$ 17476167 18062831 18840934 19856444 21227144 22822604 24258923 25209682 25624094 25642202
40250B5642202k39007m34159o25867q49705j095731j263111j192583p73172k6363
$$ 25642202 25403195 24969036 24343169 23493464 22397733 21134622 19942039 19168867 19142504
40241A9142504Q70516J628217J995149J944480J678510J391166J083492O85579
$$ 19142504 20013020 21641237 23636386 25580866 27259376 28650542 29734034 30419613
40233C0419613K70241r766j68655l93131p52730j043988j005755o07090p0887
$$ 30419613 30689854 30680088 30511433 30118302 29365572 28321584 27315829 26708739 26637852
40224B6637852K95369K48651k66348j010870j549568j605266j308220j000728
$$ 26637852 26933221 27181872 26915524 25904654 24355086 22749820 21441600 20440872
40216B0440872q35257o87108m32534j40557O2197J74414K71936L80175N16302
$$ 20440872 19605615 18918507 18485973 18345416 18407613 18582027 18853963 19234138 19750440
40207A9750440P87076J276855J821699K046954J729582J061289M75618K61295
$$ 19750440 20537516 21814371 23636070 25683024 27412606 28473895 28949513 29210808
40199B9210808M11879P73778J187682J488519J539034J355523J102841Q87302
$$ 29210808 29622687 30396465 31584147 33072666 34611700 35967223 37070064 37957366
40191C7957366O53775L78603K39859M19049P84546R62329P39537K49768k54785
$$ 37957366 38611141 38989744 39229603 39648652 40433198 41395527 42135064 42384832 42130047
40182D2130047o44600q70723q50591n22211O2399P68157J419678J775578J615958
$$ 42130047 41485447 40614724 39764133 39241922 39304321 40072478 41492156 43267734 44883692
40173D4883692R93177L08403o542J38038N03610Q25869R92076R99657R05950Q16711
$$ 44883692 45876869 46185272 46178730 46316768 46820378 47646247 48638323 49637980 50543930 51360641
40163E1360641Q00214Q03183P43798O76997P60054J039481J353389J459006J209649
$$ 51360641 52160855 52964038 53707836 54384833 55144887 56184368 57537757 58996763 60206412
40154F0206412O43638j0468m38304m54491j30274L39716Q46660J351810J731297
$$ 60206412 60850050 60839582 60401278 59946787 59816513 60156229 61002889 62354699 64085996
40145F4085996J808714J558641J144535P38640M38044L68872O86705J368118K116326
$$ 64085996 65894710 67453351 68597886 69336526 69774570 70143442 70830147 72198265 74314591
40136G4314591K581708K623270K320665J850343J427986J241652J293329J366286
$$ 74314591 76896299 79519569 81840234 83690577 85118563 86360215 87653544 89019830
40128H9019830J287708J198851J428758K069998K771316L016112K606843J876484
$$ 89019830 90307538 91506389 92935147 95005145 97776461 100792573 103399416 105275900
40120A05275900J424777J614085K294138L016451L479509L700316L795751L764166
$$ 105275900 106700677 108314762 110608900 113625351 117104860 120805176 124600927 128365093
40112A28365093L556996L228885K877322K505268K094026J790787J872969K475171
$$ 128365093 131922089 135150974 138028296 140533564 142627590 144418377 146291346 148766517
40104A48766517L424088M372971N052378N393034N483256N453453N385702N324095
$$ 148766517 152190605 156563576 161615954 167008988 172492244 177945697 183331399 188655494
40096A88655494N359702N631510O172651O801516P268099P507114P657381P825647
$$ 188655494 194015196 199646706 205819357 212620873 219888972 227396086 235053467 242879114
40088B42879114P932809P834910P515751P102391O742806O519770O441240O455775
$$ 242879114 250811923 258646833 266162584 273264975 280007781 286527551 292968791 299424566
40080B99424566O493591O532105O611525O767944O972012P138372P146521O837599
$$ 299424566 305918157 312450262 319061787 325829731 332801743 339940115 347086636 353924235
40072C53924235O078119M915996L639289K583277J865904J370610R72555O73968
$$ 353924235 360002354 364918350 368557639 371140916 373006820 374377430 375349985 376023953
40064C76023953M75603K17644l37338j267562k398003l439556m187020m614420
$$ 376023953 376499556 376717200 376379862 375112300 372714297 369274741 365087721 360473301
40056C60473301m853147n084907n400406n752732o086349o478534p049946p721957
$$ 360473301 355620154 350535247 345134841 339382109 333295760 326817226 319767280 312045323
40048C12045323q186664q201230p841434p390991p057898o896032o919823p123937
$$ 312045323 303858659 295657429 287815995 280425004 273367106 266471074 259551251 252427314
40040B52427314p387494p513732p423575p215192o995535o757469o477591o229048
$$ 252427314 245039820 237526088 230102513 222887321 215891786 209134317 202656726 196427678
40032A96427678o101255o064987o000439n824838n535929n180922m850871m653637
$$ 196427678 190326423 184261436 178260997 172436159 166900230 161719308 156868437 152214800
40024A52214800m602267m555025m348569l977652l573710l231353k947055k718038
$$ 152214800 147612533 143057508 138708939 134731287 131157577 127926224 124979169 122261131
40016A22261131k585995k537701k444179k170229j725794j286113j091137j320313
$$ 122261131 119675136 117137435 114693256 112523027 110797233 109511120 108419983 107099670
40008A07099670j973302k796187l373482l412382k992912k504934k299941k406279
$$ 107099670 105126368 102330181 98956699 95544317 92551405 90046471 87746530 85340251
40000H5340251k581306k589035k375391k008549j557231j082236o73939l94538
$$ 85340251 82758945 80169910 77794519 75785970 74228739 73146503 72472564 72078026
39992G2078026j86038Q5947M80979R29553J321578J564869J553894J213259O53709
$$ 72078026 71891988 71977935 72458914 73388467 74710045 76274914 77828808 79042067 79695776
39983G9695776J81034J7493N1460j9785l18540o75182q78826q97354q05497o30008
$$ 79695776 79876810 79894303 79945763 79925978 79607438 78932256 78053430 77156076 76350579 75720571
39973G5720571l71841j08076M2770M0488o8348k44364m80595p33705q98815q72830
$$ 75720571 75348730 75240654 75283424 75323912 75255564 75011200 74530605 73796900 72898085 72025255
39963G2025255o11311j45611L81157P02784N80970O0768m81631o57587m45401
$$ 72025255 71413944 71268333 71649490 72352274 72933244 72994012 72512381 71854794 71409393
39954G1409393j89372k18118n30478q66201r92814q62472n63332k34496l1786
$$ 71409393 71220021 71001903 70471425 69605224 68612410 67749938 67186606 66952110 66920324
39945F6920324p4564l53720p08536r36274r40065p74317n55399l31721m4161L71279
$$ 66920324 66845760 66492040 65783504 64847230 63907165 63132848 62577449 62245728 62201567 62572846
39935F2572846Q40663J148394J114679P75789L77182K02656M01824R09980J477149
$$ 62572846 63413509 64561903 65676582 66452371 66829553 67032209 67434033 68344013 69821162
39926F9821162J827615J882641J819320J846370J952961J975532J888973J882637
$$ 69821162 71648777 73531418 75350738 77197108 79150069 81125601 83014574 84897211
39918H4897211K095365K402178K568137K545123K513523K660088K995012L364273
$$ 84897211 86992576 89394754 91962891 94508014 97021537 99681625 102676637 106040910
39910A06040910L564808L461919L077770K588146K188129J946214J813990J762899
$$ 106040910 109605718 113067637 116145407 118733553 120921682 122867896 124681886 126444785
39902A26444785J849566K118024K477192K738372K808261K826350L051126L570983
$$ 126444785 128294351 130412375 132889567 135627939 138436200 141262550 144313676 147884659
39894A47884659M162183M486747M409707M064153L640810L224598K847096K569101
$$ 147884659 152046842 156533589 160943296 165007449 168648259 171872857 174719953 177289054
39886A77289054K428655K377892K350346K349119K404448K475442K452660K252321
$$ 177289054 179717709 182095601 184445947 186795066 189199514 191674956 194127616 196379937
39878A96379937J895396J521742J308448J287397J234709Q57381J41608n95065
$$ 196379937 198275333 199797075 201105523 202392920 203627629 204485010 204626618 204031553
39870B04031553j070496j345505j668772k123476k563796k831641k896089k822973
$$ 204031553 202961057 201615552 199946780 197823304 195259508 192427867 189531778 186708805
39862A86708805k741295k810043l084868l423054l622944l638025l565726l486777
$$ 186708805 183967510 181157467 178072599 174649545 171026601 167388576 163822850 160336073
39854A60336073l446235l529554l772637m010605m012115l802431l682141l864243
$$ 160336073 156889838 153360284 149587647 145577042 141564927 137762496 134080355 130216112
39846A30216112m240012m569511m757994m851854m885160m847810m736508m548361
$$ 130216112 125976100 121406589 116648595 111796741 106911581 102063771 97327263 92778902
39838I2778902m275451l961256l692959l480743l218880k828981k368481j930074
$$ 92778902 88503451 84542195 80849236 77368493 74149613 71320632 68952151 67022077
39830F7022077j510437j070210o74177m71625n38537p96190j089660j324884j538479
$$ 67022077 65511640 64441430 63767253 63295628 62757091 61960901 60871241 59546357 58007878
39821E8007878j832098k207542k483378k443142k074902j603992j288111j242392
$$ 58007878 56175780 53968238 51484860 49041718 46966816 45362824 44074713 42832321
39813D2832321j436157j736272j933514j850530j482250r58220l67465K56498
$$ 42832321 41396164 39659892 37726378 35875848 34393598 33435378 33067913 33324411
39805C3324411P78621R83859Q38571N63563L35681P0454l64926q73770j244094
$$ 33324411 34103032 35086891 35925462 36489025 36824706 36895160 36530234 35656464 34412370
39796C4412370j429849j525560j541640j415864j214562j114301j163035j217805
$$ 34412370 32982521 31456961 29915321 28499457 27284895 26170594 25007559 23789754
39788B3789754j137750r05965n66005j94059N5141M6740j32552k10083l6203K44052
$$ 23789754 22652004 21746039 21180034 20985975 21041116 21087856 20955304 20745221 20709018 20953070
39778B0953070L81614K87887N9695j59244k79223l11216l75234n92864r16190
$$ 20953070 21334684 21622571 21682266 21523022 21243799 20932583 20557349 19964485 19048295
39769A9048295j120411j002813n31757K00046J041194J744613K010271J716383
$$ 19048295 17927884 16925071 16393314 16593360 17634554 19379167 21389438 23105821
39761B3105821J067731M03402j20795n73450j013113j339428j404399j189297
$$ 23105821 24173552 24576954 24456159 23882709 22869596 21530168 20125769 18936472
39753A8936472q31550n17873l65281l57435l66731k65175l6857K28174M43353
$$ 18936472 18104922 17587049 17221768 16864333 16497602 16232427 16195570 16423744 16867097
39744A6867097N85993O37186N26502K15489j69750l82499l04006j14102j25919
$$ 16867097 17453090 18090276 18616778 18832267 18662517 18280018 17976012 17861910 17735991
39735A7735991m33340p95342r15445p79781o49328p42725r99269j159720j024654
$$ 17735991 17302651 16507309 15591864 14812083 14162755 13420030 12420761 11261041 10236387
39726A0236387o16621j30908K41816M50914N58594N99835N15928K49676j42147
$$ 10236387 9619766 9488858 9730674 10181588 10740182 11340017 11855945 12105621 11963474
39717A1963474n23814q01598r64360j040248j074859j116579j141694j018464
$$ 11963474 11439660 10638062 9673702 8633454 7558595 6442016 5300322 4281858
39709D281858o44635j17160L38445O18442Q08647R74734J018834Q33726N02667
$$ 4281858 3637223 3520063 3858508 4476950 5285597 6260331 7279165 8112891 8615558
39700H615558K29123J12788R5448R8634J12015J46035J84584K09255K23428K44573
$$ 8615558 8844681 8957469 9052917 9151551 9263566 9409601 9594185 9803440 10026868 10271441
39690A0271441L03908M29178N70581N69041K87989k07624o76658r29076r63189
$$ 10271441 10575349 11004527 11575108 12144149 12432138 12224514 11547856 10618780 9655591
39681I655591q59904o39377k98815P6241L48780M65544M61853L30902j952n19765
$$ 9655591 8795687 8156310 7857495 7933736 8282516 8748060 9209913 9540815 9538863 9019098
39671I019098j007122j185548r33657l34796M27051J126619J504453J377884Q14557
$$ 9019098 8011976 6826428 5892771 5557975 5985026 7111645 8616098 9993982 10808539
39662A0808539J13101m54792q32767j080033j187792j100922q59883n78934k75976
$$ 10808539 10921640 10466848 9634081 8554048 7366256 6265334 5405451 4826517 4550541
39653D550541J53081P37388J288126J521898J309368P86691K57990r928L0580
$$ 4550541 4703622 5441010 6729136 8251034 9560402 10347093 10605083 10595155 10625735
39644A0625735J83494K05604N8858p9894q7624r0590k99043o86295r51342q33064
$$ 10625735 10809229 11014833 11073691 10993797 10906173 10815583 10516540 9830245 8878903 8045839
39634H045839l87770Q2756L14428K39641o9436m97797r04693j136992j114916
$$ 8045839 7658069 7740825 8055253 8294894 8225458 7727661 6822968 5685976 4571060
39625D571060r02608o50255m66502l71603l42287l27281k13229J32816P14369
$$ 4571060 3668452 3018197 2551695 2180092 1837805 1510524 1297295 1430111 2144480
39616B144480J325318J671662J577893J084239M12988j21040k61020k290L58980
$$ 2144480 3469798 5141460 6719353 7803592 8216580 8095540 7834520 7832230 8191210
39607H191210M64948K16101j86175m94343o28873o44020n97139n14381m17282
$$ 8191210 8656158 8872259 8686084 8191741 7562868 6918848 6321709 5807328 5390046
39598E390046l11378j71308K3511K56758M92909O94566Q18320Q45998Q29077Q32654
$$ 5390046 5078668 4907360 4930871 5187629 5680538 6375104 7193424 8039422 8868499 9701153
39588I701153Q09426O04477J32584n07054j126257j577238j741855j514995r39034
$$ 9701153 10510579 11115056 11247640 10740586 9614329 8037091 6295236 4780241 3841207
39579C841207l06048K9315k4363k32831l08129j72130M6585J84406J79746J05961
$$ 3841207 3535159 3564474 3540111 3307280 2999151 2827021 2873606 3058012 3237758 3343719
39569C343719J02297K32591M04741M76166M27404L54015K86065J23395j95571
$$ 3343719 3446016 3678607 4083348 4559514 4986918 5340933 5626998 5750393 5554822
39560E554822n38152o64346m45230K1214M45450M78147o7344j003785j832919
$$ 5554822 5016670 4352324 3907094 3928308 4373758 4851905 4784561 3780776 1947857
39551A947857k139848j925832j492064j064180o66675l20043j34836j11765j6062
$$ 1947857 -191991 -2117823 -3609887 -4674067 -5340742 -5660785 -5795621 -5907386 -5923448
39542e923448L69665R20376J251684J130963O89376K14132j45607m06777n84373
$$ -5923448 -5553783 -4633407 -3381723 -2250760 -1561384 -1347252 -1492859 -1899636 -2484009
39533b484009o04118l77309R0428O63755J124950J280968J082161O66637K83652
$$ -2484009 -3088127 -3465436 -3375008 -2711253 -1586303 -305335 776826 1443463 1727115
39524A727115J52287L49111P73521J204981J439948J421337J239067J003826P48414
$$ 1727115 1879402 2228513 3002034 4207015 5646963 7068300 8307367 9311193 10059607
39515A0059607M60944J66423o7829j85999j70740m5010J09140J59347J7589k59214
$$ 10059607 10520551 10686974 10619145 10433146 10262406 10217396 10326536 10485883 10503472 10244258
39505A0244258n03414n90780n43413m76215m62692m64020l88268k24182j06147
$$ 10244258 9740844 9150064 8606651 8130436 7667744 7203724 6815456 6591274 6485127
39496F485127k05306n38078r25079j170138j230992j168336r94892o81369k95563
$$ 6485127 6279821 5741743 4816664 3646526 2415534 1247198 252306 -429063 -724626
39487g24626j8448K7368q6983j60974l4721K93304O56761Q30252P14745M21283
$$ -724626 -743074 -715706 -802689 -963663 -998384 -705080 -48319 781933 1496678 1917961
39477A917961J14370k00373o25501j117879j438137j413180j118755p21178k73289
$$ 1917961 2032331 1831958 1206457 88578 -1349559 -2762739 -3881494 -4602672 -4875961
39468d875961K09017N96372P68358Q37230J047988J435603J752743J793301J641932
$$ -4875961 -4666944 -4070572 -3302214 -2464984 -1416996 18607 1771350 3564651 5206583
39459E206583J513678J452024J293319Q80807K34419m55796r42300j067066q79472
$$ 5206583 6720261 8172285 9465604 10346411 10580830 10125034 9182734 8115668 7236196
39450G236196o16072n22932o80835r82937j227496j225558r11015m23960m3228
$$ 7236196 6620124 6097192 5416357 4433420 3205924 1980366 1069351 645391 602163
39441F02163M2193j12498l11357m13925l59423q1024M33395R79227J202194R37887
$$ 602163 644356 531858 220501 -193424 -552847 -633871 -200476 778751 1980945 2918832
39431B918832M06206k4529k01856k20090j60167L0188L68455O94438P97224O29638
$$ 2918832 3325038 3300509 3098653 2878563 2718396 2748584 3117039 3811477 4608701 5238339
39421E238339L19472J163k92385n84716q71068j096568j189831j111714q84519
$$ 5238339 5557811 5558974 5266589 4681873 3810805 2714237 1524406 412692 -471827
39412d71827n66231j94252K06325N39127O28533L77503q7687n15906p80789r53951
$$ -471827 -1038058 -1232310 -1025985 -486858 141675 519178 431491 -84415 -865204 -1819155
39402a819155j113582j175962r90326n55675o8355K42398K90324J68683O5526
$$ -1819155 -2932737 -4108699 -5099025 -5654700 -5723055 -5480657 -5190333 -5021650 -4956124
39393d956124J34564L87938O85643Q55446Q51706P94708Q40508J008870J147364
$$ -4956124 -4821560 -4433622 -3747979 -2892533 -2040827 -1246119 -405611 603259 1750623
39384A750623J076827P75309M05433J50818M2066l6183j84219l70024m71426m02724
$$ 1750623 2827450 3602759 4008192 4159010 4201076 4164893 3980674 3610650 3139224 2736500
39374B736500j94878K3848J25000Q5954O098L521J08809K79801M76180O50680
$$ 2736500 2541622 2565470 2690470 2776424 2782522 2786043 2894852 3174653 3650833 4301513
39364D301513O93872M93894P8933l78555p26844r25416r53561p58087l81468l7227
$$ 4301513 4995385 5489279 5568212 5189657 4462813 3537397 2583836 1825749 1444281 1407054
39354A407054Q0319J7848l1521j6896q3740l28912o39547q33523q58836p83899
$$ 1407054 1487373 1505221 1473700 1456804 1373064 1044152 404605 -428918 -1287754 -2071653
39344b071653o70545n41397m20878l16298j78002L7232K62461L63312L16362K74033
$$ -2071653 -2742198 -3283595 -3704473 -4020771 -4198773 -4161541 -3899080 -3535768 -3219406 -2945373
39334b945373L80720N54059N40993K24428j91179l69566j97168J20189L15833
$$ -2945373 -2564653 -2010594 -1469601 -1245173 -1436352 -1805918 -2003086 -1882897 -1567064
39325a567064L43237L63482N09870P27858Q37218P10829L87575K5500k50507m38651
$$ -1567064 -1223827 -860345 -350475 377383 1214601 1925430 2313005 2338505 2087998 1649347
39315A649347n81566o44095n57034l76419k75753l18674l45039j85431Q3562K20333
$$ 1649347 1067781 423686 -133348 -509767 -785520 -1104194 -1449233 -1634664 -1551102 -1330769
39305a330769J19745q3916k03273j77652o6393L0081K3108r9108k33942k61995
$$ -1330769 -1211024 -1294940 -1498213 -1675865 -1742258 -1712177 -1689069 -1788177 -2022119 -2284114
39295b284114j85905r0756K4614K56565O10000R22994J033242R17326O10301J13210
$$ -2284114 -2470019 -2560775 -2536161 -2279596 -1669596 -746602 286640 1203966 1814267 1927477
39285A927477n08624j026038j190532r67050n34991q5705K86621N16930N20998
$$ 1927477 1418853 392815 -797717 -1764767 -2299758 -2385463 -2098842 -1581912 -1060914
39276a060914K72975j16699m42488n25914l23188M8755M02944O32491P63238Q50585
$$ -1060914 -787939 -904638 -1347126 -1873040 -2196228 -2147473 -1744529 -1112038 -348800 501785
39266E01785Q84502Q50477Q22518Q89924J005583J014111Q49446O04782L62575
$$ 501785 1386287 2236764 3059282 3949206 4954789 5968900 6818346 7423128 7785703
39257G785703N1817m33251j018656j459763j580681j440915j236168j078340r16667
$$ 7785703 7837520 7404269 6385613 4925850 3345169 1904254 668086 -410254 -1326921
39248a326921o58213l13615L204K00086K97443L87080N22166O65496P40330P18783
$$ -1326921 -1985134 -2298749 -2295545 -2095459 -1798016 -1410936 -888770 -223274 517056 1235839
39238A235839O59070O57930P58322Q98076R59768Q83390P25650N98911N55992
$$ 1235839 1894909 2552839 3311161 4209237 5169005 6052395 6778045 7376956 7932948
39229G932948N44454M68945K82443J0882k97636o23552r60649j258887j412555
$$ 7932948 8477402 8946347 9228790 9239672 8942036 8318484 7357835 6098948 4686393
39220D686393j334324j052115p30336n79765p05521r99685j194763j087574p37832
$$ 4686393 3352069 2299954 1569618 989853 284332 -715353 -1910116 -2997690 -3735522
39211c735522l96020k08418o3524K13258N95994R03876J060705J153750J221460
$$ -3735522 -4131542 -4339960 -4403484 -4190226 -3594232 -2690356 -1629651 -475901 745559
39202G45559J143684Q26578L83147K3213j65366k22569j60611O8044M42349Q12833
$$ 745559 1889243 2715821 3098968 3122181 2956815 2734246 2573635 2641679 3084028 3896861
39192C896861J016154J014869R00908P72636O18780L42846p1893m59300o21246
$$ 3896861 4913015 5927884 6828792 7601428 8220208 8563054 8491161 8031861 7410615
39183G410615n77907n43966o17072o38864m65720k29262j55292k30009k67769
$$ 7410615 6832708 6288742 5671670 5032806 4567086 4337824 4182532 3952523 3684754
39174C684754k63598m23892q07993j175414j293370j204307j056432q37721m57239
$$ 3684754 3421156 2997264 2189271 1013857 -279513 -1483820 -2540252 -3377973 -3835212
39165c835212J9397M09066O38316P67259Q17474P41768N69309M27696L81948L66832
$$ -3835212 -3815815 -3406749 -2768433 -2001174 -1183700 -441932 127377 555073 937021 1303853
39155A303853L14156K42171J82466J24637Q2489J07696J63856Q8729k00705n19126
$$ 1303853 1618009 1860180 2042646 2167283 2249772 2357468 2521324 2610053 2409348 1890222
39145A890222n58755k32899K17302M81579M79189L78570L87477N70450Q30236
$$ 1890222 1331467 1098568 1315870 1797449 2276638 2655208 3042685 3613135 4443371
39136D443371J005948R89492P86603M84788J63065j52754m37856o13971o16324
$$ 4443371 5449319 6438811 7225414 7710202 7873267 7720513 7282657 6668686 6052362
39127F052362n26580n61539q45991j206138j270720q22152j5476P77234J295375
$$ 6052362 5525782 4964243 4118252 2912114 1641394 819242 803766 1581000 2876375
39118B876375J515134J495028J213353O25239j56223q14875j020862o92581q6371
$$ 2876375 4391509 5886537 7099890 7725129 7568906 6754031 5733169 5040588 4954217
39109D954217L81427M37465J21939l04038n94404o71649o07207n15701m71284
$$ 4954217 5335644 5773109 5895048 5591010 4996606 4324957 3717750 3202049 2730765
39100B730765m78038m92452m81814m53216m03191k68262M91L05581M38458L14506
$$ 2730765 2252727 1760275 1278461 825245 422054 153792 154283 459864 898322 1212828
39090A212828J18660J29798M07827P16560P53841M12330j62860o96909r64159
$$ 1212828 1331488 1461286 1869113 2585673 3339514 3751844 3588984 2892075 1927916
39081A927916r32232p73217o92722p32282p86300q04359q64941r84889r55211
$$ 1927916 995684 222467 -470255 -1202537 -1988837 -2793196 -3658137 -4643026 -5598237
39072e598237n06253L61132J305602J931433K076547J797766J175809K61480p75617
$$ -5598237 -6104490 -5743358 -4437756 -2506323 -429776 1367990 2543799 2805279 2029662
39063B029662j567275j759870j353794p57064m13128l87325l95709k27466j2400
$$ 2029662 462387 -1297483 -2651277 -3408341 -3821469 -4208794 -4604503 -4831969 -4844369
39054d844369o458k15326l54708j59986L59890R62748J369396J414589J107992
$$ -4844369 -4850827 -5066153 -5420861 -5580847 -5220957 -4258209 -2888813 -1474224 -366232
39045c66232O08621J06175l01646o03797p78070p68187n61831k24477J56792N04002
$$ -366232 242389 348564 46918 -556879 -1334949 -2103136 -2664967 -2889444 -2732652 -2228650
39035b228650P29946P90342P84771Q99093J178700J447830J539357J517393J543409
$$ -2228650 -1498704 -708362 76409 975502 2154202 3602032 5141389 6658782 8202191
39026H202191J575546J369189Q03022O7578n33233q63820r70547r29707q21836
$$ 8202191 9777737 11146926 11949948 12017526 11484293 10620473 9649926 8720219 7898383
39017G898383p98810r89639j291250j403812j186224q75944q04507r45367r33945
$$ 7898383 7099573 6109934 4818684 3414872 2228648 1352704 548197 -397170 -1331115
39008a331115n64365p0343K03169K48633L32354N75650Q20588Q99948Q23195O50483
$$ -1331115 -1895480 -1965823 -1762654 -1514021 -1181667 -606017 214571 1114519 1937714 2588197
38998B588197L93873J48266J28173L97324O80952O42219K92710m7858j71152j75836
$$ 2588197 2982070 3130336 3258509 3655833 4336785 4979004 5271714 5223856 5052704 4876868
38988D876868k31450l32339l72361l41684l41232m49264o35034p62772o46050
$$ 4876868 4645418 4313079 3940718 3599034 3257802 2808538 2173504 1410732 764682
38979G64682j70401N57483J207367J445966J190841O53164J52912j11335j70152
$$ 764682 594281 1151764 2359131 3805097 4995938 5649102 5802014 5690679 5520527
38970E520527k15094m11805p46207j046780j153017j041944p94806m85619j34807
$$ 5520527 5305433 4893628 4147421 3100641 1947624 905680 110874 -374745 -509552
38961e09552K41448N61751O75375M58818m5843n97150r09477q74643o32278m37167
$$ -509552 -268104 293647 969022 1427840 1381997 784847 -124630 -999273 -1631551 -2068718
38951b068718m72338p45353j087273j245230j049673n39305R2185O70366J126032
$$ -2068718 -2541056 -3286409 -4373682 -5618912 -6668585 -7207890 -7115705 -6445339 -5319307
38942e319307J429426J527946J387237J040252N65631O8615k98904l86360j83106
$$ -5319307 -3889881 -2361935 -974698 65554 631185 699800 400896 14536 -168570
38933a68570J37469L71550M40600L47844O3904m21949r60515j284186j230813
$$ -168570 -31101 340449 781049 1128893 1192797 770848 -189667 -1473853 -2704666
38924b704666q53095k89217L75782J060381J581716J710498J339900N61997l98969
$$ -2704666 -3557761 -3846978 -3471196 -2410815 -829099 881399 2221299 2783296 2384327
38915B384327j276395j817722j865812j459343q30081k48602J42237L47109M18300
$$ 2384327 1107932 -709790 -2575602 -4034945 -4865026 -5113628 -4971391 -4624282 -4205982
38906d205982L87505K83741J50670R548j60228l63407n34720n94388n56955n27919
$$ -4205982 -3818477 -3534736 -3384066 -3374518 -3534746 -3898153 -4432873 -5027261 -5584216 -6112135
38896f112135n57351n30130k59754K90047R07526J296596J349626J234065J184415
$$ -6112135 -6669486 -7199616 -7459370 -7169323 -6261797 -4965201 -3615575 -2381510 -1197095
38887a197095J226441J152222P75841J69934l73668n80531l72567J17949O34118
$$ -1197095 29346 1181568 1957409 2127343 1753675 1173144 800577 918526 1552644
38878A552644R27041R04935O80566M25796J85912r2389l61606m32605k07514J37107
$$ 1552644 2479685 3384620 4065186 4490982 4676894 4584505 4222899 3790294 3582780 3719887
38868C719887L09199K04490m7528l04701n39971p25594p41205n20495k24141j24846
$$ 3719887 4029086 4233576 4186048 3881347 3341376 2615782 1874577 1354082 1129941 1005095
38858A005095l03362n60310o68923o24347n69863n52286m77986l05973j56316
$$ 1005095 701733 141423 -527500 -1151847 -1721710 -2273996 -2751982 -3057955 -3214271
38849c214271j65000l10259m57196n26068n41171n42069n20490m35174k33705
$$ -3214271 -3379271 -3689530 -4146726 -4672794 -5213965 -5756034 -6276524 -6711698 -6945403
38840f945403J17011N52672Q85103R44905P61401N27522L81866L09522K64174
$$ -6945403 -6828392 -6275720 -5390617 -4445712 -3684311 -3156789 -2774923 -2465401 -2201227
38831b201227K68428L30661L60268K63617P5177r2074j93614k72849l61686m43504
$$ -2201227 -1932799 -1602138 -1241870 -978253 -903076 -995150 -1188764 -1461613 -1823299 -2266803
38821b266803m99665n09647m11441j60135J45727K90157J68842n0738p9102J87712
$$ -2266803 -2766468 -3276115 -3687556 -3847691 -3701964 -3411807 -3242965 -3293703 -3372805 -3185093
38811c185093N76165Q65243J035453J222163J459733J578941J398673R47095M25844
$$ -3185093 -2608928 -1743685 -708232 513931 1973664 3552605 4951278 5898373 6324217
38802F324217l745l30045o21602r31170j250900j472657j400590r13638j45979
$$ 6324217 6320472 5990427 5368825 4437655 3186755 1714098 313508 -600130 -746109
38793g46109N86856J078795J366619J549470J601824J449943J133293P75767M52693
$$ -746109 -159253 919542 2286161 3835631 5437455 6887398 8020691 8796458 9249151
38784I249151J80251k7720k03454m66610q79234j277509j391198j150483p53988
$$ 9249151 9429402 9401682 9198228 8731618 7852384 6574875 5183677 4033194 3279206
38775C279206m02282q2478L21905Q01604J188793J316539J157603Q32408N15593
$$ 3279206 2876924 2794446 3116351 3917955 5106748 6423287 7580890 8413298 8928891
38766H928891L07215J63459l3043l26502o31802q14603p85459n26503r9758L43400
$$ 8928891 9236106 9399565 9366522 9040020 8408218 7593615 6808156 6281653 6181895 6525295
38756F525295O24404O67763N60078M61211M71832N84345P17909P79321P20078
$$ 6525295 7149699 7817462 8377540 8838751 9310583 9894928 10612837 11392158 12112236
38747A2112236N55094L13000k0225m64799r58088j363948j594766j674781j654193
$$ 12112236 12667330 12980330 12960105 12495306 11537218 10173270 8578504 6903723 5249530
38738E249530j512114j196762p39154k77564L7725J48843J08286J1139q9177k05585
$$ 5249530 3737416 2540654 1801500 1523936 1561661 1710504 1818790 1829929 1740752 1535167
38728A535167l70454n85152q17739j011903j077563r27327n79792j82401J50598
$$ 1535167 1164713 579561 -238178 -1250081 -2327644 -3254971 -3834763 -4017164 -3866566
38719c866566M89909R62878J462935J626181J199270L75930l27597n35660l16040
$$ -3866566 -3376657 -2413779 -950844 675337 1874607 2250537 1922940 1387280 1071240
38710A071240m5021k6880k55769n08641o07943n41648l49975j9333M13006P25939
$$ 1071240 1026219 999339 743570 234929 -373014 -914662 -1264637 -1283970 -870964 -145025
38700a45025O56811K13802k68934m43059k36338J88280O32505R29926R15724M88151
$$ -145025 511786 725588 456654 13595 -222743 -34463 598042 1527968 2443692 2931843
38690B931843k68392j077056j613751j689580j364147r07701n82400m09182j89131
$$ 2931843 2663451 1586395 -27356 -1716936 -3081083 -3988784 -4571184 -4980366 -5169497
38681e169497K27758P59594J185361J318872J072681N07061r0567l26202o9575
$$ -5169497 -4941739 -4182145 -2996784 -1677912 -605231 -98170 -188737 -514939 -584514
38672e84514L64593N46326L75062N9305k42704n34175p64594p69865n13687j92441
$$ -584514 -219921 326405 701467 760772 518068 -16107 -780701 -1550566 -2064253 -2256694
38662b256694K1501K01192N02148Q78649J099530J002446O26593J18770l99120
$$ -2256694 -2235193 -2034001 -1531853 -653204 446326 1448772 2075365 2194135 1795015
38653A795015q62760j222660j399244j308685r78242o11467m37530m65574m78963
$$ 1795015 932255 -290405 -1689649 -2998334 -3976576 -4588043 -5025573 -5491147 -5970110
38644e970110l14351m6888J68205L32620N65155Q82284J145432J219213J085046
$$ -5970110 -6284461 -6331349 -6163144 -5830524 -5265369 -4383085 -3237653 -2018440 -933394
38635i33394P97812M21428K9931k95569n05723n92017n55655m01238j55318J47153
$$ -933394 -135582 285846 315777 20208 -485515 -1077532 -1633187 -2034425 -2189743 -2042590
38625b042590M87517Q34193J099995J181717J049877P65284M17282R4898r5035
$$ -2042590 -1555073 -720880 379115 1560832 2610709 3375993 3793275 3888173 3793138
38616C793138p2753R9208J97604J2760m46593r56298j293473j422559j450349
$$ 3793138 3720385 3819593 4017197 4029957 3583364 2627066 1333593 -88966 -1539315
38607a539315j430634j273351q64100k21901N09069J186958J720471K012728J967536
$$ -1539315 -2969949 -4243300 -5107400 -5329301 -4820232 -3633274 -1912803 99925 2067461
38598B067461J598837J064968N44246J27321j42723k26334j71676j57536l13122
$$ 2067461 3666298 4731266 5275512 5402833 5260110 5033776 4862100 4704564 4391442
38589D391442n20639n36232l24007j44706k61147o47721j045073j217781j089242
$$ 4391442 3870803 3334571 3010564 2865858 2604711 1956990 911917 -305864 -1395106
38580a395106o99841j47084M33154R05307J192886J288350J203352R23669M28662
$$ -1395106 -2094947 -2242031 -1808877 -903570 289316 1577666 2781018 3704687 4133349
38571D133349k19340q01287j032692q30257m73051l73729o42662r75780j026604
$$ 4133349 3914009 3112722 2080030 1249773 776722 402993 -239669 -1215449 -2242053
38562b242053p75529m37170j25308K04326N15556O11634L79808j0973k65305k58436
$$ -2242053 -3017582 -3454752 -3580060 -3375734 -2860178 -2248544 -1868736 -1879709 -2145014 -2403450
38552b403450j01589L9752J04573J29120J63202K19909K75069L03240L30574M43218
$$ -2403450 -2505039 -2465287 -2360714 -2231594 -2068392 -1848483 -1573414 -1270174 -939600 -496382
38542d96382P03562J040285J250018J150262P45662K26585k10880n26099p94615
$$ -496382 207180 1247465 2497483 3647745 4393407 4619992 4409112 3883013 3088398
38533C088398j042881j198853j223272j206987j272734j432327j609305j743584
$$ 3088398 2045517 846664 -376608 -1583595 -2856329 -4288656 -5897961 -7641545
38525g641545j768254j530861r05027k1331P52509J148891J232717J231962J238990
$$ -7641545 -9409799 -10940660 -11845687 -11867018 -11114509 -9965618 -8732901 -7500939 -6261949
38516f261949J177849R76500O38582J99927k44247n00814m27510j32903J21809
$$ -6261949 -5084100 -4107600 -3469018 -3269091 -3513338 -4014152 -4441662 -4574565 -4452756
38507d452756K59899M78991R24413J405712J570427J292389P66291K60601r6965
$$ -4452756 -4192857 -3713866 -2789453 -1383741 186686 1479075 2245366 2505967 2409002
38498B409002l02548l83211l76077l29806k79840k53559l02498m66597o89802
$$ 2409002 2106454 1723243 1347166 1017360 737520 483961 181463 -285134 -974936
38489i74936q46329q94239r31301j024491j039998p60171j81634M02152O70931
$$ -974936 -1821265 -2715504 -3646805 -4671296 -5711294 -6471465 -6653099 -6250947 -5580016
38480e580016N76373L25275J23707J6570n0466j16823j87030k50639k70841j99849
$$ -5580016 -5003643 -4678368 -4554661 -4538091 -4588557 -4705380 -4892410 -5143049 -5413890 -5613739
38470e613739n6758N2849O8636J08361L74410Q86503J368533J475375J132619
$$ -5613739 -5670497 -5617648 -5549012 -5440651 -5066241 -4179738 -2811205 -1335830 -203211
38461b03211O05780K20784N4079p2388l24416o52633q70183q67463o91908m50106
$$ -203211 402569 623353 677432 605044 280628 -372005 -1242188 -2109651 -2801559 -3251665
38451c251665k07310J7568K26099M19842N45769M70688J18727l27222m82373j30882
$$ -3251665 -3458975 -3441407 -3215308 -2795466 -2249697 -1779009 -1660282 -1987504 -2469877 -2600759
38441b600759N09640R85993J039572P75278M73095L44386M28448N90640O15429
$$ -2600759 -2091119 -1105126 -65554 709724 1182819 1527205 1955653 2546293 3161722
38432C161722M04113Q4072j54132k77164l39971k65885P5946N49588P57189M92538
$$ 3161722 3565835 3649907 3495775 3218611 2878640 2612755 2688701 3238289 3995478 4488016
38422D488016N225l35599m73018n67687o15587m32533n875L72645L95239K8257
$$ 4488016 4493241 4157642 3684624 3116937 2501350 2068817 2062942 2435587 2830826 2859083
38412B859083n17699r81149j178928j073513p94093n32985l78954k92270k33070
$$ 2859083 2341384 1360235 181307 -892206 -1686299 -2219284 -2598238 -2890508 -3123578
38403c123578k21917k56097k64981k01306j14370q9337j60206l08527m96520o72248
$$ -3123578 -3345495 -3601592 -3866573 -4067879 -4182249 -4271586 -4431792 -4740319 -5236839 -5909087
38393e909087p80104p81850o41714l24192J12129M41979M29361J07594j95624
$$ -5909087 -6689191 -7471041 -8112755 -8436947 -8324818 -7882839 -7453478 -7345884 -7541508
38384g541508j78622J62300O28610J076731J467945J734748J756628J498263J079050
$$ -7541508 -7720130 -7557830 -6929220 -5852489 -4384544 -2649796 -893168 605095 1684145
38375A684145O67183L62004K04051K25502M08768O07557N95978K65462k31448
$$ 1684145 2351328 2713332 2917383 3142885 3551653 4159210 4755188 5020650 4789202
38366D789202n82074n81164k83817R3126L56157M04550K16330j29491m53681o15193
$$ 4789202 4207128 3625964 3342147 3435273 3791430 4195980 4412310 4282819 3829138 3213945
38356C213945o64593p82675j058276j397269j642928j687485j458985r27925j95777
$$ 3213945 2549352 1766677 708401 -688868 -2331796 -4019281 -5478266 -6406191 -6601968
38347f601968N10249J006110J267198J347258J272871J079036Q55297O59124M43086
$$ -6601968 -6091719 -5085609 -3818411 -2471153 -1198282 -119246 736051 1395175 1838261
38338A838261J60944j05473k25962j94659j25538r8275j03807j24507j58848j55157
$$ 1838261 1999205 1893732 1667770 1473111 1347573 1249298 1145491 1020984 862136 706979
38328G06979k4328K31977M59814M57724J27365m60645j090904j498931j524528
$$ 706979 682651 914628 1374442 1832166 1959531 1498886 407982 -1090949 -2615477
38319b615477j215591p61374l28681k52J62818J11491r6406k80680l03923k22251
$$ -2615477 -3831068 -4592442 -4921123 -4921375 -4758557 -4647066 -4743472 -5024152 -5328075 -5550326
38309e550326k00966k92790l75117l29422k15495j94026k84467k78618M7961O62269
$$ -5550326 -5751292 -6044082 -6419199 -6748621 -6964116 -7158142 -7442609 -7721227 -7673266 -7010997
38299g010997J261910J530055J365901Q95846L48953o4795k54595k98515l46284
$$ -7010997 -5749087 -4219032 -2853131 -1957285 -1608332 -1673127 -1927722 -2226237 -2572521
38290b572521m31967m47798l42804k38661k44612k50871o5341K84619N65324O64079
$$ -2572521 -3004488 -3452286 -3795090 -4033751 -4278363 -4529234 -4594575 -4309956 -3744632 -3080553
38280c080553P24286Q85558J045722R98339O99779K72347j78518o01195q86480
$$ -3080553 -2356267 -1470709 -424987 573352 1273131 1545478 1366960 765765 -120715
38271a20715q78274n36477K307N54386J001626J262942J268263J036889P08194
$$ -120715 -998989 -1535466 -1533159 -978773 22853 1285795 2554058 3590947 4299141
38262D299141M00990P9763l47646q24309j154888j247542j229973j244915j214797
$$ 4299141 4700131 4779894 4432248 3607939 2453051 1205509 -24464 -1269379 -2484176
38253b484176r33016l66068K55471O66591P91184P12811N38367L62913K72172
$$ -2484176 -3417192 -3783260 -3527789 -2861198 -2070014 -1357203 -818836 -455923 -183751
38244a83751K62595K02829q977k60054l03815m1860L67207P07122R19255J062338
$$ -183751 78844 281673 272696 12642 -291173 -333033 34174 741296 1660551 2722889
38234B722889J132388J019318O43372Q3824m40557p07207o27464k94901P7923
$$ 2722889 3855277 4874595 5517967 5601791 5161234 4454027 3826563 3531662 3609585
38225C609585K78423J87428j83921p04016j183174j479383j566234j492778j300740
$$ 3609585 3888008 4075436 3891515 3187499 2004325 524942 -1041292 -2534070 -3834810
38216c834810j019665p17926m73453k54594J15116P98707J729938K574586K939398
$$ -3834810 -4854475 -5572401 -6045854 -6300448 -6185332 -5386625 -3656687 -1082101 1857297
38207A857297K662889J932169J110185M39314o9298m74965p45964q41388q67268
$$ 1857297 4520186 6452355 7562540 8001854 7932556 7457591 6711627 5870239 5002971
38198E002971r86078j165529j178578r16562n59342l24487j65414J21152N49235
$$ 5002971 4016893 2851364 1672786 756224 196882 -127605 -293019 -171867 377368
38189C77368Q89750R71402Q65772P11135N02549J78976j78011l94745m43606m91641
$$ 377368 1267118 2238520 3104292 3815427 4317976 4496952 4318941 3924196 3480590 2988949
38179B988949o71275r04509j013904r23680o69273k81852K02902O34382P96024
$$ 2988949 2317674 1413165 399261 -524419 -1193692 -1475544 -1272642 -638260 157764
38170A57764O35373L49854J55384L6300j72146m98355p61852p93014o02521k83900
$$ 157764 793137 1142991 1298375 1334675 1162529 664174 -97678 -890692 -1493213 -1777113
38160a777113J42196O81118J209071J486456J371247R77719N85629L94091L71073
$$ -1777113 -1634917 -953799 255272 1741728 3112975 4090694 4676323 5070414 5441487
38151E441487L30308J31724k02034n38544p56058q02480o87134m62804k04777
$$ 5441487 5771795 5903519 5701485 5162941 4406883 3604403 2917269 2454465 2249688
38142B249688J5945J18497l0088n52809j367126k098614k321610j926588j191413
$$ 2249688 2265633 2384130 2354042 1801233 434107 -1664507 -3986117 -5912705 -7104118
38133g104118m84350L7450M46984Q72777J339124J706397J755137J413999R09278
$$ -7104118 -7588468 -7551018 -7104034 -6231257 -4892133 -3185736 -1430599 -16600 892678
38124H92678N70039M59313L41062O6519j85969j91513m5066m0933k60297m94394
$$ 892678 1462717 1922030 2263092 2329611 2143642 1952129 1907063 1866130 1605833 1111439
38114A111439n67793n36775n27724n49669n36455m44997k44632P3790M03492N43450
$$ 1111439 543646 6871 -520853 -1070522 -1606977 -2051974 -2296606 -2222816 -1819324 -1275874
38104a275874M10593J63411L4149Q9239K13477K65616J82900m221j83557k36120
$$ -1275874 -865281 -701870 -667721 -578482 -365005 -99389 83511 79290 -104267 -340387
38094c40387j67443j13071j53545k01374j59362j04229j75255l37242m24822m14911
$$ -340387 -507830 -620901 -774446 -975820 -1135182 -1239411 -1414666 -1751908 -2176730 -2591641
38084b591641m74239o85875q88310q76187o34858k69029J92421P78552J420982
$$ -2591641 -3065880 -3751755 -4640065 -5516252 -6151110 -6420139 -6227718 -5449166 -4028184
38075d028184J955631K265025K312940K064009J500853P35265j4055n91886r69772
$$ -4028184 -2072553 192472 2505412 4569421 6070274 6805539 6791484 6199598 5229826
38066E229826j126704r91016n68458l1221M10455O66931P30607N62663J46474
$$ 5229826 4103122 3112106 2543648 2512427 2922882 3589813 4320420 4883083 5029557
38057E029557l67725o99877o70469l47994L8715K80691K81852N2161l34027p83322
$$ 5029557 4661832 3961955 3291486 2943492 2982207 3262898 3544750 3596911 3262884 2479562
38047B479562j211087j539609j704702j693499j545082j267676p82080j3966R54189
$$ 2479562 1268475 -271134 -1975836 -3669335 -5214417 -6482093 -7264173 -7278139 -6323950
38038f323950J869717K451273K527031K094157J338570N79857P6612j64023l21210
$$ -6323950 -4454233 -2002960 524071 2618228 3956798 4536655 4613267 4449244 4128034
38029D128034m84225n24810k93586J29155M55192M38686P0056m34816p86672q01435
$$ 4128034 3643809 3118999 2825413 2954568 3409760 3848446 3918502 3483686 2697014 1895579
38019A895579n08966j23145J00130N460l83826q51372j083174q99735m42829o2851
$$ 1895579 1386613 1263468 1363598 1369058 985232 133860 -949314 -1849049 -2291878 -2354729
38009b354729J5938j37711l23950m15652l55591j02689K83458N97214O89520O86667
$$ -2354729 -2338791 -2476502 -2800452 -3216104 -3571695 -3674384 -3390926 -2793712 -2104192 -1417525
37999a417525Q57283J251675J599760J598772J202720N95377j9553n30231q83503
$$ -1417525 -560242 691433 2291193 3889965 5092685 5688062 5668509 5138278 4254775
37990D254775j034508r55776o86387l57352j27553n7495p0355p3818p9138j39811
$$ 4254775 3220267 2264491 1578104 1220752 1093199 1035704 965349 891531 812393 672582
37980F72582k22889k51545k67508m25207p73739j133794j259622j073764o94488
$$ 672582 449693 198148 -69360 -494567 -1268306 -2402100 -3661722 -4735486 -5429974
37971e429974k89241L4233K40694L68874N25798P96059J100237J175497P76172
$$ -5429974 -5719215 -5684982 -5444288 -5075414 -4549616 -3753557 -2653320 -1477823 -701651
37962g01651n2913r19729j371394j286306r58859p55862p18293n68315r7689N48965
$$ -701651 -754564 -1674293 -3045687 -4331993 -5290852 -6046714 -6765007 -7333322 -7431011 -6882046
37952f882046J030705J186135J167015J205464J330836J359843J118199O08759
$$ -6882046 -5851341 -4665206 -3498191 -2292727 -961891 397952 1516151 2124910
37944B124910j6781n65819q67707q37117n71782l33212l11738m15294l89405j36296
$$ 2124910 2108129 1542310 674603 -162514 -734296 -1067508 -1379246 -1794540 -2183945 -2320241
37934b320241K05460M98038P58577J019369J193402J188055J031080P74673M04411
$$ -2320241 -2114781 -1616743 -858166 161203 1354605 2542660 3573740 4348413 4752824
37925D752824j6276k41979q5230L07123O01302O39794M73686J26643l90936q43211
$$ 4752824 4736548 4494569 4409339 4716462 5317764 5957558 6431244 6557887 6166951 5323740
37915E323740q66787m30624L6134J22708j32061m12896n46497n75909n65710n39204
$$ 5323740 4456953 4026329 4062463 4185171 4053110 3640214 3093717 2517808 1952098 1412894
37905A412894n43008o09404o90273p35483p66787p69517o14563k37049J91366
$$ 1412894 869886 260482 -429791 -1165274 -1932061 -2701578 -3316141 -3553190 -3361824
37896c361824M38202N02425N62157O77769P38851O94835O35245N96609M63777
$$ -3361824 -2923622 -2421197 -1859040 -1181271 -442420 252415 887660 1484269 1948046
37887A948046J42786k89995o74885q92667q43108m31380L02577J097333J616213
$$ 1948046 2090832 1800837 1125952 233285 -609823 -1041203 -738626 358707 1974920
37878A974920J682777J357192Q49159M08939K27463L26621N32476O15519M80291
$$ 1974920 3657697 5014889 5864048 6272987 6500450 6827071 7359547 7975066 8455357
37869H455357K02530j00408l83066o40929q16554q10471o16129l94897l35343
$$ 8455357 8657887 8557479 8174413 7533484 6716930 5906459 5290330 4895433 4560090
37860D560090m27420m53713k48697J01146L81744N14135N94807P07197Q10935
$$ 4560090 4132670 3678957 3430260 3531406 3913150 4427285 5022092 5729289 6540224
37851F540224Q30173P47399N71902K99890m0990l64298n87339o81669o47767n21596
$$ 6540224 7370397 8117796 8689698 8989588 8948598 8584300 7996961 7315292 6667525 6145929
37841F145929m53266o77689j274339j966599k275631j924582j047410P452R91739
$$ 6145929 5692663 5014974 3740635 1774036 -501595 -2426177 -3473587 -3466135 -2474396
37832b474396J817238K387074K523979K129405J344062M72646k39466p21557j018499
$$ -2474396 -657158 1729916 4253895 6383300 7727362 8200008 7960542 7238985 6220486
37823F220486j196760j299144j317123j201967r65039p51013p10979p97174q08695
$$ 6220486 5023726 3724582 2407459 1205492 240453 -510560 -1221539 -2018713 -2827408
37814b827408o78725n71836o08944o41255m47782n4064L23267N80158P73803R03976
$$ -2827408 -3506133 -4077969 -4686913 -5328168 -5775950 -5830014 -5506747 -4926589 -4152786 -3248810
37804c248810Q79882P43598P03879Q39561R37824P58049L35027j06310m33252
$$ -3248810 -2368928 -1625330 -921451 -81890 855934 1613983 1949010 1842700 1409448
37795A409448o61845q02367p92237n66198j14127M74617R43815R52829L97859
$$ 1409448 747603 -54764 -847001 -1413199 -1527326 -1052709 -108894 843935 1241794
37786A241794l75252q36258p65172l81693k5218J21489q67l91735q85948j152468
$$ 1241794 866542 30284 -734888 -1116581 -1141799 -1020310 -1021177 -1412912 -2298860 -3451328
37776c451328r96165o07029l45386k96203j92357J95512P40305J111892J151056
$$ -3451328 -4447493 -5054522 -5399908 -5696111 -5888468 -5692956 -4952651 -3840759 -2689703
37767b689703R76809P61855N31664K30262j03545l30578l84332l60803l69046
$$ -2689703 -1712894 -951039 -419375 -189113 -292658 -623236 -1007568 -1368371 -1737417
37758a737417l35176o3680M65520R42898R69588M47536l30958r67295j246951
$$ -1737417 -2072593 -2136273 -1670753 -727855 241733 689269 358311 -608984 -1855935
37749a855935j156760p67113k13652K86294N67396O89744Q55711J102567J188324
$$ -1855935 -3012695 -3779808 -3993460 -3707166 -3139770 -2450026 -1594315 -491748 696576
37740F96576Q84414L21534p8915l0121L43255O76664P49782O56093O31368P85947
$$ 696576 1580990 1902524 1823609 1793488 2136743 2813407 3563189 4219282 4850650 5636597
37730E636597J033236J238318J352410J358193J157655O49545n8216o46907q98115
$$ 5636597 6669833 7908151 9260561 10618754 11776409 12425954 12367738 11720831 10822716
37721A0822716r21697r50283r77412p87412l53046Q007p78k66827m17716l08909
$$ 10822716 9901019 8950736 7973324 7185912 6832866 6840873 6840095 6573268 6155552 5846643
37711E846643j93394l82723q76745j403608j738421j875624j902055j797787j428240
$$ 5846643 5653249 5270526 4393781 2990173 1251752 -623872 -2525927 -4323714 -5751954
37702e751954p28506J44874Q81476J245533J225936R65041N87709J48992k73816
$$ -5751954 -6480460 -6335586 -5454110 -4208577 -2982641 -2017600 -1429891 -1280899 -1554715
37693a554715n28606m93380k16268J02177K79494K81133J88503R8254R1559K46637
$$ -1554715 -2083321 -2576701 -2792969 -2690792 -2411298 -2130165 -1941662 -1843408 -1751849 -1505212
37683a505212N76837R31876J053757Q23179M29291K12492L23043N87495P19363
$$ -1505212 -928375 3501 1057258 1880437 2309728 2522220 2845263 3432758 4152121
37674D152121N96977L09902J0027k04968k93344k48881j14634J5042L1735j40837
$$ 4152121 4749098 5059000 5069027 4864059 4570715 4321834 4207200 4222242 4253977 4113140
37664D113140n00545r12599j113739q66976j97110N39768Q99367P16696K34875
$$ 4113140 3612595 2699996 1586257 719281 522171 1061939 1961306 2678002 2912877
37655B912877j39761k03684q4012m5811k20530n19662p54192p85552n74298j50507
$$ 2912877 2773116 2569432 2485420 2439609 2219079 1699417 945225 159673 -414625 -565132
37645e65132M03185R34414J235747J145337O81034P3277l73117m84031l01990
$$ -565132 -161947 772467 2008214 3153551 3834585 3907862 3534745 3050714 2748724
37636B748724L052K69483L96315L33570R3793k28092m96472o21027n97728m85377
$$ 2748724 2751776 3021259 3417574 3751144 3844937 3616845 3120373 2499346 1901618 1416241
37626A416241l77479l80476n47133p89279q93774o83611j75124M40640R60941
$$ 1416241 1038762 658286 111153 -678126 -1571900 -2255511 -2430635 -1989995 -1029054
37617a029054J286488J391467J259900R22699N33251L03384L01268L61008K68810
$$ -1029054 257434 1648901 2908801 3831500 4364751 4668135 4969403 5330411 5599221
37608E599221J7510k09691l03313l56598m75371n71497m75412k17598o0449k08055
$$ 5599221 5616731 5407040 5103727 4747129 4271758 3700261 3224849 3007251 2946802 2738747
37598B738747n55148p60230n33411J37174R62386J529364J587963J236533P99309
$$ 2738747 2183599 1423369 889958 1027132 1989518 3518882 5106845 6343378 7142687
37589G142687M80717J78787l10255r45257j393131j359858r18681m61453l35262
$$ 7142687 7623404 7802191 7491936 6546679 5153548 3793690 2875009 2413556 2078294
37580B078294n60398q93206j094626j086930r05652o25480l74659l14578m89790
$$ 2078294 1517896 624690 -469936 -1556866 -2462518 -3087998 -3462657 -3777235 -4267025
37571d267025p21440p42654m50305K4975M67880P15161O76103L62591m0110k35229
$$ -4267025 -4988465 -5731119 -6181424 -6156449 -5688569 -4973408 -4297305 -3934714 -3974824 -4210053
37561d210053n3668L82928P83902R46859Q57022N79164J41413m36286j026466
$$ -4210053 -4263721 -3880793 -3096891 -2150032 -1293010 -713846 -572433 -1008719 -2035185
37552b035185j368607j236842o78843m6455K86606K40652L1682q6289J2360L54807
$$ -2035185 -3403792 -4640634 -5319477 -5365932 -5079326 -4838674 -4806992 -4893281 -4880921 -4526114
37542d526114Q78654J367691J553800J399380J165772J086025J070517Q68730
$$ -4526114 -3647460 -2279769 -725969 673411 1839183 2925208 3995725 4864455
37534D864455M31265n7034m49310p49008r49752r61036p73927n63141n15090o21576
$$ 4864455 5295720 5238686 4789376 4040368 3090616 2129580 1355653 792512 277422 -344154
37524c44154p24504p16917o29867n51685n24617n16503m60520l22773j36150M5981
$$ -344154 -1068658 -1785575 -2415442 -2967127 -3491744 -4008247 -4468767 -4791540 -4927690 -4881709
37514d881709K17662M05118N94065P30201P99357Q44128Q76432Q36543O87823
$$ -4881709 -4664047 -4258929 -3664864 -2934663 -2135306 -1291178 -414746 421797 1109620
37505A109620N08218M18513M13548L07854j08340q28214j540296j830446j528995
$$ 1109620 1617838 2036351 2449899 2757753 2649413 1821199 280903 -1549543 -3078538
37496c078538q50364j58067L65063P49003J009601J056088Q61443N76860L75463
$$ -3078538 -3928902 -4086969 -3721906 -2972903 -1963302 -907214 -45771 531089 906552
37487I06552K68713J66623L1447j38440l88052p05434q82782o72234j19040M26960
$$ 906552 1175265 1341888 1373335 1234895 846843 141409 -741373 -1413607 -1532647 -1105687
37477a105687P13017Q56576J102917J428338J559388J355345J003818P96610Q29359
$$ -1105687 -392670 463906 1566823 2995161 4554549 5909894 6913712 7710322 8539681
37468H539681R83331J113658J164107J128585R83319O83332K10216l78478r48245
$$ 8539681 9523012 10636670 11800777 12929362 13912681 14596013 14806229 14427751 13479506
37459A3479506j356934j534581j486296j245777q91042o02188n92779q95543j261138
$$ 13479506 12122572 10587991 9101695 7855918 6964876 6362688 5769909 4874366 3613228
37450C613228j362618j102658o64127k73648J0183K71191N81722R21428J215899
$$ 3613228 2250610 1147952 483825 210177 220360 491551 1073273 1994701 3210600
37441C210600J419690J558695J680294J752790J662125J366286J013642Q10233
$$ 3210600 4630290 6188985 7869279 9622069 11284194 12650480 13664122 14474355
37433A4474355P69212O91235M18380J3395l50849n79382o67982o25829m91511
$$ 14474355 15243567 15934802 16353182 16366577 16015728 15436346 14768364 14142535 13651024
37424A3651024l70290l44034l65106l35733k77003l11179m60471n67656m77026
$$ 13651024 13280734 12936700 12571594 12235861 11958858 11647679 11187208 10619552 10142526
37415A0142526k33401l0344J9857j434M3102J41976J30080r7182m20649o03406
$$ 10142526 9909125 9878781 9898638 9897204 9940306 10082282 10212362 10115180 9694531 9091125
37405I091125n28409k62692P7854M02554N73326M19365o0980n98381q66445p52088
$$ 9091125 8562716 8300024 8377878 8780432 9353758 9773123 9712143 9113762 8247317 7495229
37395G495229l45756K22106P78420J025713P06372q5652r09377j371061j419634
$$ 7495229 7149473 7371579 8149999 9175712 9882084 9796432 8887055 7515994 6096360
37386F096360j221687q97077m88011q1799J92511K87942K77111K65866L13188
$$ 6096360 4874673 3977596 3489585 3407786 3600297 3888239 4165350 4431216 4744404
$$ [...]
##END NTUPLES=NMR SPECTRUM
##END=
