##TITLE=31Pdec_E3eN3-2
 CDCl3
  64 sc
 25.12.2023
##JCAMPDX= 6.0         $$ Bruker NMR JCAMP-DX V2.0
##DATA TYPE= NMR SPECTRUM
##DATA CLASS= NTUPLES
##ORIGIN= UXNMR, Bruker Analytische Messtechnik GmbH
##OWNER= root
$$ XWIN-NMR		Version 3.5
$$ Mon Dec 25 14:32:09 2023 Russian Standard Time (UT+4h)  she@DPX200
##.OBSERVE FREQUENCY= 81.013821
##.OBSERVE NUCLEUS= ^31P
##.ACQUISITION MODE= SIMULTANEOUS
##.ACQUISITION SCHEME= undefined
##.AVERAGES= 24
##.DIGITISER RES= 16
##SPECTROMETER/DATA SYSTEM= spect
##.PULSE SEQUENCE= zgpg30
##.SOLVENT NAME= CDCl3
##.SHIFT REFERENCE= (INTERNAL, CDCl3, 0, 248.564)
##AUDIT TRAIL= $$ (NUMBER, WHEN, WHO, WHERE, WHAT)
$$ ##TITLE= Audit trail, XWIN-NMR		Version 3.5
$$ ##JCAMPDX= 5.01
$$ ##ORIGIN= Bruker BioSpin GmbH
$$ ##OWNER= she
$$ F:/spectra/data/she/nmr/P31/1/pdata/1/auditp.txt
$$ ##AUDIT TRAIL=  $$ (NUMBER, WHEN, WHO, WHERE, WHAT)
(   1,<2023-12-25 14:30:57.45 +0400>,<she>,<DPX200>,
      <created by zg, POWCHK disabled, PULCHK disabled
       configuration hash MD5:
       00 E9 B6 7A A2 85 ED C7 34 08 36 98 17 FE 4E 26
       data hash MD5: 32K
       A1 AB 99 BA CB 8B 2A F0 B6 9D 80 D8 6D A9 D7 18>)
(   2,<2023-12-25 14:31:00.28 +0400>,<she>,<DPX200>,
      <Start of raw data processing
       efp BC_mod = 2 LB = 10 FT_mod = 6 PKNL = 1 PHC0 = -12788.13 PHC1 = 1541.694 SI = 64K 
       data hash MD5: 64K
       47 BD 40 B3 A9 D2 2B 89 8B B0 7B 83 67 75 D9 F9>)
(   3,<2023-12-25 14:31:16.32 +0400>,<she>,<DPX200>,
      <pk PHC0 = -2.536212 PHC1 = 0 
       data hash MD5: 64K
       30 A4 F7 FF FC 00 AE CB 66 4F FB 57 23 0C 50 0D>)
(   4,<2023-12-25 14:31:36.57 +0400>,<she>,<DPX200>,
      <pk PHC0 = -1.2 PHC1 = 0 
       data hash MD5: 64K
       42 B6 3D 1C 7B 16 63 02 E8 E9 34 9A CB 1E 6E 6B>)
(   5,<2023-12-25 14:31:39.90 +0400>,<she>,<DPX200>,
      <abs ABSG = 5 
       data hash MD5: 64K
       C7 F1 5F E1 C1 95 15 26 91 0D 29 43 7F BA 3E F3>)
$$ ##END=
$$ 
$$ hash MD5
$$ 14 23 04 A0 0E 32 D3 5F 00 25 EF 52 37 28 6E 89
##$RELAX= 
##$RELAX= 
##$RELAX= 
##$RELAX= 
##$RELAX= 
##$RELAX= 
##$RELAX= 
##$RELAX= 
##$RELAX= 
$$ Bruker specific parameters
$$ --------------------------
##$DU= <F:/spectra>
##$EXPNO= 1
##$NAME= <P31>
##$PROCNO= 1
##$TYPE= <nmr>
##$USER= <she>
##$AMP= (0..31)
100 100 100 100 100 100 100 100 100 100 100 100 100 100 100 100 100 100 
100 100 100 100 100 100 100 100 100 100 100 100 100 100 
##$AQSEQ= 0
##$AQ_mod= 1
##$AUNM= <au_zg>
##$AUTOPOS= <>
##$BF1= 81.014009
##$BF2= 200.13
##$BF3= 200.13
##$BF4= 200.13
##$BF5= 200.13
##$BF6= 200.13
##$BF7= 200.13
##$BF8= 200.13
##$BYTORDA= 1
##$CFDGTYP= 0
##$CFRGTYP= 5
##$CHEMSTR= <none>
##$CNST= (0..31)
1 1 145 1 1 1 1 1 1 1 1 1 1 1 1 1 1 1 1 1 1 1 1 1 1 1 1 1 1 1 1 1 
##$CPDPRG= <waltz16>
##$CPDPRG1= <>
##$CPDPRG2= <waltz16>
##$CPDPRG3= <>
##$CPDPRG4= <mlev>
##$CPDPRG5= <mlev>
##$CPDPRG6= <mlev>
##$CPDPRG7= <mlev>
##$CPDPRG8= <mlev>
##$CPDPRGB= <>
##$CPDPRGT= <>
##$D= (0..31)
0 1 0 0 0 0 0 0 0 0 0 0.03 2e-05 3e-06 0 0 0 0 0 0 0 0 0 0 0 0 0 0 0 0 
$$ [...]
##$SUBNAM3= <"">
##$SUBNAM4= <"">
##$SUBNAM5= <"">
##$SUBNAM6= <"">
##$SUBNAM7= <"">
##$SUBNAM8= <"">
##$SUBNAM9= <"">
##$SW= 501.771253377433
##$SWIBOX= (0..15)
0 1 3 0 0 0 0 0 0 0 0 0 0 0 0 0 
##$SW_h= 40650.406504065
##$TD= 32768
##$TD0= 1
##$TE= 0
##$TE2= 300
##$TE3= 300
##$TEG= 300
##$TL= (0..7)
0 120 53 12 22 120 120 120 
##$TP= (0..7)
150 150 150 150 150 150 150 150 
##$TP07= 0
##$TPNAME0= <>
##$TPNAME1= <>
##$TPNAME2= <>
##$TPNAME3= <>
##$TPNAME4= <>
##$TPNAME5= <>
##$TPNAME6= <>
##$TPNAME7= <>
##$TPOAL= (0..7)
0.5 0.5 0.5 0.5 0.5 0.5 0.5 0.5 
##$TPOFFS= (0..7)
0 0 0 0 0 0 0 0 
##$TUNHIN= 0
##$TUNHOUT= 0
##$TUNXOUT= 0
##$USERA1= <user>
##$USERA2= <user>
##$USERA3= <user>
##$USERA4= <user>
##$USERA5= <user>
##$V9= 5
##$VALIST= <valist>
##$VCLIST= <CCCCCCCCCCCCCCC>
##$VD= 0
##$VDLIST= <DDDDDDDDDDDDDDD>
##$VPLIST= <PPPPPPPPPPPPPPP>
##$VTLIST= <TTTTTTTTTTTTTTT>
##$WBST= 1024
##$WBSW= 4
##$XGAIN= (0..3)
0 0 0 0 
##$XL= 0
##$YL= 0
##$YMAX_a= 2819
##$YMIN_a= -2615
##$ZGOPTNS= <>
##$ZL1= 120
##$ZL2= 120
##$ZL3= 120
##$ZL4= 120
##$ABSF1= 248.5645
##$ABSF2= -253.2056
##$ABSG= 5
##$ABSL= 3
##$ALPHA= 0
##$AQORDER= 0
##$ASSFAC= 0
##$ASSFACI= 0
##$ASSFACX= 0
##$ASSWID= 0
##$AUNMP= <proc_1d>
##$AZFE= 0.1
##$AZFW= 0.5
##$BCFW= 0
##$BC_mod= 2
##$BYTORDP= 0
##$COROFFS= 0
##$CY= -3
##$DATMOD= 1
##$DC= 0
##$DFILT= <>
##$DTYPP= 0
##$F1P= 0
##$F2P= 0
##$FCOR= 1
##$FTSIZE= 65536
##$FT_mod= 6
##$GAMMA= 0
##$GB= 0
##$INTBC= 1
##$INTSCL= 6.047779e-11
##$ISEN= 30
##$LB= 10
##$LEV0= 0
##$LPBIN= 0
##$MAXI= 10000
##$MC2= 0
##$MEAN= 0
##$ME_mod= 0
##$MI= 50
##$NCOEF= 0
##$NC_proc= -8
##$NLEV= 6
##$NOISF1= 182.463
##$NOISF2= 159.3651
##$NSP= 0
##$NTH_PI= 0
##$NZP= 0
##$OFFSET= 248.5645
##$PC= 4
##$PHC0= -12791.87
##$PHC1= 1541.694
##$PH_mod= 1
##$PKNL= yes
##$PPARMOD= 0
##$PSCAL= 0
##$PSIGN= 0
##$REVERSE= no
##$SF= 81.0140089999694
##$SI= 65536
##$SIGF1= 159.3651
##$SIGF2= -187.1042
##$SINO= 113.3802
##$SIOLD= 16384
##$SREGLST= <1H.CDCl3>
##$SSB= 0
##$STSI= 65536
##$STSR= 0
##$SW_p= 40650.406504065
##$SYMM= 0
##$S_DEV= 0
##$TDeff= 32768
##$TDoff= 0
##$TI= <>
##$TILT= no
##$TM1= 0
##$TM2= 0
##$TOPLEV= 0
##$USERP1= <user>
##$USERP2= <user>
##$USERP3= <user>
##$USERP4= <user>
##$USERP5= <user>
##$WDW= 1
##$XDIM= 65536
##$YMAX_p= 318983329
##$YMIN_p= -24451090
$$ End of Bruker specific parameters
$$ ---------------------------------
##NTUPLES= NMR SPECTRUM
##VAR_NAME=  FREQUENCY,     SPECTRUM/REAL,   SPECTRUM/IMAG
##SYMBOL=    X,             R,               I
##VAR_TYPE=  INDEPENDENT,   DEPENDENT,       DEPENDENT
##VAR_FORM=  AFFN,          ASDF,            ASDF
##VAR_DIM=   65536,         65536,           65536
##UNITS=     HZ,            ARBITRARY UNITS, ARBITRARY UNITS
##FACTOR=    0.620285442955139, 1,           1
##FIRST=     20137.2065510682, 0,            0
##LAST=      -20513.1999529968, 0,           0
##MIN=       -20513.1999529968, -24451090,   0
##MAX=       20137.2065510682, 318983329,    0
$$ Real data points
##PAGE= N=1
##DATA TABLE= (X++(R..R)), XYDATA
$$ [...]
41907 -338196 -248879 -141630 -19531 113368 253478 398893 549937 708846 878609 1061066
41897 1061066 1255086 1455825 1655237 1842955 2006889 2134127 2213283 2238138 2210765 2141941
41887 2141941 2048144 1946382 1849332 1763168 1688921 1626073 1575708 1541068 1525471 1529508 1549452
41876 1549452 1577418 1602630 1613387 1599848 1557232 1487663 1398683 1298592 1191332 1074297 940335
41865 940335 782492 598719 394369 181745 -22592 -201303 -339349 -426259 -457815 -437159
41855 -437159 -374623 -285541 -186219 -89657 -3188 70850 132212 179855 211002 222498 213275 186298
41843 186298 148892 111348 84367 76220 90522 125272 173576 225855 272558 305992 320562 311953
41831 311953 276659 212761 121668 9711 -111377 -225431 -313888 -358332 -343095 -257760 -99352
41820 -99352 126179 403696 710120 1017154 1295280 1518538 1669196 1741006 1739862 1681277
41810 1681277 1585105 1469111 1343887 1211400 1067901 909671 738647 564950 405043 276468
41800 276468 191925 155707 163901 207482 276059 360342 452781 547135 637904 720055 788890 839865
41788 839865 868549 871061 845066 791039 713281 620125 522852 433275 360788 310001 279795 263845
41776 263845 252266 233902 198702 139630 53821 -56933 -186331 -324631 -460738 -584748
41766 -584748 -689792 -772118 -829254 -857403 -850097 -799642 -700915 -555123 -371190 -164204 47783
41755 47783 247063 418831 552882 644640 695692 713672 710727 699854 689893 681457 666188 630058
41743 630058 559125 445142 288629 98597 -110320 -321460 -519096 -690555 -827901 -929051
41733 -929051 -997440 -1039718 -1062159 -1067401 -1052913 -1011565 -934029 -812174 -642320 -427053 -174956
41722 -174956 101107 385706 661548 909606 1109904 1243839 1297665 1265859 1153067 973931
41712 973931 750862 510175 277091 70434 -101408 -241378 -360493 -471606 -583069 -695246
41702 -695246 -801040 -889272 -948586 -970155 -948902 -884051 -779608 -644458 -491403 -335110
41692 -335110 -189802 -67809 20700 67429 66311 15028 -83187 -219116 -379165 -548063 -710896
41681 -710896 -853759 -963723 -1029103 -1040446 -991936 -882692 -717458 -506183 -262509 -1681
41671 -1681 261305 512631 739475 929230 1069392 1149075 1161869 1108420 996912 840899
41661 840899 655486 453770 245370 37628 -161862 -343735 -497684 -614872 -689890 -721133
41651 -721133 -710036 -660257 -577367 -468806 -343458 -210376 -76801 53801 182878 316611
41641 316611 464380 635885 837159 1066446 1311643 1550963 1757346 1905404 1978209 1971073
41631 1971073 1890921 1752125 1571472 1364803 1146357 929923 730050 561801 438909 371294
41621 371294 363078 411620 507485 635383 776255 910330 1020524 1095315 1130384 1128456 1097210
41610 1097210 1045959 982434 910772 830950 739532 631714 504384 359262 204778 56139
41600 56139 -66045 -138196 -137284 -45323 146113 432999 798709 1216685 1654907 2080796 2465465
41589 2465465 2786776 3031088 3193426 3275785 3283861 3223766 3100650 2920040 2690736 2427002
41579 2427002 2148233 1875878 1628978 1420510 1256179 1135519 1053565 1001640 967717 937896
41569 937896 899399 843257 764716 661562 532612 378078 201192 8875 -190025 -388297
41559 -388297 -583440 -778126 -977510 -1185067 -1399441 -1613589 -1815312 -1987637 -2108994 -2155109
41549 -2155109 -2104100 -1943366 -1674624 -1314279 -889700 -434266 16766 429885 777660 1043494
41539 1043494 1224706 1331705 1383022 1398206 1391699 1370097 1333357 1278485 1203439 1109454 1001377
41528 1001377 886657 774071 673197 594927 551921 557242 620282 741734 910918 1107637
41518 1107637 1307572 1488038 1631819 1729049 1778218 1786388 1767680 1739504 1717643 1712175 1726011
41507 1726011 1756577 1799730 1853560 1919475 1999659 2092788 2191258 2281673 2347834 2374203 2348692
41496 2348692 2264923 2124378 1938140 1727093 1519243 1343856 1224081 1171248 1183539 1249170
41486 1249170 1351840 1475535 1607086 1736370 1854995 1954783 2027259 2064701 2062243 2019983
41476 2019983 1944058 1846318 1742352 1648022 1575291 1528976 1505852 1496373 1487784 1467078 1422970
41465 1422970 1346891 1233253 1079198 884189 649710 379106 77374 -248812 -590096 -932505
41455 -932505 -1256472 -1539052 -1759619 -1906372 -1979972 -1992386 -1962108 -1908641 -1848920 -1796730 -1763966
41444 -1763966 -1761264 -1796080 -1868778 -1969618 -2079544 -2175134 -2235296 -2246618 -2205528 -2117159 -1991886
41433 -1991886 -1841124 -1674204 -1497641 -1316602 -1137063 -967122 -817019 -698110 -621271 -594910
41423 -594910 -622948 -703407 -828115 -983699 -1153513 -1320044 -1467241 -1582485 -1658028 -1691740
41413 -1691740 -1687063 -1652285 -1599513 -1543273 -1498389 -1476993 -1485566 -1523618 -1584737 -1659571 -1739469 -1819649
41401 -1819649 -1900905 -1988993 -2091591 -2213822 -2354323 -2503557 -2645320 -2760991 -2834914 -2858797
41391 -2858797 -2833532 -2768400 -2678447 -2580948 -2491621 -2421504 -2375461 -2352675 -2348595 -2357457 -2374575 -2397680
41379 -2397680 -2426664 -2461786 -2501334 -2540165 -2569861 -2580293 -2562020 -2508782 -2419379 -2298199 -2154151
41368 -2154151 -1998361 -1841529 -1691574 -1551878 -1420365 -1289887 -1150480 -993304 -815030
41359 -815030 -620785 -424125 -243551 -96474 7081 68015 97099 110121 122240 144374
41349 144374 182290 237256 306952 386218 468013 544952 611208 663971 703629 732518 753019
41338 753019 766005 770183 762686 741010 705585 661278 616214 578210 550965 532268 515032 490229
41326 490229 450314 391910 316989 232272 146973 69716 6039 -42105 -74782 -92187 -94309 -82274
41314 -82274 -59560 -31644 -4396 17248 29670 30266 17026 -11811 -57878 -122433 -205685 -305924
41302 -305924 -418723 -536541 -649129 -745012 -813906 -849591 -852429 -830480 -798112 -772010 -766009
41291 -766009 -787137 -834547 -901518 -979239 -1060320 -1140096 -1215138 -1280519 -1328349 -1348915 -1333613
41280 -1333613 -1277709 -1181396 -1048860 -886138 -699283 -494321 -279178 -65898 128992 286757
41270 286757 390418 428812 399487 309676 175013 16411 -143892 -286000 -395103 -463014
41260 -463014 -488228 -474543 -428922 -359670 -275533 -185315 -97223 -17672 50058 106621 156455
41249 156455 206505 263815 332597 411989 495655 573339 633427 665599 663293 625886 559996 478934
41237 478934 400080 341055 316079 333625 395774 499430 639148 810755 1013998 1252369
41227 1252369 1529474 1843715 2184525 2532585 2863702 3153921 3383431 3538528 3612238 3604458
41217 3604458 3521963 3378116 3191753 2984647 2777653 2586828 2421505 2285262 2178691 2101610
41207 2101610 2053254 2031108 2030529 2046450 2076328 2121927 2188371 2281133 2403338 2555274 2735791
41196 2735791 2943611 3176911 3431357 3698402 3965522 4218632 4445543 4638794 4796864
41187 4796864 4923488 5025489 5109943 5181741 5242351 5289965 5320505 5328870 5310268 5261818 5183893
41176 5183893 5080235 4956159 4815660 4659436 4485250 4290249 4073414 3836744 3585210
41167 3585210 3326541 3071218 2831941 2621609 2449949 2320129 2226834 2156578 2090294 2007644
41157 2007644 1891985 1734469 1536012 1306792 1063752 826941 615563 444731 323650
41148 323650 255266 236739 260188 313718 382968 453304 512419 552779 573003 577287 572864 566624
41136 566624 562468 560346 556939 547573 528868 501294 470294 444843 433528 439874 459531 481131
41124 481131 490519 475992 431786 358454 260817 145208 17463 -117650 -255521 -389883 -511466
41113 -511466 -608512 -669721 -688230 -664330 -605311 -522834 -429761 -338385 -260339 -206789 -187081
41102 -187081 -205613 -258775 -334579 -415824 -485131 -529176 -540583 -517683 -463079 -381869 -280284
41091 -280284 -165383 -45862 66908 158894 215251 223670 177955 80060 -60619 -230493 -415832
41080 -415832 -605555 -791871 -969283 -1133262 -1279565 -1404553 -1506209 -1584957 -1643509 -1685536
41070 -1685536 -1714007 -1730375 -1735142 -1729334 -1715741 -1699153 -1685572 -1680780 -1688682 -1709744 -1740277 -1773493
41058 -1773493 -1802502 -1823925 -1839906 -1857134 -1883211 -1922258 -1972033 -2024042 -2066566 -2088964 -2085103
41047 -2085103 -2054525 -2001417 -1932436 -1854349 -1772018 -1686951 -1596808 -1496270 -1379290 -1241785 -1083390
41036 -1083390 -907384 -719124 -524222 -327615 -133804 52401 225721 381284 515946
41027 515946 628725 719633 787681 829580 840058 813430 745503 635267 486126 306283 108082
41016 108082 -93510 -282776 -445255 -569955 -651430 -690759 -694579 -672390 -633403 -584221 -527894
41005 -527894 -464146 -390444 -303598 -201409 -83674 47799 189688 337228 483581 619302
40995 619302 733045 813548 851659 841053 777820 660381 490759 276307 29985 -231687
40985 -231687 -491840 -735608 -950775 -1127502 -1258430 -1339641 -1371794 -1360095 -1312539 -1237144
40975 -1237144 -1140083 -1026165 -901297 -775083 -661794 -579163 -545486 -575687 -677182 -846586
40965 -846586 -1068782 -1319480 -1570979 -1798771 -1985836 -2122749 -2204779 -2229111 -2194385 -2102211
40955 -2102211 -1958688 -1774382 -1562531 -1336239 -1105727 -876774 -651166 -428975 -211440
40946 -211440 -2807 189826 358492 496894 602261 675988 723296 752185 771426 787730
40936 787730 803253 815275 818848 811133 794755 777992 771580 783918 817239 866602 921754 970639
40924 970639 1002875 1012148 997162 961255 910926 853612 795261 738765 684174 630576 578244 529557
40912 529557 488083 456588 435033 419415 402341 375638 334258 279315 218252 161834 119803
40901 119803 97890 97918 120687 169293 250013 369543 529998 724455 935239 1135531 1293816
40890 1293816 1380366 1374323 1269232 1074951 815138 521423 226476 -41700 -262856 -424994
40880 -424994 -523535 -560594 -544842 -490955 -417232 -341289 -275464 -224279 -185161 -151575 -116409
40869 -116409 -73907 -19927 48238 131200 225896 324186 412956 476273 499122 471557 391500
40858 391500 264771 102245 -84049 -283420 -486713 -685581 -872588 -1042342 -1192195 -1321451
40848 -1321451 -1429624 -1515293 -1576583 -1612933 -1626850 -1624286 -1613079 -1599991 -1587861 -1574452 -1553740
40837 -1553740 -1519039 -1466312 -1395996 -1312691 -1223440 -1136055 -1058463 -998670 -964385 -961722 -993464
40826 -993464 -1058163 -1150754 -1264172 -1390714 -1522380 -1650658 -1766876 -1863666 -1936996 -1987653
40816 -1987653 -2021070 -2045015 -2066013 -2086505 -2104785 -2117625 -2123217 -2121696 -2112781 -2092550 -2052063 -1979223
40804 -1979223 -1863335 -1700245 -1495336 -1262516 -1019688 -783329 -564976 -370375 -199989
40795 -199989 -49445 89911 229070 377470 538968 710510 884939 1056056 1222180 1385553
40785 1385553 1548332 1708390 1857848 1985160 2079305 2133885 2149487 2133788 2099612 2061512
40775 2061512 2031661 2016417 2015195 2022260 2030281 2033285 2027505 2010478 1980178 1935432 1877286 1809792
40763 1809792 1738956 1670175 1605800 1544476 1482459 1415833 1342187 1261032 1173082 1079079 978993
40752 978993 872144 758361 639489 520315 407980 309788 230286 169132 120868 76589
40742 76589 26553 -37293 -119515 -220599 -337897 -467718 -607232 -754611 -907038 -1057814
40732 -1057814 -1194582 -1300035 -1355046 -1343048 -1254319 -1088948 -857618 -579725 -279235 20090
40722 20090 298287 540745 738396 887552 989675 1050577 1078655 1082619 1069651 1045050 1013593
40711 1013593 981743 958940 956552 984638 1048335 1145918 1269508 1408045 1551135 1691913 1827610
40700 1827610 1957733 2081416 2195999 2297655 2383273 2451702 2503229 2537613 2552325 2542449 2502388
40689 2502388 2428213 2319157 2177792 2009161 1819427 1614262 1397474 1170623 934403 691432
40679 691432 448824 218523 14526 -151700 -274909 -356918 -404884 -428936 -440486 -450797
40669 -450797 -468914 -499355 -541024 -588277 -633544 -670237 -695096 -709510 -719152 -731343 -750685 -774985
40657 -774985 -793710 -789869 -744471 -641733 -473582 -242456 38427 347850 661712 958382
40647 958382 1222038 1443335 1618301 1746580 1829569 1868974 1866599 1825204 1748931 1641835 1505374
40636 1505374 1337465 1134436 894565 620509 319408 1413 -322096 -639951 -942267
40627 -942267 -1221010 -1469786 -1682848 -1853779 -1974601 -2035958 -2028682 -1946820 -1791374 -1573112
40617 -1573112 -1312606 -1036882 -774147 -548913 -378584 -271298 -224848 -227461 -261175 -306939
40607 -306939 -349316 -378741 -390882 -384201 -357922 -312227 -250828 -183822 -128190 -104744 -132507 -222725
40595 -222725 -374630 -574457 -798204 -1017409 -1206081 -1346515 -1432036 -1465724 -1456003 -1411587
40585 -1411587 -1338455 -1239861 -1118223 -977249 -823366 -666374 -519093 -395710 -309003 -267270
40575 -267270 -271843 -315683 -383476 -453875 -504086 -515738 -479675 -397407 -278780 -137694 11747
40564 11747 157478 290328 404150 495420 562583 605739 626891 630103 620640 603265 580849
40553 580849 554111 522316 484300 439640 389719 337855 287879 241895 199252 157750 115910
40542 115910 74087 33898 -2556 -32193 -49762 -48041 -20557 34339 110757 195978 274597 333850
40530 333850 367256 375014 361858 334297 298573 259458 219654 179874 139629 98088 54016 4380
40518 4380 -57624 -143558 -268258 -445497 -682189 -973813 -1303570 -1646016 -1973898 -2265418
40508 -2265418 -2509046 -2703957 -2856409 -2974532 -3064462 -3129375 -3170964 -3191651 -3195835 -3189053 -3175342
40497 -3175342 -3154518 -3121261 -3066439 -2979222 -2848586 -2664499 -2419877 -2113316 -1750785 -1344713
40487 -1344713 -910843 -464842 -20341 411515 821854 1203740 1551747 1861311 2128218
40478 2128218 2348733 2520343 2642497 2716779 2746400 2735425 2688146 2608779 2501574 2371397
40468 2371397 2224813 2071220 1923096 1794425 1697336 1638437 1616799 1624592 1649467 1677146 1693670
40457 1693670 1687807 1653728 1592949 1514223 1431340 1359843 1313597 1301602 1325519 1378841 1448338
40446 1448338 1517300 1569353 1591618 1576594 1522535 1432638 1313420 1172606 1016545 847651
40436 847651 663348 457855 226294 -31411 -309329 -597257 -883643 -1158013 -1412472 -1642594
40426 -1642594 -1847647 -2029764 -2192087 -2336626 -2462904 -2567943 -2647521 -2697970 -2717526 -2706422
40416 -2706422 -2665716 -2595767 -2495592 -2363812 -2200850 -2011204 -1804329 -1593193 -1390819 -1206211
40406 -1206211 -1041536 -891910 -747986 -600571 -445448 -286053 -132581 1885 105892
40397 105892 172593 200778 194723 163476 119382 75529 42432 24999 21029 22118 16774 -5622
40385 -5622 -51700 -122854 -215681 -323476 -438101 -551802 -658819 -756523 -845738 -929610 -1011093
40374 -1011093 -1090358 -1163852 -1225436 -1268278 -1286133 -1274098 -1229702 -1154281 -1053496 -936368 -813348
40363 -813348 -694475 -588059 -499833 -432647 -386779 -360635 -351263 -354323 -363847 -372461 -372779 -359899
40351 -359899 -334148 -302595 -278407 -278098 -317696 -408981 -556639 -756910 -998078 -1262459 -1529124
40340 -1529124 -1776560 -1985110 -2139470 -2230847 -2257736 -2224552 -2138929 -2009615 -1846370 -1661227
40330 -1661227 -1469084 -1286189 -1126918 -1000642 -910183 -852243 -819300 -802162 -792235 -782785 -769268
40319 -769268 -749648 -725284 -701544 -686489 -687381 -707171 -743552 -791104 -844595 -900966 -958913 -1016570
40307 -1016570 -1068932 -1106939 -1119369 -1096756 -1035041 -937003 -811539 -671883 -533551 -411918
40297 -411918 -319532 -263697 -245039 -257671 -291339 -335234 -381825 -428450 -475902 -525488 -576945
40286 -576945 -628346 -677317 -722403 -763729 -802735 -840939 -878191 -911283 -933912 -938400 -918449 -871342
40274 -871342 -798085 -701349 -582917 -442963 -281989 -103935 82081 262789 423784 552767
40264 552767 641893 689163 699116 682506 654567 632021 629608 657007 716684 803224 904787 1006831
40252 1006831 1096846 1167847 1218807 1252130 1270207 1273502 1261189 1233381 1192845 1144643 1093752
40241 1093752 1042235 987800 924515 845149 743866 618358 470978 308733 141965 -17981
40231 -17981 -161189 -280527 -371492 -431238 -457918 -450994 -412197 -346375 -261754 -169796 -84841
40220 -84841 -23208 -978 -30396 -115963 -252080 -423409 -607927 -781650 -923843 -1021409 -1071204
40209 -1071204 -1079611 -1059869 -1028645 -1003182 -999341 -1030165 -1104601 -1226444 -1393614 -1598044 -1826674
40198 -1826674 -2063886 -2294724 -2507316 -2693647 -2849264 -2972986 -3066690 -3134199 -3179195 -3203175
40188 -3203175 -3204672 -3179898 -3124354 -3034835 -2911036 -2755770 -2573798 -2370687 -2153044 -1929562
40178 -1929562 -1711057 -1508631 -1331184 -1183918 -1068299 -983023 -925455 -893310 -886035 -905090
40168 -905090 -952702 -1029482 -1131921 -1251015 -1372764 -1480323 -1556723 -1587095 -1560055 -1468563 -1310680
40157 -1310680 -1090250 -817198 -506793 -177612 151148 461742 738655 968900 1143060
40148 1143060 1257218 1314303 1323390 1296701 1245653 1177668 1095144 996987 881879 751719 613568
40137 613568 479280 363066 277991 232740 229923 266396 335113 427497 535702 654681 783709
40126 783709 926338 1087902 1271416 1474098 1686495 1894229 2081059 2232084 2336670 2390610
40116 2390610 2396658 2362814 2298846 2212646 2108137 1985705 1844643 1685917 1513251 1331872
40106 1331872 1146064 957736 767347 576702 391383 220457 72892 -47330 -144255 -229118
40096 -229118 -315985 -415866 -531639 -655650 -771068 -856835 -894514 -874503 -799080 -680776 -536493
40085 -536493 -380279 -218926 -52798 119751 298555 481343 666248 854147 1048557 1253081
40075 1253081 1467889 1686868 1896592 2077846 2209671 2274763 2263829 2176865 2021323 1809255
40065 1809255 1555494 1276997 991782 716622 464260 241749 50694 -110920 -246224
40056 -246224 -357224 -443560 -502438 -529440 -519618 -468471 -372526 -229575 -39012 197243 473571
40045 473571 780224 1104427 1432506 1751977 2052844 2327961 2572465 2782632 2955012 3086705
40035 3086705 3176641 3226677 3241418 3226681 3187317 3125394 3039873 2928292 2789586 2625819 2441211
40024 2441211 2239175 2019833 1779800 1514193 1219763 898115 558100 216020 -107201
40015 -107201 -391207 -621345 -791388 -903101 -963625 -982387 -968799 -930994 -875327 -806319 -727077
40004 -727077 -640402 -550357 -463697 -390257 -341626 -328100 -354959 -419979 -513877 -623540 -735987
39993 -735987 -840643 -929149 -993762 -1026101 -1017451 -960838 -854058 -701942 -516096 -311738 -103017
39982 -103017 100736 296297 485350 671991 860138 1051436 1243669 1429749 1597953 1734199
39972 1734199 1826181 1867720 1861125 1816514 1748855 1674225 1606435 1554429 1520636 1500725 1485091
39961 1485091 1462088 1422210 1361829 1284857 1201357 1123694 1062095 1021652 1001908 998877 1008243 1027736
39949 1027736 1056975 1094874 1136933 1175238 1201611 1211470 1205237 1186294 1157020 1115564 1055289 967342
39937 967342 845019 687242 498911 288161 62808 -171460 -410473 -649678 -882506 -1099850
39927 -1099850 -1290881 -1444928 -1553746 -1613192 -1623787 -1590310 -1520994 -1426514 -1318402 -1206743
39917 -1206743 -1097655 -991610 -883405 -764026 -624137 -458209 -267430 -59535 154624
39908 154624 365543 567716 759383 940552 1110790 1267547 1405326 1516537 1594118 1634496
39898 1634496 1638755 1611394 1558112 1484139 1393234 1286855 1163944 1022612 863846 695291
39888 695291 532191 394383 300788 264449 290380 376481 516236 701351 923099 1172134
39878 1172134 1437680 1707510 1969515 2214259 2436803 2636349 2813742 2968477 3097265
39869 3097265 3195078 3257720 3283917 3275775 3237712 3174667 3089997 2983406 2850133 2682846 2476212
39858 2476212 2231791 1960164 1679059 1408790 1167476 968251 819363 726552 695614 732572
39848 732572 840462 1014662 1240450 1495206 1754274 1997188 2211525 2393906 2548947 2686703
39838 2686703 2818789 2954188 3096452 3243377 3388577 3523508 3639082 3726766 3779107 3789697
39828 3789697 3752969 3664587 3522547 3328301 3087119 2807621 2500859 2179247 1855346 1540951
39818 1540951 1247050 984427 763699 593584 477849 412940 388126 388003 395760 395831 375886
39807 375886 328455 251944 150386 32182 -91478 -208317 -307470 -383043 -437330 -481423 -532196
39796 -532196 -606879 -717898 -870198 -1061569 -1284766 -1529719 -1785003 -2039059 -2281826 -2506577
39786 -2506577 -2710888 -2896093 -3065675 -3223603 -3373364 -3517828 -3659689 -3801912 -3947477
39777 -3947477 -4097824 -4250410 -4396838 -4523302 -4614102 -4656898 -4646927 -4587686 -4487761 -4355883
39767 -4355883 -4197402 -4014092 -3806760 -3578138 -3333583 -3079209 -2819209 -2554671 -2284515
39758 -2284515 -2007361 -1722831 -1431857 -1136594 -840627 -549477 -270811 -13605 213974
39749 213974 407134 565603 692056 788491 853198 880837 865851 806911 709363 584209 444458
39738 444458 301269 161818 29317 -95905 -215425 -332144 -449642 -571054 -697667 -827873
39728 -827873 -957100 -1078811 -1186038 -1272581 -1333346 -1364201 -1362025 -1325357 -1255234 -1155882 -1035193
39717 -1035193 -904806 -779062 -672147 -594077 -547431 -526497 -519073 -509993 -485393 -436672 -362792
39706 -362792 -269862 -168458 -70638 11688 67147 85445 59024 -14649 -131448 -280569 -446413
39695 -446413 -611930 -762409 -888386 -986484 -1057902 -1105600 -1131921 -1137978 -1124605 -1093549 -1047608
39684 -1047608 -989493 -920299 -838467 -739888 -619320 -472998 -301702 -113131 77839 251727
39674 251727 389496 478360 515794 509647 474110 423652 368181 311863 255603 200987 152921
39663 152921 119686 111110 136547 203679 317824 481012 690696 938744 1211509 1491039
39653 1491039 1757008 1989021 2169151 2284486 2328882 2302954 2212052 2063073 1861681 1611338
39643 1611338 1314595 975829 603691 211602 -183976 -566296 -920467 -1234305 -1498004
39634 -1498004 -1703111 -1841208 -1903024 -1878803 -1760319 -1544054 -1234528 -846350 -403525 64771
39624 64771 530704 973585 1382291 1754009 2091185 2398586 2680854 2940235 3174716 3377659
39614 3377659 3539721 3652529 3712541 3723313 3695272 3643329 3583639 3530769 3495659 3484143 3495922
39603 3495922 3524652 3559742 3589398 3603542 3595260 3560654 3497915 3406642 3287964 3145280 2984860
39592 2984860 2815308 2645653 2482880 2330166 2186542 2047822 1908243 1762046 1604281
39583 1604281 1430583 1236723 1019307 778092 518698 253558 57 -223360 -401147
39574 -401147 -523095 -584841 -586937 -533280 -429619 -282873 -101722 102016 312748 512464
39564 512464 683906 813908 895349 927169 912781 857607 766808 644396 494071 320834
39554 320834 131729 -65063 -262347 -455862 -644604 -828856 -1006775 -1171684 -1311991 -1413943
39544 -1413943 -1465918 -1462493 -1406942 -1310929 -1190832 -1061969 -933647 -807791 -681534 -551535
39534 -551535 -417298 -282208 -152796 -37614 53476 109866 121475 81275 -11493 -148713
39524 -148713 -312982 -480300 -625522 -728904 -781165 -784897 -751711 -696522 -631620 -563026 -489909
39513 -489909 -406061 -301696 -164932 16197 250268 538268 870940 1229482 1589269 1924683
39503 1924683 2213264 2438722 2592951 2676903 2699921 2677612 2628954 2573486 2528949 2509435 2523879
39492 2523879 2574938 2658397 2763494 2874405 2972796 3041106 3065907 3040583 2966394 2851642 2709654
39481 2709654 2556632 2409519 2283267 2187837 2126594 2097371 2095008 2112721 2141170 2166860 2172487
39470 2172487 2139892 2054188 1907014 1698005 1434756 1131912 809653 491307 199846 -46388
39460 -46388 -237353 -372703 -460087 -511203 -537807 -549650 -554670 -560169 -573216 -599484 -641067 -694784
39448 -694784 -752503 -804009 -841082 -860302 -862959 -852697 -832972 -805910 -772555 -733861 -691740 -649713
39436 -649713 -612703 -586057 -574448 -581466 -610064 -663515 -745905 -861128 -1010062 -1187238 -1379546
39425 -1379546 -1568529 -1735372 -1866082 -1954502 -2002339 -2016595 -2005652 -1975694 -1928879 -1863607 -1776113
39414 -1776113 -1662438 -1520285 -1350629 -1158911 -955429 -754532 -572314 -423147 -316126
39405 -316126 -252933 -228113 -231537 -251719 -278418 -303586 -321153 -327175 -321411 -309685 -304630 -322797
39393 -322797 -378483 -477343 -613314 -770165 -926081 -1058338 -1146451 -1174088 -1130903 -1014454
39383 -1014454 -831554 -598285 -338371 -79780 150347 331569 454795 523853 553452 564893
39373 564893 581449 624453 709916 845338 1027301 1241329 1464881 1672700 1842496 1958969
39363 1958969 2015091 2010509 1947917 1829461 1655541 1427083 1149896 838133 514472 206724
39353 206724 -57583 -256559 -377582 -418575 -386881 -296592 -165424 -12310 144075 286442
39343 286442 400336 475728 507780 496235 443902 355260 235700 91313 -71004 -243419
39333 -243419 -417578 -586289 -746055 -898463 -1048262 -1198320 -1344582 -1474788 -1571947 -1620175
39323 -1620175 -1609338 -1536647 -1405769 -1225128 -1006559 -764632 -515932 -277324 -62910 119079
39313 119079 267426 386114 480764 555678 612931 653327 678095 690344 695658 701608 716559
39302 716559 748502 804317 889208 1005779 1152918 1325322 1514292 1709551 1901333 2082143
39292 2082143 2247891 2397831 2533007 2653869 2758826 2845211 2912229 2963689 3008444 3058153
39282 3058153 3123679 3211757 3323196 3452979 3592007 3729493 3855074 3960084 4037956 4083808
39272 4083808 4093569 4063684 3992416 3882538 3743342 3589883 3439122 3304675 3192333 3097861
39262 3097861 3007913 2904162 2769597 2594374 2378549 2130763 1864193 1592283 1326241 1074900
39252 1074900 845931 646554 482500 355973 264839 204588 172202 169197 201777 278210 405321
39241 405321 586136 819605 1101904 1427839 1790799 2180875 2582527 2974136 3330973 3630878
39231 3630878 3859967 4015603 4105495 4144012 4147751 4131867 4107522 4080189 4048884 4006565 3942105
39220 3942105 3843653 3702627 3517194 3294124 3048512 2801456 2576146 2392887 2264246 2192090
39210 2192090 2168274 2179018 2210902 2255466 2310498 2378128 2461172 2559465 2667404 2773444 2861648
39199 2861648 2914688 2917175 2858166 2732362 2540187 2287342 1984173 1644877 1286443 927295
39189 927295 585673 277820 16140 -191967 -344079 -441722 -489286 -493545 -463317 -408419 -337885
39178 -337885 -258568 -174950 -89835 -4727 80680 169320 266691 379220 511555 664252 833179
39167 833179 1010933 1189250 1361065 1521397 1667042 1795597 1904325 1989271 2044790 2063483
39157 2063483 2036868 1957534 1823026 1639979 1425741 1205571 1006357 850024 749432 707353
39147 707353 717362 765528 832569 896463 935232 929711 866421 740176 555449 325459 69221
39136 69221 -192005 -437834 -651490 -822449 -948335 -1034869 -1093324 -1136332 -1173635 -1209326 -1241502
39125 -1241502 -1264264 -1270872 -1256426 -1218974 -1159097 -1078805 -980906 -869546 -751605 -637407 -539281
39114 -539281 -468220 -430803 -428500 -459617 -522015 -614558 -736436 -885194 -1055005 -1236267 -1416509
39103 -1416509 -1582005 -1719559 -1818428 -1871843 -1877353 -1835721 -1749358 -1621509 -1456541 -1260663
39093 -1260663 -1042345 -812189 -582181 -364347 -169136 -4251 125648 218513 274181 293770
39083 293770 279532 235253 166779 82102 -9196 -96630 -169292 -216744 -231157 -210545 -161224
39072 -161224 -97186 -35681 9151 31015 31889 18314 -3782 -32486 -69926 -119561 -182730 -256653
39060 -256653 -334893 -409922 -476486 -534176 -588046 -646556 -717262 -802046 -894477 -980916 -1044931
39049 -1044931 -1072838 -1057875 -1001298 -910355 -794699 -663531 -524727 -385394 -252351 -131798
39039 -131798 -28423 55360 119810 167510 202056 226194 240836 246247 244945 244078 255010 289968
39027 289968 357762 460977 595535 751981 917457 1077827 1219610 1331333 1404265 1433023
39017 1433023 1416536 1358987 1269852 1162314 1050268 944801 851731 771661 702716 644178 598442
39006 598442 570211 563965 581640 621553 678734 746252 817030 885390 947725 1002353 1048775 1086544
38994 1086544 1113910 1126793 1118798 1082611 1012622 908131 776031 631399 495081 388758
38984 388758 329474 325587 375016 465499 576314 681343 753630 770992 721085 603805 430044
38973 430044 217786 -12271 -239853 -446771 -617963 -742666 -815848 -839174 -820509 -771561
38963 -771561 -704396 -628274 -548042 -464494 -376287 -282434 -183963 -83831 14594 108994 197869
38952 197869 278437 343997 382883 380394 323346 205064 28197 -196077 -451640 -721578 -990886
38941 -990886 -1246925 -1478306 -1673377 -1819389 -1903135 -1913450 -1845252 -1703744 -1506404 -1280933
38931 -1280933 -1059227 -869669 -731016 -650253 -624900 -647886 -711968 -811228 -939446 -1087421
38921 -1087421 -1241861 -1386906 -1507235 -1590445 -1627337 -1610595 -1533926 -1393083 -1188247 -925835
38911 -925835 -618370 -282702 62278 397476 704632 966671 1168134 1296714 1346128 1319028
38901 1319028 1228013 1093884 941791 796571 678310 599051 561641 561179 588431 633580 688763
38890 688763 748881 810979 872991 932693 987599 1036239 1080282 1125981 1183152 1261256 1364188
38879 1364188 1486779 1615413 1732969 1825745 1888728 1926412 1949147 1967355 1986664 2005659 2016338
38868 2016338 2006599 1963920 1879192 1749417 1578470 1375934 1154815 929003 711149 511632
38858 511632 338934 200952 105853 61153 71062 133687 239975 374931 520206 656943
38848 656943 768520 843137 875672 867930 827068 763023 686112 605377 527700 457541 397233
38837 397233 347479 307409 273941 240923 199349 139536 54838 -54916 -182253 -313765 -433535
38826 -433535 -525993 -576975 -573592 -504719 -362983 -147393 135061 469581 835008 1205975
38816 1205975 1555713 1859590 2098721 2262679 2350458 2369436 2332626 2255195 2151608 2034160
38806 2034160 1912459 1793057 1679369 1572827 1475521 1392977 1335030 1313673 1338789 1413879
38796 1413879 1533871 1685617 1850271 2006503 2134125 2218166 2252678 2242552 2201954 2149565
38786 2149565 2102662 2072709 2064218 2076729 2108058 2156590 2221604 2302014 2394569 2492288 2583774
38775 2583774 2654058 2687080 2669164 2592133 2454984 2263718 2029586 1766552 1488847 1209234
38765 1209234 938158 683786 452852 251837 87697 -32497 -103115 -122002 -92207 -22581
38755 -22581 73057 177888 274354 346191 380233 368260 308549 206332 72489 -79329 -236162
38744 -236162 -388435 -530910 -661921 -782030 -893240 -998939 -1103789 -1212774 -1329572 -1454956
38734 -1454956 -1585712 -1714211 -1828933 -1916293 -1963649 -1962388 -1909691 -1808257 -1664594 -1486870
38724 -1486870 -1283002 -1059336 -820298 -569289 -310390 -49997 202476 435213 636273
38715 636273 797319 917021 1001340 1059327 1096784 1112375 1099015 1049302 961146 840571 701029
38704 701029 560132 434840 336591 268354 225411 199576 184237 177286 181214 201604 245308
38693 245308 318206 422330 553388 700422 848175 980920 1085799 1154417 1182632 1169336
38683 1169336 1115469 1024137 901454 756724 600802 443049 288478 136616 -17428 -180348
38673 -180348 -357461 -549831 -752449 -954213 -1140077 -1294574 -1404921 -1462194 -1460828 -1398233
38663 -1398233 -1275926 -1101794 -891783 -669351 -462172 -296845 -193557 -162796 -205322 -314644
38653 -314644 -480202 -689801 -930984 -1191528 -1459198 -1721165 -1963973 -2174844 -2343724 -2464564
38643 -2464564 -2534982 -2555148 -2527369 -2456771 -2351946 -2224174 -2084951 -1942825 -1801080 -1657680
38633 -1657680 -1507951 -1348953 -1183091 -1018653 -866795 -736760 -632196 -550652 -486289 -433831
38623 -433831 -391198 -359470 -340824 -336034 -342619 -354111 -360936 -353244 -324951 -276757 -216108 -153925
38611 -153925 -100048 -59998 -34644 -22482 -22659 -36638 -67592 -118454 -190103 -280322 -383290 -489511
38599 -489511 -586798 -662688 -707478 -716271 -689022 -628818 -539382 -422812 -278292 -102284 109803
38588 109803 361161 651377 975184 1322387 1679043 2029817 2360909 2662256 2928136 3156468
38578 3156468 3347910 3505360 3633391 3736950 3819483 3881295 3919133 3927301 3900044 3834221 3731057
38567 3731057 3596308 3439277 3271740 3107389 2961401 2849243 2784293 2774833 2821539 2916422
38557 2916422 3043634 3181799 3307278 3397656 3434937 3407870 3313104 3155064 2944846 2698559
38547 2698559 2435311 2174749 1934222 1726209 1557166 1428501 1339182 1288358 1276126 1301717
38537 1301717 1360307 1440910 1527412 1602483 1652160 1668929 1652814 1611191 1557638 1509405 1483394
38526 1483394 1491834 1539431 1623161 1734510 1862881 1998523 2133990 2264242 2386175 2498014
38516 2498014 2598137 2683006 2744899 2771036 2745480 2653857 2489049 2255081 1967037 1647036
38506 1647036 1318436 1000847 707537 445472 217297 24059 -132722 -250457 -326033 -356970
38496 -356970 -343121 -288843 -204584 -106139 -11121 65529 114346 131323 116035 69636 -6447
38485 -6447 -111179 -244099 -404784 -591263 -797846 -1013592 -1222806 -1408045 -1554768 -1655580
38475 -1655580 -1711938 -1732532 -1729468 -1714585 -1697369 -1684253 -1678329 -1679149 -1683076 -1684401 -1676664 -1653785 -1611072
38462 -1611072 -1546397 -1461167 -1360502 -1252404 -1146437 -1052371 -978823 -931709 -912739 -918885 -943657
38451 -943657 -979843 -1022038 -1067326 -1113995 -1159673 -1200066 -1228353 -1234913 -1207782 -1134602 -1005725
38440 -1005725 -816783 -569132 -268252 78300 461745 871276 1292597 1707468 2095389
38431 2095389 2437142 2718386 2931553 3075722 3155608 3180618 3163617 3118457 3056550 2984488
38421 2984488 2904593 2818225 2729564 2647244 2583045 2548588 2551699 2593666 2667992 2760941 2854054
38410 2854054 2928155 2967811 2964914 2920552 2844858 2754878 2670787 2611176 2588580 2606358 2657783
38399 2657783 2727768 2796903 2846466 2862466 2837498 2770749 2667275 2537093 2393612 2251161
38389 2251161 2122376 2016475 1938710 1890323 1868431 1866069 1873142 1878634 1873479 1852788 1816521 1768732
38377 1768732 1716207 1667128 1629706 1610756 1614544 1642342 1692737 1762481 1847706 1945304 2053745
38366 2053745 2172608 2300863 2434882 2567369 2687751 2784090 2845974 2867479 2848837 2796037
38356 2796037 2718617 2626724 2528462 2428276 2326960 2223351 2116789 2008713 1902526 1802402
38346 1802402 1712518 1637219 1581358 1549780 1545922 1570342 1619645 1685736 1755160 1809293 1826679
38335 1826679 1787963 1682053 1510617 1288727 1041363 797686 585419 426706 335568 316722
38325 316722 366027 472885 624206 808317 1017057 1245256 1488460 1740437 1991933 2231421
38315 2231421 2447766 2633551 2787153 2911990 3013189 3093791 3152758 3185639 3186908 3152321
38305 3152321 3080170 2971564 2830311 2663073 2479592 2292241 2114259 1957065 1828096 1730640
38295 1730640 1665675 1633966 1636421 1672299 1737075 1822114 1916747 2011350 2099736 2180021 2253925
38284 2253925 2324658 2394000 2460148 2517963 2561531 2586864 2592408 2577180 2538638 2472604 2375576
38273 2375576 2247783 2094739 1926322 1754061 1588130 1435187 1297448 1173181 1058778
38264 1058778 952006 854656 772464 711900 676117 663239 668001 685164 712244 750457 804038
38253 804038 878080 975148 1091805 1217090 1334191 1424456 1471735 1465497 1402500 1287373 1132164
38242 1132164 954702 775824 616011 492182 415284 389092 410519 471377 560967 668469
38232 668469 784427 901570 1015527 1125098 1230925 1332209 1423307 1492915 1526866 1512673
38222 1512673 1442993 1316529 1137022 911698 649865 361704 57346 -253590 -562200 -860792
38212 -860792 -1143918 -1409173 -1656846 -1888507 -2105499 -2308133 -2495056 -2662123 -2801292 -2900818
38202 -2900818 -2947404 -2929477 -2840360 -2680840 -2461030 -2200935 -1928520 -1674602 -1465659 -1317353
38192 -1317353 -1231625 -1198347 -1200211 -1218365 -1236844 -1244924 -1237303 -1212554 -1170934 -1112981 -1039512 -952468
38180 -952468 -855361 -752777 -649287 -548575 -453280 -365344 -286441 -218501 -164556 -129640 -120471
38169 -120471 -143102 -199655 -286719 -396727 -521093 -652468 -784883 -912496 -1028395 -1124470
38159 -1124470 -1192538 -1226374 -1223724 -1187457 -1125341 -1048481 -968621 -894886 -831133 -775246 -720752
38148 -720752 -659954 -587175 -500959 -404399 -303439 -203964 -109450 -20589 63062 140713 208756
38137 208756 260711 288543 284737 244644 168721 64191 -54964 -170624 -265342 -327091 -351365
38126 -351365 -339983 -298376 -233649 -153922 -67754 17144 95131 162535 216352 253235 269884
38115 269884 264497 238165 195447 143599 89871 37312 -18397 -87900 -182279 -305843 -452488
38104 -452488 -607745 -754582 -879206 -974353 -1039723 -1080573 -1105542 -1124460 -1146411 -1178186 -1223376
38093 -1223376 -1282368 -1353215 -1432917 -1518476 -1607325 -1697180 -1785574 -1869666 -1946596 -2014330 -2072363
38082 -2072363 -2121953 -2166159 -2210014 -2260385 -2324627 -2407972 -2511157 -2629981 -2756876 -2882871
38072 -2882871 -2998535 -3094083 -3159752 -3186926 -3169412 -3104215 -2991934 -2837190 -2649194 -2441876
38062 -2441876 -2232868 -2041140 -1883806 -1773114 -1714541 -1706482 -1741442 -1808133 -1893564 -1984353 -2067264
38051 -2067264 -2129830 -2161868 -2157544 -2116773 -2044964 -1951210 -1845741 -1737466 -1632284 -1532460 -1437068
38040 -1437068 -1343196 -1247602 -1148575 -1047066 -946022 -847806 -751592 -653299 -548898 -438843
38030 -438843 -330096 -233852 -160530 -115463 -97913 -103152 -125329 -159193 -200447 -245530 -291231
38019 -291231 -334074 -369775 -393558 -401520 -392115 -366654 -328709 -283195 -235625 -191216 -153410 -122210
38007 -122210 -93537 -60535 -16462 42425 115571 198619 284598 364796 429679 471060 485697
37996 485697 478435 462195 453773 467323 508977 575319 655984 738493 812808 873988 922849 964947
37984 964947 1008080 1058529 1117567 1180425 1238818 1285477 1317715 1338270 1353805 1372245 1399816
37973 1399816 1438538 1485280 1533081 1573892 1600999 1610086 1599442 1570090 1525899 1473024 1418352
37962 1418352 1367490 1323382 1286324 1255117 1228356 1204954 1183864 1163658 1142502 1118843 1092707
37951 1092707 1066825 1046037 1034252 1030777 1029650 1023655 1010317 994682 986105 991124 1007507 1023278
37939 1023278 1020857 983246 898624 761743 573074 337504 63299 -239153 -558966 -885852
37929 -885852 -1210147 -1522324 -1813068 -2073759 -2296693 -2474962 -2603246 -2679972 -2709458 -2701686
37919 -2701686 -2669048 -2621542 -2562846 -2488746 -2388326 -2247618 -2054593 -1803440 -1496045 -1140216
37909 -1140216 -746198 -323732 119285 576756 1043572 1514378 1982138 2436801 2864540
37900 2864540 3247948 3567493 3804154 3942593 3973946 3897554 3721483 3461861 3140968 2784327
37890 2784327 2417499 2063709 1742968 1472561 1267709 1140906 1099226 1140725 1252540 1412599
37880 1412599 1594702 1774579 1934368 2064313 2161927 2229695 2272345 2294607 2300085 2291666 2273088
37869 2273088 2250482 2232310 2227308 2241654 2277260 2331973 2400834 2477082 2552510 2617685 2662924
37858 2662924 2680389 2666997 2626916 2571875 2518126 2480870 2468713 2480726 2506947 2531245 2535178
37847 2535178 2502095 2421009 2289183 2112340 1902463 1674834 1445936 1232500 1050442 912692
37837 912692 826156 789386 792317 818496 848672 864350 850583 798430 707408 586988 455273
37826 455273 334025 241646 187313 169047 176153 194283 210352 215484 205882 182695 151649 122123
37814 122123 104971 109166 138720 191794 262910 346958 442179 550030 672492 809414 957905
37803 957905 1113447 1271035 1425395 1570570 1699546 1804243 1876096 1907706 1895474 1842182
37793 1842182 1758078 1659742 1567257 1500488 1475121 1499011 1570121 1677599 1806009 1940702 2071457
37782 2071457 2193345 2305982 2412719 2520039 2636491 2770779 2929343 3113933 3319953
37773 3319953 3536497 3748574 3940600 4099409 4215620 4283586 4300861 4268072 4189700 4075246
37763 4075246 3939217 3798363 3666723 3551217 3450341 3356018 3256821 3141086 2999819 2829355
37753 2829355 2632937 2420113 2203867 1996799 1808040 1642055 1499292 1377917 1275781
37744 1275781 1192035 1128087 1087630 1075729 1097072 1153717 1242899 1355940 1479277 1597456 1696509
37733 1696509 1765983 1799450 1794768 1755025 1689431 1612330 1539288 1481344 1440318 1408078 1370497
37722 1370497 1313829 1229976 1118389 984943 839485 693286 556710 437152 337700 257188
37712 257188 191949 138599 96338 67179 53841 56709 72093 92853 110768 119108 114376 97074
37700 97074 71700 45736 27377 22419 31810 51424 74251 93537 104876 106503 98404 81376
37688 81376 56465 24601 -13861 -59564 -113978 -178272 -251584 -329823 -406153 -473046 -524276 -555056
37676 -555056 -560337 -533334 -466461 -354658 -198981 -8155 202505 414037 607557 767941
37666 767941 886405 960956 994531 992055 958085 896103 809323 702143 581109 454575 331116
37655 331116 217704 118817 36875 -26706 -70816 -94848 -99803 -89513 -70961 -53163 -45201 -54802
37643 -54802 -87986 -148968 -239166 -355462 -488969 -625503 -747815 -838729 -884097 -874648 -806267
37632 -806267 -679082 -496296 -263568 11047 317005 641222 968080 1279618 1556479 1780132
37622 1780132 1936098 2017017 2024252 1967139 1859972 1717705 1552081 1369920 1174208 966834
37612 966834 750753 530284 310166 94846 -111442 -304407 -479672 -632654 -758144 -850295
37602 -850295 -903800 -915776 -886904 -821090 -724369 -604145 -469028 -328469 -191335 -63486
37592 -63486 54373 166850 281307 403865 536473 676750 820051 961743 1098034 1225187
37582 1225187 1338285 1430865 1496006 1528459 1526566 1492839 1432934 1353735 1261550 1161129 1055628
37571 1055628 947390 839062 734452 638556 556593 492587 448204 422260 410944 408665 409379
37560 409379 407871 400157 382605 350670 298849 222624 121276 -605 -134288 -270151 -401061
37549 -401061 -523951 -638992 -747211 -848027 -937772 -1009228 -1051823 -1052702 -999286 -883519 -706259
37538 -706259 -479508 -224965 30382 259591 440369 558476 609754 600219 543613 456852
37528 456852 355034 247932 139090 27443 -89481 -212160 -336879 -455725 -558661 -636405
37518 -636405 -682237 -691759 -661490 -588110 -469528 -307182 -108159 113795 338815 543345
37508 543345 704514 805290 838188 805995 719802 595905 452962 309792 183604 88309
37498 88309 32789 19670 45575 103425 185956 288346 408204 542889 686210 827092 951229
37487 951229 1044580 1096578 1101864 1060960 980482 872715 753821 640748 548015 485704 459355
37476 459355 471451 523396 616493 750766 922053 1119473 1325795 1521724 1692487 1833274
37466 1833274 1950435 2057663 2169430 2295244 2437230 2591095 2748469 2898532 3028262
37457 3028262 3122530 3165829 3146080 3058779 2908867 2709092 2475833 2224686 1967753 1713553
37447 1713553 1469054 1242096 1042179 878709 757832 679946 639121 624191 620822 614550 594759
37436 594759 558551 512259 468975 442870 443141 470443 516769 567719 605593 612350 572306 474555
37424 474555 315076 98161 -163473 -450620 -741225 -1014256 -1252042 -1440883 -1571365 -1639579
37414 -1639579 -1648368 -1606525 -1525223 -1413733 -1277613 -1120644 -948673 -772205 -605824 -465075
37404 -465075 -362844 -307047 -300068 -339363 -418572 -528848 -660409 -804090 -952430 -1099909
37394 -1099909 -1242224 -1375055 -1493021 -1589560 -1657930 -1692620 -1690361 -1650635 -1576207 -1473782 -1353936
37383 -1353936 -1229345 -1111742 -1009072 -924259 -855392 -796239 -736439 -662142 -558290 -412786
37373 -412786 -220938 12067 271899 538595 791394 1013315 1194169 1331132 1427007 1487377
37363 1487377 1517991 1523166 1505558 1467550 1413868 1353640 1299902 1266131 1261781 1289201 1343088 1412082
37351 1412082 1481809 1538643 1573014 1580956 1563324 1523654 1466513 1397575 1324848 1259051 1211596
37340 1211596 1190903 1199468 1233704 1286419 1350305 1421041 1499398 1591857 1709053 1862032 2057523
37329 2057523 2294216 2561617 2841966 3114519 3360671 3568092 3732406 3855770 3942914 3996463
37319 3996463 4013751 3986701 3904584 3758158 3543318 3263076 2927358 2551040 2151269 1745435
37309 1745435 1350298 981680 653934 379209 167374 26697 -35782 -15764 84844 254469
37299 254469 471385 707589 935545 1134275 1292011 1405179 1475594 1507622 1505840 1473070
37289 1473070 1409160 1311349 1176369 1003328 795942 563181 318185 75796 -150676 -352529
37279 -352529 -527582 -680311 -820090 -957773 -1101255 -1251553 -1401480 -1538109 -1647915 -1721804
37269 -1721804 -1757633 -1759741 -1736479 -1696867 -1647384 -1589916 -1521739 -1437361 -1331139 -1199534 -1042634
37258 -1042634 -865005 -675769 -487695 -315484 -173648 -74260 -24754 -26277 -73363 -155198
37248 -155198 -257903 -366760 -467792 -549083 -602315 -624426 -618197 -590825 -550883 -505423 -458722
37237 -458722 -412696 -367758 -323023 -275830 -221295 -152825 -63886 49597 187557 345746 516933
37226 516933 691989 860201 1009633 1128454 1207006 1239351 1223613 1161733 1059425 926180
37216 926180 774397 617477 467937 336668 233053 164582 135361 144597 186615 252599 332998
37205 332998 419462 506125 590096 670949 749281 825157 897252 962872 1018533 1060880 1087612
37194 1087612 1097748 1090902 1066234 1022225 957579 872519 769520 653114 528807 401444 273768
37183 273768 146060 17325 -112545 -240757 -360986 -464585 -542954 -589552 -600455 -573940
37173 -573940 -510308 -412407 -285991 -139004 19946 182831 342433 492065 625727 739259
37163 739259 831934 907050 970514 1027808 1080914 1126694 1157275 1162255 1132076 1061521 951935
37152 951935 811276 652089 488544 333884 199258 93882 25488 6 20400 85555
37142 85555 189950 324169 476193 633597 786352 929017 1061038 1184993 1303710 1417448
37132 1417448 1522204 1610086 1671795 1699930 1691132 1646255 1569342 1466952 1348242 1224803 1108894
37121 1108894 1009869 930354 864444 799217 719011 610525 466656 287731 80132 -146162
37111 -146162 -379188 -605084 -807891 -970883 -1079866 -1127162 -1114327 -1052193 -957674 -848430
37101 -848430 -737677 -631650 -530370 -430487 -328137 -220757 -107584 10733 132981 258159
37091 258159 385883 516155 648368 779843 905005 1016283 1106570 1171593 1210457 1224257
37081 1224257 1214422 1182664 1132832 1072804 1013923 967338 939464 929884 933031 942069 952337 962892
37069 962892 976387 998021 1034010 1089752 1168049 1267907 1384276 1508715 1630614 1738630 1822226
37058 1822226 1873326 1887578 1864645 1807465 1721286 1613401 1493817 1376229 1278051 1218506 1214841
37047 1214841 1278060 1410256 1604682 1848210 2124855 2418979 2717215 3008783 3284774 3537701
37037 3537701 3762220 3956677 4124226 4272414 4410865 4547545 4684837 4817346 4933066
37028 4933066 5017929 5061675 5061872 5023865 4956948 4869311 4764947 4643947 4505389 4350650 4185487
37017 4185487 4020121 3867490 3740293 3647988 3594928 3580252 3599217 3644916 3709509 3784713 3862222
37006 3862222 3934723 3997392 4048859 4090949 4127605 4163782 4204543 4253923 4313577 4382191 4456362
36995 4456362 4532365 4607153 4677684 4739231 4784585 4805569 4796540 4757949 4697648 4629006 4566632
36984 4566632 4521795 4499469 4498185 4512554 4537138 4569719 4612361 4670142 4748593 4851140 4977142
36973 4977142 5120698 5270726 5412984 5533844 5624187 5681296 5707795 5708586 5687828 5647618 5588734
36962 5588734 5512869 5425211 5336189 5261258 5218263 5223138 5285764 5407750 5582683 5798192 6038989
36951 6038989 6290226 6540272 6781463 7008181 7213266 7385171 7507888 7564160 7540925 7434801
36941 7434801 7255176 7023487 6769152 6523889 6315817 6164093 6075160 6042300 6049321 6077001
36931 6077001 6109484 6138390 6163974 6193649 6238476 6308616 6409370 6539408 6692027 6858685
36921 6858685 7032809 7211787 7396460 7589248 7792622 8008505 8237980 8480835 8735348
36912 8735348 8999028 9269973 9547641 9832143 10122381 10414071 10698723 10964143 11196615
36903 11196615 11384322 11520824 11607258 11652528 11671659 11682758 11703139 11745611 11816159 11913716 12031565
36892 12031565 12159532 12286685 12404445 12509237 12603442 12694333 12792050 12907796 13052380 13234565
36882 13234565 13459034 13724378 14021975 14336852 14651071 14948773 15220634 15465681 15690417
36873 15690417 15906741 16130020 16377414 16665587 17007423 17408421 17864362 18361635 18880297
36864 18880297 19398877 19899593 20373126 20822106 21262138 21719565 22226246 22813049 23504190
36855 23504190 24314190 25248019 26303800 27476832 28763972 30167436 31696907 33369034
36847 33369034 35205041 37228488 39464293 41938344 44676697 47704776 51047805 54732597
36839 54732597 58789772 63255807 68174964 73600779 79596350 86232651 93584292 101722021
36831 101722021 110701672 120549749 131245125 142695275 154706781 166953663 178951122
36824 178951122 190047181 199452830 206334899 209976391 209963322 206316853 199499354 190287902
36816 190287902 179580015 168217941 156883318 146063997 136068104 127060368 119104246
36809 119104246 112199900 106313135 101395347 97396601 94273338 91991764 90528435 89869341
36801 89869341 90007871 90942486 92675707 95215337 98577228 102788793 107893066 113951723
36793 113951723 121043887 129259313 138688519 149413299 161497354 174974095 189829022
36786 189829022 205974836 223216855 241208372 259401773 277008638 292991295 306120147
36779 306120147 315131478 318983329 317134800 309721955 297533443 281794952 263871448
36772 263871448 245013851 226216534 208179803 191337614 175913657 161982307 149521308
36765 149521308 138450876 128659795 120021291 112401300 105662132 99664551 94269973 89343245
36757 89343245 84757097 80399582 76183456 72053580 67988662 63996817 60106972 56358645
36749 56358645 52792024 49439910 46322858 43448295 40813324 38409348 36225779 34251193
36741 34251193 32472682 30875459 29443869 28163358 27022412 26013740 25134114 24382643
36733 24382643 23758256 23257904 22876636 22609485 22454415 22414754 22499261 22718909 23081882 23590049
36723 23590049 24239114 25021881 25932009 26966069 28123179 29402803 30801486 32308876
36715 32308876 33903258 35547423 37186565 38749422 40152553 41306866 42126117 42537476
36707 42537476 42493161 41980390 41026247 39694961 38077071 36272956 34375885 32460105 30576530
36698 30576530 28754671 27007658 25337987 23742660 22216967 20756654 19358983 18023260
36690 18023260 16750778 15543824 14403996 13330802 12321532 11372622 10481951 9650879
36682 9650879 8884988 8193065 7584741 7067665 6645094 6314556 6067598 5890111 5763062
36673 5763062 5664285 5571896 5468346 5343129 5193121 5021412 4835849 4647612 4469373 4313053
36663 4313053 4187732 4098419 4046230 4030076 4048740 4101500 4186478 4298070 4425646 4554559
36653 4554559 4668773 4754000 4800435 4804407 4768401 4699457 4606410 4496704 4373947 4237627 4085487
36642 4085487 3916994 3735282 3546295 3356299 3170118 2991400 2824153 2673657 2545397
36633 2545397 2442568 2364045 2304302 2255004 2206992 2151986 2084108 2001221 1905518 1803161 1703395
36622 1703395 1617449 1556810 1530629 1543156 1592839 1673932 1779911 1906616 2053250 2220550
36612 2220550 2407575 2609466 2817876 3023608 3219329 3400359 3563098 3702436 3810178
36603 3810178 3875845 3889825 3847454 3752281 3617182 3462861 3314113 3194965 3124390 3114353
36593 3114353 3170843 3296646 3493301 3760411 4093141 4480422 4905676 5349335 5791043 6210262
36583 6210262 6585714 6894891 7114763 7224144 7207448 7058599 6783577 6400660 5938126 5429536
36573 5429536 4907231 4395943 3909221 3450349 3016991 2606807 2221533 1868244 1557899
36564 1557899 1302045 1109134 981966 917065 905532 934328 987450 1047487 1098336 1128813 1135692
36553 1135692 1124573 1108165 1102900 1125104 1187697 1298091 1457723 1662977 1906464 2177841
36543 2177841 2464464 2752834 3031334 3293104 3537110 3766199 3982944 4185834 4368321
36534 4368321 4521281 4637037 4712182 4747736 4747124 4713913 4650698 4559453 4442351 4302140 4141674
36523 4141674 3963115 3767582 3555664 3328408 3087913 2836790 2576933 2308697 2031314
36514 2031314 1744236 1448519 1147825 849227 563540 304522 86586 -78360 -183846
36505 -183846 -230753 -227681 -189283 -132538 -71998 -16000 34471 84018 139375 206155 286833 379705
36493 379705 478035 569665 638580 669252 652208 587708 485569 361661 233084 113868 12329
36482 12329 -69407 -133778 -185134 -227433 -263151 -293346 -318226 -337329 -348648 -347048 -323751 -268658
36470 -268658 -175335 -45924 107399 265662 409301 524038 603671 649052 664654 655231 624356
36459 624356 574916 510117 433761 349696 261358 172162 86665 11631 -43983 -70413 -59047
36448 -59047 -3861 98092 246479 437126 661447 906781 1157824 1398621 1614562 1794346
36438 1794346 1931662 2025697 2079870 2099423 2089338 2053401 1993977 1911710 1804985 1669720 1500059
36427 1500059 1290219 1037584 746569 431793 118238 -163105 -382879 -520488 -567122 -524194
36417 -524194 -399825 -206044 42802 331498 645558 971998 1298572 1612314 1899077 2145038
36407 2145038 2339577 2477882 2561739 2598085 2596421 2566858 2519579 2465017 2413581 2374801 2356396
36396 2356396 2363507 2397776 2456280 2531169 2610388 2679040 2720814 2720115 2666070 2558101 2410277
36385 2410277 2250904 2116194 2040419 2047043 2144246 2325184 2571055 2854906 3145619 3412627
36375 3412627 3631329 3787885 3881493 3923287 3932340 3930320 3936475 3964174 4019582 4102272 4207070
36364 4207070 4326291 4451606 4574977 4688611 4784612 4855268 4894318 4898538 4868512 4807935 4721790
36353 4721790 4614157 4486534 4337190 4161862 3955598 3715112 3440854 3138227 2817931
36344 2817931 2495468 2189776 1920568 1704630 1552316 1466029 1441284 1469168 1538050 1633699
36334 1633699 1739112 1836309 1910756 1956524 1978774 1991370 2010647 2048825 2110647 2194093 2293575
36323 2293575 2403244 2519259 2641037 2771631 2917084 3084529 3279561 3504009 3755266
36314 3755266 4027277 4312035 4600161 4880224 5138068 5357582 5523085 5622002 5646656 5595173
36304 5595173 5472096 5288647 5061764 4811526 4558006 4319184 4110433 3944364 3829491
36295 3829491 3767873 3753713 3774795 3816339 3864842 3909826 3943460 3959803 3955040 3928615 3883931
36284 3883931 3827430 3766173 3705307 3647256 3593344 3546647 3513575 3502327 3518529 3560543 3617365
36273 3617365 3670458 3698627 3683919 3616878 3500246 3350046 3192635 3057276 2966664 2929862
36263 2929862 2941162 2984889 3042682 3099197 3143901 3169606 3170095 3139185 3071718 2965429 2822262
36252 2822262 2648751 2455669 2256861 2067092 1899385 1762899 1661986 1596151 1560378 1545927
36242 1545927 1541800 1536746 1521324 1489773 1441362 1380497 1314927 1252324 1196722 1146582 1095585 1036039
36230 1036039 963446 879770 793229 714494 651524 606042 573156 543541 506485 452543 375347
36219 375347 272701 147008 4802 -144817 -292398 -430060 -552297 -655623 -737744 -796900
36209 -796900 -831801 -842162 -829466 -797062 -748899 -687231 -611116 -517387 -403895 -272897 -132408
36198 -132408 4948 124416 211685 255462 250386 199948 117860 26269 -49539 -88351 -79365
36187 -79365 -25124 59951 154652 237590 293079 314485 304416 272373 231631 196889 182913 203121
36175 203121 267277 378977 534579 724621 937133 1161067 1388088 1611923 1826117 2022172
36165 2022172 2189880 2319801 2406017 2447212 2445813 2406452 2334958 2238039 2122926 1996387 1863421
36154 1863421 1726694 1587590 1448476 1314620 1194422 1098178 1036753 1020904 1060590 1163025
36144 1163025 1329361 1551587 1811936 2086125 2349572 2583519 2777882 2929720 3039181
36135 3039181 3106032 3128995 3107946 3047373 2958816 2860478 2773542 2716530 2700217 2725300 2783536
36124 2783536 2861508 2945054 3022534 3085934 3130085 3151226 3146252 3113266 3052897 2969038 2868004
36113 2868004 2756485 2639719 2520924 2401765 2282945 2164455 2045651 1925474 1803104
36104 1803104 1679170 1557069 1443217 1345230 1268751 1215263 1182751 1168706 1172933 1197899 1246294
36093 1246294 1317612 1406027 1500939 1589800 1661663 1709713 1731639 1727745 1697940 1639629 1548147
36082 1548147 1419531 1253712 1056183 837565 611638 392702 193022 21325 -117061
36073 -117061 -218900 -281776 -303861 -284768 -226839 -136206 -23078 99027 214973 310521 375351
36062 375351 405918 406834 389806 370396 363869 381604 428844 504323 601829 713111 830946 951363
36050 951363 1074584 1204400 1345913 1502385 1672826 1851581 2029874 2198347 2349608 2479965
36040 2479965 2589437 2679813 2752073 2805188 2837044 2846365 2834062 2803483 2759874 2709475 2658667
36029 2658667 2613945 2583147 2576858 2607842 2687203 2818716 2994844 3197391 3402776 3588867
36019 3588867 3739809 3847256 3909098 3927625 3908216 3858396 3786826 3702162 3612027 3522292 3436712
36008 3436712 3356945 3282769 3212355 3142596 3069695 2990131 2901835 2805351 2704761 2607979 2525809
35997 2525809 2469546 2447659 2462934 2511250 2582423 2662487 2736422 2790288 2812478 2794280 2730366
35986 2730366 2619604 2466174 2280395 2078232 1878750 1699896 1554404 1447642 1377972 1338786
35976 1338786 1321290 1317848 1325492 1348126 1395511 1478874 1605268 1773575 1973520 2187149 2391687
35965 2391687 2563271 2681413 2733307 2716523 2639081 2517316 2372720 2228576 2106438 2022794
35955 2022794 1986859 2000301 2058549 2152583 2270763 2400974 2532985 2660046 2778995 2889434
35945 2889434 2993391 3095590 3203147 3323258 3459277 3607200 3754958 3885580 3983128 4038517
35935 4038517 4052027 4031115 3984905 3918731 3831845 3719086 3575183 3399266 3197494 2982756
35925 2982756 2771435 2578468 2412700 2274657 2157762 2052470 1951256 1851974 1757980 1675471
35915 1675471 1610142 1565107 1540181 1531406 1530396 1524700 1500582 1447827 1364207 1257171 1141775
35904 1141775 1035898 955085 909406 903322 937351 1009258 1113606 1240623 1376396 1505504
35894 1505504 1615346 1700314 1764068 1818993 1882895 1973709 2103650 2274845 2478470 2698079
35884 2698079 2915374 3115388 3288998 3433074 3549607 3644378 3724729 3796437 3861003 3914777
35874 3914777 3950157 3957939 3929768 3860260 3748632 3599478 3422308 3229751 3034805 2847845
35864 2847845 2674268 2513650 2360987 2209769 2055691 1899396 1746945 1607858 1491657
35855 1491657 1404636 1348171 1318934 1310288 1313976 1321845 1327568 1328033 1323552 1316772 1311077 1309493 1314250
35842 1314250 1326405 1345394 1369012 1394147 1417586 1435896 1444360 1436292 1404241 1343291 1254840 1148364
35830 1148364 1039479 944739 875566 834274 814027 802470 786948 758920 715975 661329 601729
35819 601729 545034 498482 467946 457476 468291 497253 536151 573278 597298 601719 587622 563275
35807 563275 540850 531930 544089 579917 638151 715417 807312 908715 1013777 1116216 1210313
35796 1210313 1292545 1362665 1422833 1474802 1517291 1545999 1556390 1547171 1522097 1489440 1459789
35785 1459789 1443233 1446695 1471832 1513881 1562050 1602211 1621676 1614119 1582018 1535424 1488488 1456036
35773 1456036 1451339 1484736 1562321 1684285 1843332 2024297 2206285 2367411 2490319 2565909
35763 2565909 2594365 2584285 2550994 2514086 2493941 2507794 2566582 2673428 2823787 3006840 3207680
35752 3207680 3409781 3597315 3756954 3878907 3957148 3989123 3975539 3920532 3831642 3718625
35742 3718625 3590863 3454419 3310436 3156060 2987493 2803618 2608389 2410921 2223331
35733 2223331 2057090 1919178 1809555 1721361 1644001 1567735 1487453 1403846 1321667 1246189 1179894
35722 1179894 1121223 1065934 1009857 951267 891885 836586 792024 764148 755368 763159 781432 803966
35710 803966 827610 853499 886054 930635 990868 1066837 1155222 1251304 1351100 1451611 1549026
35699 1549026 1636792 1705720 1746511 1753414 1727325 1677150 1618901 1572300 1555552 1579992 1646828
35688 1646828 1747405 1866657 1987791 2096013 2180118 2232301 2247303 2221856 2154828 2047874
35678 2047874 1906205 1738973 1559024 1382085 1225619 1107127 1041536 1037944 1097031 1210604
35668 1210604 1363509 1536905 1711725 1871768 2005787 2107506 2173348 2199576 2181716 2117223
35658 2117223 2009127 1867246 1705522 1537270 1371069 1208979 1046919 876555 687974
35649 687974 472609 225792 -51342 -350785 -657749 -952662 -1215181 -1428946 -1584898 -1681722
35639 -1681722 -1723995 -1719776 -1679103 -1613279 -1534145 -1452585 -1376416 -1308420 -1245548 -1180117 -1102850
35628 -1102850 -1006657 -889604 -755910 -614677 -476817 -351449 -243493 -153791 -81434 -26260
35618 -26260 10375 26760 22463 -920 -40158 -91370 -151311 -218649 -294674 -382791 -486984 -610040
35606 -610040 -751992 -908638 -1070277 -1221773 -1345175 -1424401 -1449622 -1418876 -1336636 -1211179
35596 -1211179 -1052797 -873060 -683829 -495451 -315233 -147711 3503 134269 240334
35587 240334 319088 370846 398627 406804 399495 379284 346615 300194 238216 159855 66430 -37939
35575 -37939 -146130 -248585 -335071 -397515 -432946 -444900 -442168 -435382 -433409 -441424 -460677 -488519
35563 -488519 -517993 -538190 -536979 -505948 -445051 -364091 -279939 -210627 -168975 -158483 -172915 -199090
35551 -199090 -221169 -224665 -199277 -140425 -49691 65553 193269 318606 426338 503379 540696
35540 540696 534471 486802 406294 308172 212935 142874 116885 145485 228329 355347 510679
35529 510679 677240 839959 986850 1108186 1195084 1239130 1234014 1178432 1078185 945812
35519 945812 797836 651168 520087 414394 338476 291139 266325 254913 247279 235677 215713
35508 215713 186793 151905 117005 90095 80354 97626 151804 251385 401184 600493 842872
35497 842872 1117606 1411947 1713316 2010826 2295508 2559128 2792831 2987459 3136187 3237876
35487 3237876 3298714 3330807 3348605 3365187 3390206 3429853 3487918 3566742 3667562 3790286 3932784
35476 3932784 4089786 4251937 4406034 4536943 4630583 4676658 4670198 4611762 4506565 4362956
35466 4362956 4190652 3999431 3798891 3599362 3413233 3255502 3142708 3090287 3109083 3201899
35456 3201899 3361100 3568357 3797114 4017306 4200800 4326194 4382131 4368502 4294656 4174622
35446 4174622 4021420 3843902 3647917 3440105 3230335 3030417 2850445 2696031 2568426
35437 2568426 2466721 2390051 2338392 2311868 2309226 2326479 2356736 2391692 2424061 2449551 2467325
35426 2467325 2479031 2487452 2496168 2510554 2538738 2590337 2672531 2785758 2921999 3066509 3201237
35415 3201237 3308142 3371931 3382319 3335473 3234163 3086721 2905119 2702314 2489469 2274251
35405 2274251 2060789 1850442 1642214 1432835 1217495 991409 751543 497976 234992
35396 234992 -28299 -278594 -500690 -680825 -809942 -885910 -913882 -904356 -869552 -819837 -761911
35385 -761911 -699186 -633576 -567573 -505861 -455893 -427142 -428855 -466646 -539075 -636171 -741402
35374 -741402 -836587 -907279 -946099 -953290 -935199 -901599 -862626 -826200 -796620 -774427 -757223 -741213
35362 -741213 -723261 -702443 -679663 -655002 -624409 -578171 -502569 -384094 -214369 6329 268257
35351 268257 554321 844402 1120611 1372050 1597478 1804513 2005173 2209492 2420434 2632668
35341 2632668 2835409 3017009 3168444 3284323 3362013 3400549 3400507 3364790 3299191 3211448 3108824
35330 3108824 2995682 2873041 2740615 2599994 2456952 2321631 2206406 2122223 2075189 2065239
35320 2065239 2087561 2135129 2200222 2274505 2348942 2414442 2462484 2484769 2472579 2417534 2314277
35309 2314277 2163648 1974440 1762700 1548799 1353010 1190900 1070224 990689 946528 930215
35299 930215 935199 956435 989083 1026681 1060249 1078988 1072380 1032962 958866 855334 734685
35288 734685 614445 513971 450360 434745 470016 550442 663115 790581 913989 1016309
35278 1016309 1085390 1116435 1113185 1087265 1055667 1036777 1045622 1089381 1164783 1258912 1353518 1431064
35266 1431064 1479998 1497484 1489139 1466247 1441656 1426021 1425829 1443505 1478622 1528957 1590718 1658019
35254 1658019 1722504 1774253 1804275 1807424 1783617 1736564 1671515 1594238 1511806 1433644 1371081
35243 1371081 1335318 1335286 1376904 1464092 1600590 1791027 2040178 2350412 2718673 3134567 3580640
35232 3580640 4034711 4473350 4875309 5224200 5510079 5729872 5886631 5987831 6043109 6061770
35222 6061770 6050398 6011175 5941851 5837769 5695037 5513129 5296020 5052286 4795002 4541209
35212 4541209 4310180 4120190 3984798 3909944 3892664 3921652 3979608 4046866 4105294 4141328 4147658
35201 4147658 4123606 4074284 4008603 3936696 3867978 3810681 3772221 3758956 3774680 3818888 3886381
35190 3886381 3968784 4056980 4143038 4220739 4284931 4330807 4354362 4354208 4333432 4299358 4260300 4220674
35178 4220674 4177378 4119805 4033694 3906988 3735040 3523152 3285696 3042508 2814186 2617953
35168 2617953 2465282 2361491 2306713 2297324 2326950 2386758 2465332 2548950 2622954 2674249 2694061
35157 2694061 2679851 2635669 2571049 2498756 2431743 2379957 2348003 2334743 2334848 2341146 2346357 2343863
35145 2343863 2328231 2296285 2248654 2190889 2133108 2087595 2064735 2068888 2096420 2137313 2179543
35134 2179543 2213561 2234465 2241402 2235365 2216763 2183472 2129978 2048339 1931132 1775108 1583505
35123 1583505 1365728 1134821 904239 685451 486993 314751 172547 62055 -18285 -74494
35113 -74494 -116946 -158208 -209216 -275147 -352387 -427924 -482018 -493881 -448365 -340682 -177062
35102 -177062 28281 257732 494135 722880 932466 1114296 1262532 1374576 1452195 1502488
35092 1502488 1537336 1570455 1612671 1667378 1728351 1780860 1805453 1782971 1699245 1548246 1332966
35081 1332966 1064289 759028 438221 125614 -154715 -382110 -543241 -634216 -659871 -631080
35071 -631080 -561627 -465587 -355389 -240393 -125994 -13275 100619 221080 353525 500549
35061 500549 660141 825848 988428 1137952 1265724 1365861 1435883 1475509 1483936 1457579
35051 1457579 1390421 1277280 1118184 921337 703116 485019 288956 132784 27624 -22890
35041 -22890 -22223 20062 89996 171990 252298 322229 379996 430634 483885 550661 639278 752763
35029 752763 888052 1036991 1188593 1331836 1458314 1563865 1648579 1715300 1767742 1809396
35019 1809396 1843661 1874545 1907222 1948017 2003373 2077384 2168592 2268382 2363204 2439967 2491243
35008 2491243 2517157 2523836 2520594 2517678 2524759 2549579 2596337 2663920 2744446 2823089 2880061 2894959
34996 2894959 2852350 2746578 2583616 2378732 2150718 1915499 1682296 1453509 1227184 1000180
34986 1000180 770992 541582 317436 105391 -89725 -267358 -430766 -584453 -731802
34977 -731802 -874784 -1015513 -1157780 -1306886 -1467967 -1644159 -1835554 -2038780 -2247003 -2450766
34967 -2450766 -2639998 -2806115 -2942487 -3042663 -3097833 -3095806 -3022857 -2868044 -2628244 -2311551
34957 -2311551 -1937223 -1531787 -1122873 -733417 -378443 -64880 206801 440824 644703
34948 644703 827430 996553 1155047 1299856 1423170 1515683 1570259 1584586 1562006 1510110
34938 1510110 1437619 1351236 1254307 1147932 1033221 912734 789864 666834 543326 417514
34928 417514 289305 163370 49471 -40282 -95460 -110532 -86414 -30495 44437 122091 185126
34917 185126 218241 211684 164106 83093 -17424 -121573 -215385 -288759 -335998 -356135 -353577
34906 -353577 -338595 -326606 -335277 -379681 -467069 -593635 -744584 -897292 -1026421 -1109967 -1134917
34895 -1134917 -1100633 -1018192 -905757 -782246 -662418 -555154 -464334 -390153 -329236 -273850
34885 -273850 -212247 -131707 -23427 113556 272023 439917 605325 760377 902372 1031907
34875 1031907 1149095 1249961 1325254 1362831 1352847 1293265 1192838 1070042 948465 850760
34865 850760 793745 786435 831102 925712 1065329 1241108 1437771 1632314 1796333 1901968
34855 1901968 1928809 1868403 1724654 1510873 1245546 948454 637741 328047 30027 -248479
34845 -248479 -500118 -715968 -885219 -996950 -1043016 -1020487 -932496 -787287 -596128 -371117
34835 -371117 -123847 134758 393759 641429 864935 1050630 1184981 1256157 1256154 1182780 1040515
34824 1040515 839560 593369 315794 19339 -284500 -583255 -861636 -1101843 -1286584
34815 -1286584 -1403454 -1448357 -1426385 -1349843 -1234397 -1094940 -942920 -785930 -629036 -476178
34805 -476178 -330385 -192722 -61263 68392 200561 335917 469017 588471 679810 729694
34795 729694 729810 679275 585061 460450 322177 187196 70003 -19004 -74077 -93852 -80584
34784 -80584 -39045 24882 105688 199197 302655 414360 533603 660889 797455 943492
34774 943492 1096076 1248574 1392273 1519016 1623129 1701894 1755283 1785750 1798062 1798221 1791008
34763 1791008 1777013 1751018 1703151 1622679 1502660 1343086 1151091 938544 718828 504472
34753 504472 305812 129703 -22010 -152961 -270082 -379125 -480608 -569086 -636348 -676187
34743 -676187 -687311 -672682 -636347 -580528 -504881 -407981 -289805 -154047 -9201 132555 258672
34732 258672 359850 431216 470093 472540 431964 341334 197597 5550 -221009 -461519 -693579
34721 -693579 -898672 -1066120 -1193310 -1282267 -1335183 -1352326 -1333737 -1282764 -1207839 -1120693 -1032402
34710 -1032402 -950115 -875852 -806870 -736783 -657182 -559698 -437607 -286202 -102330 115625
34700 115625 366670 645611 942192 1241616 1526352 1778733 1983634 2130426 2213710 2232877
34690 2232877 2191005 2093569 1947322 1759671 1538756 1293981 1036292 777772 530728 306801
34680 306801 116289 -32388 -133142 -182271 -178157 -120776 -11345 147934 354117 603447
34670 603447 890555 1206922 1539690 1872251 2187302 2471273 2717725 2927687 3106928 3262024
34660 3262024 3397411 3514257 3610892 3684160 3731273 3751388 3745795 3716400 3663536 3584981 3477133
34649 3477133 3337727 3168464 2976084 2771326 2566327 2371823 2195328 2040669 1908492
34640 1908492 1797497 1706270 1634899 1584777 1555932 1543475 1536038 1517577 1471387 1384173 1249005
34629 1249005 1067022 847656 607023 364521 138691 -56195 -211686 -324553 -394709 -422980
34619 -422980 -409890 -355987 -263365 -137725 10053 164016 305597 417876 489933 519588
34609 519588 513613 485728 453430 434860 446284 499838 601230 747950 929089 1127137 1320886
34598 1320886 1488572 1611102 1675399 1677031 1620838 1519124 1388208 1244614 1102050 969863
34588 969863 853211 754253 673229 608818 558229 517627 482788 449332 412463 367062 308857
34577 308857 236191 150954 57909 -37015 -128021 -209754 -277258 -326449 -355121 -363880 -356566 -340160
34565 -340160 -324116 -318820 -333219 -372358 -435820 -517508 -606722 -690368 -755986 -794660 -802516 -780260
34553 -780260 -731668 -662504 -580433 -495226 -418247 -361089 -333949 -344212 -395329 -485917 -609514
34542 -609514 -755429 -910748 -1062695 -1200280 -1314813 -1399835 -1451445 -1469002 -1455082 -1413835
34532 -1413835 -1348390 -1259059 -1143347 -997560 -819028 -608234 -370042 -113188 151968 416019
34522 416019 671631 913127 1136206 1339377 1526318 1706535 1892351 2093094 2309907 2534545
34512 2534545 2752773 2949871 3114751 3240878 3324875 3364965 3360827 3314667 3232220 3122264
34502 3122264 2994326 2855779 2710237 2558368 2400410 2238448 2077125 1923093 1784277
34493 1784277 1669171 1585095 1534896 1513420 1506409 1493445 1453924 1373487 1248381 1086465 905035
34482 905035 726568 573991 466398 415421 422397 477506 562266 655401 739902 808184 863282
34471 863282 915962 979398 1063812 1173158 1304621 1450104 1598211 1735892 1850160 1930740
34461 1930740 1973425 1982278 1968521 1945782 1924159 1906565 1889003 1863590 1821827 1756644 1663342
34450 1663342 1540100 1388237 1212070 1018189 814286 607775 404465 207617 17803
34441 17803 -166046 -344482 -515084 -671291 -803789 -904332 -970050 -1005666 -1022241 -1033309
34431 -1033309 -1050839 -1083134 -1135001 -1208754 -1304311 -1417915 -1540861 -1660221 -1762085 -1835676
34421 -1835676 -1875861 -1882912 -1860379 -1812617 -1742875 -1652321 -1540392 -1406675 -1253323 -1086096 -912674
34410 -912674 -739039 -566423 -391156 -207719 -12943 191304 398250 598217 780912 937155
34400 937155 1060219 1146779 1197159 1215018 1206997 1182394 1152153 1126735 1113779 1116700 1134470 1161813
34388 1161813 1189614 1206224 1200309 1164751 1099766 1013374 918531 828237 751186 689964 641968
34377 641968 601700 562992 520424 470028 409887 341396 271158 212132 182183 199482 276452
34366 276452 415055 605528 829019 1062870 1286148 1483204 1644501 1765723 1846822 1891640
34356 1891640 1907626 1904983 1895071 1888452 1893109 1913484 1950800 2004597 2074504 2160867 2263382 2378435
34344 2378435 2497080 2605380 2687231 2728153 2718159 2652697 2531729 2357759 2134032 1863998
34334 1863998 1552118 1204870 830819 439809 42435 -349542 -722597 -1061790 -1352494
34325 -1352494 -1582797 -1745764 -1840917 -1874386 -1857207 -1802051 -1719582 -1616035 -1492764 -1347580
34315 -1347580 -1177249 -980433 -760072 -524280 -285350 -57555 145181 311326 433637
34306 433637 510654 546723 549842 528324 488510 435059 373135 310230 255856 219354 207697 224842
34294 224842 272379 349695 452419 570048 685183 776130 822087 808364 729461 589484 400813
34283 400813 182098 -44026 -253713 -425274 -542588 -597298 -588712 -521781 -404748 -247989
34273 -247989 -63934 133336 329749 513460 676266 813712 924607 1010805 1077268 1131623
34263 1131623 1182556 1237197 1298602 1364618 1428499 1480438 1509118 1503509 1455578 1363465 1233046
34252 1233046 1076181 906292 733670 562835 392918 220767 45326 -129106 -292940
34243 -292940 -434823 -546192 -623941 -670033 -689057 -685373 -661098 -615639 -547153 -455503 -345059
34232 -345059 -225410 -109309 -9358 64026 102144 96374 37993 -79281 -255501 -482191 -743156
34221 -743156 -1017910 -1286010 -1530682 -1740707 -1910208 -2036881 -2119955 -2159426 -2157157 -2118907
34211 -2118907 -2055255 -1979670 -1904013 -1833992 -1767459 -1696309 -1610007 -1498164 -1351307 -1161027 -920755
34200 -920755 -627295 -282290 107052 528330 965608 1402228 1823947 2221416 2591446 2937058
34190 2937058 3266221 3588906 3912823 4239362 4561838 4866992 5138927 5363437 5530966
34181 5530966 5637571 5684461 5676995 5623559 5534062 5417922 5282250 5131291 4967426 4792713
34171 4792713 4609438 4419234 4221720 4014342 3794091 3560129 3315450 3066423 2820784
34162 2820784 2585563 2366043 2165811 1987540 1834173 1709750 1618622 1562563 1537256 1530959
34152 1530959 1526956 1508603 1464003 1388091 1282011 1151212 1003705 849067 697751 559728
34142 559728 441932 345271 263345 184673 98147 -978 -107772 -208217 -282831 -311450 -277981
34131 -277981 -174233 -1853 228452 500237 795650 1099079 1399066 1688227 1961610 2214370
34121 2214370 2440041 2630397 2777126 2874731 2923531 2931288 2912158 2882720 2856817 2841977 2839290
34110 2839290 2846185 2859693 2877977 2899579 2921535 2938165 2941683 2924648 2883015 2817987 2735461 2643178
34098 2643178 2547166 2449487 2348266 2239617 2120111 1988685 1847598 1702590 1562618 1439423
34088 1439423 1346863 1299489 1309846 1384511 1520032 1700562 1898859 2081018 2213734 2271596
34078 2271596 2241794 2124794 1931481 1678871 1386489 1074019 759488 457241 176402 -78805
34068 -78805 -306611 -504737 -668744 -791973 -866067 -881546 -829199 -702944 -503171 -238515
34058 -238515 75296 418768 771959 1115925 1432257 1702576 1910188 2044210 2103863 2099460
34048 2099460 2048618 1969313 1873586 1765012 1640573 1495072 1325234 1131645 918508 692391
34038 692391 460973 231997 12408 -191951 -375610 -532038 -652852 -728650 -751345 -716731
34028 -716731 -626161 -486830 -310768 -112739 92520 292915 480424 650896 802550 934217
34018 934217 1044166 1129774 1187798 1214949 1208591 1167241 1090407 977749 828421 641661 418617
34007 418617 164090 -112896 -399512 -679538 -933744 -1141223 -1282369 -1342805 -1316860 -1209443
33997 -1209443 -1035874 -819619 -588589 -371073 -192175 -70695 -16303 -27834 -94087 -197520
33987 -197520 -319349 -443661 -559049 -657957 -735081 -786403 -809624 -805495 -778812 -738100 -694022
33976 -694022 -656994 -634568 -628913 -635295 -642616 -636469 -603592 -535731 -431251 -294277 -132422 45620
33964 45620 231722 418911 601168 773014 929481 1066561 1181734 1274444 1346827 1404747
33954 1404747 1458115 1519147 1598421 1700427 1820853 1946994 2061313 2147073 2194222 2203280 2185596
33943 2185596 2159812 2145833 2158458 2202898 2273708 2357151 2435455 2491049 2509793 2483139 2409187
33932 2409187 2292356 2141775 1969358 1788518 1613489 1458262 1334484 1248875 1201688 1187294
33922 1187294 1196459 1218751 1243948 1262889 1269058 1261135 1244982 1232892 1239468 1275746 1344434 1438523
33910 1438523 1543865 1644474 1728188 1790231 1833124 1863411 1887343 1908125 1925881 1939450 1948293
33899 1948293 1953354 1956637 1959941 1963313 1964101 1957172 1936165 1895235 1830772 1742778 1635297 1515359
33887 1515359 1391053 1270249 1160831 1071428 1010826 985526 996543 1037178 1092900 1143781 1168909
33876 1168909 1151132 1079964 951830 768915 538575 274004 -5037 -273064 -501886 -665130
33866 -665130 -743079 -726823 -620908 -443544 -223437 6832 219083 396112 533637 637084
33856 637084 715515 776084 821536 851020 862766 856592 835066 803592 770183 745114 739843 765027
33844 765027 828509 934332 1082639 1269439 1485813 1717721 1947726 2158512 2336505 2473991
33834 2473991 2569250 2625313 2648156 2645066 2623494 2590359 2551433 2510816 2470883 2432849 2397233
33823 2397233 2363377 2328217 2285701 2227972 2147886 2041169 1907024 1747494 1566771 1370922
33813 1370922 1167428 963857 766052 577061 397415 226389 63385 -90870 -233593
33804 -233593 -360379 -467405 -554614 -627550 -695815 -768478 -849051 -932886 -1008065 -1058730 -1069028
33793 -1069028 -1026600 -925496 -768504 -568005 -344211 -120853 79616 238779 342186 378459
33783 378459 340128 227012 50061 -167525 -393893 -596083 -748537 -839096 -870401 -856901
33773 -856901 -819458 -779755 -756005 -760369 -798165 -868745 -967509 -1088113 -1223794 -1367453 -1510951
33762 -1510951 -1644496 -1756768 -1835907 -1871003 -1853459 -1777676 -1641048 -1443866 -1190057 -888747
33752 -888747 -555362 -210405 124473 431197 697944 918679 1091147 1215808 1296373 1340372
33742 1340372 1358045 1359593 1352486 1340271 1323006 1298395 1262908 1212930 1146463 1065526 978263 899049
33730 899049 845652 834670 877921 981562 1147074 1371750 1647524 1959495 2286384 2603522
33720 2603522 2886832 3115925 3275727 3357360 3358857 3285512 3149302 2967179 2758592 2542748
33710 2542748 2336097 2150387 1991714 1860834 1754791 1669213 1600294 1545550 1503187 1470610
33700 1470610 1443085 1413609 1374664 1321372 1254328 1180050 1108257 1047274 1000209 963999 931934
33689 931934 898227 861906 827590 802743 793506 801974 826314 862985 909260 964621 1030390 1107800
33677 1107800 1195670 1289191 1380795 1462531 1528473 1575845 1604522 1615657 1610667 1591638 1562927
33666 1562927 1532375 1510400 1506711 1526191 1565970 1614914 1655643 1668483 1636178 1548027 1402247
33655 1402247 1206164 974327 725104 476525 242558 30901 -157316 -326241 -482976
33646 -482976 -634760 -786420 -939189 -1091372 -1240025 -1382015 -1513757 -1630431 -1725999 -1794177
33636 -1794177 -1829320 -1826392 -1780653 -1688432 -1549435 -1369217 -1159742 -937306 -719046 -520045
33626 -520045 -351838 -221662 -131566 -77714 -50876 -38631 -28551 -11213 17930 58330 105662
33615 105662 154067 198373 235709 266566 295300 329736 379327 452208 552174 676942 818379
33604 818379 964543 1102536 1221077 1312177 1371943 1400702 1402375 1383373 1351624 1316176 1286817
33593 1286817 1272857 1281242 1315229 1374407 1455321 1551641 1654056 1751310 1833048 1893220 1931620
33582 1931620 1952399 1960779 1960628 1954512 1945593 1939392 1944141 1969772 2026141 2120734 2256219 2428715
33570 2428715 2627770 2838115 3042437 3224291 3370648 3473666 3531289 3546689 3526910 3481183
33560 3481183 3419156 3349399 3278698 3212411 3155414 3112617 3088278 3084368 3099203 3127531 3162092
33549 3162092 3195524 3221374 3234081 3228784 3201650 3150595 3075901 2980384 2869218 2749453 2629371
33538 2629371 2517665 2422312 2348919 2298854 2268043 2247200 2223518 2183246 2114599 2010512 1870300
33527 1870300 1699259 1506112 1299727 1086979 872744 661547 459464 275019 118452
33518 118452 -481 -75256 -104396 -91173 -40985 41985 156555 303240 480691 682286
33508 682286 895114 1101908 1285071 1431483 1536718 1607238 1659330 1714711 1794236 1912037
33498 1912037 2072054 2267733 2484225 2701712 2898655 3054903 3155202 3192737 3170855 3101183
33488 3101183 2998698 2876764 2744985 2610213 2478944 2359234 2261417 2197586 2179791 2217322
33478 2217322 2314161 2467814 2669681 2906207 3160362 3413833 3650198 3857876 4030672 4164922
33468 4164922 4255125 4291738 4263460 4163069 3993077 3767719 3510267 3247415 3003736 2798351
33458 2798351 2644087 2547909 2511255 2529842 2593353 2685683 2786222 2872372 2923206 2923513 2866735
33447 2866735 2755170 2596984 2401657 2176774 1928235 1663082 1391838 1127667 882629
33438 882629 663609 470537 297569 136126 -21895 -182047 -346938 -517160 -692477 -872382
33428 -872382 -1055857 -1240845 -1423964 -1600382 -1763315 -1902693 -2003753 -2047519 -2014790 -1892674
33418 -1892674 -1680080 -1388663 -1038861 -653960 -255642 137343 508129 840266 1117838
33409 1117838 1328145 1465773 1535139 1548979 1522951 1469599 1395425 1302526 1192982 1072536
33399 1072536 951188 840800 751907 691734 663772 667856 699930 751950 813116 872646 922839
33388 922839 960605 986549 1002120 1006326 993703 954752 878979 759032 593639 387717 150089
33377 150089 -109054 -379085 -647929 -900669 -1119696 -1287296 -1389827 -1421390 -1384978 -1290636
33367 -1290636 -1151689 -980692 -786479 -572991 -340144 -86286 188812 481678 784457
33358 784457 1085833 1373056 1634474 1861912 2052161 2207269 2333670 2440551 2537558 2632000
33348 2632000 2726292 2816935 2895822 2953155 2980449 2972455 2927929 2849475 2742744 2615187 2474702
33337 2474702 2328140 2179496 2028281 1869677 1697499 1508849 1307711 1105671 920005
33328 920005 770574 676460 652739 707928 842748 1050319 1317231 1624950 1951416 2272866
33318 2272866 2565602 2807502 2979301 3066000 3058739 2956920 2769691 2515440 2218676 1905060
33308 1905060 1596670 1309434 1053262 833668 653206 511747 406060 329936 275557 235557
33298 235557 204266 177115 148911 113018 63058 -3504 -82708 -164963 -239279 -297869 -338182
33287 -338182 -361946 -373350 -378455 -385891 -407027 -453960 -535433 -652761 -798369 -957920 -1114649
33276 -1114649 -1253335 -1362305 -1433871 -1464282 -1453570 -1404750 -1321990 -1208437 -1064890 -890304
33266 -890304 -684043 -448870 -193029 69913 323577 552179 742713 884939 970356 992593
33256 992593 950347 851187 712665 558353 409984 280045 169307 70833 -22263 -110273
33246 -110273 -185405 -235564 -250427 -226217 -167124 -83478 12010 108306 198764 281514 357478
33235 357478 427302 488995 537519 566509 571096 550539 509516 457538 406694 368455 350844 356940
33223 356940 384989 429569 483175 537968 587710 629581 665114 699684 740557 794337 864957
33212 864957 952948 1055956 1169674 1288265 1404210 1508494 1592108 1648628 1676215 1677211 1655164
33201 1655164 1611275 1542851 1444755 1312473 1144364 941822 708047 447068 164125 -132820
33191 -132820 -431496 -714916 -963192 -1157711 -1286197 -1345848 -1342246 -1284573 -1180575 -1034917
33181 -1034917 -851477 -636957 -402664 -163587 63995 264956 427399 544401 615164 645122
33171 645122 644937 628620 610976 604459 616165 646393 689761 738442 785558 826920 860855 887349
33159 887349 907921 926257 948354 980812 1027318 1084981 1142798 1183564 1188771 1144366 1044896 894421
33147 894421 704348 489829 266584 49127 -149854 -319670 -451802 -540347 -582934 -582008
33137 -582008 -545671 -486947 -421264 -363119 -323213 -306557 -311509 -329925 -349075 -355555 -340184 -301768
33125 -301768 -247436 -188559 -133870 -83736 -29618 40319 133102 246092 369027 491381 609567
33114 609567 728880 859140 1007379 1172102 1341787 1497604 1618745 1688278 1697318 1645960
33104 1645960 1541076 1392823 1211892 1008178 790326 565618 340179 119373 -92246
33095 -92246 -291639 -477797 -650877 -810170 -952717 -1074197 -1171590 -1245357 -1299488 -1339689
33085 -1339689 -1371142 -1396753 -1416110 -1425713 -1421243 -1401700 -1373235 -1349863 -1349637 -1387757 -1469996 -1589709
33073 -1589709 -1729558 -1866357 -1976234 -2038095 -2035370 -1956938 -1797974 -1560743 -1255274 -899604
33063 -899604 -519077 -143927 194932 471169 667725 779239 811091 775621 687715 562149
33053 562149 413463 257045 109581 -12035 -92887 -122318 -95481 -13845 115244 279761
33043 279761 464962 655991 840254 1008510 1154295 1272645 1359237 1410318 1423078 1396285
33033 1396285 1331181 1232345 1107790 967611 821351 674927 528607 377302 213541 31825
33023 31825 -167970 -380098 -595477 -805647 -1005801 -1195277 -1375521 -1546913 -1706122 -1844912
33013 -1844912 -1950534 -2007508 -2000410 -1917015 -1750796 -1502226 -1178947 -795269 -371430 67377
33003 67377 492405 873757 1183957 1402043 1516748 1527701 1444585 1285074 1072371 832431
32993 832431 590690 368142 177723 22745 -101383 -203125 -291188 -373228 -456076 -545142
32983 -545142 -642188 -743178 -838300 -914393 -958091 -958096 -906420 -799320 -638352 -430815 -188451
32972 -188451 75992 353161 640315 941722 1265924 1620827 2008267 2420218 2838541 3238563
32962 3238563 3594651 3885161 4095469 4219605 4261098 4232555 4153077 4043779 3922930 3802316
32952 3802316 3685563 3568501 3441459 3293090 3114582 2902868 2661680 2400355 2131045
32943 2131045 1865705 1614243 1384654 1184661 1023253 910478 855143 861557 926753 1039210
32933 1039210 1179690 1324703 1452183 1547204 1604594 1627125 1621095 1592791 1547647 1491194 1429583
32922 1429583 1368515 1311122 1256110 1197377 1125563 1031196 908326 757235 585240 405418
32912 405418 233783 85823 -26612 -97270 -125788 -116441 -75935 -11166 72432 171612 284949
32901 284949 411270 547215 685310 814112 921017 996364 1036526 1044269 1026393 990049 939635
32890 939635 875879 797483 704360 600630 495835 403890 340135 317309 341647 410655 513811
32879 513811 636190 763339 884925 995538 1093040 1176295 1244104 1295506 1330202 1348059 1348186
32868 1348186 1328979 1289772 1233049 1165591 1097872 1042204 1010501 1012234 1053101 1134665 1254693
32857 1254693 1407429 1583254 1768255 1944885 2094351 2200293 2252355 2248086 2192255 2094190
32847 2094190 1964980 1816344 1661159 1513833 1388675 1296243 1239535 1212318 1200653 1186766
32837 1186766 1153275 1086053 975413 816689 611009 366048 95811 -181083 -444447 -676268
32827 -676268 -864251 -1003941 -1098558 -1156742 -1189542 -1207819 -1220362 -1232530 -1245636 -1257626 -1264966
32816 -1264966 -1264608 -1254734 -1234073 -1200877 -1152798 -1087698 -1004352 -902165 -780494 -638783 -478025
32805 -478025 -302520 -120592 56112 214099 339721 421462 453160 437411 387222 324328
32795 324328 274236 259555 293623 376163 492618 618058 724771 790255 801962 757198 659786
32784 659786 516415 334724 123069 -109259 -352475 -597205 -834788 -1056527 -1252704 -1412765
32774 -1412765 -1526747 -1586512 -1585784 -1519646 -1385270 -1184418 -926101 -626834 -307309 13087
32764 13087 320936 610290 881180 1136941 1381961 1620085 1853214 2080225 2296731 2495914
32754 2495914 2670138 2813077 2921873 2998426 3048837 3080891 3100688 3110043 3105772 3081227 3029458
32743 3029458 2946331 2831687 2688007 2518083 2324123 2109332 1880702 1650600 1435610 1253095
32733 1253095 1117331 1037164 1015938 1053173 1146684 1293639 1489632 1726233 1989041 2258567
32723 2258567 2514523 2741436 2932577 3090534 3224954 3348923 3475141 3612677 3765053
32714 3765053 3930134 4101393 4269319 4422291 4547403 4632264 4667726 4649963 4580330 4463044
32704 4463044 4302447 4101696 3863305 3590554 3288534 2964364 2626856 2286129 1953197
32695 1953197 1639092 1353090 1100511 881459 691681 525589 380118 257671 166834 120335
32685 120335 130710 205236 342264 530628 752209 986297 1213870 1420393 1596677 1738129
32675 1738129 1843258 1912484 1947816 1953260 1935190 1901787 1861404 1820573 1782778 1748406 1715131
32664 1715131 1678018 1629580 1561207 1466550 1345658 1207409 1068499 949127 867068 832584
32654 832584 846357 901294 986869 1093129 1212113 1336736 1459041 1569464 1657386 1712421
32644 1712421 1726103 1693826 1616404 1500209 1355522 1193919 1025988 859923 700832 550650
32634 550650 408920 274422 146783 27201 -81674 -175937 -250474 -299472 -317644 -301605
32624 -301605 -250605 -166740 -55356 74420 209926 336652 440698 510733 538802 520390
32614 520390 454273 342094 187328 -5984 -233539 -489246 -762611 -1037286 -1292684 -1508394
32604 -1508394 -1668974 -1766309 -1798796 -1768940 -1681980 -1546706 -1377176 -1192867 -1015919 -866223
32594 -866223 -756492 -689220 -656570 -643336 -632027 -608020 -562524 -492584 -399328 -286496 -160363
32583 -160363 -30254 91830 193248 263492 296193 289661 246746 174768 84962 -9783 -98940
32572 -98940 -178048 -249650 -320777 -398834 -488518 -591231 -706239 -831704 -964426 -1098786 -1226324
32561 -1226324 -1336722 -1419773 -1467573 -1476545 -1449181 -1394864 -1328643 -1267265 -1223354 -1200370 -1191583
32550 -1191583 -1184325 -1167274 -1136355 -1096056 -1056433 -1028421 -1019826 -1032817 -1062932 -1099809 -1129769 -1139750
32538 -1139750 -1121248 -1072672 -999052 -909233 -812032 -713387 -615740 -519254 -423395 -327538 -230622
32527 -230622 -130889 -26759 81287 189039 288415 369321 422808 444171 434667 401270 354806
32516 354806 307590 271315 255376 265565 303372 366291 449067 545311 648892 754730 858919
32505 858919 958384 1050463 1132765 1203269 1260466 1303688 1333841 1354394 1371885 1395103 1432895
32494 1432895 1491526 1573060 1675753 1795951 1929856 2073845 2223677 2374011 2518859 2652292
32484 2652292 2768539 2861846 2927019 2960636 2961649 2930523 2867640 2772793 2646672 2493303 2321446
32473 2321446 2143696 1973726 1823096 1698771 1601761 1526934 1464208 1401114 1326268 1232569
32463 1232569 1118917 990058 855158 726059 615716 536570 498714 508428 567767 675145
32453 675145 825894 1012073 1221938 1440433 1651488 1841430 2001687 2129159 2224438 2289718
32443 2289718 2328350 2346176 2352527 2358597 2373085 2397653 2425557 2444904 2444768 2420298 2373935 2312859
32431 2312859 2245468 2179704 2123713 2087045 2080466 2113862 2193243 2318327 2481970 2671904 2874159
32420 2874159 3076602 3270722 3450960 3612266 3747534 3846490 3896980 3888651 3817536 3689045
32410 3689045 3517187 3320281 3115678 2916330 2730200 2561555 2412611 2284461 2177068
32401 2177068 2088640 2015183 1950882 1889291 1824821 1754131 1677122 1597006 1519008 1448266 1388494
32390 1388494 1342416 1313226 1304979 1320672 1358877 1411467 1464596 1503111 1516021 1500054 1459687
32379 1459687 1404268 1344147 1287487 1238765 1199077 1167546 1142660 1122824 1106493 1092582 1081195
32368 1081195 1074236 1075558 1090473 1124148 1178621 1249398 1324085 1384911 1414541 1402277 1347524 1259261
32356 1259261 1152334 1042272 940265 849741 766105 680318 584795 478162 365920 257399
32346 257399 161914 86681 36382 12602 12477 27904 47127 58905 57310 44532 30120 27000
32334 27000 45839 90061 153754 223913 285996 329426 349526 345472 317265 264999 190818 101069
32322 101069 6087 -82707 -156623 -212180 -251034 -277633 -295947 -306725 -306337 -287594 -242279 -164363
32310 -164363 -52374 89991 254692 430455 603523 758308 878671 950138 962667 913045
32300 913045 805933 652917 469840 273387 78265 -103907 -263846 -393003 -483133 -528081
32290 -528081 -526739 -484503 -411554 -318695 -213470 -98917 24625 156438 293862 433971
32280 433971 577326 730340 903274 1104147 1332086 1573962 1806004 1999689 2129761 2181689
32270 2181689 2155638 2065078 1930655 1772741 1606666 1442333 1286833 1147360 1032931 954740
32260 954740 925054 954108 1045497 1192521 1378262 1579887 1774737 1944971 2079189 2171423
32250 2171423 2219165 2222184 2183080 2108823 2011352 1905988 1808509 1732912 1690885 1692143 1744312
32239 1744312 1851762 2013771 2222798 2464039 2717383 2961903 3181210 3366922 3518385
32230 3518385 3638930 3730830 3791615 3813507 3785976 3699896 3551372 3343971 3089048 2804200
32220 2804200 2510043 2225959 1966126 1737370 1539445 1367110 1212540 1066771 919714
32211 919714 759550 573087 348301 78580 -233531 -575475 -927252 -1265898 -1569662 -1820829
32201 -1820829 -2007300 -2123431 -2170232 -2154898 -2089721 -1990294 -1872662 -1749518 -1626602 -1501241
32191 -1501241 -1364467 -1206509 -1023409 -821455 -616970 -431401 -284132 -186534 -139723 -136335
32181 -136335 -164705 -212998 -271542 -333158 -392445 -445083 -487251 -515104 -524751 -513496 -482008 -435951
32169 -435951 -385734 -344582 -325960 -341133 -396998 -494640 -629143 -790606 -965489 -1137726 -1289982
32158 -1289982 -1405516 -1470327 -1474717 -1414252 -1290577 -1112089 -893493 -653434 -410734 -180837
32148 -180837 26204 205838 357727 483955 587448 671096 737388 788315 825389 849928
32138 849928 863853 871057 878896 898922 945840 1034310 1174331 1366858 1601584 1858256 2111546
32127 2111546 2337703 2519967 2650543 2729062 2759545 2747944 2701005 2626054 2530868 2423289
32117 2423289 2310641 2199438 2095471 2003759 1927765 1868272 1823347 1790176 1767691 1757777 1763770
32106 1763770 1786920 1822990 1861218 1886627 1884736 1846176 1768966 1657925 1522447 1374009 1223982
32095 1223982 1081767 953609 842320 747684 666985 595362 526392 453415 371558 279685 181121
32084 181121 82716 -6899 -78485 -122424 -129393 -92964 -13697 97900 222299 336064 418828
32073 418828 458770 454638 414319 351487 281924 220504 179190 165965 184515 234458 311811 409569
32061 409569 518379 627670 727550 811285 877284 929266 974169 1018588 1065469 1112651 1154146
32050 1154146 1183750 1199064 1203160 1202197 1200176 1194295 1174469 1127731 1045184 927542 786298 639874
32038 639874 506660 398327 316530 254421 201660 149832 95352 38862 -17590 -73226 -129193
32027 -129193 -186720 -243900 -293279 -322113 -315479 -260453 -149185 20072 243346 511655 811558
32016 811558 1125847 1435008 1719849 1964909 2161208 2306773 2404573 2459571 2477086 2463295
32006 2463295 2426543 2377511 2327579 2286276 2259109 2246609 2244870 2247521 2248377 2243126 2228674 2200596
31994 2200596 2150941 2068626 1942542 1765567 1537425 1265794 966109 660507 375687 139171
31984 139171 -25697 -104462 -93879 -916 160696 374164 621820 885672 1147468 1389430
31974 1389430 1595888 1755086 1860410 1910948 1911732 1873538 1811310 1740376 1671439 1607096 1542286
31963 1542286 1468577 1379638 1275162 1162137 1054034 968690 925223 940461 1025756 1185157
31953 1185157 1415181 1705751 2041896 2406049 2780625 3149890 3500009 3817330 4086752
31944 4086752 4292223 4419912 4462363 4421270 4307603 4139246 3936945 3719459 3499397 3281608
31934 3281608 3065154 2847742 2629846 2416142 2214039 2031083 1873232 1744532 1647186 1580881
31924 1580881 1541560 1520914 1507636 1490031 1458669 1407919 1336150 1245032 1138474 1021485 898937
31913 898937 774374 649558 525689 406210 299518 219191 181031 198475 278897 422271
31903 422271 622112 867550 1145171 1439826 1734638 2011410 2252352 2442720 2573142 2640683
31893 2640683 2648616 2605198 2521656 2409752 2279744 2139489 1994971 1851670 1715694 1593744
31883 1593744 1491821 1413767 1360858 1332797 1329071 1349651 1394887 1465289 1561485 1683836 1830857
31872 1830857 1996750 2169756 2333291 2470005 2566508 2615812 2616840 2572922 2491585 2385489
31862 2385489 2272274 2171631 2100436 2068466 2076726 2118518 2181936 2252292 2313645 2349598 2344041
31851 2344041 2282805 2156561 1964293 1715633 1430454 1135350 858498 625081 454651 360049
31841 360049 346570 410394 536830 700025 865580 996071 1057976 1027994 897185 672105
31831 672105 372617 26834 -335158 -686476 -1005932 -1278176 -1492997 -1644856 -1732473 -1757842
31821 -1757842 -1724916 -1638816 -1505940 -1334378 -1133596 -913370 -682635 -449219 -220626 -5139
31811 -5139 187972 349696 473327 555888 598277 604801 583070 544085 501172 467282 451772
31800 451772 458719 487628 535707 599917 677332 763754 851711 929614 982990 997409 961850 871410
31788 871410 728778 544090 333060 113862 -96174 -282970 -436920 -553202 -631568 -675755
31778 -675755 -692515 -690450 -678959 -667345 -663952 -675069 -703816 -749502 -807970 -872751 -936327 -990839
31766 -990839 -1028236 -1040547 -1020779 -964157 -868912 -736318 -570608 -379527 -175055 27010
31756 27010 209556 357934 463243 523731 544081 533335 502596 463490 427674 406695 411188
31745 411188 449120 523751 632393 766663 914329 1062408 1200524 1323251 1430309 1524640
31735 1524640 1609579 1686814 1756087 1816213 1866102 1904825 1931100 1943311 1940603 1924446 1899591
31724 1899591 1873745 1855947 1854031 1871875 1907534 1953107 1996583 2025014 2028004 2000353 1942805 1860644
31712 1860644 1761020 1650640 1534814 1417630 1302372 1191711 1087842 992904 909799 843253
31702 843253 800751 792608 830380 923532 1075545 1281279 1526907 1792475 2056115 2298490
31692 2298490 2506305 2673823 2802068 2896245 2962748 3007162 3033715 3045608 3045229 3033695 3010061
31681 3010061 2970970 2911259 2825607 2710934 2568981 2408076 2242627 2089460 1961879 1864189
31671 1864189 1789822 1724150 1650260 1554324 1427976 1267585 1072329 843256 584055 302715
$$ [...]
##END NTUPLES=NMR SPECTRUM
##END=
