##TITLE=31Pdec_E3eN3-1
 CDCl3
  64 sc
 25.12.2023
##JCAMPDX= 6.0         $$ Bruker NMR JCAMP-DX V2.0
##DATA TYPE= NMR SPECTRUM
##DATA CLASS= NTUPLES
##ORIGIN= UXNMR, Bruker Analytische Messtechnik GmbH
##OWNER= root
$$ XWIN-NMR		Version 3.5
$$ Mon Dec 25 14:23:31 2023 Russian Standard Time (UT+4h)  she@DPX200
##.OBSERVE FREQUENCY= 81.013821
##.OBSERVE NUCLEUS= ^31P
##.ACQUISITION MODE= SIMULTANEOUS
##.ACQUISITION SCHEME= undefined
##.AVERAGES= 64
##.DIGITISER RES= 16
##SPECTROMETER/DATA SYSTEM= spect
##.PULSE SEQUENCE= zgpg30
##.SOLVENT NAME= CDCl3
##.SHIFT REFERENCE= (INTERNAL, CDCl3, 0, 248.564)
##AUDIT TRAIL= $$ (NUMBER, WHEN, WHO, WHERE, WHAT)
$$ ##TITLE= Audit trail, XWIN-NMR		Version 3.5
$$ ##JCAMPDX= 5.01
$$ ##ORIGIN= Bruker BioSpin GmbH
$$ ##OWNER= she
$$ F:/spectra/data/she/nmr/P31/1/pdata/1/auditp.txt
$$ ##AUDIT TRAIL=  $$ (NUMBER, WHEN, WHO, WHERE, WHAT)
(   1,<2023-12-25 14:22:37.23 +0400>,<she>,<DPX200>,
      <continue with go, POWCHK disabled, PULCHK disabled
       configuration hash MD5:
       00 E9 B6 7A A2 85 ED C7 34 08 36 98 17 FE 4E 26
       data hash MD5: 32K
       9C 20 92 F3 6D 14 92 55 A2 F3 A4 B9 B6 25 F6 1A>)
(   2,<2023-12-25 14:22:42.26 +0400>,<she>,<DPX200>,
      <Start of raw data processing
       efp BC_mod = 2 LB = 10 FT_mod = 6 PKNL = 1 PHC0 = -12791.94 PHC1 = 1541.694 SI = 64K 
       data hash MD5: 64K
       EC 81 D8 88 C4 16 04 95 38 70 28 9A F3 1D EE 37>)
(   3,<2023-12-25 14:22:57.06 +0400>,<she>,<DPX200>,
      <pk PHC0 = 3.807912 PHC1 = 0 
       data hash MD5: 64K
       5B F1 6A 56 66 F2 AF 9C 64 13 9F 7D 5D E0 18 7C>)
(   4,<2023-12-25 14:23:00.81 +0400>,<she>,<DPX200>,
      <abs ABSG = 5 
       data hash MD5: 64K
       92 FA AD 6F F5 93 29 3A 46 56 72 D0 87 50 9B 40>)
$$ ##END=
$$ 
$$ hash MD5
$$ 19 BE 72 1F 0E 0C 50 A9 1B E9 E7 CE 70 C7 4B 4D
##$RELAX= 
##$RELAX= 
##$RELAX= 
##$RELAX= 
##$RELAX= 
##$RELAX= 
##$RELAX= 
##$RELAX= 
##$RELAX= 
$$ Bruker specific parameters
$$ --------------------------
##$DU= <F:/spectra>
##$EXPNO= 1
##$NAME= <P31>
##$PROCNO= 1
##$TYPE= <nmr>
##$USER= <she>
##$AMP= (0..31)
100 100 100 100 100 100 100 100 100 100 100 100 100 100 100 100 100 100 
100 100 100 100 100 100 100 100 100 100 100 100 100 100 
##$AQSEQ= 0
##$AQ_mod= 1
##$AUNM= <au_zg>
##$AUTOPOS= <>
##$BF1= 81.014009
##$BF2= 200.13
##$BF3= 200.13
##$BF4= 200.13
##$BF5= 200.13
##$BF6= 200.13
##$BF7= 200.13
##$BF8= 200.13
##$BYTORDA= 1
##$CFDGTYP= 0
##$CFRGTYP= 5
##$CHEMSTR= <none>
##$CNST= (0..31)
1 1 145 1 1 1 1 1 1 1 1 1 1 1 1 1 1 1 1 1 1 1 1 1 1 1 1 1 1 1 1 1 
##$CPDPRG= <waltz16>
##$CPDPRG1= <>
##$CPDPRG2= <waltz16>
##$CPDPRG3= <>
##$CPDPRG4= <mlev>
##$CPDPRG5= <mlev>
##$CPDPRG6= <mlev>
##$CPDPRG7= <mlev>
##$CPDPRG8= <mlev>
##$CPDPRGB= <>
##$CPDPRGT= <>
##$D= (0..31)
0 1 0 0 0 0 0 0 0 0 0 0.03 2e-05 3e-06 0 0 0 0 0 0 0 0 0 0 0 0 0 0 0 0 
0 0 
##$DATE= 1703499644
##$DBL= (0..7)
120 120 120 11 120 120 24 19 
##$DBP= (0..7)
150 150 150 150 150 150 150 150 
##$DBP07= 0
##$DBPNAM0= <>
##$DBPNAM1= <>
$$ [...]
##$SUBNAM3= <"">
##$SUBNAM4= <"">
##$SUBNAM5= <"">
##$SUBNAM6= <"">
##$SUBNAM7= <"">
##$SUBNAM8= <"">
##$SUBNAM9= <"">
##$SW= 501.771253377433
##$SWIBOX= (0..15)
0 1 3 0 0 0 0 0 0 0 0 0 0 0 0 0 
##$SW_h= 40650.406504065
##$TD= 32768
##$TD0= 1
##$TE= 0
##$TE2= 300
##$TE3= 300
##$TEG= 300
##$TL= (0..7)
0 120 53 12 22 120 120 120 
##$TP= (0..7)
150 150 150 150 150 150 150 150 
##$TP07= 0
##$TPNAME0= <>
##$TPNAME1= <>
##$TPNAME2= <>
##$TPNAME3= <>
##$TPNAME4= <>
##$TPNAME5= <>
##$TPNAME6= <>
##$TPNAME7= <>
##$TPOAL= (0..7)
0.5 0.5 0.5 0.5 0.5 0.5 0.5 0.5 
##$TPOFFS= (0..7)
0 0 0 0 0 0 0 0 
##$TUNHIN= 0
##$TUNHOUT= 0
##$TUNXOUT= 0
##$USERA1= <user>
##$USERA2= <user>
##$USERA3= <user>
##$USERA4= <user>
##$USERA5= <user>
##$V9= 5
##$VALIST= <valist>
##$VCLIST= <CCCCCCCCCCCCCCC>
##$VD= 0
##$VDLIST= <DDDDDDDDDDDDDDD>
##$VPLIST= <PPPPPPPPPPPPPPP>
##$VTLIST= <TTTTTTTTTTTTTTT>
##$WBST= 1024
##$WBSW= 4
##$XGAIN= (0..3)
0 0 0 0 
##$XL= 0
##$YL= 0
##$YMAX_a= 5463
##$YMIN_a= -1894
##$ZGOPTNS= <>
##$ZL1= 120
##$ZL2= 120
##$ZL3= 120
##$ZL4= 120
##$ABSF1= 248.5645
##$ABSF2= -253.2056
##$ABSG= 5
##$ABSL= 3
##$ALPHA= 0
##$AQORDER= 0
##$ASSFAC= 0
##$ASSFACI= 0
##$ASSFACX= 0
##$ASSWID= 0
##$AUNMP= <proc_1d>
##$AZFE= 0.1
##$AZFW= 0.5
##$BCFW= 0
##$BC_mod= 2
##$BYTORDP= 0
##$COROFFS= 0
##$CY= -3
##$DATMOD= 1
##$DC= 0
##$DFILT= <>
##$DTYPP= 0
##$F1P= 0
##$F2P= 0
##$FCOR= 1
##$FTSIZE= 65536
##$FT_mod= 6
##$GAMMA= 0
##$GB= 0
##$INTBC= 1
##$INTSCL= 6.047779e-11
##$ISEN= 30
##$LB= 10
##$LEV0= 0
##$LPBIN= 0
##$MAXI= 10000
##$MC2= 0
##$MEAN= 0
##$ME_mod= 0
##$MI= 50
##$NCOEF= 0
##$NC_proc= -10
##$NLEV= 6
##$NOISF1= 182.463
##$NOISF2= 159.3651
##$NSP= 0
##$NTH_PI= 0
##$NZP= 0
##$OFFSET= 248.5645
##$PC= 4
##$PHC0= -12788.13
##$PHC1= 1541.694
##$PH_mod= 1
##$PKNL= yes
##$PPARMOD= 0
##$PSCAL= 0
##$PSIGN= 0
##$REVERSE= no
##$SF= 81.0140089999694
##$SI= 65536
##$SIGF1= 159.3651
##$SIGF2= -187.1042
##$SINO= 113.3802
##$SIOLD= 16384
##$SREGLST= <1H.CDCl3>
##$SSB= 0
##$STSI= 65536
##$STSR= 0
##$SW_p= 40650.406504065
##$SYMM= 0
##$S_DEV= 0
##$TDeff= 32768
##$TDoff= 0
##$TI= <>
##$TILT= no
##$TM1= 0
##$TM2= 0
##$TOPLEV= 0
##$USERP1= <user>
##$USERP2= <user>
##$USERP3= <user>
##$USERP4= <user>
##$USERP5= <user>
##$WDW= 1
##$XDIM= 65536
##$YMAX_p= 516707858
##$YMIN_p= -43592955
$$ End of Bruker specific parameters
$$ ---------------------------------
##NTUPLES= NMR SPECTRUM
##VAR_NAME=  FREQUENCY,     SPECTRUM/REAL,   SPECTRUM/IMAG
##SYMBOL=    X,             R,               I
##VAR_TYPE=  INDEPENDENT,   DEPENDENT,       DEPENDENT
##VAR_FORM=  AFFN,          ASDF,            ASDF
##VAR_DIM=   65536,         65536,           65536
##UNITS=     HZ,            ARBITRARY UNITS, ARBITRARY UNITS
##FACTOR=    0.620285442955139, 1,           1
##FIRST=     20137.2065510682, 0,            0
##LAST=      -20513.1999529968, 0,           0
##MIN=       -20513.1999529968, -43592955,   0
##MAX=       20137.2065510682, 516707858,    0
$$ Real data points
##PAGE= N=1
##DATA TABLE= (X++(R..R)), XYDATA
$$ [...]
41347 11491956 11837304 12080158 12202534 12176518 11977516 11598184 11058568 10407347 9711362
41338 9711362 9036966 8432197 7918397 7493733 7144297 6855684 6619932 6437267 6315210
41329 6315210 6267152 6309992 6459661 6725447 7105461 7584008 8129671 8694237 9214796 9620676
41319 9620676 9844221 9834187 9571122 9080083 8429867 7710475 6995658 6311270 5627629 4877730
41309 4877730 3989638 2919684 1676442 327229 -1017700 -2238218 -3238825 -3967963
41301 -3967963 -4416397 -4601948 -4553345 -4302080 -3882801 -3335687 -2702770 -2015226 -1276521 -451120
41291 -451120 533135 1766963 3330325 5261198 7533735 10054587 12678634 15236673
41283 15236673 17564081 19522884 21015308 21989643 22439655 22399315 21934525 21131123 20077235
41274 20077235 18843198 17469777 15973530 14364571 12661048 10890039 9079824 7255250
41266 7255250 5439944 3659140 1937309 292662 -1264558 -2725521 -4069752 -5253256
41258 -5253256 -6207446 -6853663 -7128049 -7004372 -6504464 -5694174 -4668495 -3530410 -2368092
41249 -2368092 -1237470 -158472 871553 1853979 2769748 3578382 4236142 4721011 5049867
41240 5049867 5282387 5515216 5869576 6470360 7415799 8745413 10420603 12329150 14313730
41231 14313730 16213195 17899932 19299629 20389669 21182773 21706806 21988823 22046328 21885672
41222 21885672 21506173 20907439 20096757 19094247 17935109 16669464 15361026 14085894
41214 14085894 12931088 11989659 11348208 11066251 11153808 11558804 12174006 12864028 13501781
41205 13501781 13998496 14315379 14454801 14438654 14286594 14005260 13591201 13040683 12356688
41196 12356688 11549883 10637901 9647177 8615674 7591806 6628022 5771138 5051915 4476186
41187 4476186 4021457 3643703 3295700 2951683 2627231 2381286 2293133 2421150 2763702 3243113
41177 3243113 3719685 4027571 4019492 3609259 2800454 1688375 430277 -804384 -1880050
41168 -1880050 -2717773 -3290020 -3597031 -3639523 -3400550 -2843237 -1924187 -616246 1068660
41159 1068660 3065601 5257613 7493274 9617317 11505322 13089812 14367208 15384125
41151 15384125 16212138 16923583 17575194 18198995 18798329 19349385 19808520 20122834 20240904
41142 20240904 20123310 19753197 19144011 18339667 17406083 16418436 15449912 14564618 13814472
41133 13814472 13238720 12864574 12707362 12769438 13038260 13484406 14060649 14704345 15345771
41124 15345771 15921630 16387430 16721586 16920643 16992600 16954425 16831162 16648989 16421228 16137519
41114 16137519 15767668 15279627 14658719 13915355 13078989 12184765 11260289 10317402 9352336
41105 9352336 8355648 7329130 6302988 5345472 4558344 4054733 3923103 4191105 4807952
41096 4807952 5656100 6586460 7458895 8170358 8663824 8922652 8959354 8804178 8493194 8054900
41086 8054900 7499577 6819571 6003793 5059618 4029964 2997439 2074072 1378091 1001247
41077 1001247 976540 1262583 1756380 2330185 2873138 3318114 3646592 3877145 4047411 4197348
41067 4197348 4358662 4552938 4797669 5115267 5537586 6099687 6822153 7689482 8638246
41058 8638246 9566285 10361568 10935111 11239105 11263248 11019160 10529746 9832585 8991809 8104165
41048 8104165 7287966 6655571 6282298 6188535 6343774 6686987 7148758 7664203 8176768 8639686
41038 8639686 9019162 9297367 9472199 9554034 9561616 9517828 9444765 9358685 9267051 9169728 9064268
41027 9064268 8952287 8841662 8740625 8646345 8537164 8375946 8122178 7743312 7219365 6543249
41017 6543249 5721106 4771441 3718829 2582474 1365751 53111 -1383162 -2967194
41009 -2967194 -4698548 -6534307 -8385014 -10130060 -11646598 -12838129 -13651761 -14082950
41001 -14082950 -14173061 -14002918 -13679464 -13311547 -12978110 -12701860 -12443742 -12123967 -11659272
40992 -11659272 -10995413 -10117040 -9032838 -7751121 -6267152 -4573080 -2682855 -652600
40984 -652600 1418232 3403904 5174466 6611830 7620280 8138436 8154342 7715298 6921836
40975 6921836 5904121 4789903 3677188 2621386 1639913 729391 -115746 -894086 -1599526
40966 -1599526 -2227610 -2778118 -3253388 -3655877 -3985239 -4232610 -4374337 -4372848 -4189454 -3804314
40956 -3804314 -3233540 -2536450 -1811149 -1178174 -753100 -614229 -777806 -1193098 -1760594
40947 -1760594 -2365038 -2908984 -3334967 -3631494 -3824689 -3961194 -4089034 -4242008 -4430199
40938 -4430199 -4636426 -4818896 -4922571 -4900389 -4737349 -4462411 -4136422 -3819728 -3538296 -3268640
40928 -3268640 -2949184 -2510828 -1911445 -1158782 -311352 542549 1314847 1938231 2367114
40919 2367114 2564579 2489236 2091525 1321147 144513 -1430393 -3331024 -5414815 -7490795
40910 -7490795 -9360177 -10855436 -11862202 -12323459 -12234760 -11636866 -10605604 -9236337 -7624086
40901 -7624086 -5846512 -3959713 -2011578 -65230 1784380 3414976 4702819 5556430
40893 5556430 5940908 5882441 5454138 4753307 3882005 2936888 2006496 1171041 502234 62892
40883 62892 -95209 62047 540554 1309398 2301299 3423761 4575763 5662289 6602121
40874 6602121 7330176 7799492 7987595 7907008 7614043 7207533 6812880 6554562 6527329 6777289
40864 6777289 7298621 8044028 8941928 9912441 10875990 11753018 12460181 12913106 13042446
40855 13042446 12818636 12270737 11485532 10584484 9689316 8892531 8244584 7758709 7424376
40846 7424376 7217563 7101774 7023219 6908883 6673703 6235888 5533438 4534802 3241746
40837 3241746 1688368 -58943 -1901110 -3711742 -5353877 -6706402 -7691641 -8294296
40829 -8294296 -8565388 -8609064 -8554500 -8520150 -8581541 -8753317 -8991001 -9211237 -9323327 -9260669
40819 -9260669 -8999849 -8560596 -7990457 -7346326 -6684183 -6059334 -5530346 -5158017 -4996096
40810 -4996096 -5077560 -5403318 -5938528 -6618025 -7359565 -8081512 -8719412 -9235150 -9615676 -9864468
40800 -9864468 -9992776 -10015919 -9955022 -9840998 -9716704 -9633750 -9642711 -9779686 -10055402 -10451514
40790 -10451514 -10923604 -11407409 -11826410 -12101502 -12162706 -11960330 -11472822 -10710859 -9718185
40781 -9718185 -8567841 -7350997 -6158392 -5060112 -4091913 -3252763 -2511806 -1820395 -1126518
40772 -1126518 -390009 405734 1251459 2119908 2976386 3782466 4490673 5036571 5336347
40763 5336347 5293369 4813100 3824337 2303099 291958 -2094243 -4681448 -7265311 -9646589
40754 -9646589 -11663093 -13211716 -14256725 -14821701 -14966628 -14760016 -14261572 -13525223 -12617474
40745 -12617474 -11634743 -10704186 -9962548 -9518962 -9416140 -9608450 -9971260 -10341824 -10574227
40736 -10574227 -10582094 -10349707 -9910676 -9310867 -8577935 -7711410 -6693043 -5506952 -4157080
40727 -4157080 -2672386 -1096795 529600 2184216 3860035 5550584 7234100 8866681
40719 8866681 10386103 11724118 12824159 13657375 14226944 14557398 14678258 14614946 14390874
40710 14390874 14034388 13582903 13080771 12571140 12085251 11635960 11220476 10829333 10453110
40701 10453110 10082774 9707965 9319228 8914065 8501129 8097441 7719234 7372810 7052793
40692 7052793 6748686 6452008 6156565 5855284 5544935 5241891 4995979 4885827 4994126
40683 4994126 5378611 6056516 7007566 8187291 9538994 10998576 12494378 13948133 15280273
40674 15280273 16417385 17297856 17875883 18127968 18063463 17733201 17225943 16647727 16090923
40665 16090923 15608015 15202661 14840164 14469786 14048394 13557274 13008057 12438585 11904276
40656 11904276 11470799 11208243 11181069 11430657 11956678 12709428 13600688 14529471 15410467
40647 15410467 16192056 16857198 17410660 17863774 18226488 18506874 18710745 18837462 18877404
40638 18877404 18818636 18660296 18420147 18127277 17805816 17465319 17107019 16740137 16394252
40629 16394252 16118490 15967637 15980972 16161353 16463466 16799203 17061476 17157614 17037362 16703205
40619 16703205 16199946 15591020 14935337 14276740 13648565 13085081 12627954 12320916 12194098
40610 12194098 12245245 12427473 12652291 12811101 12808852 12595455 12180074 11622317 11007860 10425271
40600 10425271 9957785 9688716 9705067 10085232 10873424 12058265 13570993 15303568 17134731
40591 17134731 18951873 20664084 22208376 23553211 24701005 25686800 26568525 27408975
40583 27408975 28257397 29140686 30066754 31033025 32030736 33042390 34037910 34976720 35817115
40574 35817115 36526587 37085143 37480649 37703478 37747691 37617160 37328683 36908038 36383567
40565 36383567 35783554 35137717 34478950 33843649 33271608 32804244 32477449 32308850 32285821
40556 32285821 32362080 32465488 32513593 32431026 32162676 31677734 30963079 30009817 28800450 27303971
40546 27303971 25483133 23313451 20807097 18029726 15099854 12169757 9397019 6918608
40538 6918608 4834567 3201702 2034115 1307289 964421 925478 1099099 1394868 1731885
40529 1731885 2041958 2270368 2378712 2351033 2199800 1967328 1721212 1544930 1524134 1727639
40519 1727639 2184942 2868969 3695397 4542413 5282419 5811774 6070020 6047494 5782440 5348279
40509 5348279 4833975 4323935 3883027 3548057 3324858 3191311 3106998 3027511 2918286 2761920
40499 2761920 2554959 2295482 1969765 1549015 1001121 311087 -503359 -1392241 -2292222
40490 -2292222 -3155335 -3970838 -4764728 -5575078 -6418958 -7272719 -8076242 -8754381 -9240383
40481 -9240383 -9490248 -9486743 -9238417 -8778075 -8158759 -7441344 -6673310 -5869344 -5008018 -4049013
40471 -4049013 -2960967 -1743641 -432757 913856 2239536 3506812 4700210 5816535
40463 5816535 6853857 7806555 8664668 9413615 10035054 10511445 10833442 11007343 11061256
40454 11061256 11047188 11032250 11075137 11196962 11365125 11502122 11513933 11321676 10883019 10198803
40444 10198803 9306578 8265526 7139337 5984148 4845197 3759681 2759299 1868454
40436 1868454 1100552 458171 -61602 -462522 -750837 -939876 -1047415 -1082000 -1028537 -849417
40426 -849417 -506494 9268 662307 1383986 2105211 2790337 3452329 4140356 4905664 5762806
40416 5762806 6666726 7519250 8201965 8616193 8707881 8468860 7923122 7111992 6084597
40407 6084597 4892242 3585013 2211421 820127 -541058 -1832260 -3031067 -4135991
40399 -4135991 -5158408 -6105686 -6964448 -7692997 -8226911 -8495401 -8441296 -8036512 -7288094
40390 -7288094 -6235391 -4942947 -3493202 -1979226 -495675 871099 2048792 2977478
40382 2977478 3604644 3885805 3794882 3338813 2566208 1563731 440673 -693246 -1749867
40373 -1749867 -2676557 -3457047 -4100907 -4629359 -5064647 -5424693 -5720756 -5956313 -6127186
40364 -6127186 -6223077 -6230162 -6135148 -5931858 -5629790 -5260659 -4876889 -4538616 -4292876 -4155680
40354 -4155680 -4107877 -4106953 -4106253 -4070480 -3982819 -3845750 -3677583 -3504438 -3349700 -3227655 -3146490
40343 -3146490 -3117246 -3159659 -3299442 -3559152 -3947240 -4446986 -5005724 -5527995 -5879691 -5908607
40333 -5908607 -5479996 -4516717 -3027348 -1108236 1081008 3353078 5520025 7405451
40325 7405451 8852534 9741490 10016002 9703224 8911570 7804125 6559325 5334204 4239816
40316 4239816 3330891 2607813 2028379 1526683 1034919 502107 -95379 -752709 -1441753
40307 -1441753 -2117728 -2724095 -3195639 -3462540 -3458987 -3137125 -2481714 -1517298 -302536 1085541
40297 1085541 2567609 4069405 5519344 6844358 7973718 8852819 9458080 9800742 9915707
40288 9915707 9843799 9620117 9273425 8830433 8315414 7742505 7107570 6388898 5559189 4602461
40278 4602461 3526999 2370444 1198039 94832 -849527 -1562502 -2009603 -2204204 -2199740
40269 -2199740 -2066133 -1860030 -1603207 -1281475 -864898 -334685 303228 1025645 1809269
40260 1809269 2639368 3502931 4375240 5213575 5963442 6571915 6999067 7222674 7237126 7050182
40250 7050182 6680047 6153652 5506556 4785252 4051263 3383327 2871378 2597905 2609861 2893770
40240 2893770 3370129 3914877 4399492 4729393 4862339 4802977 4584495 4252609 3859517 3463929
40230 3463929 3128126 2907329 2835225 2914181 3116292 3395403 3704602 4010596 4297195 4556371
40220 4556371 4774535 4926602 4985239 4940733 4817872 4677461 4600544 4664999 4928427 5425225
40210 5425225 6174625 7189214 8474607 10018536 11776426 13665367 15574793 17390127
40202 17390127 19014656 20376657 21422628 22108386 22396709 22260573 21688278 20690815 19311637
40193 19311637 17632347 15765395 13832966 11941560 10163824 8532701 7046197 5678557
40185 5678557 4394513 3164388 1977212 847023 -191840 -1097991 -1834732 -2371557 -2678125
40176 -2678125 -2722469 -2480632 -1951478 -1163070 -163332 999422 2292807 3703423 5226803
40167 5226803 6852295 8550638 10266516 11916569 13396987 14605257 15471254 15981788
40159 15981788 16183156 16159848 16001819 15776977 15519964 15238716 14931035 14599205 14255806
40150 14255806 13924858 13646785 13487074 13536676 13893226 14626624 15745581 17181315 18794932
40141 18794932 20406573 21839450 22965896 23737118 24182510 24380971 24424146 24393686 24358953
40132 24358953 24382880 24519827 24802281 25228254 25761801 26345768 26915579 27407842 27769281
40123 27769281 27971857 28026823 27982274 27900173 27828315 27786878 27773146 27771164 27753828 27679405 27493855
40112 27493855 27144383 26596477 25841394 24889796 23760566 22476770 21069908 19582323 18059916
40103 18059916 16539881 15044835 13588302 12186530 10868825 9681727 8684958 7938650
40095 7938650 7485261 7333725 7453284 7780353 8237375 8758324 9310992 9904659 10577167
40086 10577167 11365626 12273616 13251273 14200970 15008783 15584627 15886306 15914965 15691800
40077 15691800 15236247 14556948 13652504 12515316 11136407 9511825 7649362 5573603
40069 5573603 3329860 988587 -1351211 -3564949 -5516798 -7084553 -8186634 -8799351
40061 -8799351 -8956911 -8736339 -8237015 -7563618 -6813906 -6066786 -5368134 -4719976 -4083534
40052 -4083534 -3400356 -2621634 -1727320 -723614 375617 1566276 2855572 4245174 5706418
40043 5706418 7164375 8503861 9597106 10338744 10671166 10593897 10161835 9477473 8675614
40034 8675614 7897922 7262101 6837618 6638496 6635002 6776461 7012520 7302878 7614901 7917726
40024 7917726 8182117 8387086 8526671 8610915 8661541 8706630 8776825 8902643 9112069 9428574
40014 9428574 9869240 10442343 11145261 11965178 12883174 13878237 14927190 16001484 17066494
40005 17066494 18087265 19038257 19910841 20714304 21470775 22207391 22949458 23717074 24524986
39996 24524986 25382525 26290011 27230807 28162712 29015391 29700205 30132977 30260796 30077634
39987 30077634 29618550 28936979 28082043 27090856 25996152 24835193 23645456 22447377 21231513
39978 21231513 19969023 18644965 17290988 15991283 14857154 13988952 13447285 13240997
39970 13240997 13326926 13616360 13988049 14308485 14456653 14347587 13948193 13280156 12408888
39961 12408888 11423450 10415392 9462599 8620460 7920643 7376488 6991413 6764621 6689936
39952 6689936 6748841 6903805 7099313 7274213 7381500 7405186 7363794 7297757 7247772 7235940
39942 7235940 7258956 7296033 7327342 7353309 7403563 7528950 7780140 8185266 8738886 9405154
39932 9405154 10127793 10837770 11456613 11900604 12091301 11972499 11528472 10796011 9862958
39923 9862958 8849396 7875401 7027982 6342024 5803193 5369811 5002755 4689886 4453503
39914 4453503 4335908 4368559 4540340 4783366 4987035 5036298 4855973 4437858 3835598 3130533
39904 3130533 2388720 1633693 847978 -1884 -934544 -1934600 -2952764 -3922576 -4784145
39895 -4784145 -5503500 -6078721 -6530703 -6885110 -7156915 -7345886 -7442737 -7438528 -7329549 -7115299
39885 -7115299 -6793218 -6355998 -5794050 -5100497 -4273571 -3313256 -2213139 -951641 511235
39876 511235 2225787 4232601 6539471 9108873 11862331 14694691 17485939 20106275
39868 20106275 22421014 24303307 25654922 26427212 26631996 26335252 25634220 24627942 23395806
39859 23395806 21993089 20460757 18839175 17177148 15533399 13971061 12546733 11298500
39851 11298500 10241048 9374125 8700402 8237761 8011941 8030602 8256429 8599166 8933097
39842 8933097 9131182 9101194 8811813 8301391 7667412 7041520 6559579 6334283 6432757 6860990
39832 6860990 7560834 8425320 9330078 10168920 10879106 11447796 11900764 12282235 12637411
39823 12637411 13005230 13419744 13911478 14501716 15192266 15961222 16772231 17592147 18402600
39814 18402600 19196395 19965132 20692088 21354934 21928598 22378524 22649315 22664464 22345941
39805 22345941 21646078 20574999 19210359 17685520 16161099 14791022 13695608 12948810
39797 12948810 12578251 12572253 12890077 13474520 14265638 15211795 16273721 17419888 18616029
39788 18616029 19815744 20959593 21984970 22840836 23497753 23948579 24203769 24288175 24241429
39779 24241429 24117977 23982525 23901002 23929970 24106285 24437809 24897596 25425368 25937147 26338540
39769 26338540 26536078 26446024 26005316 25188070 24023618 22605537 21081686 19623807 18386520
39760 18386520 17472114 16915037 16689799 16734973 16980173 17364476 17842111 18379205 18948903
39751 18948903 19528904 20099917 20642506 21133013 21541121 21829235 21952647 21862801 21518531
39742 21518531 20904977 20050488 19029365 17946565 16911657 16013968 15307522 14807808 14496951
39733 14496951 14331875 14251941 14186500 14065097 13831709 13460427 12966435 12405948 11863569 11432724
39723 11432724 11197485 11219078 11523956 12091994 12851910 13693726 14497870 15166809 15642620
39714 15642620 15905385 15961450 15834931 15568419 15226629 14890612 14637039 14512405 14521716 14643401
39704 14643401 14861646 15192365 15682944 16385591 17322714 18466879 19745874 21066020 22337290
39695 22337290 23487648 24465102 25234087 25772625 26071878 26136134 25981118 25630974 25116612
39686 25116612 24477768 23767313 23052061 22404868 21889351 21545274 21382991 21388426 21532942 21780789
39676 21780789 22091157 22417057 22704963 22897138 22936093 22770024 22358778 21679534 20729781
39667 20729781 19524828 18090158 16453642 14644145 12698405 10669821 8628700 6648507
39659 6648507 4784166 3056058 1450442 -63815 -1511623 -2892631 -4174435 -5299941
39651 -5299941 -6205060 -6838025 -7170989 -7199706 -6934443 -6388794 -5571549 -4484236 -3125964
39642 -3125964 -1505315 345864 2365688 4468197 6559356 8554817 10392989 12041292
39634 12041292 13494000 14759182 15836614 16697353 17278658 17498961 17284203 16591657 15423129
39625 15423129 13827478 11895577 9750396 7534400 5395609 3471723 1872344 664602
39617 664602 -128788 -516123 -517696 -156373 536274 1506493 2670084 3914909 5111922
39608 5111922 6132156 6869774 7269306 7348312 7202287 6982967 6853804 6939929 7295138 7899984
39598 7899984 8687629 9579580 10511850 11442418 12343971 13192756 13962322 14623666 15147407
39589 15147407 15504066 15663911 15601318 15305682 14794495 14121023 13371084 12647861 12048089
39580 12048089 11637488 11436098 11421137 11545816 11763121 12041028 12361539 12706222 13039422
39571 13039422 13301367 13415792 13306535 12913944 12207001 11192656 9922352 8489724 7013151
39562 7013151 5605780 4346362 3266115 2356557 1588742 928117 337347 -225862 -803324
39553 -803324 -1420342 -2070472 -2715103 -3300261 -3779778 -4131041 -4356706 -4474744 -4503909 -4451253
39543 -4451253 -4305529 -4037733 -3609429 -2988808 -2170698 -1191047 -125278 932747 1902501
39534 1902501 2743948 3467635 4124621 4781953 5494046 6280353 7116494 7940123 8666709
39525 8666709 9208122 9490123 9469242 9148324 8584065 7878266 7153260 6523559 6077053 5869141
39515 5869141 5923988 6237789 6784394 7523991 8411217 9397949 10431208 11451739 12398400
39506 12398400 13219032 13884070 14396636 14792418 15126252 15449778 15790731 16143309 16471317
39497 16471317 16719388 16827322 16745222 16446236 15930971 15219897 14338951 13310025 12153728
39488 12153728 10900824 9602562 8332958 7181559 6237465 5567016 5191937 5077912 5139540
39479 5139540 5259023 5311471 5191870 4841177 4265976 3541893 2794283 2161436 1756781 1646835
39469 1646835 1850761 2354725 3129378 4142000 5360365 6749449 8265904 9857257 11468971
39460 11468971 13053658 14572725 15988365 17255094 18320897 19137559 19671714 19911298
39452 19911298 19869466 19588543 19140520 18617415 18108778 17671344 17303286 16938737 16472433
39443 16472433 15807596 14902441 13788387 12550743 11286575 10065950 8916660 7836715
39435 7836715 6823828 5902812 5133801 4595794 4354367 4430425 4785104 5327720 5943795
39426 5943795 6530876 7025492 7409665 7698214 7918855 8096748 8246394 8366968 8438514 8422596
39416 8422596 8273762 7963015 7504298 6968097 6469721 6133038 6044879 6221721 6605062 7087848
39406 7087848 7557424 7930781 8163946 8237305 8135975 7843304 7349176 6661015 5806712 4828931
39396 4828931 3777038 2701711 1652817 677841 -182383 -901134 -1472728 -1913497 -2254641
39387 -2254641 -2529980 -2764223 -2966558 -3131309 -3243559 -3284851 -3235999 -3079400 -2804815 -2416360
39377 -2416360 -1932339 -1373560 -747534 -41716 768086 1699808 2748606 3879587 5031692
39368 5031692 6130507 7105543 7907237 8519544 8964456 9295544 9580950 9881893 10236053
39359 10236053 10652461 11117391 11605127 12086395 12530876 12906238 13180583 13333295 13370507
39350 13370507 13332714 13283112 13277868 13334623 13420113 13467257 13413802 13241663 12995744 12771385 12674146
39339 12674146 12769099 13043627 13401683 13689627 13736367 13388784 12536205 11128839 9192639
39330 9192639 6833737 4224167 1570124 -925784 -3095274 -4821542 -6044360 -6758545
39322 -6758545 -7009115 -6881247 -6482166 -5918472 -5278767 -4627978 -4009006 -3442661 -2924751
39313 -2924751 -2428159 -1914597 -1349053 -705880 35101 893101 1882736 3003314 4228662
39304 4228662 5503197 6745311 7857838 8745637 9338029 9609876 9593257 9373498 9067439
39295 9067439 8787955 8606394 8529251 8500913 8431109 8232293 7848290 7263205 6492741 5569737
39285 5569737 4536046 3444344 2363507 1377558 573183 19245 -252298 -254346 -37303
39276 -37303 328748 771664 1227082 1642373 1981730 2234660 2422263 2594432 2816530 3149235
39266 3149235 3627387 4245147 4955014 5683057 6353522 6910665 7328827 7609016 7765987
39257 7765987 7813207 7754505 7588097 7320688 6982346 6632789 6355045 6237613 6349483 6715872
39247 6715872 7305021 8033822 8791484 9471387 9997408 10334795 10484698 10470553 10327097 10097058
39237 10097058 9831757 9588366 9420535 9365778 9436707 9621944 9897222 10240092 10638422 11087734
39227 11087734 11582132 12108199 12646062 13173473 13666928 14099583 14441006 14662999 14750470
39218 14750470 14712119 14585191 14431529 14325832 14339441 14523373 14894120 15426459 16057224 16700592
39208 16700592 17269651 17695731 17939003 17989604 17862908 17592806 17223854 16800772 16355208
39199 16355208 15894391 15399029 14834090 14167503 13386292 12502536 11549946 10577443 9644080
39190 9644080 8813537 8143499 7669226 7387800 7252482 7181911 7080744 6863592 6475029 5901546
39180 5901546 5173380 4356452 3538169 2813138 2272488 1995573 2041031 2437623 3179219 4227507
39170 4227507 5520794 6983221 8530013 10070055 11511557 12774919 13809489 14603913
39162 14603913 15181052 15578895 15830430 15956763 15976035 15916355 15818083 15722544 15657915 15634637
39152 15634637 15652437 15711487 15820154 15996348 16261568 16627667 17081512 17578559 18053185 18440975
39142 18440975 18698257 18807759 18771732 18601775 18311928 17914289 17413868 16803524 16064620
39133 16064620 15177458 14137164 12964176 11701699 10403407 9121638 7902840 6788740
39125 6788740 5818297 5028133 4451648 4116678 4041788 4233319 4685334 5380300 6285125 7341202
39115 7341202 8456155 9508815 10371429 10939799 11155364 11009651 10534954 9792858 8868993
39106 8868993 7873346 6939350 6214764 5840763 5921094 6490143 7494027 8796852 10213506
39097 10213506 11557640 12687006 13531391 14097173 14451327 14692599 14918262 15193350 15528408
39088 15528408 15871919 16122346 16159059 15882447 15247073 14274775 13046722 11684829 10333427
39079 10333427 9142391 8245952 7735755 7637242 7901861 8420374 9052073 9659367 10137329
39070 10137329 10430695 10535355 10487027 10343193 10163877 9995133 9858760 9750843 9647852
39061 9647852 9515299 9315029 9012338 8585998 8039518 7405321 6734171 6072391 5441070
39052 5441070 4832768 4228784 3623992 3041255 2527419 2136677 1912264 1873041 2006658 2270923
39042 2270923 2605913 2955680 3291318 3623569 3997951 4475680 5111604 5939371 6965878
39033 6965878 8170471 9505518 10900958 12277092 13563916 14717519 15723325 16584325
39025 16584325 17302846 17867921 18254358 18430650 18369103 18054160 17487813 16690848 15699209
39016 15699209 14558514 13322205 12053839 10826584 9713794 8774649 8046208 7548351
39008 7548351 7296435 7310681 7615552 8230888 9162319 10398071 11912925 13672130 15626780
38999 15626780 17701126 19783808 21736256 23420126 24732390 25632751 26153451 26389601
38991 26389601 26474122 26545137 26715203 27050498 27564349 28224658 28970202 29728537 30430547 31022297
38981 31022297 31477090 31805583 32054925 32290104 32563631 32891333 33249261 33590542 33866241
38972 33866241 34033816 34049617 33855931 33377041 32531112 31253309 29519516 27362049 24873710
38963 24873710 22198923 19511582 16983372 14753382 12912024 11504328 10544995 10031529
38955 10031529 9946587 10250613 10872620 11707554 12624056 13479343 14133197 14455853 14333445
38946 14333445 13680116 12460107 10710498 8548914 6156948 3743371 1500187 -434944
38938 -434944 -2001284 -3218728 -4172323 -4980677 -5755751 -6565053 -7407328 -8208769 -8841068
38929 -8841068 -9157155 -9035569 -8419748 -7337818 -5895188 -4244124 -2544044 -928232 512323
38920 512323 1725538 2681736 3356907 3728130 3784536 3545645 3073332 2468126 1850269 1333749
38910 1333749 1003014 898569 1013180 1297899 1675782 2059189 2365260 2526391 2497356 2261984
38900 2261984 1837411 1269375 616124 -71030 -757243 -1418039 -2025442 -2540441 -2919207
38891 -2919207 -3127743 -3153012 -3003109 -2699360 -2269329 -1747440 -1182830 -648262 -242087 -77408
38881 -77408 -258870 -855548 -1882058 -3294706 -4999607 -6865088 -8734327 -10440154 -11824225
38872 -11824225 -12758298 -13160948 -13003329 -12302740 -11110045 -9500113 -7569218 -5433734 -3221322
38863 -3221322 -1053159 974726 2801929 4403610 5783320 6962348 7967929 8823222
38855 8823222 9542393 10131987 10596304 10942417 11180894 11321888 11371669 11336861 11237175 11115705
38845 11115705 11032132 11036411 11139210 11301381 11450794 11514116 11442542 11219185 10850629 10353160
38835 10353160 9742746 9032904 8240441 7395594 6549722 5773308 5142320 4719230 4539186
38826 4539186 4607657 4906763 5402170 6045701 6776348 7524895 8221838 8802853 9208908 9386255
38816 9386255 9293418 8914595 8271185 7424814 6471716 5529799 4716994 4122045 3778632 3658908
38806 3658908 3693431 3807127 3950931 4114292 4318345 4600631 5002228 5559790 6297989 7219233
38796 7219233 8295009 9466808 10659467 11800951 12838883 13747767 14526301 15187444 15745076
38787 15745076 16202148 16544775 16743324 16757486 16542060 16053980 15263394 14167333 12797876
38778 12797876 11216993 9499709 7716326 5923362 4163971 2472376 877748 -593625
38770 -593625 -1917592 -3071792 -4033885 -4778069 -5273570 -5489840 -5408268 -5034816 -4407419
38761 -4407419 -3594997 -2686859 -1773857 -927944 -190672 423529 914123 1282000 1524811
38752 1524811 1639901 1631049 1514935 1323474 1099740 889363 733031 664706 714945 913689
38742 913689 1286139 1839463 2546116 3336149 4109905 4771000 5265026 5603194 5858480 6138397
38732 6138397 6550778 7177907 8063328 9205954 10556796 12021453 13475317 14792454 15878520
38723 15878520 16692913 17249226 17592772 17764487 17768426 17561548 17075784 16264633 15149318
38714 15149318 13836403 12494964 11306431 10413811 9889959 9727582 9845699 10111498 10378747
38705 10378747 10534548 10534849 10411870 10253316 10167853 10252412 10569175 11133893 11915315 12844374
38695 12844374 13829479 14772626 15581750 16177215 16493773 16481885 16112019 15382043 14324124
38686 14324124 13006375 11525483 9989310 8493342 7100583 5835619 4695775 3670909
38678 3670909 2758935 1970364 1324459 842661 541224 422046 463504 618615 828090 1047172
38668 1047172 1272817 1553360 1972381 2615303 3536738 4741915 6184148 7773400 9391224
38659 9391224 10908981 12206968 13192646 13816572 14082468 14045650 13797873 13445028 13087649
38650 13087649 12807917 12660041 12662931 12800037 13029781 13300876 13562562 13766310 13864075 13809099
38640 13809099 13560587 13091292 12397677 11511015 10503867 9484662 8577115 7888725 7480192
38631 7480192 7350569 7447318 7696616 8036328 8433306 8878781 9369671 9889169 10397174 10835158
38621 10835158 11143738 11285308 11261355 11117654 10937276 10824911 10884615 11192446 11769915 12569886
38611 12569886 13485304 14380520 15132164 15661003 15941579 15988680 15831730 15493532 14985631
38602 14985631 14320871 13531753 12679195 11842730 11094814 10471160 9951527 9461466 8897073
38593 8897073 8164406 7217502 6078303 4829252 3581317 2430889 1424263 544998 -272040
38584 -272040 -1109867 -2038316 -3094588 -4277056 -5547729 -6839499 -8066945 -9139382 -9973961
38575 -9973961 -10507889 -10710214 -10591263 -10203386 -9627329 -8946718 -8222111 -7477447 -6704937
38566 -6704937 -5885203 -5012877 -4115237 -3254088 -2509448 -1953547 -1627502 -1528731 -1610591 -1793286
38556 -1793286 -1985202 -2110838 -2136075 -2079484 -2003873 -1991305 -2111645 -2396494 -2828076 -3347242
38546 -3347242 -3877802 -4357420 -4761283 -5106370 -5433515 -5777637 -6144687 -6508401 -6824204
38537 -6824204 -7044958 -7124977 -7012299 -6642097 -5945109 -4873273 -3429533 -1682838 242062
38528 242062 2194702 4034289 5658192 7017256 8114382 8985677 9672076 10197886 10568848
38519 10568848 10786491 10863161 10825673 10709006 10550036 10387946 10268260 10241039 10346141 10589876
38509 10589876 10929097 11278704 11542413 11647642 11561887 11283826 10821314 10174050 9330659
38500 9330659 8279372 7025422 5605384 4088903 2564644 1118578 -181565 -1288853
38492 -1288853 -2172931 -2819380 -3234169 -3445110 -3494103 -3424128 -3270477 -3061197 -2824032 -2593834
38482 -2593834 -2415016 -2335035 -2388583 -2579092 -2869768 -3192829 -3473665 -3655809 -3712573 -3641707
38472 -3641707 -3451932 -3154643 -2767203 -2322018 -1869185 -1465840 -1157132 -961106 -866913 -846148
38462 -846148 -868525 -910947 -954699 -975489 -937666 -801107 -539297 -158872 289386 713514
38452 713514 999006 1041849 788457 266430 -412311 -1083959 -1590011 -1834336 -1815682 -1623908
38442 -1623908 -1403877 -1302040 -1415563 -1761819 -2276950 -2839246 -3304762 -3543311 -3468031 -3053378
38432 -3053378 -2335845 -1395688 -327737 784121 1877967 2909948 3843152 4638222 5251518
38423 5251518 5641443 5778472 5651875 5268746 4647370 3811985 2794876 1644331 430028
38414 430028 -762089 -1844788 -2745970 -3419250 -3848096 -4045746 -4049945 -3910805 -3675824 -3380243
38404 -3380243 -3045930 -2683461 -2290875 -1850049 -1327407 -683819 108209 1047553 2096361
38395 2096361 3185306 4228670 5140578 5846185 6288312 6432831 6273334 5833066 5162572
38386 5162572 4332302 3419467 2490824 1587348 717481 -138834 -1017306 -1950652 -2948677
38377 -2948677 -3985612 -5003239 -5929708 -6703404 -7289158 -7681392 -7897084 -7965281 -7918573
38368 -7918573 -7787419 -7593802 -7342012 -7012200 -6567350 -5977020 -5246626 -4434175 -3643962
38359 -3643962 -3000033 -2610497 -2535396 -2769422 -3245763 -3858287 -4490486 -5038282 -5420880 -5582918
38349 -5582918 -5494629 -5153237 -4582905 -3829170 -2948107 -1995200 -1018425 -55984 862282 1709043
38339 1709043 2449278 3031831 3392562 3473279 3248737 2746246 2045373 1255791 482717 -204521
38329 -204521 -787497 -1293022 -1771909 -2271419 -2810410 -3365154 -3871947 -4246268 -4409276 -4308451
38319 -4308451 -3924476 -3265914 -2358526 -1235599 66628 1506393 3027746 4551697 5976262
38310 5976262 7191549 8106781 8675735 8904912 8839466 8538688 8060202 7461578 6809987
38301 6809987 6183055 5653444 5264721 5013693 4851482 4706626 4521704 4285682 4045255
38292 4045255 3891915 3936072 4281825 5007131 6147474 7683637 9538515 11586476 13673729
38283 13673729 15645275 17372503 18773186 19815678 20506270 20868966 20930902 20719951 20270142
38274 20270142 19624333 18826899 17909381 16880895 15733623 14462062 13083172 11644288
38266 11644288 10215622 8873956 7686739 6702644 5949634 5436953 5155749 5075945 5142080
38257 5142080 5272611 5364556 5303413 4979007 4307475 3254806 1852725 198592 -1563071
38248 -1563071 -3272990 -4793609 -6037147 -6975910 -7634719 -8073634 -8369296 -8597780 -8818991
38239 -8818991 -9065236 -9338308 -9616356 -9866919 -10060545 -10179710 -10218963 -10176308 -10043091 -9803440
38229 -9803440 -9447208 -8986615 -8460338 -7917721 -7392244 -6882173 -6350893 -5746226 -5026967
38220 -5026967 -4181909 -3231962 -2217204 -1181196 -166034 779028 1586172 2169207 2440063
38211 2440063 2333500 1827522 951916 -215509 -1561386 -2953097 -4254789 -5341669 -6114457
38202 -6114457 -6515027 -6538909 -6236196 -5696185 -5020412 -4295314 -3574475 -2874725 -2185863 -1490402
38192 -1490402 -785389 -94689 536569 1062049 1454211 1710568 1845479 1879383 1836253 1747282
38182 1747282 1648960 1568466 1503852 1415661 1241063 926481 462415 -97235 -640673 -1025384
38172 -1025384 -1114463 -807891 -60915 1110424 2633831 4394472 6256716 8087283 9769201
38163 9769201 11201501 12292568 12962976 13166327 12918342 12310791 11491865 10617184 9798192
38154 9798192 9077910 8444549 7867924 7332474 6849368 6446930 6150017 5961213 5853402
38145 5853402 5777282 5680242 5526866 5310487 5050620 4779544 4527090 4312399 4145733 4036505
38135 4036505 4000216 4059240 4238040 4557909 5035839 5687349 6528459 7571913 8816864
38126 8816864 10235882 11765415 13306616 14741983 15966787 16923463 17620794 18126744 18540038
38117 18540038 18956430 19442940 20024148 20680089 21355860 21981554 22495473 22860392 23067078
38108 23067078 23127443 23064381 22903928 22671039 22387758 22072468 21740138 21403650 21075371 20767186
38098 20767186 20487257 20233508 19986785 19709517 19355152 18887024 18296313 17606072 16857415
38089 16857415 16088024 15319479 14561916 13829706 13153140 12575259 12135407 11850778 11707486
38080 11707486 11664655 11666535 11654366 11572674 11370697 11004430 10444358 9687206 8762545 7725699
38070 7725699 6638646 5550575 4489193 3464065 2476053 1527366 630131 -188396 -886873
38061 -886873 -1418101 -1741667 -1836846 -1712503 -1410726 -1000288 -558705 -148155 204313 513332
38051 513332 826768 1207985 1717619 2401710 3287609 4384404 5683826 7161114 8778503
38042 8778503 10491858 12255505 14019928 15725362 17302705 18689381 19852374 20799874
38034 20799874 21569623 22200158 22702878 23050280 23185296 23047221 22602663 21865041 20888791
38025 20888791 19738147 18447622 16998158 15323267 13341592 10999260 8303632 5336574
38017 5336574 2244457 -789518 -3578838 -5959522 -7801304 -9008938 -9525052 -9339020
38009 -9339020 -8492848 -7071884 -5181054 -2921864 -384486 2344798 5171440 7985282
38001 7985282 10661233 13067751 15081868 16607104 17588812 18023103 17958497 17490302 16747831
37992 16747831 15876526 15019179 14299250 13806713 13586768 13633752 13892475 14267022 14636562
37983 14636562 14878708 14898819 14657291 14182545 13561155 12906845 12320601 11859216 11526473
37974 11526473 11289205 11105716 10947865 10805873 10679179 10563748 10442889 10283266 10037043
37965 10037043 9651431 9083505 8313086 7346930 6213988 4957776 3632306 2303051 1047853
37956 1047853 -50356 -922913 -1540168 -1927068 -2158640 -2337458 -2565041 -2918007 -3433539
37947 -3433539 -4105968 -4896043 -5749828 -6616988 -7458143 -8240800 -8932964 -9503169 -9927547
37938 -9927547 -10198277 -10327155 -10340993 -10270185 -10137093 -9952318 -9720542 -9448218 -9143840 -8810211
37928 -8810211 -8436675 -7997940 -7458531 -6778557 -5919835 -4854352 -3574451 -2100429 -481679
37919 -481679 1209032 2886579 4468390 5891041 7124281 8178366 9103193 9979702 10903298
37910 10903298 11959201 13194274 14594973 16080377 17512395 18719456 19529801 19811125
37902 19811125 19508856 18668661 17429392 15984571 14526466 13195759 12056562 11103553
37894 11103553 10292298 9573558 8914096 8299080 7724421 7190966 6705237 6283271 5952373
37885 5952373 5749169 5714484 5885245 6284543 6914314 7755488 8775452 9937063 11204376
37876 11204376 12545320 13932733 15341112 16735908 18060077 19230043 20149050 20732928
37868 20732928 20935434 20763599 20280037 19591424 18823694 18090578 17468080 16984839 16628008
37859 16628008 16357171 16119989 15867426 15566912 15209804 14810054 14395008 13993644 13629231
37850 13629231 13320897 13091896 12975518 13009856 13222516 13617902 14180073 14891101 15749850
37841 15749850 16773926 17980211 19355663 20836682 22309205 23629149 24653027 25265966
37833 25265966 25398409 25029303 24178531 22893950 21239580 19291281 17141509 14906244
37825 14906244 12722235 10728973 9043343 7741326 6853821 6371959 6254875 6439292 6853616
37816 6853616 7433775 8132048 8913044 9741201 10571124 11349496 12027529 12574612 12984202
37807 12984202 13271888 13473266 13646229 13870780 14234545 14802790 15588515 16542473 17569638
37798 17569638 18560670 19420339 20081086 20500504 20649100 20498192 20017196 19184081 18004231
37789 18004231 16527000 14849579 13103218 11423974 9917536 8633483 7563075 6663203
37781 6663203 5893380 5244841 4746941 4450035 4395728 4589913 4991689 5523540 6097368 6643030
37771 6643030 7125404 7542657 7908519 8230710 8500944 8703786 8836253 8921242 9004988 9142939
37761 9142939 9383323 9751782 10236869 10780930 11284590 11627230 11696442 11416114 10765650 9786235
37751 9786235 8573642 7261924 6004338 4953437 4238012 3938611 4072170 4596682 5434981
37742 5434981 6503162 7726651 9037553 10361894 11613200 12702902 13562568 14161977
37734 14161977 14510581 14643033 14599097 14408651 14088103 13648974 13112434 12518603 11922887
37725 11922887 11382527 10943702 10635789 10471030 10445022 10537014 10711976 10925521 11130548 11284051
37715 11284051 11353541 11323569 11202150 11024660 10851115 10754521 10802738 11039702 11471868 12064027
37705 12064027 12746606 13432992 14040757 14508895 14806925 14936700 14929287 14837787 14726218 14655574
37695 14655574 14669218 14780695 14968202 15179392 15346262 15404955 15313773 15064512 14684780 14230479
37685 14230479 13769671 13361873 13038936 12794077 12584149 12345511 12016512 11554483 10938654
37676 10938654 10161012 9215487 8094205 6791300 5309170 3663234 1884812 22490
37668 22490 -1859195 -3684432 -5372377 -6842821 -8022414 -8854777 -9314806 -9422452 -9249459
37659 -9249459 -8914709 -8566237 -8351271 -8382250 -8712816 -9333971 -10186997 -11180204 -12201089
37650 -12201089 -13126709 -13838067 -14237793 -14265914 -13911115 -13216969 -12278661 -11223704 -10178358
37641 -10178358 -9233615 -8426660 -7742947 -7132809 -6534487 -5898053 -5204064 -4468485 -3730494
37632 -3730494 -3031123 -2397087 -1837673 -1351036 -931385 -572374 -266652 -2872 237666
37623 237666 480575 750605 1058746 1392230 1715430 1982585 2153993 2202841 2106322 1829914
37613 1829914 1323564 539288 -542000 -1896648 -3465857 -5173310 -6938671 -8685757
37605 -8685757 -10351617 -11896189 -13305320 -14583978 -15744769 -16798440 -17748452 -18588420
37597 -18588420 -19300888 -19856331 -20212797 -20318989 -20122598 -19580630 -18666250 -17371581 -15710386
37588 -15710386 -13720745 -11461736 -9001488 -6404745 -3731182 -1045925 1567746 4005182
37580 4005182 6152328 7911703 9233579 10135385 10692677 11001631 11135231 11121576 10955342
37571 10955342 10628598 10156372 9580495 8951480 8300646 7618784 6853501 5927568 4770048
37562 4770048 3346840 1678974 -156922 -2045116 -3857818 -5483706 -6849383 -7928373
37554 -7928373 -8735915 -9312157 -9702187 -9944728 -10076141 -10143581 -10212255 -10356147 -10635304 -11072146
37544 -11072146 -11637925 -12253770 -12806298 -13175679 -13270665 -13060335 -12590325 -11974824 -11364738
37535 -11364738 -10903458 -10688938 -10757181 -11088692 -11626302 -12291374 -12994868 -13647622 -14172044
37526 -14172044 -14510984 -14629577 -14512996 -14166510 -13618268 -12917413 -12122082 -11282571 -10431420
37517 -10431420 -9586226 -8758828 -7960067 -7196300 -6464118 -5751746 -5048084 -4351203 -3667254
37508 -3667254 -2999235 -2334849 -1643920 -887790 -34023 931742 1999923 3136040 4284683
37499 4284683 5380622 6366913 7212828 7920512 8515280 9026931 9476751 9878543 10248283
37490 10248283 10609726 10989365 11405265 11859198 12337614 12820219 13290269 13739508 14164506
37481 14164506 14558787 14910456 15210524 15465876 15704468 15966238 16284988 16672461 17111791
37472 17111791 17560279 17958500 18244504 18372202 18328118 18135358 17837614 17470233 17037573
37463 17037573 16512855 15860465 15066387 14160541 13221538 12362038 11699536 11323643 11273090
37454 11273090 11530725 12035853 12707132 13466775 14256016 15034579 15766424 16405643 16898162
37445 16898162 17201837 17310373 17261668 17123255 16964972 16836462 16760208 16738107 16761784 16817686
37435 16817686 16884242 16926319 16897364 16756563 16494800 16149310 15789191 15475821 15224636 14995143
37425 14995143 14714123 14314521 13767524 13095403 12363804 11658140 11052551 10583746 10241434
37416 10241434 9979387 9740392 9482449 9195267 8901957 8646272 8470012 8389731 8384396 8401950
37406 8401950 8382140 8282316 8091362 7825836 7514399 7182252 6844066 6506463 6175573 5863643
37396 5863643 5590254 5376778 5236630 5167031 5147916 5149570 5145651 5125890 5103478 5114198 5206911
37385 5206911 5428518 5809585 6356985 7056792 7885466 8822346 9853829 10963818 12116725
37376 12116725 13249462 14285062 15162804 15864638 16420311 16890314 17339846 17818148 18349321
37367 18349321 18932078 19542002 20131977 20632626 20959320 21030296 20792417 20243993 19443359
37358 19443359 18497233 17531539 16655518 15933777 15376885 14951281 14600296 14265691 13902821
37349 13902821 13488132 13020991 12521154 12020802 11550709 11125229 10734665 10349450 9931345
37340 9931345 9442675 8850437 8130378 7277096 6318659 5325845 4404467 3667114 3194672
37331 3194672 3008200 3068017 3298780 3621542 3972026 4299581 4558407 4706007 4713059 4575479
37321 4575479 4315876 3970261 3568994 3127192 2653334 2170054 1730251 1414293 1308214
37312 1308214 1475884 1939268 2672418 3608173 4655892 5727163 6759339 7722982 8609483
37303 8609483 9412521 10122170 10736343 11276785 11793816 12355424 13027767 13857488 14862645
37294 14862645 16033228 17337541 18730404 20162749 21593582 23000373 24379032 25728973
37286 25728973 27030822 28232116 29252061 30003538 30419054 30464682 30135492 29441758 28403430
37277 28403430 27060886 25490851 23807909 22143025 20608571 19267932 18123403 17126094
37269 17126094 16201486 15277110 14299396 13236236 12072500 10806992 9452623 8036768
37261 8036768 6600752 5199800 3902590 2786388 1925826 1378654 1174292 1308771 1746706
37252 1746706 2429301 3285710 4242711 5228043 6168405 6989774 7627903 8048671 8267743
37243 8267743 8355747 8421557 8577607 8901075 9408069 10052791 10751681 11419891 12002129 12484707
37233 12484707 12886765 13239221 13564547 13867314 14136669 14354557 14503224 14571258 14560862 14495609
37223 14495609 14422358 14401169 14483734 14688805 14987091 15306246 15557840 15675112 15641187 15491594
37213 15491594 15291011 15099581 14947390 14827316 14705388 14540709 14304161 13985749 13585701
37204 13585701 13095322 12483244 11701702 10712040 9510639 8133710 6636645 5065649 3445095
37195 3445095 1788940 124104 -1494635 -2990457 -4287863 -5339936 -6146400 -6757558
37187 -6757558 -7266068 -7788699 -8438140 -9288328 -10344365 -11530843 -12705443 -13693394 -14330470
37178 -14330470 -14499247 -14145946 -13274638 -11928656 -10174706 -8097632 -5801193 -3405860
37170 -3405860 -1039564 1176877 3145534 4802546 6118817 7089417 7719017 8012458 7973159
37161 7973159 7606137 6923144 5949863 4733150 3343451 1869990 411180 -936304 -2088905
37152 -2088905 -2987213 -3603216 -3940364 -4027567 -3911470 -3649936 -3306228 -2942309 -2611009 -2348270
37142 -2348270 -2167334 -2057220 -1987925 -1923404 -1839792 -1741229 -1663277 -1658912 -1773382 -2022531 -2385968
37131 -2385968 -2814412 -3241656 -3592856 -3788428 -3747907 -3397857 -2684084 -1584432 -116589
37122 -116589 1662632 3665217 5781763 7889001 9855882 11552801 12866581 13717314
37114 13717314 14068920 13928930 13341900 12384611 11164412 9812526 8464765 7234157 6189665
37105 6189665 5351286 4698938 4185166 3745870 3311760 2825493 2262758 1646886 1045387
37096 1045387 546277 225758 124677 243885 555158 1016429 1582136 2206728 2845179
37087 2845179 3456121 4010746 4504271 4960832 5423405 5929806 6486911 7058084 7570762
37078 7570762 7939328 8091996 7992352 7651530 7129793 6525642 5951814 5504008 5235536 5150159
37068 5150159 5214342 5378701 5596927 5837823 6091605 6370030 6697807 7097286 7575686 8123862
37058 8123862 8726142 9372187 10062204 10803812 11604268 12462488 13364020 14279990 15168561
37049 15168561 15976843 16644478 17113294 17343715 17329696 17100488 16705964 16195202 15602392
37040 15602392 14946289 14237678 13483909 12684483 11822715 10866304 9785218 8579597 7297290
37031 7297290 6024619 4853814 3848445 3028190 2378455 1873418 1495552 1241639 1116751
37022 1116751 1125168 1266777 1541307 1956253 2531353 3293498 4260858 5422290 6723466
37013 6723466 8069217 9342465 10431265 11253589 11773505 12005562 12005236 11845718 11587798
37004 11587798 11255691 10831632 10274067 9552111 8678479 7721235 6784652 5967743 5323590
36995 5323590 4842189 4463802 4111389 3723571 3275848 2787427 2314274 1928337 1686770
36986 1686770 1604398 1646426 1747882 1848084 1918726 1970578 2038885 2158579 2342683 2573116
36976 2573116 2806522 2990846 3083856 3064963 2936576 2717171 2431628 2103720 1753210 1398311
36966 1398311 1063490 790358 644791 711255 1070821 1770684 2801052 4092523 5535262
36957 5535262 7008813 8406558 9645102 10661449 11408898 11858213 12000049 11842288 11405692
36948 11405692 10727995 9877711 8963045 8119624 7477735 7127304 7099333 7368872 7871918
36939 7871918 8525650 9245306 9955475 10595501 11118807 11487700 11669363 11640385 11400120 10982092
36929 10982092 10451087 9886075 9362550 8946689 8700593 8688407 8975512 9620624 10664801
36920 10664801 12121063 13966781 16139510 18536711 21021528 23438015 25635589 27495807
36912 27495807 28951483 29992035 30655186 31009015 31130381 31087261 30930880 30697352 30412682
36903 30412682 30095169 29753817 29384853 28968899 28471617 27851070 27072712 26127219 25042048
36894 25042048 23879490 22721386 21648329 20723852 19990162 19474363 19197773 19179696 19431522
36885 19431522 19944533 20680789 21576210 22557041 23560577 24547479 25500318 26414862 27295738
36876 27295738 28161527 29051899 30023461 31128695 32388421 33777397 35234686 36691553
36868 36691553 38097850 39433032 40701766 41922488 43116578 44303020 45501901 46746059
36860 46746059 48092404 49620375 51412254 53524796 55970786 58723431 61740286 64990258
36852 64990258 68468338 72195481 76212622 80577689 85365863 90667632 96581756 103205461
36844 103205461 110625326 118909787 128103488 138225486 149273928 161236851 174104773
36837 174104773 187878750 202568163 218174377 234659710 251906024 269671798 287557762
36830 287557762 304988827 321218851 335368202 346507203 353789272 356611553 354753162
36823 354753162 348436624 338286330 325201820 310194672 294241115 278183764 262689526
36816 262689526 248248222 235187098 223684379 213783882 205424514 198491200 192875370
36809 192875370 188522733 185452960 183750723 183537988 184940842 188063651 192979518 199737891
36801 199737891 208381740 218964384 231558989 246256702 263150301 282302844 303705750
36794 303705750 327233284 352598209 379311130 406647514 433630101 459037950 481458536
36787 481458536 499403107 511495169 516707858 514583182 505349196 489882259 469525689
36780 469525689 445832093 420313433 394259825 368649499 344141375 321126342 299807808
36773 299807808 280280967 262585283 246719626 232629978 220193488 209220584 199481732
36766 199481732 190748589 182831154 175595780 168960102 162872937 157292996 152176427 147473187
36758 147473187 143124396 139054514 135161814 131318551 127389196 123262194 118879295 114247068
36750 114247068 109426657 104510068 99595191 94767844 90093034 85613986 81356743 77338478
36742 77338478 73577142 70098571 66936840 64126374 61689218 59623772 57900425 56466375
36734 56466375 55258664 54220876 53315905 52528287 51856852 51306371 50886604 50618358 50537951
36725 50537951 50692367 51124813 51856687 52873824 54124388 55532192 57021006 58536378
36717 58536378 60052072 61560340 63057153 64532803 65968207 67331974 68577902 69647455
36709 69647455 70478343 71013266 71202371 70999506 70357896 69230931 67580950 65395331 62704033
36700 62704033 59587297 56163333 52557020 48864615 45134091 41371125 37565003 33718307
36692 33718307 29864968 26070008 22414639 18977052 15819532 12986218 10507190 8400292
36684 8400292 6665923 5277710 4175918 3268503 2441079 1574975 570069 -634440 -2048614
36675 -2048614 -3631649 -5298906 -6932032 -8393070 -9544873 -10275129 -10516119 -10253193 -9520375
36666 -9520375 -8386084 -6933652 -5242307 -3374853 -1376366 717478 2869708 5036727
36658 5036727 7169510 9215566 11116820 12806760 14214405 15276185 15947695 16207796
36650 16207796 16057480 15521050 14651105 13530100 12262112 10957213 9716179 8620104
36642 8620104 7723534 7049115 6587074 6306533 6179956 6208737 6430266 6896580 7636278 8624503
36632 8624503 9777675 10970319 12060393 12913096 13420695 13517532 13186651 12455151 11381130
36623 11381130 10040739 8522525 6927736 5367249 3947315 2747235 1800930 1092136
36615 1092136 563999 138489 -259072 -676970 -1126047 -1588362 -2040420 -2474246 -2901944
36606 -2901944 -3343763 -3811779 -4301415 -4794004 -5264398 -5685137 -6023306 -6233490 -6253374 -6005550
36596 -6005550 -5404661 -4368295 -2831450 -762867 1822054 4857023 8229477 11790640
36588 11790640 15369907 18795439 21919299 24637828 26896780 28679867 29990461 30838512
36580 30838512 31238264 31215006 30815941 30118986 29231868 28275868 27357155 26539287 25832365
36571 25832365 25203760 24600084 23964472 23242253 22382372 21346859 20130723 18780230 17393432
36562 17393432 16097280 15010834 14211668 13718886 13496469 13471495 13557040 13671134 13749648
36553 13749648 13756363 13691732 13595521 13536294 13587912 13803274 14197725 14746914 15394304 16060800
36543 16060800 16653076 17072328 17227293 17053831 16538793 15739538 14786218 13857205 13130296
36534 13130296 12726728 12672136 12892391 13245830 13575511 13756040 13715095 13426684 12889333 12107272
36524 12107272 11084916 9833361 8380689 6777267 5091024 3393295 1741441 167252
36516 167252 -1322136 -2730471 -4052839 -5261435 -6305235 -7124102 -7670118 -7927045 -7921622
36507 -7921622 -7722415 -7423223 -7113573 -6848406 -6632690 -6427577 -6170848 -5799119 -5264338
36498 -5264338 -4543173 -3639538 -2581568 -1417433 -214108 943227 1959395 2749496 3264950
36489 3264950 3512030 3553068 3490085 3438045 3497220 3732724 4165930 4777625 5518449 6321290
36479 6321290 7114041 7834660 8447927 8956124 9393773 9805600 10220417 10636964 11026932
36470 11026932 11346553 11544953 11565977 11349317 10837422 9988764 8792916 7282224 5536013
36461 5536013 3673573 1834136 148548 -1285545 -2413844 -3219749 -3711895 -3914421 -3862948
36452 -3862948 -3604787 -3201683 -2732937 -2294012 -1986360 -1899827 -2094127 -2585566 -3342317 -4290098
36442 -4290098 -5327704 -6346930 -7248673 -7951789 -8398572 -8561477 -8449588 -8109258 -7616059
36433 -7616059 -7060045 -6528184 -6087580 -5773092 -5581935 -5475510 -5387627 -5239648 -4962785 -4522520
36423 -4522520 -3934509 -3262599 -2598674 -2033836 -1634244 -1431275 -1426938 -1606289 -1944919 -2405362
36413 -2405362 -2927649 -3426733 -3806127 -3985261 -3926796 -3647823 -3208150 -2683585 -2140859 -1625499
36403 -1625499 -1160292 -744953 -354517 55769 533052 1104048 1762214 2472876 3189468
36394 3189468 3867408 4468688 4960712 5317541 5527985 5607421 5604715 5596571 5668267 5887226
36384 5887226 6279598 6819807 7439272 8052324 8586787 9002238 9287694 9445965 9479810 9388960
36374 9388960 9176218 8855515 8456140 8020026 7591437 7202223 6859169 6539534 6196717
36365 6196717 5773922 5221884 4515613 3664351 2710295 1716119 746345 -150544 -954222
36356 -954222 -1676220 -2353659 -3032825 -3747389 -4502144 -5272324 -6018531 -6706151 -7317222 -7851622
36346 -7851622 -8322548 -8751602 -9165306 -9593202 -10067105 -10619203 -11275727 -12046032 -12911868
36337 -12911868 -13823748 -14709276 -15493103 -16121285 -16577444 -16880490 -17064692 -17154316 -17147571 -17018069
36327 -17018069 -16732163 -16271348 -15643790 -14874701 -13982290 -12960660 -11786426 -10444855 -8955664
36318 -8955664 -7382351 -5823064 -4389361 -3179096 -2249762 -1601569 -1178484 -886965 -622387
36309 -622387 -290902 179578 837684 1710652 2805671 4109378 5587080 7183998 8829475
36300 8829475 10443052 11941121 13245242 14294401 15059668 15553369 15824842 15943764 15980970
36291 15980970 15996043 16032955 16119717 16268526 16474515 16712220 16932272 17065136 17036270 16787086
36281 16787086 16289463 15546448 14583146 13437236 12155116 10792837 9416845 8099643
36273 8099643 6909667 5899696 5099651 4516796 4143095 3968199 3993516 4238190 4729452
36264 4729452 5482106 6483733 7698192 9082448 10599690 12217433 13894787 15572384
36256 15572384 17175640 18632296 19895664 20960981 21865810 22673797 23448207 24224087 24988022
36247 24988022 25674348 26183039 26414603 26306881 25856764 25118815 24184606 23152773 22099662
36238 22099662 21058628 20014806 18918698 17714145 16367847 14886019 13311372 11704529
36230 11704529 10120397 8589766 7112912 5667536 4227771 2786093 1368890 39936
36222 39936 -1109680 -1983083 -2504004 -2636739 -2389850 -1804456 -939224 136547 1342808
36213 1342808 2592481 3805882 4929584 5946500 6869348 7721126 8513911 9237707 9866002
36204 9866002 10375624 10768565 11079480 11360199 11648300 11937873 12168742 12238869 12033476 11458937
36194 11458937 10469297 9077482 7351151 5400344 3364361 1398729 -342132 -1728043
36186 -1728043 -2675705 -3160963 -3215387 -2910089 -2334454 -1576311 -706405 231581 1222816 2272271
36176 2272271 3387232 4560421 5762742 6946563 8052681 9015872 9771312 10266946 10481021
36167 10481021 10436690 10204238 9886365 9589591 9392490 9325425 9371555 9485904 9618598 9729251
36157 9729251 9789490 9778521 9677618 9467059 9127618 8646793 8026213 7284831 6455059 5573570
36147 5573570 4670793 3763328 2852706 1931384 992285 35714 -928892 -1883263 -2799250
36138 -2799250 -3638162 -4354851 -4907575 -5270107 -5442107 -5454921 -5369345 -5262065 -5203215 -5235226
36128 -5235226 -5364272 -5567511 -5809077 -6053706 -6270494 -6426687 -6478327 -6367051 -6028839 -5412585
36118 -5412585 -4499681 -3314730 -1922090 -410473 1126135 2602110 3944843 5094367
36110 5094367 6004019 6643847 7003453 7090895 6927150 6537748 5944817 5165547 4222369 3161225
36100 3161225 2062964 1033094 170749 -465024 -871433 -1093604 -1200254 -1257978 -1315513
36091 -1315513 -1401309 -1529560 -1706234 -1930440 -2193703 -2481503 -2776222 -3057009 -3296458 -3460278
36081 -3460278 -3514204 -3434467 -3214854 -2868955 -2431132 -1956778 -1517011 -1184610 -1015889 -1037594
36071 -1037594 -1244047 -1603345 -2069003 -2594126 -3144563 -3704953 -4271996 -4835916 -5360262
36062 -5360262 -5774328 -5986121 -5910488 -5496587 -4739917 -3675884 -2364643 -880635 687304
36053 687304 2230841 3623940 4739848 5481036 5809656 5762409 5439348 4969103 4466783
36044 4466783 4006099 3618327 3312256 3095476 2979794 2969567 3046329 3163731 3255726 3251215
36034 3251215 3089073 2733577 2190695 1518316 819085 212695 -200628 -367366 -289087 -15231
36024 -15231 371767 774276 1097967 1266873 1230078 959651 445986 -301646 -1247574 -2322944
36014 -2322944 -3431210 -4469646 -5356220 -6044756 -6521493 -6792821 -6878846 -6815721 -6656517
36005 -6656517 -6461190 -6278326 -6130775 -6014591 -5909853 -5792764 -5639055 -5418600 -5091114
35996 -5091114 -4611588 -3942811 -3064439 -1973833 -685328 763555 2300657 3813272 5156550
35987 5156550 6176051 6737845 6757771 6221177 5185874 3766708 2108317 356790 -1361944
35978 -1361944 -2954952 -4367217 -5578756 -6593591 -7422862 -8067742 -8508921 -8707319 -8616914
35969 -8616914 -8205578 -7474097 -6461530 -5232141 -3852544 -2375578 -840537 715711
35961 715711 2250558 3718928 5084950 6331826 7460975 8478569 9376351 10119165 10649453
35952 10649453 10908969 10866745 10538027 9984116 9294404 8562483 7870585 7288610 6881597
35943 6881597 6713158 6837281 7281610 8032729 9033659 10196931 11427205 12641681 13779453
35934 13779453 14800435 15681582 16416665 17018981 17521772 17971719 18414898 18880550 19372511
35925 19372511 19875658 20373667 20863851 21356528 21859707 22361801 22825405 23195942 23418912
35916 23418912 23454585 23281316 22887144 22257859 21371122 20199928 18722007 16930292 14841021
35907 14841021 12497280 9967835 7344686 4742587 2296812 149544 -1578539 -2820062
35899 -2820062 -3577348 -3914457 -3932794 -3745020 -3455055 -3142509 -2848932 -2568920 -2252487 -1821796
35889 -1821796 -1198898 -336551 757380 2010883 3299532 4476334 5407577 5998776 6201469
35880 6201469 6004095 5418702 4473441 3212459 1698613 14869 -1736398 -3436819 -4961104
35871 -4961104 -6194149 -7052493 -7501121 -7557673 -7282208 -6755965 -6055440 -5230606 -4296897
35862 -4296897 -3245236 -2064450 -764028 613077 1991360 3275690 4370618 5197920
35854 5197920 5706035 5871453 5697328 5213492 4478089 3579254 2634732 1784758 1172508
35845 1172508 913284 1064574 1612446 2481116 3559382 4730118 5889613 6950848 7835560
35836 7835560 8467515 8776874 8714799 8269710 7477908 6426287 5245929 4094226 3125478
35827 3125478 2456337 2137760 2145216 2392174 2759866 3127383 3389971 3468112 3318283 2946944
35817 2946944 2414279 1815108 1243294 761500 393384 136682 -17895 -75908 -39961 84090
35807 84090 283399 538918 826729 1117013 1374211 1564097 1666399 1683383 1636166 1551019
35797 1551019 1446203 1327348 1190008 1021893 800827 492763 56907 -542270 -1325387
35788 -1325387 -2299488 -3468303 -4840684 -6429195 -8240385 -10263604 -12463223 -14775132
35780 -14775132 -17107115 -19343487 -21354947 -23014080 -24214535 -24888652 -25017858 -24634601
35772 -24634601 -23819590 -22696368 -21418871 -20146567 -19010791 -18086439 -17382553 -16852940 -16416158
35763 -16416158 -15973973 -15426505 -14689104 -13712664 -12499919 -11106859 -9626544 -8165035 -6823495
35754 -6823495 -5692169 -4849665 -4357048 -4244110 -4496638 -5057305 -5844109 -6776367 -7791340
35745 -7791340 -8841855 -9880634 -10846837 -11666235 -12264573 -12585168 -12601565 -12320103 -11771599
35736 -11771599 -10996321 -10031286 -8908569 -7664597 -6350212 -5030430 -3772465 -2629904
35728 -2629904 -1630852 -772415 -22741 665638 1330471 1972824 2546393 2973783 3182609
35719 3182609 3141791 2880161 2480940 2056968 1717907 1541829 1559936 1756350 2079168 2457588
35709 2457588 2821097 3116417 3316561 3418316 3431237 3367703 3242800 3083996 2940951 2883575
35699 2883575 2984227 3291457 3809222 4492323 5259210 6014711 6673274 7176362 7501275
35690 7501275 7660502 7692866 7651647 7596550 7591525 7702036 7983813 8464275 9128212 9918180
35680 9918180 10748113 11520020 12137101 12515142 12595034 12352475 11797668 10964378 9896853
35671 9896853 8643694 7258951 5802372 4330953 2881656 1453346 -680 -1560728
35663 -1560728 -3308395 -5284416 -7456461 -9715753 -11907334 -13879381 -15526506 -16808124
35655 -16808124 -17740423 -18375261 -18781620 -19036094 -19218163 -19402604 -19646755 -19977684 -20387113
35646 -20387113 -20838023 -21280032 -21664757 -21951583 -22099998 -22055216 -21740899 -21069172 -19965802
35637 -19965802 -18398055 -16392636 -14038184 -11473067 -8861481 -6361989 -4095155 -2119301
35629 -2119301 -422945 1062004 2429903 3764842 5111476 6462125 7761158 8922510
35621 8922510 9854723 10487287 10790815 10784926 10532721 10125949 9666075 9244617 8925280 8731532
35611 8731532 8643775 8607748 8551628 8405709 8117756 7659853 7027744 6238077 5328602 4361387
35601 4361387 3423599 2619372 2050698 1791890 1867283 2243005 2839327 3560226 4326421 5095801
35591 5095801 5864399 6654526 7501676 8445096 9517838 10731350 12057654 13419764 14700399
35582 14700399 15769396 16517969 16882429 16847070 16430562 15669353 14608032 13297333 11796655
35573 11796655 10179297 8537136 6976924 5602384 4487671 3657186 3083031 2698831
35565 2698831 2420588 2166457 1871796 1497715 1031211 476499 -159045 -876502 -1685885
35556 -1685885 -2592942 -3580366 -4597307 -5564756 -6392180 -6995798 -7314274 -7323134 -7045703 -6551754
35546 -6551754 -5937748 -5295043 -4681832 -4110207 -3547573 -2925461 -2152991 -1137533 188409
35537 188409 1843717 3790019 5940489 8177819 10370806 12385829 14097291 15403052
35529 15403052 16245329 16628871 16624073 16349074 15938151 15511506 15156329 14918065 14797154 14752076
35519 14752076 14713598 14609700 14391406 14047403 13602978 13108995 12629812 12233058 11977076
35510 11977076 11893510 11972728 12165311 12403272 12627842 12804606 12917692 12950130 12863731 12589457
35500 12589457 12034718 11108258 9754122 7978689 5857017 3516543 1107327 -1228498
35492 -1228498 -3378614 -5269520 -6863720 -8149966 -9132417 -9822751 -10236877 -10396074 -10330666
35483 -10330666 -10083218 -9708491 -9268672 -8823665 -8418578 -8074271 -7787730 -7542795 -7322477
35474 -7322477 -7112231 -6892826 -6632224 -6286925 -5814157 -5187534 -4407378 -3502479 -2526380
35465 -2526380 -1553064 -672200 22623 458485 614150 537914 334671 124629 -3866 -23273
35455 -23273 31474 82885 42845 -151988 -511724 -983416 -1465114 -1837187 -1997358 -1888176
35445 -1888176 -1511261 -925830 -230748 466820 1087102 1603936 2047887 2481116 2954427
35436 2954427 3469948 3971028 4363819 4556837 4499154 4203209 3745277 3242576 2814467 2543887
35426 2543887 2455315 2515134 2648505 2763226 2774161 2624608 2300643 1834539 1295917 773186
35416 773186 350438 85819 -3131 56925 203954 358645 444783 405153 210618 -136683
35406 -136683 -606808 -1154681 -1739340 -2338432 -2946894 -3561734 -4167841 -4738134 -5247132 -5685395
35396 -5685395 -6063262 -6402031 -6719994 -7023214 -7305473 -7552718 -7743275 -7842145 -7798804 -7559022
35386 -7559022 -7088012 -6389210 -5504946 -4500100 -3441227 -2382706 -1363956 -416543 422746
35377 422746 1100337 1545308 1684606 1468542 894106 15095 -1064737 -2211941 -3288410
35368 -3288410 -4170571 -4755768 -4958436 -4706984 -3950778 -2676011 -920591 1220267 3598857
35359 3598857 6028198 8304073 10236181 11681559 12566911 12890459 12706885 12108101 11209607
35350 11209607 10142261 9043473 8043739 7249310 6725306 6485301 6493237 6679011 6961215
35341 6961215 7265881 7533723 7717081 7773980 7666157 7363028 6848344 6124263 5209958 4136634
35331 4136634 2942626 1669152 353950 -977764 -2319942 -3683378 -5083198 -6521300
35323 -6521300 -7971094 -9370572 -10627407 -11636291 -12303510 -12569750 -12422936 -11898116 -11066483
35314 -11066483 -10018164 -8843366 -7615760 -6381928 -5160899 -3956124 -2776578 -1656517
35306 -1656517 -660620 132784 665727 935882 1013978 1032346 1149074 1504812 2189500 3226679
35296 3226679 4574133 6137968 7797665 9436485 10967421 12345959 13567284 14651821
35288 14651821 15626462 16509926 17307890 18016440 18626631 19125100 19493152 19709654 19758016
35279 19758016 19632142 19337702 18890772 18318215 17661062 16977069 16336455 15808129 15441836
35270 15441836 15257745 15251271 15408343 15717260 16167182 16735652 17376346 18018255 18581708 19007116
35260 19007116 19280901 19437775 19530144 19580279 19547646 19335171 18831161 17961560 16724956 15195963
35250 15195963 13499622 11772291 10128898 8649008 7379723 6344032 5546894 4980805
35242 4980805 4634880 4504671 4595052 4912453 5450885 6180291 7043992 7967099 8871671 9689799
35232 9689799 10367684 10862229 11138216 11171325 10954304 10501087 9847790 9051734 8185885 7323963
35222 7323963 6518315 5783045 5095866 4419765 3730376 3031186 2349849 1723750 1187211
35213 1187211 764427 463969 273813 164690 108537 104877 196800 463687 994274 1854429
35203 1854429 3063524 4587877 6353777 8273939 10272733 12297134 14312866 16295000
35195 16295000 18219112 20052158 21745705 23242542 24502211 25530002 26382389 27138393
35187 27138393 27856435 28548259 29185153 29726575 30149734 30463726 30703759 30912337 31120389
35178 31120389 31338158 31555487 31744806 31864431 31866193 31708591 31368095 30840540 30133987 29260741
35168 29260741 28232154 27053946 25722202 24225518 22556176 20724442 18767006 16746709
35160 16746709 14746842 12862516 11188792 9807205 8775828 8125913 7861257 7954534 8342231
35151 8342231 8928138 9602818 10273109 10885051 11427414 11918059 12386796 12866571 13394033
35142 13394033 14012375 14768739 15703311 16832924 18137150 19556678 21008734 22412957
35134 22412957 23712782 24880883 25910507 26804363 27569469 28215274 28747538 29157068 29411642
35125 29411642 29459858 29247305 28737489 27928568 26860118 25607948 24268862 22941201 21708257
35116 21708257 20628476 19730801 19010853 18426406 17896735 17314056 16570766 15594130 14370341
35107 14370341 12944183 11398286 9830758 8346813 7062155 6101973 5582880 5581122 6103382
35098 6103382 7076417 8361013 9783554 11172826 12391699 13358738 14058765 14541985 14910034
35089 14910034 15287827 15784399 16453352 17268318 18125537 18873799 19359064 19465957 19143238
35080 19143238 18410377 17349944 16091632 14789905 13595022 12621234 11922669 11487630 11252660
35071 11252660 11127179 11017768 10847182 10567606 10166544 9662297 9088983 8476369 7833116
35062 7833116 7140932 6362664 5460580 4415790 3239933 1975177 683689 -569660 -1735368
35053 -1735368 -2790071 -3734443 -4580968 -5341758 -6025253 -6642239 -7214345 -7777058 -8372678
35044 -8372678 -9033977 -9765344 -10532470 -11269561 -11903443 -12382429 -12693597 -12859523 -12919720 -12912006
35034 -12912006 -12866690 -12814658 -12799887 -12884717 -13140927 -13626680 -14357685 -15288344 -16317570 -17319531
35024 -17319531 -18180984 -18822196 -19193887 -19263272 -19008131 -18425096 -17541987 -16420510 -15145847
35015 -15145847 -13811100 -12505566 -11307925 -10279857 -9458345 -8851014 -8438963 -8185846 -8047709
35006 -8047709 -7979349 -7936736 -7876905 -7757078 -7534748 -7169916 -6629333 -5892168 -4956687 -3846338
34996 -3846338 -2611314 -1322407 -58429 1108250 2124739 2967954 3649566 4211267 4710003
34987 4710003 5200201 5722102 6299223 6940272 7639890 8378040 9123338 9844572 10527445
34978 10527445 11186095 11859538 12592174 13407229 14284698 15152347 15895051 16384015 16518640
34969 16518640 16263416 15661047 14815581 13855663 12895490 12007656 11214432 10496502 9812077
34960 9812077 9116811 8378497 7586658 6759330 5945715 5219791 4661831 4331759 4245176 4363876
34950 4363876 4605696 4867793 5051099 5077104 4896684 4496065 3903252 3192860 2483096 1918331
34940 1918331 1635934 1725589 2197072 2971365 3900260 4808363 5544373 6025351 6258076 6328699
34930 6328699 6365854 6494826 6802043 7319917 8030435 8879579 9794785 10701237 11535792 12257061
34920 12257061 12847876 13306812 13631589 13804394 13789589 13546207 13048188 12301541 11350673
34911 11350673 10272352 9161716 8117467 7231128 6579151 6212982 6146274 6346614 6741670
34902 6741670 7240995 7762229 8246886 8660463 8984438 9211135 9345005 9405104 9422297 9430120
34892 9430120 9453131 9497574 9547276 9565761 9504004 9312046 8951955 8408940 7696869 6854730
34882 6854730 5933979 4982243 4032740 3106092 2222500 1414357 729681 225355 -43060
34873 -43060 -29130 297984 944919 1885552 3060146 4386113 5774901 7145354 8429070
34864 8429070 9570536 10527173 11272473 11802987 12146740 12365921 12545093 12763533 13063963
34855 13063963 13437519 13836716 14208948 14528418 14806897 15080576 15386725 15746796 16162718
34846 16162718 16622009 17103685 17580505 18017868 18372979 18599005 18656757 18530053 18235217
34837 18235217 17817163 17333703 16837146 16361202 15915342 15486493 15049148 14583254 14092465
34828 14092465 13611436 13196226 12903148 12768134 12796504 12965556 13235450 13560904 13898327
34819 13898327 14208891 14462156 14642107 14750464 14800138 14798670 14730700 14550565 14190604 13583277
34809 13583277 12689607 11522378 10152422 8693496 7273132 6003462 4962217 4185214
34801 4185214 3667185 3369393 3234186 3204176 3239937 3329817 3489300 3751251 4149332 4696848
34791 4696848 5366196 6079219 6718765 7161165 7314667 7143531 6667936 5946410 5055130
34782 5055130 4073378 3075077 2122555 1260565 511249 -128382 -684908 -1201162 -1722729
34773 -1722729 -2281142 -2879970 -3489716 -4053034 -4496425 -4742846 -4722312 -4381310 -3693085 -2669084
34763 -2669084 -1369532 90849 1547496 2805976 3676933 4017030 3761140 2934091 1639635
34754 1639635 32693 -1715937 -3452863 -5063766 -6476609 -7648095 -8545498 -9138692
34746 -9138692 -9408682 -9365976 -9065377 -8606673 -8118661 -7731440 -7546430 -7614341 -7927343 -8424944
34736 -8424944 -9008389 -9559389 -9962477 -10130075 -10024247 -9665037 -9119037 -8471979 -7798107
34727 -7798107 -7140221 -6508120 -5894268 -5297285 -4739182 -4264911 -3924082 -3747773 -3736491 -3865155
34717 -3865155 -4097365 -4396914 -4730032 -5058683 -5328849 -5461356 -5356449 -4919176 -4097804
34708 -4097804 -2913391 -1460920 118788 1679147 3099279 4296917 5225178 5862323
34700 5862323 6203349 6257330 6047887 5611164 4989088 4221683 3343801 2387236 1384344
34691 1384344 368964 -626537 -1576954 -2470173 -3309661 -4110154 -4887673 -5650372 -6396439
34682 -6396439 -7117931 -7803390 -8435198 -8986834 -9428538 -9741541 -9928924 -10009803 -9996749 -9872552
34672 -9872552 -9585578 -9069724 -8277639 -7209090 -5922287 -4525475 -3152188 -1927259 -934395
34663 -934395 -197071 321116 698981 1030325 1393689 1826691 2314646 2801409 3220080 3527437
34653 3527437 3720661 3824804 3859116 3805603 3602249 3166651 2436276 1402933 124537
34644 124537 -1289996 -2714662 -4042646 -5207297 -6179310 -6947850 -7503611 -7836498 -7945175
34635 -7945175 -7845564 -7568621 -7148027 -6605217 -5939537 -5128968 -4144007 -2972708 -1648119
34626 -1648119 -264534 1028798 2058022 2668329 2763177 2323515 1401971 99771 -1458259
34617 -1458259 -3138450 -4802465 -6310990 -7536409 -8383707 -8809900 -8832552 -8524859 -8000455
34608 -8000455 -7392661 -6832679 -6430501 -6261036 -6356489 -6705666 -7260278 -7946500 -8678633 -9373470
34598 -9373470 -9965923 -10424175 -10757858 -11013197 -11256682 -11556001 -11965819 -12519486 -13223942
34589 -13223942 -14056840 -14967743 -15884932 -16726949 -17416176 -17891326 -18116223 -18083074 -17809248
34580 -17809248 -17327542 -16672099 -15865839 -14917255 -13830875 -12626416 -11352910 -10084192 -8893582
34571 -8893582 -7821679 -6859090 -5957314 -5061332 -4142625 -3213409 -2318541 -1515623 -856341
34562 -856341 -375379 -86118 20214 -26237 -177697 -379020 -585810 -784267 -1000599 -1291327
34552 -1291327 -1718312 -2321826 -3102859 -4016988 -4978281 -5874562 -6595233 -7064275 -7262549
34543 -7262549 -7226703 -7025949 -6730857 -6391166 -6033400 -5678451 -5367851 -5180267 -5223553 -5602826
34533 -5602826 -6381265 -7555027 -9053926 -10764079 -12558234 -14319414 -15952143 -17386059
34525 -17386059 -18580326 -19530694 -20271600 -20864433 -21373253 -21840518 -22276105 -22662435 -22967101
34516 -22967101 -23151951 -23174235 -22984301 -22528314 -21760944 -20664396 -19262421 -17618189 -15814856
34507 -15814856 -13930390 -12022116 -10127522 -8274527 -6489700 -4799396 -3227072 -1791048
34499 -1791048 -503088 632885 1619484 2458996 3143458 3649669 3945312 4004130 3821095
34490 3821095 3418297 2838399 2130971 1342582 518970 -283594 -991932 -1528033 -1838568
34481 -1838568 -1924670 -1852097 -1733772 -1692587 -1821043 -2153474 -2659883 -3261548 -3860535 -4370828
34471 -4370828 -4739979 -4955900 -5040601 -5037641 -4999964 -4980206 -5021223 -5145658 -5348692 -5600014
34461 -5600014 -5855235 -6068954 -6200784 -6212969 -6066031 -5719965 -5143314 -4326096 -3288864
34452 -3288864 -2081308 -770236 575252 1891322 3117102 4190570 5053136 5664318
34444 5664318 6016428 6136644 6072213 5865984 5535626 5067818 4430247 3594504 2557378
34435 2557378 1350555 36550 -1304611 -2592577 -3764262 -4788681 -5673765 -6459588
34427 -6459588 -7196622 -7915259 -8599840 -9181604 -9556740 -9620637 -9298514 -8556512 -7393495
34418 -7393495 -5827573 -3890017 -1626775 901046 3623062 6467003 9358468 12210991
34410 12210991 14916035 17346006 19373590 20896805 21855453 22234180 22058535 21391108 20327481
34401 20327481 18987026 17496674 15971856 14501712 13144803 11937003 10905637 10077697
34393 10077697 9473112 9087114 8877087 8766644 8665271 8490378 8180366 7698485 7035012
34384 7035012 6212691 5292041 4368532 3557551 2970654 2690741 2752815 3134768 3761927 4526713
34374 4526713 5318550 6052539 6685445 7214988 7667517 8082766 8501312 8954696 9455653
34365 9455653 9988371 10503177 10921261 11151213 11113253 10763139 10107262 9203151 8144744
34356 8144744 7037662 5972371 5001835 4128749 3308051 2468303 1545396 510389 -625269
34347 -625269 -1826171 -3052742 -4267189 -5425518 -6468900 -7325527 -7923855 -8212383 -8180370
34338 -8180370 -7871979 -7383650 -6839376 -6351750 -5987278 -5752614 -5606203 -5486795 -5343038
34329 -5343038 -5148773 -4897768 -4586355 -4201453 -3725514 -3153696 -2508963 -1845442 -1240684
34320 -1240684 -781081 -542704 -570713 -865147 -1381206 -2044788 -2774986 -3502475 -4176896 -4763784
34310 -4763784 -5238175 -5583751 -5800562 -5915145 -5983056 -6079869 -6286116 -6674570 -7303221 -8210755
34300 -8210755 -9409789 -10876969 -12544764 -14302789 -16013465 -17538088 -18762552 -19613304
34292 -19613304 -20062230 -20124749 -19853987 -19330120 -18644155 -17879438 -17097068 -16331192 -15597420
34283 -15597420 -14911920 -14310872 -13856692 -13625150 -13682071 -14065319 -14779874 -15800432 -17072280
34274 -17072280 -18509768 -20000878 -21424362 -22674652 -23680543 -24405803 -24832765 -24942431
34266 -24942431 -24705849 -24090373 -23072559 -21648347 -19839432 -17700466 -15327451 -12859608
34258 -12859608 -10465800 -8315053 -6541549 -5218673 -4351748 -3889166 -3743843 -3815681 -4009061
34249 -4009061 -4242980 -4453508 -4590703 -4614535 -4493939 -4209088 -3753934 -3138006 -2389617 -1561436
34239 -1561436 -733668 -6292 524407 799275 823429 668945 447011 263070 179652 203502
34229 203502 294802 385623 399743 274509 -15880 -445290 -941203 -1413578 -1794119 -2064305
34219 -2064305 -2255142 -2417755 -2581873 -2726649 -2778690 -2633516 -2184721 -1347859 -76048
34210 -76048 1630760 3723410 6110634 8674478 11287703 13826899 16179853 18249117
34202 18249117 19953181 21225720 22014953 22286398 22029418 21263006 20035443 18417384 16493446
34193 16493446 14357322 12110423 9859550 7709208 5748508 4037644 2601485 1435716
34185 1435716 524013 -143544 -563729 -731151 -659686 -397776 -24491 372885 726332 1004648
34175 1004648 1214975 1392513 1586797 1850349 2230467 2761784 3457174 4297583 5225989
34166 5225989 6154003 6986630 7659425 8168481 8570706 8947199 9347896 9750773 10060563
34157 10060563 10146911 9899142 9269068 8284396 7033351 5634707 4209661 2864326 1681916
34148 1681916 720189 12719 -424657 -583698 -456584 -38424 661444 1608692 2743583
34139 2743583 3992632 5285583 6570390 7823565 9055044 10303668 11618929 13032209
34131 13032209 14530035 16042864 17454371 18626786 19433038 19785152 19648768 19038437 17998078
34122 17998078 16579629 14832748 12809177 10574058 8211329 5815113 3470755 1238560
34114 1238560 -848262 -2771298 -4510858 -6037370 -7314165 -8308642 -9005900 -9418531 -9586732
34105 -9586732 -9566247 -9408338 -9141451 -8764208 -8253318 -7581332 -6732636 -5706571 -4506284
34096 -4506284 -3125144 -1547263 232766 2184813 4233708 6272724 8186667 9865977
34088 9865977 11208263 12120237 12531592 12416529 11807798 10793390 9497559 8052988 6569760
34079 6569760 5108429 3669607 2211241 690940 -887321 -2449108 -3862775 -4983339
34071 -4983339 -5705674 -6005635 -5955983 -5711956 -5468690 -5403047 -5621794 -6136076 -6867396 -7675805
34061 -7675805 -8398294 -8890144 -9062190 -8902485 -8472583 -7880422 -7243800 -6660433 -6194327
34052 -6194327 -5880714 -5744805 -5822108 -6164938 -6827325 -7835890 -9164932 -10730769 -12407067
34043 -12407067 -14050922 -15526665 -16719793 -17541497 -17929061 -17846962 -17289291 -16280195 -14869139
34034 -14869139 -13122042 -11113427 -8924091 -6642824 -4365070 -2182520 -164938 1657223
34026 1657223 3299124 4810684 6249656 7647896 8985741 10188140 11145713 11750830
34018 11750830 11932350 11675792 11023561 10057386 8872227 7555624 6183276 4828671 3572459
34009 3572459 2498390 1676262 1143587 896080 888340 1041482 1256212 1430490 1477661 1339244
33999 1339244 990862 445194 -245118 -988678 -1668958 -2172712 -2423232 -2401641 -2145981 -1732490
33989 -1732490 -1252185 -791571 -417236 -162343 -19132 56042 125493 249515 470560 803594
33979 803594 1230775 1701937 2145434 2490084 2691120 2748165 2705230 2630886 2587585 2606345
33969 2606345 2680258 2777940 2865475 2922609 2946251 2943653 2921715 2878478 2800644 2668230 2463451
33958 2463451 2178071 1814512 1380719 882624 318914 -318697 -1038586 -1837912 -2692853
33949 -2692853 -3557168 -4370970 -5074562 -5619418 -5972135 -6112323 -6027818 -5710134 -5152218 -4349918
33939 -4349918 -3307128 -2042751 -596284 971149 2581515 4148558 5587088 6821873
33931 6821873 7798347 8495384 8933239 9166980 9263892 9276389 9226477 9109588 8913440 8641204
33921 8641204 8328568 8047702 7896212 7975479 8367437 9118085 10230678 11666463 13349850
33912 13349850 15177320 17031203 18797504 20382288 21719073 22764605 23489215 23871944
33904 23871944 23904778 23600550 22995408 22142504 21101427 19929752 18678427 17388406 16086935
33895 16086935 14785698 13483884 12175774 10859037 9540725 8240842 6993903 5846459
33887 5846459 4847893 4035353 3419013 2975927 2657372 2407525 2184323 1971622 1777620
33878 1777620 1623839 1533079 1520487 1585408 1702213 1815332 1847058 1719623 1381084 820018
33868 820018 62596 -840693 -1826040 -2819772 -3740380 -4507795 -5060861 -5374869 -5469341 -5401364
33858 -5401364 -5246270 -5072580 -4920888 -4794347 -4661439 -4466223 -4143062 -3637912 -2935395
33849 -2935395 -2080266 -1177049 -362843 233485 525070 481406 124428 -485157 -1263027 -2113597
33839 -2113597 -2939993 -3654629 -4190807 -4510670 -4603982 -4478464 -4148408 -3627255 -2924011 -2041123
33829 -2041123 -974588 280140 1715708 3299311 4967487 6635896 8221473 9664712
33821 9664712 10938584 12040162 12973006 13732162 14297904 14637583 14712526 14487124 13937495
33812 13937495 13058032 11865526 10399969 8719432 6888406 4964830 2993656 1009575
33804 1009575 -955865 -2869428 -4696966 -6409686 -7993002 -9452093 -10808018 -12084105
33796 -12084105 -13290029 -14412140 -15412984 -16237605 -16823486 -17112124 -17060914 -16654947 -15918452
33787 -15918452 -14922106 -13778135 -12618143 -11560072 -10680001 -10001642 -9504922 -9146423 -8883667
33778 -8883667 -8697312 -8604848 -8658129 -8921218 -9435842 -10192198 -11121954 -12116404 -13056752 -13839247
33768 -13839247 -14386718 -14648816 -14597742 -14225239 -13544135 -12593821 -11444145 -10191065 -8942678
33759 -8942678 -7800391 -6841208 -6104807 -5588123 -5249841 -5023814 -4836084 -4619750 -4325215
33750 -4325215 -3925196 -3413645 -2799332 -2098467 -1330709 -517942 318276 1161842 2006045
33741 2006045 2852682 3707194 4573277 5448710 6322201 7172017 7968873 8684053 9299818
33732 9299818 9816868 10255455 10650287 11041758 11466868 11953109 12516865 13164320 13890552
33723 13890552 14675587 15482059 16260482 16961669 17548572 17999400 18300411 18433295 18364989
33714 18364989 18046903 17426286 16465213 15156967 13530998 11645667 9575051 7396319
33706 7396319 5179561 2978556 822380 -1287778 -3370965 -5448695 -7527872 -9597260
33698 -9597260 -11638557 -13638405 -15587251 -17466541 -19239173 -20854606 -22264591 -23436177
33690 -23436177 -24353089 -25008211 -25397554 -25524536 -25413835 -25122871 -24736078 -24338120 -23980114
33681 -23980114 -23661296 -23338712 -22957278 -22479902 -21901794 -21248080 -20564323 -19907609 -19337535
33672 -19337535 -18903547 -18630843 -18512363 -18510652 -18564378 -18591620 -18489911 -18142504 -17439849 -16313500
33662 -16313500 -14766961 -12885546 -10818350 -8741860 -6823836 -5201131 -3971750 -3192500
33654 -3192500 -2876179 -2990723 -3466681 -4214944 -5148986 -6201994 -7331419 -8509754 -9707377
33645 -9707377 -10877771 -11954091 -12859206 -13523054 -13897367 -13960627 -13713315 -13169807 -12354366
33636 -12354366 -11302903 -10063872 -8688923 -7212049 -5630049 -3903331 -1985559 130601
33628 130601 2378838 4617965 6666536 8356219 9580496 10322048 10653480 10714427 10672431
33619 10672431 10678156 10828096 11146892 11594678 12094730 12569227 12969539 13291375 13570820 13863488
33609 13863488 14215362 14638298 15101548 15542087 15886545 16073319 16066486 15858940 15466524 14917984
33599 14917984 14247476 13494386 12708611 11953645 11301279 10818912 10555539 10532068 10739379
33590 10739379 11145864 11711761 12400753 13178674 14000135 14797131 15483186 15971902 16196441
33581 16196441 16119485 15735165 15069919 14183966 13168296 12132750 11186816 10419616 9885559
33572 9885559 9598748 9535297 9640669 9840250 10053445 10210478 10266134 10202591 10020378 9727046
33562 9727046 9334586 8864848 8350327 7821487 7288195 6732799 6123824 5441197 4694720
33553 4694720 3923646 3178299 2494035 1869779 1260305 586541 -236898 -1263716 -2481777
33544 -2481777 -3801418 -5077711 -6158876 -6935628 -7366848 -7475420 -7326574 -7004928 -6597771
33535 -6597771 -6183464 -5822281 -5549364 -5371190 -5266201 -5189337 -5080170 -4874960 -4521919 -3996327
33525 -3996327 -3310319 -2513574 -1684511 -914180 -287278 133104 310527 229064 -117330 -731283
33515 -731283 -1610867 -2743354 -4097966 -5621070 -7237401 -8859783 -10404730 -11806364
33507 -11806364 -13021973 -14028867 -14818051 -15391287 -15764547 -15975304 -16086857 -16183253 -16353965
33498 -16353965 -16674117 -17188666 -17906383 -18803318 -19830364 -20919557 -21989812 -22957636 -23754340
33489 -23754340 -24341267 -24711801 -24878625 -24856105 -24649119 -24252909 -23662703 -22888001 -21962157
33480 -21962157 -20938395 -19874131 -18817471 -17806977 -16879727 -16073748 -15420029 -14932925 -14608375
33471 -14608375 -14429399 -14372665 -14412599 -14522792 -14673787 -14826976 -14928945 -14913545 -14714888 -14286390
33461 -14286390 -13616760 -12736588 -11714713 -10646252 -9632989 -8756829 -8052324 -7490876 -6988088
33452 -6988088 -6433840 -5730994 -4824437 -3709727 -2422840 -1021162 432826 1879437 3263723
33443 3263723 4537396 5662247 6611074 7363933 7904921 8226890 8343001 8294264 8143127
33434 8143127 7955170 7781410 7652785 7587965 7605843 7731733 7991504 8396331 8927992 9535782
33424 9535782 10149169 10698952 11133208 11418745 11530417 11439869 11115647 10538761 9726691 8750615
33414 8750615 7731931 6816397 6138901 5796022 5834381 6250950 6998633 7995131 9136363
33405 9136363 10313679 11430702 12415294 13224233 13841029 14269634 14527416 14638928 14629983
33396 14629983 14521879 14327651 14051891 13693107 13246314 12705644 12068783 11344124 10558595
33387 10558595 9762589 9028746 8442909 8088250 8027040 8286643 8854594 9682856 10697248
33378 10697248 11807489 12915911 13926105 14753262 15335725 15644410 15686441 15502021 15157003
33369 15157003 14734343 14325013 14015195 13867045 13896766 14061668 14267761 14398710 14353562 14075955
33359 14075955 13564039 12861344 12037404 11169926 10336196 9611349 9062584 8731772 8613318
33350 8613318 8644778 8721717 8731113 8586465 8250612 7741636 7122506 6476648 5875148 5347592
33340 5347592 4870686 4381197 3806048 3092354 2221862 1206377 73542 -1144173 -2411731
33331 -2411731 -3689072 -4930621 -6088640 -7117827 -7979975 -8651150 -9132275 -9457289 -9689789
33322 -9689789 -9904937 -10163664 -10491234 -10869678 -11247707 -11565486 -11784298 -11905674 -11967870 -12021291
33312 -12021291 -12098232 -12194892 -12274275 -12286314 -12193655 -11989510 -11697927 -11356823 -10995150 -10619254
33302 -10619254 -10216094 -9768720 -9272166 -8739829 -8198082 -7674042 -7183924 -6727371 -6289756
33293 -6289756 -5851522 -5400393 -4938657 -4478155 -4023876 -3558214 -3040439 -2425601 -1692760
33284 -1692760 -866252 -18250 749334 1335947 1672368 1736088 1547934 1157909 632443 48567
33274 48567 -509275 -957606 -1230919 -1303404 -1205576 -1024627 -882647 -898198 -1147751 -1645166
33264 -1645166 -2347362 -3179141 -4060831 -4924632 -5716764 -6393230 -6919109 -7273963 -7457226
33255 -7457226 -7486113 -7386096 -7181980 -6897327 -6561066 -6212350 -5896667 -5656312 -5524992 -5530816
33245 -5530816 -5699486 -6044997 -6546712 -7129496 -7668797 -8026883 -8102855 -7868854 -7375642 -6730618
33235 -6730618 -6062898 -5488589 -5083482 -4867896 -4808149 -4835831 -4879532 -4898337 -4905128 -4969914 -5198664
33224 -5198664 -5692586 -6503940 -7609912 -8918774 -10304269 -11646791 -12857294 -13875442
33216 -13875442 -14654619 -15153983 -15345207 -15223425 -14807610 -14128119 -13212125 -12078086 -10741176
33207 -10741176 -9224523 -7569585 -5839726 -4113531 -2470899 -981761 294332 1300095
33199 1300095 1975095 2261702 2120073 1541786 553490 -789751 -2414550 -4235873 -6160373
33190 -6160373 -8092621 -9948460 -11670641 -13236547 -14653016 -15943147 -17133033 -18241388
33182 -18241388 -19270402 -20197978 -20975791 -21537541 -21816645 -21766565 -21373997 -20657557 -19652598
33173 -19652598 -18392580 -16901108 -15201398 -13336399 -11384525 -9459215 -7691342 -6202871
33165 -6202871 -5082716 -4372544 -4065522 -4116538 -4459186 -5022817 -5744021 -6571264 -7465363
33156 -7465363 -8398148 -9347653 -10287407 -11173565 -11940490 -12512604 -12827563 -12855821 -12605669 -12115878
33146 -12115878 -11445457 -10665299 -9849128 -9061281 -8344664 -7714199 -7157155 -6638195 -6107513
33137 -6107513 -5511018 -4799591 -3933565 -2882527 -1625046 -151767 1529701 3391413 5383774
33128 5383774 7434953 9451645 11323427 12931190 14158474 14906239 15112537 14773330 13952746
33119 13952746 12770783 11368283 9864522 8329028 6780682 5210319 3610275 1993753
33111 1993753 397038 -1130477 -2538125 -3779950 -4814090 -5601052 -6108301 -6323579 -6270463
33102 -6270463 -6014467 -5653013 -5294141 -5036440 -4959876 -5127324 -5588489 -6376781 -7496221
33093 -7496221 -8905336 -10510859 -12179754 -13765700 -15136355 -16189749 -16858991 -17112551
33085 -17112551 -16955462 -16428702 -15600343 -14547581 -13337893 -12020056 -10627825 -9188893
33077 -9188893 -7730558 -6281764 -4878002 -3571796 -2441855 -1590010 -1121574 -1115727 -1599225
33068 -1599225 -2535512 -3833352 -5369008 -7010315 -8634097 -10136461 -11440182 -12500536
33060 -12500536 -13306066 -13870859 -14220313 -14377261 -14355123 -14159678 -13795328 -13269161 -12588567
33051 -12588567 -11753559 -10749794 -9549493 -8124113 -6465397 -4603860 -2612407 -591260
33043 -591260 1356837 3146799 4718632 6034251 7069848 7808406 8235643 8343287 8140978
33034 8140978 7671002 7014694 6282304 5588093 5021797 4629857 4413567 4341267 4365138 4434338
33024 4434338 4502451 4531770 4496230 4382255 4186328 3910085 3555270 3120782 2603065 1999744
33014 1999744 1314991 563610 -229693 -1037909 -1843865 -2649218 -3471871 -4331499 -5234383
33005 -5234383 -6171500 -7132015 -8118618 -9148250 -10234865 -11366767 -12495135 -13541799 -14422566
32996 -14422566 -15074962 -15478033 -15655769 -15664053 -15569511 -15431872 -15296677 -15196291 -15150844 -15162015
32986 -15162015 -15201382 -15204990 -15086745 -14770756 -14225793 -13480524 -12611714 -11716323 -10884212 -10179216
32976 -10179216 -9626955 -9208374 -8863814 -8511709 -8077235 -7517926 -6833773 -6058241 -5237583
32967 -5237583 -4412079 -3610208 -2856728 -2184800 -1639231 -1265694 -1093359 -1125108 -1344140 -1731703
32957 -1731703 -2280028 -2987666 -3839919 -4791086 -5764702 -6673048 -7441928 -8024595 -8400173
32948 -8400173 -8564589 -8524331 -8295476 -7902981 -7375809 -6739248 -6008530 -5186289 -4265203 -3237801
32938 -3237801 -2112578 -928297 245073 1322700 2229582 2920043 3385121 3649117 3757984
32929 3757984 3760496 3685615 3526008 3239501 2771915 2090516 1209126 191768 -862950 -1844064
32919 -1844064 -2647474 -3191986 -3433977 -3374908 -3052036 -2511866 -1780624 -851225 303995
32910 303995 1702306 3320286 5082597 6876719 8585301 10118182 11428006 12504175
32902 12504175 13352314 13973409 14355375 14480741 14343439 13963443 13392437 12710199 12013261
32893 12013261 11396678 10932595 10654886 10559218 10618712 10804759 11100056 11498454 11996265 12583851
32883 12583851 13242840 13947974 14669693 15375111 16027027 16580753 16979848 17155634 17036372
32874 17036372 16564813 15714038 14492464 12939928 11124015 9140503 7111898 5176694
32866 5176694 3469398 2097412 1121268 543719 312835 339919 524537 774465 1014315
32857 1014315 1186653 1252510 1193155 1010532 724971 371660 -3724 -352321 -633408 -825879
32847 -825879 -932507 -971764 -959199 -888248 -723313 -411937 89245 789368 1652173 2602526
32837 2602526 3546048 4394773 5092099 5629621 6048875 6425710 6842440 7358702 7992562
32828 7992562 8718336 9478812 10202687 10819318 11270073 11519730 11566983 11447104 11222016 10961584
32818 10961584 10724815 10546701 10431945 10356442 10278140 10156009 9970460 9736143 9500966 9331356
32808 9331356 9289901 9414713 9708214 10137747 10645427 11162589 11624611 11982393 12206626 12281580
32798 12281580 12188973 11890061 11320485 10408986 9115494 7466990 5567379 3573675 1651660
32789 1651660 -66254 -1503150 -2634324 -3465559 -4007550 -4260520 -4214214 -3858252 -3194294
32780 -3194294 -2245285 -1061509 276482 1659408 2956612 4028898 4745529 5004040 4751064
32771 4751064 4000531 2842577 1434719 -29939 -1373087 -2483338 -3346957 -4040699 -4688679
32762 -4688679 -5404654 -6248979 -7219816 -8276866 -9376961 -10496433 -11627669 -12757317 -13847050
32753 -13847050 -14835014 -15659269 -16287321 -16731789 -17043550 -17289533 -17530457 -17809908 -18155490
32744 -18155490 -18583552 -19098177 -19683105 -20295241 -20869979 -21339248 -21652307 -21787771 -21753627
32735 -21753627 -21580606 -21315633 -21017505 -20752315 -20585444 -20569974 -20735593 -21083427 -21589333
32726 -21589333 -22213221 -22910089 -23640244 -24377900 -25115522 -25859035 -26612028 -27355968 -28039556
32717 -28039556 -28585586 -28910226 -28940911 -28624520 -27930274 -26856049 -25437850 -23751780 -21899821
32708 -21899821 -19983243 -18077434 -16221320 -14425805 -12695090 -11047204 -9520406 -8162127
32700 -8162127 -7010549 -6083376 -5379627 -4887838 -4590581 -4462738 -4469918 -4574532 -4749389 -4989323
32690 -4989323 -5309440 -5727474 -6241052 -6815661 -7390660 -7896563 -8271236 -8469130 -8466977 -8270631
32680 -8270631 -7921230 -7493497 -7081187 -6771738 -6617692 -6614286 -6692448 -6734268 -6610530 -6227703
32670 -6227703 -5563217 -4672278 -3665667 -2673583 -1814336 -1177421 -818130 -754979 -965448
32661 -965448 -1383946 -1909466 -2424792 -2819946 -3009957 -2943375 -2605655 -2021811 -1256875 -408855
32651 -408855 408040 1085807 1543331 1739252 1674141 1382168 916162 333764 -307640 -946524
32641 -946524 -1512544 -1933527 -2156460 -2170391 -2013274 -1753973 -1457741 -1155600 -836073 -463141
32631 -463141 -7022 532552 1122241 1706099 2219432 2597842 2782687 2726987 2402259 1803831
32621 1803831 953341 -100691 -1283308 -2495751 -3624117 -4558359 -5221069 -5596265 -5742789
32612 -5742789 -5782711 -5869531 -6151136 -6740386 -7697940 -9026939 -10679034 -12570439 -14603553
32603 -14603553 -16688568 -18761563 -20796305 -22803907 -24813747 -26837983 -28835750 -30698320
32595 -30698320 -32265699 -33367073 -33867347 -33704629 -32910758 -31610280 -29994565 -28274194
32587 -28274194 -26624189 -25143712 -23846309 -22681746 -21576499 -20474725 -19364703 -18283540
32579 -18283540 -17302303 -16501405 -15947707 -15679187 -15696140 -15956869 -16380573 -16861894 -17294999
32570 -17294999 -17595989 -17711559 -17611779 -17276683 -16689341 -15840289 -14737480 -13411756 -11913178
32561 -11913178 -10302741 -8647583 -7022666 -5513529 -4212682 -3207993 -2569095 -2339136
32553 -2339136 -2533767 -3143023 -4131393 -5436888 -6974934 -8650724 -10375709 -12078957 -13708368
32544 -13708368 -15225512 -16601849 -17820251 -18880083 -19801568 -20625311 -21403955 -22186505 -23001321
32535 -23001321 -23846090 -24688940 -25478392 -26157648 -26680099 -27022793 -27192297 -27218123 -27135183 -26963973
32525 -26963973 -26699338 -26314254 -25777049 -25073200 -24220689 -23272727 -22309490 -21424457 -20708884
32516 -20708884 -20235800 -20046963 -20148802 -20520033 -21126179 -21932795 -22912819 -24047807 -25322289
32507 -25322289 -26709448 -28151801 -29549526 -30769698 -31676642 -32167417 -32192733 -31755639 -30895547
32498 -30895547 -29670202 -28142013 -26367906 -24390750 -22233745 -19900241 -17379344 -14656133
32490 -14656133 -11726287 -8613678 -5383831 -2142180 987220 3892438 6495926 8758262
32482 8758262 10668234 12231287 13463849 14393496 15061401 15522733 15841018 16075754 16268324
32473 16268324 16433823 16562638 16629684 16606838 16474310 16227017 15873720 15431364 14920080 14360892
32463 14360892 13772561 13165135 12534938 11868402 11154772 10398714 9624054 8868232 8172886
32454 8172886 7574054 7091610 6719094 6420578 6141469 5831374 5466371 5056613 4635357
32445 4635357 4237997 3884475 3573680 3290589 3020226 2759291 2517566 2308341 2135982
32436 2135982 1991385 1858619 1725090 1584081 1426157 1227121 944248 526436 -65436
32427 -65436 -836463 -1742052 -2684639 -3525908 -4111967 -4303143 -4000156 -3164150 -1830278 -109342
32417 -109342 1830549 3800119 5626192 7173015 8346823 9096215 9416032 9347712 8965100
32408 8965100 8346657 7549155 6599189 5506088 4284226 2966626 1600015 226974 -1130134
32399 -1130134 -2473739 -3826074 -5221881 -6701161 -8298245 -10024902 -11853060 -13708376
32391 -13708376 -15482936 -17064819 -18371389 -19370412 -20081157 -20559251 -20875235 -21095118 -21268195
32382 -21268195 -21425612 -21589011 -21780055 -22017531 -22298176 -22574452 -22749733 -22700433 -22316609
32373 -22316609 -21543268 -20406631 -19015415 -17534020 -16135585 -14954503 -14058729 -13448531
32365 -13448531 -13072789 -12850309 -12690139 -12509747 -12249502 -11882048 -11417489 -10904581 -10423175
32356 -10423175 -10062963 -9892519 -9932388 -10144656 -10440887 -10701628 -10800069 -10625562 -10104012 -9211898
32346 -9211898 -7981294 -6495552 -4878257 -3279750 -1864001 -793638 -208080 -195120 -766788
32337 -766788 -1854099 -3325398 -5017863 -6766390 -8422060 -9862868 -11001106 -11787088
32329 -11787088 -12206981 -12276142 -12031818 -11526196 -10817318 -9957407 -8983021 -7911482 -6742716
32320 -6742716 -5462880 -4050028 -2486082 -775359 1039736 2878957 4644794 6253951
32312 6253951 7663649 8882205 9963115 10986387 12030091 13136959 14288448 15402584
32304 15402584 16361465 17054446 17411544 17410253 17059828 16381901 15404555 14173144 12766580
32295 12766580 11302569 9922429 8759555 7905124 7384020 7147598 7084367 7046724 6887976
32286 6887976 6498974 5832042 4904484 3783079 2559502 1329600 183785 -794940 -1535097
32277 -1535097 -1987836 -2139426 -2015510 -1673754 -1190012 -644820 -112365 349885 711543
32268 711543 975242 1170458 1332165 1473445 1570586 1573645 1436403 1144497 724140 231566
32258 231566 -263440 -688598 -974236 -1058626 -897076 -471942 202468 1083957 2114787 3238205
32248 3238205 4413511 5624294 6876635 8188061 9572195 11025313 12519238 14002263
32240 14002263 15407573 16666292 17719905 18526735 19061053 19308943 19267590 18951061 18398043
32231 18398043 17671531 16843772 15971292 15075195 14140547 13135808 12040524 10866804 9666179
$$ [...]
##END NTUPLES=NMR SPECTRUM
##END=
