##TITLE=31Pdec_E3e200GRT
 CDCl3, 24 sc
 5.7.2023
##JCAMPDX= 6.0         $$ Bruker NMR JCAMP-DX V2.0
##DATA TYPE= NMR SPECTRUM
##DATA CLASS= NTUPLES
##ORIGIN= UXNMR, Bruker Analytische Messtechnik GmbH
##OWNER= root
$$ XWIN-NMR		Version 3.5
$$ Wed Jul  5 14:00:54 2023 Russian Standard Time (UT+4h)  she@DPX200
##.OBSERVE FREQUENCY= 81.013821
##.OBSERVE NUCLEUS= ^31P
##.ACQUISITION MODE= SIMULTANEOUS
##.ACQUISITION SCHEME= undefined
##.AVERAGES= 24
##.DIGITISER RES= 16
##SPECTROMETER/DATA SYSTEM= spect
##.PULSE SEQUENCE= zgpg30
##.SOLVENT NAME= CDCl3
##.SHIFT REFERENCE= (INTERNAL, CDCl3, 0, 248.564)
##AUDIT TRAIL= $$ (NUMBER, WHEN, WHO, WHERE, WHAT)
$$ ##TITLE= Audit trail, XWIN-NMR		Version 3.5
$$ ##JCAMPDX= 5.01
$$ ##ORIGIN= Bruker BioSpin GmbH
$$ ##OWNER= she
$$ F:/spectra/data/she/nmr/P31/1/pdata/1/auditp.txt
$$ ##AUDIT TRAIL=  $$ (NUMBER, WHEN, WHO, WHERE, WHAT)
(   1,<2023-07-05 14:00:06.15 +0400>,<she>,<DPX200>,
      <created by zg, POWCHK disabled, PULCHK disabled
       configuration hash MD5:
       00 E9 B6 7A A2 85 ED C7 34 08 36 98 17 FE 4E 26
       data hash MD5: 32K
       C9 FA 35 E1 23 94 7D 24 92 EC D1 C8 F8 7D B7 AD>)
(   2,<2023-07-05 14:00:08.50 +0400>,<she>,<DPX200>,
      <Start of raw data processing
       efp BC_mod = 2 LB = 1 FT_mod = 6 PKNL = 1 PHC0 = -10826.96 PHC1 = 439.4848 SI = 64K 
       data hash MD5: 64K
       60 4F DF 19 92 0A D8 95 5B 37 41 D1 FF D5 CC 17>)
(   3,<2023-07-05 14:00:22.93 +0400>,<she>,<DPX200>,
      <pk PHC0 = -14.95389 PHC1 = 0 
       data hash MD5: 64K
       3B AF 11 F6 B7 48 C8 7D 09 BD B6 06 66 36 D6 AA>)
$$ ##END=
$$ 
$$ hash MD5
$$ 25 56 ED 34 44 74 01 62 7B 66 BA C4 A9 3D FB F6
##$RELAX= 
##$RELAX= 
##$RELAX= 
##$RELAX= 
##$RELAX= 
##$RELAX= 
##$RELAX= 
##$RELAX= 
##$RELAX= 
$$ Bruker specific parameters
$$ --------------------------
##$DU= <F:/spectra>
##$EXPNO= 1
##$NAME= <P31>
##$PROCNO= 1
##$TYPE= <nmr>
##$USER= <she>
##$AMP= (0..31)
100 100 100 100 100 100 100 100 100 100 100 100 100 100 100 100 100 100 
100 100 100 100 100 100 100 100 100 100 100 100 100 100 
##$AQSEQ= 0
##$AQ_mod= 1
##$AUNM= <au_zg>
##$AUTOPOS= <>
##$BF1= 81.014009
##$BF2= 200.13
##$BF3= 200.13
##$BF4= 200.13
##$BF5= 200.13
##$BF6= 200.13
##$BF7= 200.13
##$BF8= 200.13
##$BYTORDA= 1
##$CFDGTYP= 0
##$CFRGTYP= 5
##$CHEMSTR= <none>
##$CNST= (0..31)
1 1 145 1 1 1 1 1 1 1 1 1 1 1 1 1 1 1 1 1 1 1 1 1 1 1 1 1 1 1 1 1 
##$CPDPRG= <waltz16>
##$CPDPRG1= <>
##$CPDPRG2= <waltz16>
##$CPDPRG3= <>
##$CPDPRG4= <mlev>
##$CPDPRG5= <mlev>
##$CPDPRG6= <mlev>
##$CPDPRG7= <mlev>
##$CPDPRG8= <mlev>
##$CPDPRGB= <>
##$CPDPRGT= <>
##$D= (0..31)
0 1 0 0 0 0 0 0 0 0 0 0.03 2e-05 3e-06 0 0 0 0 0 0 0 0 0 0 0 0 0 0 0 0 
0 0 
##$DATE= 1688551205
##$DBL= (0..7)
120 120 120 11 120 120 24 19 
##$DBP= (0..7)
150 150 150 150 150 150 150 150 
##$DBP07= 0
##$DBPNAM0= <>
##$DBPNAM1= <>
##$DBPNAM2= <>
##$DBPNAM3= <>
##$DBPNAM4= <>
##$DBPNAM5= <>
##$DBPNAM6= <>
##$DBPNAM7= <>
##$DBPOAL= (0..7)
0.5 0.5 0.5 0.5 0.5 0.5 0.5 0.5 
##$DBPOFFS= (0..7)
$$ [...]
##$SUBNAM2= <"">
##$SUBNAM3= <"">
##$SUBNAM4= <"">
##$SUBNAM5= <"">
##$SUBNAM6= <"">
##$SUBNAM7= <"">
##$SUBNAM8= <"">
##$SUBNAM9= <"">
##$SW= 501.771253377433
##$SWIBOX= (0..15)
0 1 3 0 0 0 0 0 0 0 0 0 0 0 0 0 
##$SW_h= 40650.406504065
##$TD= 32768
##$TD0= 1
##$TE= 0
##$TE2= 300
##$TE3= 300
##$TEG= 300
##$TL= (0..7)
0 120 53 12 22 120 120 120 
##$TP= (0..7)
150 150 150 150 150 150 150 150 
##$TP07= 0
##$TPNAME0= <>
##$TPNAME1= <>
##$TPNAME2= <>
##$TPNAME3= <>
##$TPNAME4= <>
##$TPNAME5= <>
##$TPNAME6= <>
##$TPNAME7= <>
##$TPOAL= (0..7)
0.5 0.5 0.5 0.5 0.5 0.5 0.5 0.5 
##$TPOFFS= (0..7)
0 0 0 0 0 0 0 0 
##$TUNHIN= 0
##$TUNHOUT= 0
##$TUNXOUT= 0
##$USERA1= <user>
##$USERA2= <user>
##$USERA3= <user>
##$USERA4= <user>
##$USERA5= <user>
##$V9= 5
##$VALIST= <valist>
##$VCLIST= <CCCCCCCCCCCCCCC>
##$VD= 0
##$VDLIST= <DDDDDDDDDDDDDDD>
##$VPLIST= <PPPPPPPPPPPPPPP>
##$VTLIST= <TTTTTTTTTTTTTTT>
##$WBST= 1024
##$WBSW= 4
##$XGAIN= (0..3)
0 0 0 0 
##$XL= 0
##$YL= 0
##$YMAX_a= 4437
##$YMIN_a= -4442
##$ZGOPTNS= <>
##$ZL1= 120
##$ZL2= 120
##$ZL3= 120
##$ZL4= 120
##$ABSF1= 0
##$ABSF2= 0
##$ABSG= 0
##$ABSL= 0
##$ALPHA= 0
##$AQORDER= 0
##$ASSFAC= 0
##$ASSFACI= 0
##$ASSFACX= 0
##$ASSWID= 0
##$AUNMP= <proc_1d>
##$AZFE= 0.1
##$AZFW= 0.5
##$BCFW= 0
##$BC_mod= 2
##$BYTORDP= 0
##$COROFFS= 0
##$CY= -3
##$DATMOD= 1
##$DC= 0
##$DFILT= <>
##$DTYPP= 0
##$F1P= 0
##$F2P= 0
##$FCOR= 1
##$FTSIZE= 65536
##$FT_mod= 6
##$GAMMA= 0
##$GB= 0
##$INTBC= 1
##$INTSCL= 6.047779e-11
##$ISEN= 30
##$LB= 1
##$LEV0= 0
##$LPBIN= 0
##$MAXI= 10000
##$MC2= 0
##$MEAN= 0
##$ME_mod= 0
##$MI= 50
##$NCOEF= 0
##$NC_proc= -6
##$NLEV= 6
##$NOISF1= 182.463
##$NOISF2= 159.3651
##$NSP= 0
##$NTH_PI= 0
##$NZP= 0
##$OFFSET= 248.5645
##$PC= 4
##$PHC0= -10841.91
##$PHC1= 439.4848
##$PH_mod= 1
##$PKNL= yes
##$PPARMOD= 0
##$PSCAL= 0
##$PSIGN= 0
##$REVERSE= no
##$SF= 81.0140089999694
##$SI= 65536
##$SIGF1= 159.3651
##$SIGF2= -187.1042
##$SINO= 113.3802
##$SIOLD= 16384
##$SREGLST= <1H.CDCl3>
##$SSB= 0
##$STSI= 65536
##$STSR= 0
##$SW_p= 40650.406504065
##$SYMM= 0
##$S_DEV= 0
##$TDeff= 32768
##$TDoff= 0
##$TI= <>
##$TILT= no
##$TM1= 0
##$TM2= 0
##$TOPLEV= 0
##$USERP1= <user>
##$USERP2= <user>
##$USERP3= <user>
##$USERP4= <user>
##$USERP5= <user>
##$WDW= 1
##$XDIM= 65536
##$YMAX_p= 325416611
##$YMIN_p= -196114758
$$ End of Bruker specific parameters
$$ ---------------------------------
##NTUPLES= NMR SPECTRUM
##VAR_NAME=  FREQUENCY,     SPECTRUM/REAL,   SPECTRUM/IMAG
##SYMBOL=    X,             R,               I
##VAR_TYPE=  INDEPENDENT,   DEPENDENT,       DEPENDENT
##VAR_FORM=  AFFN,          ASDF,            ASDF
##VAR_DIM=   65536,         65536,           65536
##UNITS=     HZ,            ARBITRARY UNITS, ARBITRARY UNITS
##FACTOR=    0.620285442955139, 1,           1
##FIRST=     20137.2065510682, 0,            0
##LAST=      -20513.1999529968, 0,           0
##MIN=       -20513.1999529968, -196114758,  0
##MAX=       20137.2065510682, 325416611,    0
$$ Real data points
##PAGE= N=1
##DATA TABLE= (X++(R..R)), XYDATA
$$ [...]
13255D55840J023317Q59451k35537q67911n80165k71048l80494k57517K38281
$$ 455840 1479157 2338608 2103071 1235160 654995 383947 3453 -254064 -15783
13246a5783J57469p06324r81810R6189J059403L08648j200537j190450N38514
$$ -15783 141686 -564638 -1546448 -1450259 -390856 -82208 -1282745 -2473195 -1934681
13237a934681J786402J095423l73078o53580L94852J094193K57320j194735j328506
$$ -1934681 -148279 947144 574066 -79514 315338 1409531 1666851 472116 -856390
13228h56390K02455J468505Q36397o27254p75648J90708J16886j254134j527337
$$ -856390 -653935 814570 1650967 1023713 248065 438773 555659 -698475 -2225812
13219b225812L24040J957212J417086L01208P28295J445255J40229k048480k043547
$$ -2225812 -1901772 55440 1472526 1773734 2502029 3947284 4087513 2039033 -4514
13210d514R996R39965k15651r76680K7563R37898K95215n24275j96365J21378
$$ -4514 5482 945447 729796 -246884 -219321 718577 1013792 489517 293152 414530
13200D14530o92456j220120J03569J956357J968100L25794q23149p27567n59422
$$ 414530 -277926 -1498046 -1394477 561880 2529980 2855774 2032625 1305058 745636
13191G45636j003446j319026q31811J00438P34905O56533n58m26728K26304J465598
$$ 745636 -257810 -1576836 -2408647 -2308209 -1573304 -916771 -917329 -1344057 -1117753 347845
13181C47845J578863n2636j783893j885568q07567K979M03637J033190J466603
$$ 347845 1926708 1874072 90179 -1795389 -2602956 -2599977 -2196340 -1163150 303453
13172C03453Q76440o2242J992O72030L17304j027736j467098k89534Q84671O91468
$$ 303453 1179893 1117651 1119643 1791673 2108977 1081241 -385857 -675391 209280 900748
13162I00748j34077m19916l64796n52939o04683q7351L66358J16009k59614j6349
$$ 900748 766671 346755 -18041 -570980 -1175663 -1263014 -896656 -780647 -1040261 -1056610
13152a056610L58569R7187k97816J08150Q88293Q37024N902l87860J8552L17287
$$ -1056610 -698041 -600854 -898670 -790520 97773 934797 940699 552839 571391 888678
13142H88678K9983k49497k13064m15008r59776r36150O5626R95516Q27248Q6057
$$ 888678 918661 669164 456100 41092 -918684 -1854834 -1789208 -793692 33556 119613
13132A19613j16599J77614J40182k54249k45527K59896M03657k86088j124262
$$ 119613 3014 180628 320810 66561 -178966 80930 484587 198499 -925763
13123i25763j120160p5141J315233K069535J655740N12531k75801k02858L7436
$$ -925763 -2045923 -2121064 -805831 1263704 2919444 3431975 3156174 2953316 2990752
13114B990752l71039j108866j299143r21703o19949l80053L15293J045002O41974
$$ 2990752 2619713 1510847 211704 -709999 -1329948 -1710001 -1394708 -349706 292268
13105B92268p87825j489018m63057J002700J198589L07498l32284l91065n39403
$$ 292268 -495557 -1984575 -2447632 -1444932 -246343 61155 -271129 -662194 -1201597
13096a201597q03864m79180L79628P79249L75942Q9223O32961J295044Q53447
$$ -1201597 -2005461 -2484641 -2105013 -1325764 -949822 -860599 -227638 1067406 1920853
13087A920853o96318j905405j388666N85975K155573J750013r0816j306896q80387
$$ 1920853 1224535 -680870 -2069536 -1483561 672012 2422025 2331209 1024313 143926
13078A43926P035r3144p76609o96407J47267N37364J59901n6550J82600J3226
$$ 143926 150961 57817 -718792 -1415199 -1267932 -730568 -570667 -627217 -444617 -431391
13068d31391p42723q52690K82587J281449P31644o14589j045288m76336j93881
$$ -431391 -1174114 -2026804 -1744217 -462768 268876 -345713 -1391001 -1867337 -2061218
13059b061218m65199k19284Q07728J352648O50745k43552p1352P59576R75738
$$ -2061218 -2526417 -2745701 -1937973 -585325 65420 -178132 -249484 510092 1485830
13050A485830L56087k83404n32754o33733n40158K6362N84966K47673o61948o72790
$$ 1485830 1841917 1558513 1025759 392026 -148132 -121770 463196 710869 48921 -623869
13040f23869N28098J200503Q7616j312173o96128J460807K309711O80080j321666
$$ -623869 -95771 1104732 1192348 -119825 -815953 644854 2954565 3634645 2312979
13031B312979j485973m10538N9057k18326j01672L91032J65125o54422n77451
$$ 2312979 827006 416468 475525 257199 155527 546559 711684 57262 -520189
13022e20189P05380J457378M52318j068620j204004j05096N37502J13364l42726
$$ -520189 185191 1642569 2094887 1026267 -177737 -282833 254669 368033 25307
13013B5307j21355J10996l09702p92345m56485L66812N72252p3445o58679n22219
$$ 25307 -96048 14948 -294754 -1087099 -1543584 -1176772 -604520 -677965 -1336644 -1858863
13003a858863n8263J64025L12877P34284J035094N57849m23193q42096k92111
$$ -1858863 -1917126 -1753101 -1440224 -705940 329154 887003 463810 -378286 -670397
12994f70397M23423M89952J45415M8532J47327j04527o82257r21445n42534o4994
$$ -670397 -246974 242978 388393 436925 584252 479725 -202532 -1123977 -1666511 -1731505
12984a731505M4236R5070O08833J335160J394268M38677p90549j334232j118955
$$ -1731505 -1687269 -1592199 -983366 351794 1746062 2184739 1394190 59958 -1058997
12975a058997p62838m80469J37227J108030J577304R25177j56797m47750K14630
$$ -1058997 -1821835 -2302304 -2165077 -1057047 520257 1445434 1288637 840887 1055517
12966A055517Q92078R18281M89383l9666n44800p58979m34510k9172k68005q25816
$$ 1055517 1947595 2865876 3355259 3315593 2770793 2011814 1577304 1548132 1280127 454311
12956D54311n73992M84222Q27963k77550j366846q28129O65120J230101N71499
$$ 454311 -119681 364541 1192504 914954 -451892 -1280021 -614901 615200 1186699
12947A186699N5104K91014L70728k77666q25800m76073J89835J23523o28307j067737
$$ 1186699 1241803 1532817 1903545 1625879 800079 324006 513841 637364 9057 -1058680
12937a058680o06519L42384J002381J014195N71345N9432k89347m13134k74177
$$ -1058680 -1665199 -1322815 -320434 693761 1265106 1324538 1035191 622057 347880
12928C47880O6555K92294J22795k00039j83104P4529p2555p04170j006198m81189
$$ 347880 414435 706729 829524 629485 446381 520910 448355 -255815 -1262013 -1743202
12918a743202K60656M95439M05103L74010P0298p69062j320944o83341N21908
$$ -1743202 -1482546 -987107 -582004 -207994 -137696 -906758 -2227702 -2911043 -2389135
12909b389135Q62789K26915p7478N95901J288385Q92311m02638j469887j393044
$$ -2389135 -1526346 -1299431 -1376909 -781008 507377 1399688 997050 -472837 -1865881
12900a865881j13167J457853J989520J049265k49037n90761j62489j18564o76904
$$ -1865881 -1979048 -521195 1468325 2517590 2268553 1677792 1515303 1396739 719835
12891G19835r33374m79807M5302J45329N1008o5327l69383o62847m57305P6120
$$ 719835 -213539 -693346 -648044 -502715 -451707 -517034 -886417 -1549264 -2006569 -1930449
12881a930449K77733K03050M76452Q76641M82909n21275p48742J74329Q51428
$$ -1930449 -1652716 -1449666 -973214 -96573 386336 -134939 -883681 -709352 142076
12872A42076L28387m43976l44572J26023K7946k27755K81882J175085J236488
$$ 142076 470463 26487 -318085 -192062 -164116 -391871 -109989 1065096 2301584
12863B301584K55367q39943j377731j404213r89478q0370R68336J444348R60054
$$ 2301584 2556951 1717008 339277 -1064936 -2054414 -2134784 -1166448 277900 1237954
12854A237954j72030j083202q80967L88914J331477O63912q49360j161968J08735
$$ 1237954 1065924 -17278 -898245 -509331 822146 1486058 636698 -525270 -416535
12845d16535J083557N89993r5491L32864Q55395K4028j220838r10058O16101J114765
$$ -416535 667022 1257015 1161524 1494388 2349783 2373811 1152973 242915 859016 1973781
12835A973781r3585j300160j143507j65251O68145J172405J212031M12495p83312
$$ 1973781 1880196 580036 -563471 -728722 -60577 1111828 2323859 2736354 1953042
12826A953042j172313n03733J04616m3798l03712j00223Q3650j35476j72722L25449
$$ 1953042 780729 276996 381612 337814 34102 -66121 17529 -117947 -290669 34780
12816C4780N59782p7493p20453l17646N48582N03383l68455n52388N43783J541839
$$ 34780 594562 517069 -203384 -521030 27552 530935 162480 -389908 153875 1695714
12806A695714R38010q16442j828258j086179L97949R31624J74895o55170n09428
$$ 1695714 2633724 1817282 -10976 -1097155 -699206 232418 407313 -247857 -757285
12797g57285K15378M45770p8072o95525q73053o53089k23997K58584N07678M26137
$$ -757285 -541907 -96137 -174209 -869734 -1742787 -2395876 -2619873 -2361289 -1853611 -1427474
12787a427474M69053R65170J264961N04612q56864j376546o46836J77624J95360
$$ -1427474 -958421 6749 1271710 1776322 919458 -457088 -1103924 -926300 -730940
12778g30940q7247L9376K87772J75839M3529L33588O41911M35929N6650N5804
$$ -730940 -818187 -778811 -491039 -315200 -271671 61917 703828 1139757 1196407 1252211
12768A252211J36176k57290q06081p90325k73558J49977L77279O06340N91677
$$ 1252211 1388387 1131097 325016 -465309 -738867 -588890 -211611 394729 986406
12759I86406J35277j67921J64473L80146l55196j209112p90299L51447L86252
$$ 986406 1121683 953762 1118235 1498381 1143185 -65927 -856226 -504779 -118527
12750a18527o49656p22302O71622J346268j3248j499952j013407L89004M95001
$$ -118527 -768183 -1490485 -818863 527405 514157 -985795 -1999202 -1610198 -1115197
12741a115197k99682q290J155749J090052l25306p87211M89866J323346K07544
$$ -1115197 -1414879 -1423169 -267420 822632 497326 -289885 199981 1523327 1730871
12732A730871j186285q64153K54391R1725j099949j366044l31504M76431L35179
$$ 1730871 544586 -319567 -65176 26549 -1073400 -2439444 -2770948 -2294517 -1959338
12723a959338K08142P09217J068809P11360L20472N02384N83103k41668j336358
$$ -1959338 -1751196 -1041979 26830 738190 1058662 1561046 2144149 1902481 566123
12714E66123j305876L8620J328637J323949K81912o14627p26758l81620j5557
$$ 566123 -739753 -701133 627504 1951453 2233365 1618738 891980 510360 494803
12705D94803M26125R47648R81708J34714q78294r74393k98292k2769m49942n69144
$$ 494803 920928 1868576 2850284 2984998 2106704 1132311 834019 811250 361308 -207836
12695b07836O3131L90673l19461j019245n15867M83430M86853l73397o98089j29271
$$ -207836 -144705 245968 -73493 -1092738 -1608605 -1125175 -638322 -1011719 -1709808 -1839079
12685a839079L52047K10495j21408l61198n27956j86857Q71356J476337M73622
$$ -1839079 -1487032 -1276537 -1397945 -1759143 -2287099 -2473956 -1602600 -126263 347359
12676C47359r33348m89163J380997J766464j68838j636978o02982R88505M81289
$$ 347359 -585989 -1075152 305845 2072309 1903471 266493 -336489 652016 1133305
12667A133305j246116j506564k28839L44369l69755o09749M23753J236773O21978
$$ 1133305 -112811 -1619375 -1848214 -1503845 -1873600 -2483349 -2059596 -822823 -200845
12658b00845n19473p77088j16471O27065R65262P90100J30909n55057n83809P0805
$$ -200845 -720318 -1497406 -1613877 -986812 -21550 768550 899459 344402 -239407 -168602
12648a68602O92529P71107M24357o3138l83716q3516P83696J140790J85984j038779
$$ -168602 523927 1295034 1719391 1656253 1272537 1189021 1972717 3113507 3299491 2260712
12638B260712q52938L57460M46114j117046k134357r22309J085097J452330J66106
$$ 2260712 1407774 1765234 2211348 1094302 -1040055 -1962364 -877267 575063 741169
12629G41169p82760m43340K54366L98774J88511K7532j21300j93335J01315N44856
$$ 741169 -41591 -484931 -230565 168209 356720 384252 262952 69617 170932 715788
12619G15788M49457k63235q25032p73206n41194n04086k40890O29141J504017
$$ 715788 1165245 902010 76978 -696228 -1237422 -1741508 -1982398 -1353257 150760
12610A50760J461307N11295n22279j129405j390576j273907n15504O32930J300822
$$ 150760 1612067 2123362 1601083 471678 -918898 -2192805 -2708309 -2075379 -774557
12601g74557J043175M45792K58192L85825K54748k00365n30081n40630m58264
$$ -774557 268618 714410 972602 1358427 1613175 1412810 882729 342099 -116165
12592a16165m12245l03315j31998L3350K82771N27287K14408q26698j530922p46997
$$ -116165 -528410 -831725 -963723 -930373 -647602 -120315 94093 -732605 -2263527 -3010524
12582c010524P88668J080472j49341p55037O08047K165267J566077m71568j231103
$$ -3010524 -2221856 -1141384 -1290725 -2045762 -1437715 727552 2293629 1822061 590958
12573E90958j42086N91974k85679j178765m94265O49345L02214j066504j276434
$$ 590958 448872 1040846 755167 -423598 -917863 -268518 33696 -1032808 -2309242
12564b309242J11549J119299M19142o73246k45042J293599J703152O3667j848845
$$ -2309242 -2197693 -1078394 -659252 -1332498 -1577540 -283941 1419211 1482878 -365967
12555c65967j808641M7975J514125J139121k21422r15127o07675j40030P8227
$$ -365967 -2174608 -2126633 -612508 526613 305191 -609936 -1217611 -1357641 -1279414
12546a279414M11858Q73134Q05869J8827o82112o13125j64945o4665k70977k58764
$$ -1279414 -867556 5578 811447 830274 148162 -464963 -629908 -694573 -965550 -1224314
12536a224314M2788K87891L67873L53517O8882n39274q29918j34552J042349J412647
$$ -1224314 -1181526 -893635 -525762 -172245 -103363 -642637 -1472555 -1607107 -564758 847889
12526H47889O74132j5242K79743R75327R78451K54614m46024q55841j152113j029797
$$ 847889 1522021 1506779 1786522 2761849 3740300 3994914 3548890 2693049 1540936 511139
12516E11139r2958Q42361K94992j508777k209290l44041K283367K768002R75050
$$ 511139 418181 1260542 1555534 46757 -2162533 -2506574 -223207 2544795 3519845
12507C519845n61875m49145o3162p86767j649358j153885N1476K58351m09192
$$ 3519845 2957970 2508825 2445663 1658896 9538 -1144347 -1092871 -834520 -1243712
12498a243712l22939P01862J017622N4449n37840L72834J406839R00691l55538
$$ -1243712 -1566651 -864789 152833 207282 -330558 42276 1449115 2349806 1994268
12489A994268m88234L53932M37964m32982n73655N42713J152030N6492j279835
$$ 1994268 1506034 1859966 2297930 1864948 1291293 1834006 2986036 3042528 1762693
12480A762693r45250M86330R52695j2060r77322j024326p21387o63526o08105
$$ 1762693 817443 1303773 2256468 2244408 1267086 242760 -478627 -1142153 -1750258
12471a750258l93713l83336n37002k28236M92440N99659k59167q92208k30046
$$ -1750258 -2143971 -2527307 -3064309 -3292545 -2800105 -2200446 -2459613 -3351821 -3581867
12462c581867J029543J476059R94560N76926N76434L78199k82945q04444p47492
$$ -3581867 -2552324 -1076265 -81705 495221 1071655 1449854 1166909 362465 -385027
12453c85027n42529p63299j185400r82692K24524J690816K085515R38455o12688
$$ -385027 -927556 -1690855 -2876255 -3858947 -3634423 -1943607 141908 1080363 467675
12444D67675j047284l46453J59644j34306l60663Q7844M44872R1986j18334O12205
$$ 467675 -579609 -926062 -766418 -900724 -1261387 -1173543 -728671 -636685 -755019 -142814
12434a42814J290284N75097q42980j136751j16394P58718Q26456P29121O11666
$$ -142814 1147470 1722567 879587 -257164 -373558 385160 1211616 1940737 2552403
12425B552403r9336r61128o84454N06290P50116n22193j548389j047208j16026
$$ 2552403 2453067 1491939 807485 1313775 2063891 1541698 -6691 -1053899 -1169925
12416a169925j02977l91630J54874J014923R80030K51542o8779J57285K02571
$$ -1169925 -1272902 -1664532 -1509658 -494735 485295 736837 668058 825343 1027914
12407A027914j31359m68375p12490r09155p85866l06731k3947q9628K11860J094676
$$ 1027914 896555 428180 -284310 -1193465 -1979331 -2286062 -2310009 -2399637 -2187777 -1093101
12397a093101J486795O71074l54127l70281K32085M29344L27621M76569M30441
$$ -1093101 393694 1064768 710641 340360 572445 1001789 1329410 1805979 2236420
12388B236420l31766r25603l13043O89578N66534l16260l19846O44194J016444
$$ 2236420 1904654 979051 666008 1355586 1922120 1605860 1286014 1930208 2946652
12379B946652K49605m86442m42836k42447l64036l99254k23320l41273o67835
$$ 2946652 3196257 2709815 2266979 2024532 1660496 1261242 1037922 696649 28814
12370B8814m30725L32462O08367J08556k69809o2966Q1346k39838n26951n08481
$$ 28814 -401911 -69449 538918 647474 377665 314699 396045 156207 -370744 -879225
12360h79225n64445o02104M1952J069999J121684r0215j021217n43264M39984
$$ -879225 -1443670 -2045774 -2003822 -933823 187861 97646 -923571 -1466835 -1026851
12351a026851O45441L80314O18681J148268J007782J19063p49694j205219j349341
$$ -1026851 -381410 -1096 617585 1765853 2773635 2892698 2143004 937785 -411556
12342d11556j061581j96381P22183R38741N28393K37641K84974P9630o75806j247856
$$ -411556 -1473137 -1669518 -947335 -8594 519799 757440 1042414 1122044 446238 -801618
12332h01618p45573N10767J133134M33576n09073k71712P74010R41534q3083o04072
$$ -801618 -1547191 -1036424 96710 530286 21213 -250499 523511 1465045 1381962 777890
12322G77890L31521J227554N71519n65851l79636M08830k98139k153860k551660
$$ 777890 1109411 2336965 2908484 2342633 1962997 2371827 2073688 -80172 -2631832
12313b631832p62321R04345P79190R8948M45020J192724J037752K74140p3463
$$ -2631832 -3394153 -2489808 -1710618 -1611670 -1166650 26074 1063826 1337966 1264503
12304A264503n3347k45712m97347m68689m64454o37755l95322M03512P76893J70532
$$ 1264503 1211156 965444 468097 -592 -465046 -1102801 -1498123 -1094611 -317718 -147186
12294a47186m92468l57063K1700J0417K02657J023986J376621L28548r74544q74559
$$ -147186 -639654 -996717 -975017 -964600 -761943 262043 1638664 1967212 992668 118109
12284A18109K19936O38842J05154k79952j70082j98431l54218M7433Q21998R70937
$$ 118109 338045 976887 1082041 802089 632007 433576 79358 126791 948789 1919726
12274A919726L52122j15516K2636K91135L35152K36021j33646q48705j170779
$$ 1919726 2271848 2156332 2178968 2470103 2805255 3041276 2907630 2058925 888146
12265H88146l82557P08616N60662p14511j254930j22637J293321J196859l15197
$$ 888146 505589 1214205 1774867 1060356 -194574 -317211 976110 2172969 1857772
12256A857772j583780j389681r2374Q84901N09889o61386r52762L17923J687105
$$ 1857772 273992 -1115689 -1208063 -323162 186727 -474659 -1427421 -1109498 577607
12247E77607J365791k53861j138252m68081M52032L33081m02903o27325j49583
$$ 577607 1943398 1689537 551285 83204 535236 868317 465414 -161911 -311494
12238c11494L69759M88028L27052K08411L13999M79671K87044l04601o14036j14893
$$ -311494 58265 546293 873345 1081756 1395755 1875426 2162470 1857869 1243833 1128940
12228A128940N82667M71699k66165m57871J99221O19541O3842o83362n63974J44274
$$ 1128940 1711607 2183306 1917141 1459270 1658491 2278032 2341874 1658512 1094538 1238812
12218A238812L36882k54826p67320m75052L10824P69996O06634K57329J48766
$$ 1238812 1575694 1320868 553548 78496 389320 1159316 1765950 2023279 2172045
12209B172045J09568j83382m46508j46517L93613J82721p78932j099744o4722
$$ 2172045 2281613 2098231 1651723 1505206 1898819 2081540 1302608 202864 138142
12200A38142R40780L45972j084665j292056m5875Q37726M12912j81793R0555N47802
$$ 138142 1078922 1424894 340229 -951827 -997702 -159976 252936 71143 161698 709500
12190G09500K39577m44312o69102n09469l82136j46393K13323K6191q16315j066907
$$ 709500 949077 504765 -164337 -673806 -1055942 -1202335 -989012 -962821 -1779136 -2846043
12180b846043P1798J286677R57215j17774J56697J592305J625688o39259k539894
$$ -2846043 -2774245 -1487568 -530353 -648127 -491430 1100875 2726563 2087304 -452590
12171d52590j427281J466231K636150J003166j006290j083881J06661M85717l41799
$$ -452590 -1879871 -413640 2222510 3225676 2219386 1135505 1242166 1727883 1386084
12162A386084q70087j41467R08929R09666k0962n82090k11656J99905k32233r84162
$$ 1386084 515997 374530 1283459 2193125 2172163 1590073 1378417 1578322 1346089 361927
12152C61927r11796m2407M28219r202l90606J34774Q74156O59099l14205q45154
$$ 361927 -549869 -592276 -164057 -173259 -563865 -429091 445065 1104164 789959 -55195
12142e5195n71361k19640j31021J47324O53461P39625L79458L94830Q32267N64786
$$ -55195 -626556 -846196 -977217 -829893 -176432 563193 942651 1337481 2169748 2734534
12132B734534o49083j241027k45129P96281P3841j483185j544650n674J037207
$$ 2734534 2085451 844424 599295 1395576 1469417 -13768 -1558418 -1564092 -526885
12123e26885O78287J79284L55047L56995k50841l92010M53233R38074m3052j401636
$$ -526885 151402 330686 685733 1042728 791887 399877 853110 1791184 1748132 346496
12113C46496j433250k43502P47600Q53451M42671o1213l91912k73123M2000k43178
$$ 346496 -1086754 -1330256 -582656 270795 713466 652253 260341 -12782 29218 -213960
12103b13960j118346j286522k2244J393864J293535n0466r48034n75708M52237
$$ -213960 -1332306 -2618828 -2641072 -1247208 46327 -4139 -952173 -1527881 -1075644
12094a075644J303368J541154R18683l00691j097176p66318M5353K40043k05421
$$ -1075644 227724 1768878 2687561 2386870 1289694 523376 568729 808772 603351
12085F03351m97027l34380k5162K46739L47694p0039q00194p18992O44900J834218
$$ 603351 106324 -228056 -253218 -6479 341215 271176 -529018 -1248010 -603110 1231108
12075A231108J169459p33786j695251r90858m6936m8437m14151j31721O05981
$$ 1231108 2400567 1666781 -28470 -1019328 -1066264 -1114701 -1528852 -1660573 -1054592
12066a054592Q15495J31616p45043q19391Q7623R67726P16789l13101o08660L47350
$$ -1054592 -239097 -107481 -852524 -1671915 -1584292 -616566 100223 -212878 -821538 -474188
12056d74188J250720R19818j10547q14562j190943j370689o26178J099169K002011
$$ -474188 776532 1696350 1585803 771241 -419702 -1790391 -2416569 -1317400 684611
12047F84611P92936q60065n95499Q56036Q52780p57202j460093l37738O01935
$$ 684611 1477547 617482 21983 878019 1730799 973597 -486496 -824234 -222299
12038b22299K2313o97407j58975Q02671R43162O00036M75224K63379j84541q6609
$$ -222299 -199986 -897393 -1056368 -253697 689465 1289501 1764725 2028104 1843563 1756954
12028A756954N78880M15922r14886j433936J53759J915284J325691q87287j918891
$$ 1756954 2335834 2751756 1836870 402934 556693 2471977 3797668 2910381 991490
12019I91490j009616Q9141L20271M47681Q43035N47821o83726j346698l84876
$$ 991490 -18126 71015 391286 838967 1682002 2229823 1546097 199399 -185477
12010a85477R04863N37789j294409k353777j227523R99371K214433J666926L64563
$$ -185477 719386 1257175 -37234 -2391011 -3618534 -2619163 -404730 1262196 1626759
12001A626759m53746m92138j26201K25054J68594n01423j226473r29308N21591
$$ 1626759 1173013 680875 554674 779728 948322 446899 -779574 -1708882 -1187291
11992a187291J724599J420567J57924o49510o97154o36610n28979L4568N75427
$$ -1187291 537308 1957875 2115799 1466289 769135 132525 -396454 -361886 213541
11983B13541J69899p45954o94167M85359J224645N88898n02839r31774p64077
$$ 213541 383440 -362514 -1056681 -571322 653323 1242221 739382 -192392 -956469
11974i56469m07023J46550N80473K13538o03909n17239O53682J303488N03182
$$ -956469 -1363492 -1216942 -636469 -422931 -1026840 -1544079 -890397 413091 916273
11965I16273n23442m88115p433j20624l40463J62986O83539J25081q83192q72128
$$ 916273 392831 -95284 -102717 -223341 -563804 -400818 282721 407802 -475390 -1347518
11955a347518R1460O94260N96493N99140Q11675L88464p69689j516609j024820
$$ -1347518 -1256058 -561798 34695 633835 1445510 1833974 1064285 -452324 -1477144
11946a477144J82828J038672R98064J93133p95967j238467q18600R0697R21142
$$ -1477144 -1294316 -255644 742420 935553 139586 -1098881 -1917481 -1826784 -905642
11937i05642J319164R44531l02005j465261j079005O78332J556696J69795j734255
$$ -905642 413522 1358053 1056048 -409213 -1488218 -809886 746810 916605 -817650
11928h17650j553113M28614J539613O56982m61129j32718Q46897P29710n49060
$$ -817650 -2370763 -1942149 -402536 254446 -206683 -339401 507496 1237206 688146
11919F88146j493849j227412m17407k5088L2012M88667J361611J728025J110809
$$ 688146 -805703 -2033115 -2450522 -2475610 -2443598 -1954931 -593320 1134705 2245514
11910B245514L22960J84109O1253j048039k370846k032512k1636J400636Q94530
$$ 2245514 2568474 2752583 2813836 1765797 -605049 -2637561 -2659197 -1258561 -364031
11901c64031j96793k55608K79235L54940L32016P93174Q23429m24733j602420
$$ -364031 -560824 -816432 -537197 -182257 149759 942933 1766362 1341629 -260791
11892b60791q86027R53536J544972N16326k65966Q8364M11806j14038o48241m24785
$$ -260791 -1146818 -193282 1351690 1868016 1602050 1690414 2102220 1988182 1339941 915156
11882I15156j2573p3521k52555m2418K96817K73509j34768o01026o66861K7966
$$ 915156 902583 829062 576507 534089 830906 1104415 969647 368621 -298240 -270274
11872b70274J027298J048904k95975j415437p52267P33812Q36935n70606j473430
$$ -270274 757024 1805928 1509953 94516 -657751 76061 912996 342390 -1131040
11863a131040q41278K51990P80475R68507R56656K63602q16490j089902l91252
$$ -1131040 -1972318 -1720328 -939853 28654 985310 1248912 432422 -657480 -1048732
11854a048732L3293l44154n28210N1168N43537L76950K29066M81542M05055k27980
$$ -1048732 -1015439 -1359593 -1887803 -1836635 -1293098 -916148 -687082 -205540 199515 -28465
11844b8465m11328K58924P02379L11934M7001M54447M40234o08900j301180n04004
$$ -28465 -439793 -180869 521510 833444 880445 1334892 1775126 1166226 -134954 -638958
11834f38958N40106K59296n67721k95339O46569O14402k73168m03864M69893R07780
$$ -638958 -98852 160444 -407277 -702616 -56047 558355 285187 -118677 351216 1258996
11824A258996L10464k54497k6980L61224K12406j99431l91640m11559l85015j45391
$$ 1258996 1569460 1314963 1287983 1649207 1861613 1662182 1270542 858983 473968 328577
11814C28577L02343N02863M8414q52410j378447p84068N65448J147252J67258
$$ 328577 630920 1133783 1182197 329787 -1048660 -1832728 -1267280 -120028 47230
11805D7230q35536J39437K127852J960129q56586k720653j091096J535732J406238
$$ 47230 -788306 -648869 1478983 3439112 2582526 -138127 -1229223 306509 1712747
11796A712747q50953j656757j74117J076967P44285J59628K06447N5729l95022
$$ 1712747 861794 -794963 -969080 107887 852172 1011800 1218247 1273976 878954
11787H78954P4091J309453J360944k02638j247558n46593K83898k63206j132206
$$ 878954 953045 2262498 3623442 3420804 2173246 1626653 1910551 1647345 515139
11778E15139q83627j72616k19500o11175m11728R7658L82893P89930J243446N98839
$$ 515139 -368488 -541104 -760604 -1371779 -1783507 -1685849 -1302956 -513026 730420 1329259
11768A329259j086063j585903K22968K062324J518179k47024p16685k21003p07178
$$ 1329259 243196 -1342707 -1119739 942585 2460764 2213740 1497055 1276052 568874
11759E68874j625645p51126J422517J911526J02896j183716k71261J027936Q47678
$$ 568874 -1056771 -1807897 -385380 1526146 1629042 445326 174065 1202001 2049679
11750B049679M5685p5956j95963j128660j682928n80106J031391J172321O6525
$$ 2049679 2095364 2019408 1823445 694785 -988143 -1568249 -536858 635463 701988
11741G01988m94379p0143J64640k77725n20808n5306L71040J6950o95077p71232
$$ 701988 207609 137466 302106 24381 -496427 -551733 -180693 -163743 -858820 -1630052
11731a630052P0658J006193R24455k78965j320440r04249N73915J454512R90551
$$ -1630052 -1559394 -553201 371254 92289 -1228151 -2132400 -1558485 -103973 886578
11722H86578P7583m08755o99759r54731m17544J096492K034837R55381j147294
$$ 886578 964161 555406 -144353 -1099084 -1516628 -420136 1614701 2570082 1422788
11713A422788j923327p52115P20431J029670M46180j15672m31312o40740n19885
$$ 1422788 -500539 -1252654 -532223 497447 943627 827955 396643 -244097 -763982
11704g63982J61492R42144R51194o2562j222939j276568k7233J161726Q02198
$$ -763982 -602490 339654 1290848 1228286 5347 -1271221 -1298454 -136728 665470
11695F65470p83956j669226p02233J063691J772545R09125n11996j279903r02295
$$ 665470 -118486 -1787712 -2489945 -1426254 346291 1255416 743420 -536483 -1438778
11686a438778K74414J267790J231517M43074k9402J13457P9230m45943o44212
$$ -1438778 -1164364 103426 1334943 1778017 1748615 1862072 1941302 1495359 851147
11677H51147j43946J17546m05914o97362L2103P83619N55355K54534Q63872J077661
$$ 851147 707201 824747 418833 -278529 -246426 537193 1092548 1347082 2210954 3288615
11667C288615o85184k892391k525267K26800J993823J204942j4188K77158R83131
$$ 3288615 2603431 -288960 -2814227 -2587427 -593604 611338 597150 874308 1857439
11658A857439M22163q24242j281388r42285n35934L5476Q67015J001363r4244
$$ 1857439 2279602 1455360 173972 -768313 -1304247 -1268771 -401756 599607 505363
11649E05363j095514n41200Q71679J314739M78815l45753l80647j06144r5602
$$ 505363 -590151 -1131351 -259672 1055067 1533882 1188129 807482 701338 605736
11640F05736k98613m64728m65199k45188Q1860L38998O69172J225963J428584
$$ 605736 307123 -157605 -622804 -867992 -786132 -447134 222038 1448001 2876585
11631B876585N61506p13373q59405P9314K25878j081551j857753n06183J424079
$$ 2876585 3438091 2724718 1865313 1944627 2170505 1088954 -768799 -1274982 149097
11622A49097J433614k53685j331903q80433n2392K28647K22309J74702n8742k18393
$$ 149097 1582711 1329026 -2877 -883310 -935702 -707055 -484746 -310044 -368786 -587179
11612e87179N9413K94601j21398n89734j47539P29404P78396R1015j15836L35273
$$ -587179 -527766 -233165 -354563 -944297 -1091836 -362432 415964 506979 391143 726416
11602G26416M34848p0231l95018m07413p65566j236264p67498M63474R56304K83367
$$ 726416 1161264 1091033 696015 288602 -476964 -1713228 -2480726 -2017252 -1060948 -777581
11592g77581k59897O4180L67571M8854r1364M16964O14116j24085p70246l09256
$$ -777581 -1037478 -973298 -605727 -556873 -648237 -231273 382843 258758 -511488 -820744
11582h20744O47361J107324J238405J406978R87601l95478j551384j238907j51201
$$ -820744 -173383 933941 2172346 3579324 4566925 4171447 2620063 1381156 1229955
11573A229955J69690l03107l67412L02493R00171R83029P51965J13410j062961
$$ 1229955 1399645 1096538 729126 1031619 1931790 2914819 3666784 3780194 2717233
11564B717233j906103j276815L65080J209893M72310p03424j037857o62010l63137
$$ 2717233 811130 -465685 -100605 1109288 1581598 878174 -159683 -821693 -1184830
11555a184830k62866M4394O00566R57892P48308R9445m14672k95614K04900K29293
$$ -1184830 -1447696 -1403302 -802736 155156 903464 1002909 588237 292623 497523 726816
11545G26816m75524r57131l56543O79485R04070M18482L65254P66247L18804j207920
$$ 726816 251292 -705839 -1062382 -382897 521173 939655 1304909 2071156 2389960 1182040
11535A182040k056747r93406O63470R48605J36994k0812O75572O63141n30429
$$ 1182040 -874707 -1868113 -1204643 -256038 -119044 -139856 535716 1198857 668428
11526F68428j284697m94699N77665L55196m73597j46102J134371J334880j97411
$$ 668428 -616269 -1110968 -533303 -178107 -651704 -797806 336565 1671445 1474034
11517A474034j548700r80434O48106J356993Q67775M56398N41764J52559j015645
$$ 1474034 -74666 -1055100 -406994 949999 1817774 2274172 2815936 2968495 1952850
11508A952850j613810n92907R40649J069783k24903j058415m16352M02316j52218
$$ 1952850 339040 -253867 686782 1756565 1531662 473247 56895 459211 306993
11499C06993j385147j242397O03144K041883J387771k98659p89638K33109J067254
$$ 306993 -1078154 -2320551 -1717407 324476 1712247 1413588 623950 857059 1924313
11490A924313O14049m39741j208125j773294k116854j392743N53018K094902J743481
$$ 1924313 2538362 2098621 890496 -882798 -2999652 -4392395 -3839377 -1744475 -994
11481i94L73030o2256N17207M87992n48875j086294l47642L96687N3220n10486
$$ -994 372036 309780 826987 1314979 766104 -320190 -667832 -271145 -217925 -728411
11471g28411j77908L96693N5268p15815o86978j36395k59341p82244k74192J155180
$$ -728411 -906319 -509626 -454358 -1170173 -1857151 -1993546 -2252887 -3035131 -3309323 -2154143
11461b154143J633515N23927m13504J19553P79606j96024j965568k195525m90940
$$ -2154143 -520628 3299 -410205 -290652 488954 292930 -1672638 -3868163 -4359103
11452d359103J186367J358230N94637R1338J80849O39458J190270J212363J23170
$$ -4359103 -3172736 -1814506 -1219869 -1128531 -947682 -308224 882046 2094409 2217579
11443B217579j352531j438363L31592J996863J502064n51727j703712q27738P09602
$$ 2217579 865048 -573315 -241723 1755140 3257204 2705477 1001765 174027 883629
11434H83629J115001K97971m54021k24457N97423Q79411J3548j306929j688597
$$ 883629 1998630 2296601 1842580 1618123 2215546 3094957 3108505 1801576 112979
11425A12979o17929Q08726J115807J80105p55831o42371L40093J231450J265541
$$ 112979 -504950 303776 1419583 1599688 843857 201486 541579 1773029 3038570
11416C038570M01668o80079j120822p39034k00433m8384L1057M63821Q16939M23251
$$ 3038570 3440238 2760159 1639337 900303 699870 651486 682543 1146364 1963303 2386554
11406B386554l73612o26811k78941j44567m21169m25841q676M0197n31476p54512
$$ 2386554 2012942 1386131 1107190 962623 541454 115613 106937 147134 -384342 -1138854
11396a138854K3066R14365P37119k32467p08875j76517O32415Q29436K86985m32095
$$ -1138854 -1115788 -201423 535696 303229 -405646 -582163 50252 879688 1166673 734578
11386G34578o54364k24351K82730K43660j41607k09609n633k13938p95974q04684
$$ 734578 80214 -144137 138593 382253 240646 31037 25404 -188534 -984508 -1789192
11376a789192K4973O52040L65207q2088J41534M99308J59426m13621k74534K94316
$$ -1789192 -1764219 -1112179 -746972 -829060 -687526 -188218 -28792 -442413 -716947 -422631
11366d22631L15993j22941j11790L79109N14010K01745J97158N08304K05771q22588
$$ -422631 -106638 -229579 -341369 37740 551750 753495 950653 1458957 1664728 842140
11356H42140j341496o22039L68922M31077j70987l74820J5076K96526J11228j83814
$$ 842140 -499356 -1121395 -752473 -321396 -492383 -867203 -852127 -555601 -444373 -628187
11346f28187k54404j62268P027L01284O01210O25950L54985O2666j69228n37641
$$ -628187 -882591 -1044859 -1037832 -736548 -135338 490612 845597 908263 739035 201394
11336B01394r12471o63661L97990J303762R49688k63771p54649O8543R66964P44363
$$ 201394 -711077 -1374738 -976748 327014 1276702 1012931 258282 326825 1293789 2038152
11326B038152n2728k30221J21967M7475m93173o55456k50519J17514K90620N64435
$$ 2038152 1985424 1755203 1877170 1924645 1431472 776016 525497 643011 933631 1498066
11316A498066O16534p5960q63104o36518J33577j5723q55666o34039O84057R22416
$$ 1498066 2114600 2038640 1175536 539018 672595 656872 -198794 -832833 -148776 773640
11306G73640o27479j694734o87113P12186N98607P3502Q77001J890173J056737
$$ 773640 146161 -1548573 -2235686 -1523500 -924893 -851391 25610 1915783 2972520
11297B972520p26702r51861K18722L96701p46560j061716R8205Q01061J06061
$$ 2972520 2245818 1293957 1512679 1909380 1162820 101104 199309 1000370 1106431
11288A106431l43140N61353J329539M53768j023328j180569j4986R15534O78200
$$ 1106431 763291 1324644 2654183 3107951 2084623 904054 889068 1804602 2482802
11279B482802l19700j074542p69053M50983J200592L52229j111056j135362L41445
$$ 2482802 2163102 1088560 319507 770490 1971082 2323311 1212255 76893 418338
11270D18338J118635M4789j292075j170389k54401q3986m61796q3701J037378
$$ 418338 1536973 1581762 289687 -880702 -1135103 -1219089 -1680885 -1764586 -727208
11261g27208J482565N59680p49701j078653j92732Q41204P41135n27542j391071
$$ -727208 755357 1315037 565336 -513317 -706049 135155 876290 348748 -1042323
11252a042323m03535J651662K412263R69465r23412j282284l67981K15628p9965
$$ -1042323 -1445858 205804 2618067 3587532 2664120 1381836 1013855 1229483 1149518
11243A149518m83347m45452j60787K48497R02454J429579J063931j62281j059074
$$ 1149518 666171 220719 59932 308429 1210883 2640462 3704393 3542112 2483038
11234B483038o72133L73928N96220l50741j150495o74105L38336L45917o09311
$$ 2483038 1810905 2184833 2781053 2430312 1279817 605712 944048 1289965 680654
11225F80654q83134K39882J397905J204515J62234m79818o17151p46322n44160
$$ 680654 -202480 37402 1435307 2639822 2802056 2322238 1705087 958765 414605
11216D14605M11902J210892O42687o98130j048157p1753Q07282O68365J12109
$$ 414605 826507 2037399 2680086 1981956 933799 862046 1669328 2337693 2449802
11207B449802j41339k14135l39258l86620l74020m57676l89224O3629L87321R2320
$$ 2449802 2308463 2094328 1755070 1368450 994430 536754 147530 211159 598480 690800
11197F90800k08534K12491O69784J30494p03033l15414R27400J162013O7337p20597
$$ 690800 482266 694757 1364541 1495035 792002 476588 1403988 2566001 2633338 1912741
11187A912741m31901j17725l51801k70350L93063N07516l09559p59168p3461O92039
$$ 1912741 1480840 1363115 1011314 740964 1134027 1641543 1331984 572816 499355 1191394
11177A191394N85805K07925K16674J19420l92226n66639r9912J13085k65027k22063
$$ 1191394 1777199 1985124 2201798 2321218 1928992 1362353 1262441 1375526 1110499 888436
11167H88436N93180Q92715l692p92138m62069j22676r00234j707645j021912M96486
$$ 888436 1481616 2374331 2370639 1578501 1116432 993756 93522 -1614123 -2636035 -2139549
11157b139549J131717P68099N12020N57108K85943j68623j83721L1263j42372
$$ -2139549 -1007832 -239733 272287 829395 1115338 946715 762994 794257 651885
11148F51885m73961l67074o6386j44385l47082j25619K69392L26278K46192L15131
$$ 651885 177924 -189150 -255536 -399921 -747003 -872622 -603230 -276952 -30760 284371
11138B84371P8305p06733j099517k48239J056428J404857P67850K15612J63189
$$ 284371 362676 -344057 -1443574 -1691813 -635385 769472 1537322 1752934 1916123
11129A916123J46213m9375j76523j56446l3613K92255N73063J29460r37383j302783
$$ 1916123 2062336 2012961 1836438 1679992 1646379 1938634 2511697 2641157 1703774 400991
11119D00991k16506J078191R46407k69745q04983q620R34235P42334m51635j384110
$$ 400991 184485 1262676 2209083 1939338 1134355 1125735 2059970 2802304 2350669 966559
11109I66559r53211O37580J831558J281787m43121j492605j142334m42212k69942
$$ 966559 13348 650928 2482486 3764273 3321152 1828547 686213 244001 -25941
11100b5941k08771R8055O0701m84665m93226N67229J501186J102872l1446n90141
$$ -25941 -234712 -136657 -75956 -560621 -1053847 -486618 1014568 2117440 2085994 1495853
11090A495853l99590m3853L34601O75769M09006o03027j374862j100503l11856
$$ 1495853 1096263 1052410 1387011 2062780 2471786 1868759 493897 -606606 -918462
11081i18462J47097L35834N66033O19328M57216N57560P75987K25706r26235j159531
$$ -918462 -771365 -435531 130502 749830 1207046 1764606 2540593 2766299 1840064 680533
11071F80533n1814P60849K50516k99410K65926Q01023o005j119751r09905Q4685
$$ 680533 628719 1389568 1640084 1340674 1606600 2407623 2401618 1281867 371962 456647
11061D56647L41326J1882J93279O69400N51163J59337J86259J4957j023933j797062
$$ 456647 797973 809855 1003134 1672534 2223697 2383034 2569293 2584250 1560317 -236745
11051b36745j001005L71721N27231j42748m1772N66764K17200o50078j74857J444349
$$ -236745 -1237750 -866029 -338798 -481546 -523318 43446 260646 -389432 -564289 880060
11041H80060J826542J61846j432518j061787M49767J087446K22218j114000j609899
$$ 880060 2706602 2868448 1435930 374143 823910 1911356 2133574 1019574 -590325
11032e90325q91266J31668K31382m63548m86285P22607J758131J367425K86644
$$ -590325 -1481591 -1349923 -1118541 -1582089 -2068374 -1345767 412364 1779789 2066433
11023B066433k41169l42384m89483j86022O28076N40699r40978j699350j16604
$$ 2066433 1825264 1482880 993397 807375 1435451 1976150 1035172 -664178 -780782
11014g80782J822622J388796m59850q10177K27281K5706j634585k093869m73690
$$ -780782 1041840 2430636 1970786 1160609 1387890 1413596 -220989 -2314858 -2788548
11005b788548R17123O29588J86608R47190J733789J093824l02645r98103q08807
$$ -2788548 -1871425 -1241837 -1055229 -108039 1625750 2719574 2416929 1418826 610019
10996F10019l64639M8792K77521P8359k75933j81907K46968L52665J05514n7569
$$ 610019 245380 294172 571693 650052 374119 192212 439180 791845 897359 839790
10986H39790k87475q43683r76630O6947J305332J132950r8481n55277J77828O91369
$$ 839790 552315 -291368 -1267998 -1201051 104281 1237231 1138750 583473 761301 1452670
10976A452670K52553k88639k76956r4246O503K57863M19841j0570o23789n87298
$$ 1452670 1705223 1416584 1139628 1045382 1051885 1309748 1729589 1719019 1095230 507932
10966E07932j32037q1203k72170k6837L33624J76578J00628Q43084J385069M00789
$$ 507932 375895 294692 22522 -4315 329309 505887 606515 1449599 2834668 3235457
10956C235457j069621r25315M96303R27040q7064p60413l74521j58728o02870
$$ 3235457 2165836 1240521 1736824 2663864 2576800 1816387 1441866 1283138 680268
10947F80268o59945j09575r6620p23479o10466M63372Q92310K2128o47398L8887
$$ 680268 20323 -89252 -185872 -909351 -1519817 -1056445 -164135 -142007 -789405 -750518
10937g50518J146551J307029M83401o01578j360686j279334l41441L99277Q0177
$$ -750518 396033 1703062 2186463 1584885 224199 -1055135 -1396576 -997299 -917122
10928i17122m26318J26480J028117P32471k54072j03082J047514J248162J45620
$$ -917122 -1343440 -1216960 -188843 543628 289556 186474 1233988 2482150 2627770
10919B627770n17972m5962K33758m40380j134416j146892q87806n43572R7855
$$ 2627770 2109798 2063836 2297594 1857214 722798 -424094 -1311900 -1855472 -1757617
10910a757617M93847Q0316j80763P50854J640070P41268q43620p20430N72790
$$ -1757617 -1263770 -1183454 -1364217 -613363 1026707 1767975 924355 203925 776715
10901G76715M89383q72080j033625J25846K20431q56886n71243J183229J400805
$$ 776715 1266098 394018 -639607 -513761 -293330 -1150216 -1721459 -538230 862575
10892H62575m78778j147967P07374J903224M46907q71011M22702J956344P02061
$$ 862575 383797 -764170 -56796 1846428 2293335 1422324 1845026 3801370 4503431
10883D503431j700178j715973M41058J671418Q08661o66118j490667j509814p09828
$$ 4503431 2803253 1087280 1528338 3199756 4008417 3342299 1851632 341818 -368010
10874c68010N14739J101377Q05122O33664P54430o8143j779563k184444l68454
$$ -368010 146729 1248106 2053228 2686892 3441322 3373179 1593616 -590828 -959282
10865i59282J435433J220877J35528J06589P94193R71653Q23282P56584p3787
$$ -959282 476151 1697028 1832556 1939145 2733338 3704991 4528273 5284857 5211070
10856E211070j920489k988583j930027q5858O83435O41251P89907P35308m0887
$$ 5211070 3290581 301998 -1628029 -1713887 -1030452 -389201 400706 1136014 1095127
10847A095127n40250P2200P41899L72612k16690q385K32760m08459j027730n05092
$$ 1095127 554877 627077 1368976 1741588 1524898 1516513 1749273 1340814 313084 -192008
10837a92008M26420N71765K93091L91282M16315j99668p17988m13044L3285j10303
$$ -192008 234412 806177 1099268 1490550 1906865 1707197 989209 576165 609450 499147
10827D99147k80691Q6450M48352M90589Q45754J384415P88917r33885j676590
$$ 499147 218456 304906 753258 1243847 2089601 3474016 4262933 3329048 1652458
10818A652458m18699R58320O32111m73390o46023n2680K73013L17845L76026J14568
$$ 1652458 1233759 2192079 2824190 2350800 1704777 1652097 1925110 2242955 2618981 2733549
10808B733549l53761j96121L73902R2429q25853o58586N30708N61461q54558j160050
$$ 2733549 2379788 2183667 2557569 2649998 1824145 1165559 1696267 2257728 1403170 243120
10798B43120N19872J506780J97111j078988k72880Q31322J39324r54701m36639
$$ 243120 762992 2269772 2466883 1387895 1115015 1946337 2085661 1130960 694321
10789F94321O18991M50807j6885N34517Q26162l37773j038384M74750J985720
$$ 694321 1313312 1764119 1747234 2281751 3107913 2770140 1731756 2206506 4192226
10780D192226P58252j472162j254919O35682O24619j409967k004752m0034J538349
$$ 4192226 4950478 3478316 2223397 2859079 3483698 2073731 68979 28945 1567294
10771A567294N81060j223122j332553J37060J148452N60755o88781p51984Q66479
$$ 1567294 2148354 925232 -407321 -270261 878191 1438946 750165 -1819 864660
10762H64660K282108J404299r21503j736379k38770J087279L95040j028009j403406
$$ 864660 3146768 4551067 3629564 1893185 1654415 2741694 3136734 2108725 705319
10753G05319j042325p67040j81749Q57280J302593R01514Q25572J137882L20659
$$ 705319 -337006 -1104046 -1285795 -428515 874078 1775592 2601164 3739046 4059705
10744D059705j488607j902401l40140O72327j22526o43051L43593Q12695m29593
$$ 4059705 2571098 668697 328557 1000884 878358 235307 578900 1391595 962002
10735I62002j139611J95820J376609N67998l99880J25537L22002j175722j884490
$$ 962002 -177609 18211 1394820 1962818 1562938 1688475 2010477 834755 -1049735
10726a049735J77814K335181J511488o10192q09002L23776M03355k06614J5049
$$ -1049735 -871921 1463260 2974748 2364556 1555554 1879330 2282685 2076071 2091120
10717B091120K49900o15123j049791K30263J184942J3820j144034L2233J626811
$$ 2091120 2341020 1725897 676106 906369 2091311 2105131 961097 993330 2620141
10708B620141R13818p99131r30709k39236m60959m16778J157747K007017J09457
$$ 2620141 3533959 2734828 1804119 1564883 1103924 687146 1844893 3851910 3961367
10699C961367k028177j396764L28401K45146m76490L71992J182316o1275j001523
$$ 3961367 1933190 536426 864827 1109973 633483 1005475 2187791 2126516 1124993
10690A124993Q91468K794111J153749j521877q77587J431484R08682j515150j540459
$$ 1124993 2016461 4810572 5964321 4442444 3564857 4996341 5905023 4389873 2849414
10681B849414L90612L48552j360397r82333J267498J575885l55787j132439p0600
$$ 2849414 3240026 3588578 2228181 1245848 2513346 4089231 3733444 2601005 2530405
10672B530405L49666j82560J28418O17525o25527k040869q32594J370828R53013
$$ 2530405 2880071 2697511 2825929 3443454 2817927 777058 -55536 1315292 2268305
10663B268305j057059q85386R88262J112965j29140L73660J895489J192930q23441
$$ 2268305 1211246 325860 1314122 2427087 2297947 2671607 4567096 5760026 4936585
10654D936585o20061R66838L89631j156034M41110L713776K965580j878566m625982
$$ 4936585 4316524 5283362 5672993 4516959 4958069 8671845 11637425 9758859 5132877
10645E132877k645430M2901L82063j4083J63801k57070j032880k86751J143969
$$ 5132877 2487447 2530348 2912411 2898328 3062129 2805059 1772179 1485428 2629397
10636B629397O41672r36499n61089R86955M85953j205171n40061J629533J313481
$$ 2629397 3271069 2334570 1773481 2760436 3246389 2041218 1501157 3130690 4444171
10627D444171r69227j055573Q86486P69050j344963j324521Q86158J055392j092577
$$ 4444171 3474944 2419371 3305857 4074907 2729944 1405423 2291581 3346973 2254396
10618B254396j266026J137959J877707j59837j272883j68016L00550n55042k05527
$$ 2254396 988370 2126329 4004036 3844199 2571316 2403300 2703850 2148808 1943281
10609A943281J158071N27797j598296j590078M36972R06520k73944l0495J185351
$$ 1943281 3101352 3629149 2030853 440775 877747 1784267 1510323 1479828 2665179
10600B665179L20001j479409o08581J502234O49252j704431q05584K011854J496152
$$ 2665179 2985180 1505771 897190 2399424 3048676 1344245 538661 2550515 4046667
10591D046667j384808j205467J359900J035872j256394n2277L241253K203142
$$ 4046667 2661859 1456392 2816292 3852164 2595770 2543493 5784746 7987888
10583G987888j991918k029895J712802J603727k640297l128645J281354K814059
$$ 7987888 5995970 3966075 5678877 7282604 4642307 1513662 2795016 5609075
10575E609075n85571k018274N66433R72863j968802j505293L200822M079461r59857
$$ 5609075 5023504 3005230 3571663 4544526 2575724 1070431 4271253 8350714 7390857
10566G390857l670214l78052K090086k1147j189698J185011J590396j560415j816181
$$ 7390857 3720643 3342591 5432677 5411530 4221832 5406843 6997239 5436824 3620643
10557C620643K274628L148794j546918l915134l15277K322724R3350j245232J332827
$$ 3620643 5895271 9044065 7497147 3582013 3266736 5589460 5682810 4437578 5770405
10548E770405K327983l83863j099625J438168R49531k899859k395726K783997
$$ 5770405 8098388 7714525 6614900 8053068 9002599 6102740 3707014 6491011
10540F491011L497449j466043k507414K099131K531437k895161l494998K841525
$$ 6491011 9988460 8522417 6015003 8114134 10645571 7750410 4255412 7096937
10532G096937M576830j298670l051337K753907M070244k701743m656127K527329
$$ 7096937 11673767 10375097 7323760 10077667 14147911 11446168 6790041 9317370
10524I317370N289191j697399m754633K098795N169765j747295m651013K709281
$$ 9317370 14606561 12909162 8154529 10253324 15423089 13675794 9024781 11734062
10516A1734062N644461k110201m696641M330692P293639l246107p704109L390899
$$ 11734062 17378523 15268322 10571681 14902373 22196012 18949905 11245796 14636695
10508A4636695R564428n43878o391563L986514R239811k443776p219232P024995
$$ 14636695 24201123 23657245 17265682 21252196 30492007 28048231 20828999 27853994
10500B7853994J2346556m862068j1027257J1136746K1696661k472814j4212201
$$ 27853994 40200550 35338482 24311225 35447971 57144632 54671818 40459617
10493D0459617J7779467L6844468J50808j6812251O0579044J36118482N0296976
$$ 40459617 58239084 95083552 95234360 78422109 139001153 275119635 325416611
10486C25416611j53948304k45480294j22102771M8569491P8982197O186037k1563944
$$ 325416611 171468307 -74011987 -196114758 -147545267 -68563070 -62377033 -83940977
10479h3940977J7116186L1572359j021449j5600536Q177624J9155300j184527
$$ -83940977 -66824791 -35252432 -36273881 -51874417 -43696793 -24541493 -25726020
10472b5726020j1216725N382313J3160235k580405j0597269L091947J0849693
$$ -25726020 -36942745 -31560432 -18400197 -20980602 -31577871 -28485924 -17636231
10465a7636231r20762q081791K152803Q594032l60324n610572L277187Q339956
$$ -17636231 -18556993 -26638784 -24485981 -15891949 -16252273 -21862845 -18585658 -10245702
10457a0245702n24277o543928N57125N919908k28930m756382J085453N208649
$$ -10245702 -10769979 -17313907 -16756782 -10836874 -11065804 -15822186 -14736733 -9528084
10449i528084k13665l757373J637747M900668n43180l839048J411055M618203
$$ -9528084 -9741749 -13499122 -11861375 -6960707 -7503887 -11342935 -9931880 -5313677
10441e313677o93616m441575L4683L683042K58022k168226J437249K892907j963915
$$ -5313677 -6007293 -10448868 -10414185 -6731143 -6473121 -8641347 -7204098 -4311191 -6275106
10432f275106m004637J363173M657210K67238l160274J91454K589184j276256
$$ -6275106 -10279743 -8916570 -4259360 -3992122 -7152396 -6960942 -4371758 -5648014
10424e648014l860524l5306K830603k99336k318110J483090L804220j77828l060847
$$ -5648014 -9508538 -9543844 -6713241 -7012577 -9330687 -7847597 -4043377 -4221205 -7282052
10415g282052M30285L284684P7526k579115P01761L513570L67481k657131r4937
$$ -7282052 -6851767 -3567083 -3489557 -6068672 -5366911 -1853341 -1485860 -4142991 -4237928
10406d237928K235212r90978l842063o43985K826126L47574k921067m54442L368926
$$ -4237928 -2002716 -2993694 -6835757 -7479742 -4653616 -4306042 -7227109 -7681551 -4312625
10397d312625J863867j719377j167388J241174M32701j367358Q6868K145332O87517
$$ -4312625 -2448758 -4168135 -5335523 -4094349 -3661648 -5029006 -4942138 -2796806 -2109289
10388b109289j559596n18030J268129j205j800989m95911J489914O79953q53712
$$ -2109289 -3668885 -4186915 -2918786 -2919991 -4720980 -5216891 -3726977 -3047024 -3900736
10379c900736l21193J43367j261279j275923J822675L306927n2412l487976k073443
$$ -3900736 -4221929 -4078562 -5339841 -6615764 -4793089 -1486162 -1538574 -5026550 -7099993
10370g099993J166554J403388J50337P36936J476001r3136j522574k51616J064921
$$ -7099993 -5933439 -4530051 -4379714 -3642778 -2166777 -2259913 -3782487 -4034103 -2969182
10361b969182k05763j362591J85498J591872J46559j320622j7793J373407J84264
$$ -2969182 -3174945 -4537536 -4352038 -2760166 -2613607 -3934229 -3952022 -2578615 -2394351
10352b394351r42386M40334J486418k05037j560147j01565R05564j095894k432464
$$ -2394351 -3336737 -2896403 -1409985 -1615022 -3175169 -3276734 -2371170 -3467064 -5899528
10343e899528K0776K521878J081422j315722m38801J623006J002647q39249p66500
$$ -5899528 -5878752 -3356874 -2275452 -3591174 -4029975 -2406969 -1404322 -2243571 -3010071
10334c010071P554n52881m81827J786786K995666O36638j911744j255313J00664
$$ -3010071 -3002517 -3555398 -4037225 -2250439 745227 1381865 -529879 -1785192 -1684528
10325a684528q54491j735950J1919J469123j74262j804380k98836J228067n07237
$$ -1684528 -2539019 -4274969 -4263050 -2793927 -2968189 -4772569 -5071405 -3843338 -4350575
10316d350575k187268k7749K681329J404842j270722n72770J758304J288533p88771
$$ -4350575 -6537843 -6565592 -3884263 -2479421 -3750143 -4322913 -2564609 -1276076 -2064847
10307b064847o94074M66644l14028j258632N09027K307657M37332k225397q86745
$$ -2064847 -2758921 -2292277 -2606305 -3864937 -3355910 -1048253 -610921 -2836318 -3723063
10298c723063K281787J881802j064549j351450R22683J231261p55552j231271
$$ -3723063 -1441276 440526 -624023 -1975473 -1052790 178471 -577081 -1808352
10290a808352K58454O24737m18125m21632M03979l0974q34420J31540J352364
$$ -1808352 -1549898 -925161 -1343286 -1764918 -1360939 -1391913 -2226333 -2094793 -742429
10281g42429K78176j237735j05150J721416N17732j958448j307002J439594J661219
$$ -742429 -464253 -1701988 -1807138 -85722 432010 -1526438 -2833440 -1393846 267373
10272B67373n41013j046920M68622N47874j007088j026067N62156P51771m15802
$$ 267373 -273640 -1320560 -851938 -304064 -1311152 -2337219 -1775063 -1023292 -1439094
10263a439094r8124J348820Q67600j112798j150978P47740J175877l08431p60928
$$ -1439094 -1537218 -188398 679202 -433596 -1584574 -836834 339043 30612 -730316
10254g30316K83295K96175r26164j021661l3902j65114q54490L35753K290587
$$ -730316 -447021 -150846 -1077010 -2098671 -2132573 -2297687 -3152177 -2816424 -525837
10245e25837J578718j125210j753525Q8836P48416o49827j057024L43923Q19425
$$ -525837 1052881 -72329 -1825854 -1737018 -988602 -1638429 -2695453 -2351530 -1532105
10236a532105k65545k30618J450012J926443L70198n83386Q0495K21770q11518
$$ -1532105 -1797650 -2028268 -578256 1348187 1718385 1134999 1215494 1437264 625746
10227F25746r16014K45208K50232j327569j798874k55184Q53411K83539j51998
$$ 625746 -290268 -45060 205172 -1122397 -2921271 -3176455 -2323044 -2039505 -2191503
10218b191503M71346N68165l76664n78524M73668R47413K12968j43334L26723
$$ -2191503 -1720157 -1151992 -1528656 -2107180 -1633512 -686099 -473131 -616465 -289742
10209b89742J71872p04102o81218J44557q2493j132297p20192J094656J574270
$$ -289742 -117870 -821972 -1503190 -1358633 -1441126 -2573423 -3293615 -2198959 -624689
10200f24689M4751j024098m44573J34192j01099J47786R91511O80071p55961r67172
$$ -624689 -579938 -1604036 -2048609 -1914417 -2015516 -1867730 -876219 -196148 -952109 -1919281
10190a919281N43088J342827K34348j008847j084731r23542j032909m35239P79690
$$ -1919281 -1376193 -33366 200982 -807865 -1892596 -2816138 -3849047 -4284286 -3504596
10181c504596J048334K98677J82143P69136L49435r26803p90052R86260J744937
$$ -3504596 -2456262 -2157585 -1975442 -1206306 -856871 -1783674 -2573726 -1587466 157471
10172A57471L03731j212108j044282k11733r0250l53156l62792k33463J19679
$$ 157471 461202 -750906 -1795188 -2006921 -2097171 -2450327 -2813119 -3046582 -2926903
10163b926903Q24034R39241j83330r94571M7425J291453K82508j656407j251316
$$ -2926903 -2102869 -1163628 -1346958 -2341529 -2294104 -1002651 -720143 -2376550 -3627866
10154c627866J051274J720823J25945q20586o6061L20420k99473j11603R06523
$$ -3627866 -2576592 -855769 -729824 -1550410 -1616471 -1296051 -1595524 -1707127 -800604
10145h00604M49392j451406j848393q2225R73063R1803m22425N39821Q16880o36491
$$ -800604 -351212 -1802618 -3651011 -3733236 -2760173 -2668370 -3090795 -2550974 -1734094 -2370585
10135b370585j568139n59466N93139M71602K65204P03199M99904m60147j51987
$$ -2370585 -3938724 -4498190 -3905051 -3433449 -3168245 -2465046 -1965142 -2425289 -2577276
10126b577276J630256K080936J306j987242j709189m46112J03242M17886R10826
$$ -2577276 -947020 1133916 1135222 -852020 -2561209 -3007321 -2904079 -2486193 -1575367
10117a575367M89412q20634j056106K22038Q90835J44625o9686J004367J251135
$$ -1575367 -1085955 -1906589 -2962695 -2740657 -1849822 -1705197 -1774883 -770516 480619
10108D80619l00044j436283o66591L48371J85436j8497M58182J97183j089334
$$ 480619 180575 -1255708 -1922299 -1573928 -1388492 -1406989 -948807 -751624 -1840958
10099a840958j178998N78195J404316k60028j770597o45048J335161J314042j47788
$$ -1840958 -3019956 -2441761 -1037445 -1297473 -3068070 -3713118 -2377957 -1063915 -1211703
10090a211703p12830j09324L65037L28505R0134m03628p65156o7596J278845J543632
$$ -1211703 -1924533 -2033857 -1668820 -1340315 -1250181 -1653809 -2418965 -2486561 -1207716 335916
10080C35916L91020o71813j010279j333546j273977J76609J623961O02746j666098
$$ 335916 726936 55123 -955156 -2288702 -3562679 -3386070 -1762109 -1159363 -2825461
10071b825461j340292J504405K426117j963j752417l26269J292735M80067n10917
$$ -2825461 -4165753 -2661348 -235231 -237194 -1989611 -2315880 -1023145 -543078 -1053995
10062a053995O08874J635938K28810j419141n44734J129368O08488j134615j323650
$$ -1053995 -445121 1190817 1419627 486 -544248 585120 1193608 58993 -1264657
10053a264657k40198K6761m49785l12466Q8882k60123p06119k73526M01259N70903
$$ -1264657 -1504855 -1478094 -1927879 -2240345 -2151463 -2411586 -3117705 -3391231 -2989972 -2419069
10043b419069P66673J013346K01568j241568j110724O21860J128942l68967j042426
$$ -2419069 -1652396 -639050 -437482 -1679050 -2789774 -2167914 -1038972 -1407939 -2450365
10034b450365L10513R49411n09767j242204L92546J442830j54541j469544K6653
$$ -2450365 -2139852 -1190441 -1700208 -2942412 -2549866 -1107036 -1261577 -2731121 -2704468
10025b704468J578064J86845j734609p02618J610613J620561O6077r3544P85064
$$ -2704468 -1126404 -939559 -2674168 -3376786 -1766173 -145612 -79535 -173079 611985
10016F11985N18689l61203j95370L2163j123348j996328o14209J359620J487470
$$ 611985 1130674 769471 574101 606264 -517084 -2513412 -3127621 -1768001 -280531
10007b80531P49497R85505J077218k91369j206821q9846O07302j262476k933846
$$ -280531 468966 1454471 2531689 2240320 1033499 943653 1550955 288479 -2645367
9998b645367j299075J314443J140234n04030j97426J119644M63573j078709m73278
$$ -2645367 -3944442 -2629999 -1489765 -1993795 -2191221 -1071577 -608004 -1686713 -2159991
9989b159991J279195J080317l63988j95482R68576N44670p58083n23772M32328
$$ -2159991 -880796 199521 -164467 -359949 608627 1153297 395214 -128558 303770
9980C03770j24401j181782o86062n77j020777j642902L90056K195785L38894k403699
$$ 303770 179369 -1002413 -1688475 -1689052 -2709829 -4352731 -3962675 -1766890 -1427996 -3831695
9970c831695j439215J452467J410403p26669n00159J521101J061063j449258j630494
$$ -3831695 -5270910 -3818443 -2408040 -3134709 -3634868 -2113767 -1052704 -2501962 -4132456
9961d132456O57010J410852N5404k49507Q15616O88850l74704j45917K84081j350975
$$ -4132456 -3475446 -2064594 -2009190 -2258697 -1443081 -754231 -1128935 -1274852 -990771 -2341746
9951b341746k796428o87185K391384J692292j050449p45106J562794R54840j665080
$$ -2341746 -5138174 -5825359 -3433975 -1741683 -2792132 -3537238 -1974444 -1019604 -2684684
9942b684684j323788J256598J103982j226212r66636J129114L16022k209083j250133
$$ -2684684 -4008472 -2751874 -1647892 -2874104 -3840740 -2711626 -2395604 -4604687 -5854820
9933e854820J799151J128494j972864j191315K352846J851037j843393j431665
$$ -5854820 -4055669 -2927175 -4900039 -6091354 -3738508 -1887471 -3730864 -5162529
9925e162529K713221L027126p55349j479846J034576Q9476l319465j666482L102692
$$ -5162529 -2449308 577818 -177531 -1657377 -622801 -533325 -3852790 -5519272 -2416580
9916b416580J653122m091140k884974M146847M157671l053352l819166K954848
$$ -2416580 -763458 -4854598 -7739572 -3592725 564946 -2488406 -6307572 -3352724
9908c352724L001137m714765m332280M781014L597188q276356n989747J2132216
$$ -3352724 -351587 -5066352 -9398632 -4617618 -1020430 -9296786 -15286533 -3154317
9900c154317J1003214j8301160k5481804K4415397P9391843O2719630j3313296
$$ -3154317 7848897 -10452263 -35934067 -11518670 67873173 130592803 117279507
9893A17279507o0736939l8862592J233225N871891j0216703r391142M252723M958433
$$ 117279507 56542568 17679976 18913201 24785092 14568389 5177247 9429970 14388403
9885A4388403m828845n019270K914732K827368l792159l105345L223956K461250
$$ 14388403 9559558 4540288 7455020 10282388 6490229 3384884 6608840 9070090
9877I070090m065904m341289J232696J887447k465086k254547K637410L230581
$$ 9070090 5004186 662897 1895593 3783040 1317954 -936593 1700817 4931398
9869D931398j039214k042423J109446J408935j655507j594964J668397J545911
$$ 4931398 3892184 1849761 2959207 4368142 2712635 1117671 2786068 4331979
9861D331979k136473k636901Q66954K029963n52388j441168O55182Q82599j648916
$$ 4331979 2195506 -441395 425559 2455522 1903134 461966 1117148 1999747 350831
9852C50831k028409P84618K014393K51217m23359J083520R38068j546469k212862
$$ 350831 -1677578 -892960 1121433 1372650 949291 2032811 2970879 1424410 -788452
9843g88452j00316P36951q64771j131665J001501J693476l05163j137711Q60271
$$ -788452 -888768 -151817 -1016588 -2148253 -1146752 546724 241561 -896150 -35879
9834c5879K097931M63450j111017l46131Q33353P84314Q08530J254435K36290
$$ -35879 2062052 2525502 1414485 1068354 1901707 2686021 3494551 4748986 4985276
9825D985276j825113j686725P91176J600125n14077j657605K61008J724826j26771
$$ 4985276 3160163 1473438 2264614 3864739 3350662 1693057 1954065 3678891 3552120
9816C552120k475348j724024P50748J491706L24526o13652o28306l30913J43210
$$ 3552120 1076772 -647252 103496 1595202 1919728 1306076 677770 346857 490067
9807D90067N39132M8889r77328r93832M0385L93397k71004l56955L64779K31044
$$ 490067 1029199 1078088 100760 -893072 -852687 -459290 -730294 -1087249 -722470 -491426
9797d91426p75090o09077P38143O64378j217236j804563J90098J814705R64765
$$ -491426 -1266516 -1875593 -1137450 -473072 -1690308 -3494871 -3304773 -1490068 -525303
9788e25303j51762O86109J747319Q24118o44816l37967P93097N54693n29578n94351
$$ -525303 -677065 9044 1756363 2580481 1935665 1597698 2390795 2945488 2415910 1821559
9778A821559M3086j70634j027454j280950j040828r79564n25043P97978J635737
$$ 1821559 1864645 1694011 666557 -614393 -1655221 -2634785 -3159828 -2361850 -726113
9769g26113P77827m94054l73253M89053L92122k68136J16918J221014J158780
$$ -726113 51714 -442340 -815593 -326540 65582 -202554 -85636 1135378 2294158
9760B294158l73591j640540j454105l67124O31714J077819Q10093O5596l85163
$$ 2294158 1920567 280027 -1174078 -1541202 -909488 168331 978424 1044020 658857
9751F58857j74172P552m50758r52772o71199N8837L55159J64601L9617J13904
$$ 658857 484685 492237 41479 -911293 -1582492 -1523655 -1168496 -1003895 -964278 -850374
9741h50374J91021L24386N52160N58760J60818m09669r93879j514533j394711
$$ -850374 -659353 -334967 217193 775953 936771 527102 -466777 -1981310 -3376021
9732c376021j00307J562724K053863J273766O22133N87866J11762j093578j632365
$$ -3376021 -3476328 -1913604 140259 1414025 2036158 2624024 2735786 1642208 9843
9723I843q08486M8103j07713k49369P00174J736198J391402J46967n23799m51726
$$ 9843 -798643 -750540 -858253 -1107622 -407448 1328750 2720152 2867119 2343320 1891594
9713A891594m33017m83546p5199N02810M65346j99180q49977j101652q35055l8050
$$ 1891594 1458577 975031 899832 1402642 1867988 1668808 818831 -282821 -1117876 -1155926
9703a155926O60728K70226r73701j401150j80586J354892J636788R25061L36709
$$ -1155926 -495198 -224972 -1198673 -2599823 -2780409 -1425517 211271 1136332 1473041
9694A473041J0325m47181p02727k94441K48713J49806l34993m26700m5123L51324
$$ 1473041 1483366 1036185 333458 39017 287730 437536 102543 -324157 -369280 -17956
9684a7956N37174M24189r7097o50064n62920k5133K5296m14458k30376P40253
$$ -17956 519218 943407 846310 196246 -366674 -391807 -366511 -780969 -1011345 -271092
9674b71092J090081J74603n86854P9452J270303J383801L62920p72054j453849
$$ -271092 818989 993592 406738 486190 1756493 3140294 3503214 2731160 1277311
9665A277311j495054o65711N87107J149560Q24110N76697N72624j91372j479779
$$ 1277311 -217743 -883454 -296347 853213 1677323 2254020 2826644 2635272 1155493
9656A155493j346501N93119J823947O78951r27142p32693J87913k82213j320026
$$ 1155493 -191008 402111 2226058 2905009 1977867 1245174 1433087 1150874 -169152
9647a69152p21424R38987J140407l09529j133912m88537P7860k78613m52422K37604
$$ -169152 -890576 48411 1188818 879289 -254623 -743160 -665300 -943913 -1396335 -1158731
9637a158731Q15338N15266J4736R4962M77849N26814Q7937n67174q62012k22620
$$ -1158731 -343393 171873 186609 281571 759420 1286234 1374171 806997 -55015 -277635
9627b77635R66142J340676M05301n16383k97000J79651l16666j097502q02588
$$ -277635 688507 2029183 2434484 1918101 1621101 1800752 1484086 386584 -416004
9618d16004J23946K57358l09891l86928M0120M0034k69678j2186N62214M20993
$$ -416004 -292058 -34700 -344591 -731519 -691399 -651365 -921043 -933229 -371015 49978
9608D9978l59783p98742o44637k05032O96086J885792J994034M12157j031693
$$ 49978 -309805 -1108547 -1753184 -1958216 -1262130 623662 2617696 3029853 1998160
9599A998160n90410M36196j44269j523345j255281M07449R84470R5116k38693
$$ 1998160 1407750 1843946 1699677 176332 -1078949 -671500 312970 408086 169393
9590A69393M70408N15405m28867n54570O22709J306569O81854P2037Q7865l22308
$$ 169393 639801 1155206 726339 171769 794478 2101047 2782901 2854938 2942803 2620495
9580B620495j180900r77809K00614K32820j213942j671550q9915J198379N04935
$$ 2620495 1439595 461786 662400 895220 -318722 -1990272 -2080187 -881808 -376873
9571c76873l92696L44037J270321L19166j514857j855694n87596O43307J174605
$$ -376873 -769569 -425532 844789 1163955 -350902 -2206596 -2794192 -2150885 -976280
9562i76280J373544J131712K76206n03781o64901o54911o19647J90696J547328
$$ -976280 397264 1528976 1805182 1301401 636500 -18411 -638058 -447362 1099966
9553A099966J674693L9983j255145o00201N66005K75512q11632r98703n44819
$$ 1099966 2774659 2814642 1559497 959296 1525301 1800813 989181 -9522 -554341
9544e54341o06723o80489K95561J436956J108120k27615p93168m18274l32915
$$ -554341 -1161064 -1841553 -1545992 -109036 999084 771469 -21699 -439973 -772888
9535g72888o65040m60821K35632M83362K69278K80050L12426j80428n33743J39044
$$ -772888 -1437928 -1898749 -1663117 -1179755 -910477 -630427 -318001 -498429 -1032172 -893128
9525h93128J016195P44299r1305o17M98417l06389j856290j650468O01710K073171
$$ -893128 123067 867366 776061 775444 1273861 967472 -888818 -2539286 -1937576 135595
9515A35595J019835o95094o73838N54674Q87642m8236q13620o04006j36316k34055
$$ 135595 1155430 460336 -213502 341172 1228814 1180578 366958 -237048 -373364 -607419
9505f07419o65375o17553J61241R50180Q73701R5024k98436J19880M14049j52305
$$ -607419 -1272794 -1890347 -1729106 -778926 94775 189799 -108637 11243 425292 272987
9495B72987p57184l77500L26884P8622o58704l35120Q88188J185543J80720k74085
$$ 272987 -484197 -861697 -534813 -456191 -1114895 -1450015 -561827 623716 804436 530351
9485E30351P23124J365066M3206j778391j604540K84805J268786K40648j082263
$$ 530351 1253475 2618541 2661747 883356 -721184 -436379 832407 1073055 -9208
9476i208r60270Q6911N84436K88982p3318l41453q17348j027789q8828J520897
$$ -9208 -969478 -882567 -298131 -9149 -82467 -423920 -1241268 -2269057 -2357885 -836988
9466h36988K008111P84414l74765J22494J111948M43757j359242j580268M04952
$$ -836988 1171123 1955537 1580772 1703266 2815214 3258971 1899729 319461 724413
9457G24413J848081O81930j416028j741236n01493J87249p3635O3650P46643O40902
$$ 724413 2572494 3254424 1838396 97160 -404333 -217084 -290719 -227069 519574 1160476
9447A160476l75487p29094J42167P96903K55240n04233m37371m6311k5625O4269
$$ 1160476 784989 55895 198062 994965 1250205 745972 308601 262290 236665 300934
9437C00934N28544M43606p22386j683108j123408J48476N14491Q5542P6430L95304
$$ 300934 829478 1273084 550698 -1132410 -2255818 -2107342 -1592851 -1507309 -1430879 -1035575
9427a035575j1553p73627l61694J109974J613433L69182q07624l38924P85325
$$ -1035575 -1047128 -1820755 -2182449 -1072475 540958 910140 102516 -236408 548917
9418E48917Q46842J9223m30996l43390l44483k49397M05637Q71616J01869j199176
$$ 548917 1395759 1414982 983986 640596 296113 46716 452353 1323969 1425838 226662
9408B26662j318095j92157N48274K52554L0622N30676Q53072L21262l95107o73699
$$ 226662 -1091433 -1283590 -735316 -482762 -452140 78536 931608 1252870 857763 184064
9398A84064q41504r43335k99351Q51998J053757P505o26222l5890K20534q27676
$$ 184064 -657440 -1600775 -1900126 -1048128 5629 13134 -613088 -648978 -428444 -1256120
9388a256120j308911L93719K247454J347508j243335j889533r414J281972L00609
$$ -1256120 -2565031 -2171312 76142 1423650 180315 -1709218 -1718632 -436660 -136051
9379a36051r31705m57608O30848M85739n33263q51158q1681R17211J301404P16593
$$ -136051 -1067756 -1525364 -894516 -408777 -942040 -1793198 -1874879 -957668 343736 1060329
9369A060329m63989j008413j61710Q33223J80153j535177j962687o92140J86515
$$ 1060329 596340 -412073 -573783 259440 439593 -1095584 -3058271 -3750411 -3563896
9360c563896k25511j97666J221257K143545R62553q69543j243446n49311k80578
$$ -3563896 -3789407 -3987073 -2765816 -622271 340282 -529261 -1772707 -2322018 -2602596
9351b602596k67229M01363J147225Q99310J69844K0738N9857m81974q45161j10435
$$ -2602596 -2869825 -2468462 -1321237 -421927 -252083 -231345 -171488 -653462 -1498623 -1609058
9341a609058O45929k9456j134285n99862J121443J587061K70520p47394k16106
$$ -1609058 -963129 -992585 -2126870 -2726732 -1605289 -18228 252292 -495102 -711208
9332g11208O25899M31707k99189m83257j00963K30901K54704Q9391m744K46679
$$ -711208 -85309 346398 47209 -436048 -537011 -306110 -51406 37985 33241 279920
9322B79920O08767L13172o21296q01462N44760J837219J138682q00022j552014
$$ 279920 888687 1201859 580563 -220899 323861 2161080 3299762 2499740 947726
9313I47726o59028M1668l14252m77867L26920J000775O29108l2945j51337j68102
$$ 947726 288698 330366 16114 -461753 -134833 865942 1495050 1462105 1310768 1142666
9303A142666n08325n18228J41362M67739k50089j017721p04104O0994L5431m54918
$$ 1142666 634341 116113 257475 725214 475125 -542596 -1246700 -1185706 -1150275 -1605193
9293a605193j29632R27470J244242K60630q31408r23594m62549m19890o61523
$$ -1605193 -1734825 -807355 436887 697517 -133891 -1057485 -1520034 -1939924 -2601447
9284b601447k75919Q28578J609733J307799M28635r6479j56838k35624l54151
$$ -2601447 -2877366 -2048788 -439055 868744 1297379 1200900 1044062 808438 454287
9275D54287j26442K62584J35545m60797o14291M237N20501K40459k66291k03153
$$ 454287 327845 590429 725974 265177 -349114 -344877 175624 416083 149792 -53361
9265e3361J39911j6011o34028j016769q30411k73490L40067O23320L19247p4104
$$ -53361 86550 70539 -563489 -1580258 -2410669 -2684159 -2344092 -1720772 -1401525 -1475629
9255a475629L10120J191536J114532k97288j329116n79330Q24687R05415k53474
$$ -1475629 -1165509 26027 1140559 843271 -485845 -1065175 -240488 664927 411453
9246D11453r57166n47363J30164M41785N13263L85385P8657J13792O25585O02538
$$ 411453 -545713 -1093076 -962912 -521127 -7864 377521 456178 569970 1195555 1798093
9236A798093m93442j222190j88890J278444Q46764j002889j602248l83327M25490
$$ 1798093 1304651 82461 -106429 1172015 2018779 1015890 -586358 -969685 -544195
9227e44195k41087o75842K71743J141608O55420R214M62467Q18406m12375k003311
$$ -544195 -785282 -1461124 -1189381 -47773 607647 616861 1079328 1897734 1485359 -517952
9217e17952j670397K95139J496561J012414K30439K20495L79218J7449m50603
$$ -517952 -2188349 -1893210 -396649 615765 846204 1066699 1445917 1463366 1012763
9208A012763n07623m11240m38314k84770J44693K24997l83179r06113m78303M63877
$$ 1012763 505140 93900 -344414 -629184 -484491 -259494 -642673 -1548786 -2027089 -1563212
9198a563212P44333J97349j88918J4546r7o35730p32957O83447K281558J815990
$$ -1563212 -818879 -621530 -810448 -795902 -795999 -1431729 -2164686 -1481239 800319 2616309
9188B616309m94155j918194j009881M74627M75513l60117k01848Q01609R40194
$$ 2616309 2122154 203960 -805921 -331294 144219 -215898 -417746 383863 1324057
9179A324057j61732j079694q62200p9559M34837M90426J48243l66898m16110K74855
$$ 1324057 1162325 82631 -779569 -859128 -424291 66135 214378 -152520 -568630 -293775
9169b93775P92586J64293r94280j263689n36318R2206K44968M57675O44073J51279
$$ -293775 498811 663104 -331176 -1594865 -2131183 -2038977 -1794009 -1336334 -692261 -540982
9159e40982o29152n25361L54179O63098K21873M07970J536315J852169K16969
$$ -540982 -1170134 -1695495 -1341316 -678218 -456345 -48375 1487940 3340109 3557078
9150C557078j873958k279597r90017L55027P63787M87676J8542l81347n30389
$$ 3557078 1683120 -596477 -1586494 -1231467 -467680 19996 38538 -342809 -873198
9141h73198m95321n81989p16957l92138L77754P75359L96906L2766N51166J539446
$$ -873198 -1368519 -1950508 -2667465 -3059603 -2681849 -1906490 -1509584 -1476818 -925652 613794
9131F13794J774308P83790n92690j104386l03074J017522J536483P20499o66093
$$ 613794 2388102 3171892 2579202 1474816 1171742 2189264 3725747 4446246 3780153
9122C780153j512065j466815q29199O3669P69938P03112n9285m99611j4960O05566
$$ 3780153 2268088 801273 -27926 35743 805681 1508793 1449508 949897 934937 1540503
9112A540503M73002N8699J96927M82845J22791l92022j45109L38859m2229p92193
$$ 1540503 2013505 2072204 2269131 2751976 2874767 2482745 2337636 2676495 2634266 1842073
9102A842073n76367K38779Q5338r11954r72984K13180Q55911J00776o43126k64459
$$ 1842073 1265706 1504485 1589823 677869 -295115 -81935 773976 874752 231626 -32833
9092c2833K82413j36428r29770r05502L092R95528J318766N18068j032758j766152
$$ -32833 249580 113152 -816618 -1722120 -1719028 -723500 595266 1113334 80576 -1685576
9082a685576n79894J182813J230782k72964j013886k82213K03149l31862m04482
$$ -1685576 -2265470 -1082657 148125 -124839 -1138725 -1420938 -1217789 -1549651 -1954133
9073a954133O55148J144713J0500j087862n30857N93099M88701m62826p17952
$$ -1954133 -1298985 -154272 -143772 -1231634 -1762491 -1169392 -680691 -1143517 -1861469
9064a861469m8184O66178R20929N75387l88626j125127m67014R75204J150978
$$ -1861469 -1909653 -1243475 -322546 252841 -135785 -1260912 -1727926 -752722 398256
9055C98256j72307q18505P6817N07145o70578j394663m6163J375351N81478r43600
$$ 398256 225949 -592556 -515739 -8594 -679172 -2073835 -2119998 -744647 -163169 -1106769
9045a106769n15462J072788J059715m46039q56381L60880J105854M69307j04452
$$ -1106769 -1622231 -549443 510272 64233 -792148 -431268 674586 1143893 1039441
9036A039441K59692N81902J54234l51640m01037l59811m29340l87326m22344p68819
$$ 1039441 1299133 1881035 2035269 1683629 1282592 922781 493441 106115 -316229 -1085048
9026a085048p75297J24591R75892N71845l53160j58100Q85943R57427k74425j132052
$$ -1085048 -1860345 -1735754 -759862 -188017 -541177 -699277 186666 1144093 869668 -262384
9016b62384o31187K56051M03413m9458m47930m51714Q4195Q92687J014446q5784
$$ -262384 -893571 -637520 -234107 -283565 -731495 -1183209 -1099014 -206327 808119 722335
9006G22335j334885j223765J11814J220184J353316Q81471J98172m17779m12063
$$ 722335 -612550 -1836315 -1724501 -504317 848999 1730470 1928642 1510863 1098800
8997A098800J66825J18022j059571j715565l53947J569076J508968k02799r22281
$$ 1098800 1265625 1383647 324076 -1391489 -1745436 -176360 1332608 1129809 207528
8988B07528R3677Q69976K64961m71329l29809j71422p28553j135913n96812K04458
$$ 207528 301205 1171181 1436142 964813 635004 463582 -264971 -1400884 -1997696 -1793238
8978a793238L96150K07351J48060K03482M44122J099677J554843P43695r48625
$$ -1793238 -1397088 -1189737 -1041677 -838195 -394073 705604 2260447 3004142 2055517
8969B055517j712606q32876L34475N27290J66838L9542n6819l95799m28916J30957
$$ 2055517 342911 -489965 -155490 371800 538638 578180 521361 125562 -303354 -172397
8959a72397M75880j7259o50929n24460O8657K86200M7864j59089j82465j68227
$$ -172397 303483 286224 -364705 -889165 -820508 -534308 -486444 -645533 -827998 -996225
8949i96225j26227j13008l39860o34872l72104N89379J439154J358127M88964
$$ -996225 -1122452 -1235460 -1575320 -2210192 -2582296 -1992917 -553763 804364 1293328
8940A293328l96412p80937o64008l32490j17087r7934L796L53967N73639K34169
$$ 1293328 896916 115979 -548029 -880519 -997606 -1095540 -1091744 -737777 -164138 70031
8930G0031l79741n56168j20988L69808L18574l71954j217360j387924n04975O05734
$$ 70031 -309710 -865878 -986866 -617058 -298484 -670438 -1887798 -3275722 -3780697 -3174963
8920c174963P45861J58986K90581J258844J267517l64689j487982l07708J405078
$$ -3174963 -2429102 -2270116 -1979535 -720691 546826 182137 -1305845 -1613553 -208475
8911b08475Q37811j329453j927217l01748Q90446J06964r40730m51706Q02696
$$ -208475 629336 -700117 -2627334 -2929082 -2038636 -1931672 -2872402 -3324108 -2521412
8902b521412J244890Q21899K56470l34650q37513n98245L75123R18836M18754
$$ -2521412 -1276522 -454623 -198153 -532803 -1370316 -1968561 -1593438 -674602 -255848
8893b55848j79563J8134M28614J48446n41076q11516n32724k9854N59422R53063
$$ -255848 -435411 -417277 11337 159783 -381293 -1192809 -1725533 -1755387 -1195965 -242902
8883b42902O43406j36285k99891M60959Q86973o4825j475829j633124m32514N54654
$$ -242902 400504 264219 -35672 425287 1312260 1247435 -228394 -1861518 -2294032 -1739378
8873a739378L18699l18604k3830J110749J658450Q62199k31180k84554K73189
$$ -1739378 -1420679 -1739283 -1763113 -652364 1006086 1868285 1637105 1352551 1625740
8864A625740l2642j118791j221005J46016J065235K10608r23619m85492P44468
$$ 1625740 1593098 474307 -746698 -600682 464553 675161 -248458 -733950 10518
8855A0518R42036L27120J90490J16040r59866j872546o39248J717030K123281
$$ 10518 952554 1279674 1470164 1586204 626338 -1246208 -1885456 -168426 1954855
8846A954855K41678j076456m78874J78264m03745r05054l81247j27058q67503
$$ 1954855 2196533 1120077 641203 819467 415722 -489332 -870579 -997637 -1865140
8837a865140r67212N97299K004241J428475p5221o50154n86133r56237j120903
$$ -1865140 -2832352 -2235053 -230812 1197663 1122442 472288 -113845 -1070082 -2190985
8828b190985m5760J276326J180605J29991j41080M43993M41578m67103j033555
$$ -2190985 -2236745 -960419 220186 350177 209097 653090 1094668 627565 -405990
8819d05990n81496J37553L69314K76110J92199r503m54687p61749l66349O75656
$$ -405990 -987486 -849933 -480619 -204509 -12310 -21813 -476500 -1238249 -1604598 -928942
8809i28942J342762N93692j005362j425775J18793J572269P28016j341812j763431
$$ -928942 413820 1007512 2150 -1423625 -1304832 267437 995453 -346359 -2109790
8800b109790k24877Q57788M73080K46696J000644J240466K12788n29265j11768
$$ -2109790 -2334667 -1476879 -1003799 -757103 243541 1484007 1696795 1167530 1055762
8791A055762k1028j030603j278917M04631J892064J031109p70593j003416j10228
$$ 1055762 1034734 4131 -1274786 -870155 1021909 2053018 1282425 279009 168781
8782A68781j27669r01369p57307J77274L13563m58198q32831n21452k58704j2618
$$ 168781 41112 -860257 -1617564 -1440290 -1126727 -1584925 -2417756 -2939208 -3197912 -3210530
8772c210530O07258R01871K10555l91844K53447J070807N15232m49152P5688J341558
$$ -3210530 -2603272 -1701401 -1490846 -1882690 -1629243 -558436 -43204 -492356 -416668 924890
8762I24890J091361l79854o85067L91522O29286m27899o30332O30453R68181q61579
$$ 924890 2016251 1636397 951330 1342852 1972138 1544239 913907 1544360 2512541 1650962
8752A650962k524366j757046J49730P55377K68141M48729J182390Q27108o13206
$$ 1650962 -873404 -2630450 -2480720 -1725343 -1457202 -1008473 173917 1001025 387819
8743C87819j146376J58578J675801J474511j61539j360602j169703m50022l06474
$$ 387819 -758557 -599979 1075822 2550333 2388794 1028192 -141511 -591533 -898007
8734h98007n60543l75325K30257N13605M15162N75346Q55131L17265q39216r57297
$$ -898007 -1458550 -1833875 -1603618 -1090013 -674851 -99505 755626 1072891 233675 -723622
8724g23622N13922J719279J006809o08476j208991q37549o36258l49903Q94770
$$ -723622 -209700 1509579 2516388 1907912 698921 -138628 -774886 -1124789 -230019
8715b30019K104059J387603p80007j839811q92244K24918K9008p19042r04423
$$ -230019 1874040 3261643 2481636 641825 -250419 -25501 3507 -715535 -1619958
8706a619958p06310m21793M36434J709439J909341L19102j473844j512574p1111
$$ -1619958 -2326268 -2748061 -2311627 -602188 1307153 1626255 152411 -1360163 -1431274
8697a431274R34375N52324l26217m55106K72729Q78381M80498o23342j172065
$$ -1431274 -496899 55425 -270792 -725898 -453169 425212 905710 282368 -889697
8688h89697m73689O37423R45976N12979K73332L63127J04253m51604l86134M18305
$$ -889697 -1363386 -725963 220013 732992 1006324 1369451 1473704 1022100 635966 1054271
8678A054271Q16771J50061o71579n28364L19289P18517J36935q87854j434146
$$ 1054271 1871042 2021103 1349524 821160 1140449 1858966 1995901 1108047 -326099
8669c26099r75502J95934J141684J172459N46171o8959n36516j041666j273563
$$ -326099 -1301601 -1105667 36017 1208476 1754647 1685688 1149172 107506 -1166057
8660a166057p26082K95102Q71724O79633J97799j92452m51336l63119K23961P08032
$$ -1166057 -1892139 -1597037 -725313 -45680 152119 -40333 -491669 -854788 -630827 77205
8650G7205L49516m29051m85603K44917O27936K03666j25051K67723O51094K12156
$$ 77205 426721 -2330 -487933 -243016 384920 588586 463535 731258 1382352 1594508
8640A594508n98288q21494l63900J51930L49518K30319j81750o78399p21455p0006
$$ 1594508 996220 174726 -189174 -37244 312274 542593 360843 -317556 -1039011 -1109017
8630a109017P03933Q53283L99764n0446k41436m22005n77624k12435O92620J070267
$$ -1109017 -405084 448199 847963 797517 556081 134076 -443548 -655983 36637 1106904
8620A106904o400j615296j681863J40461J542640O42712j134564j062979P58923
$$ 1106904 1100504 -514792 -2196655 -2056194 -513554 129158 -1005406 -2068385 -1309462
8611a309462J674958P09754k24792P6023K29093o99375j114107J19464J149986
$$ -1309462 365496 1075250 850458 926481 1155574 456199 -657908 -538444 611542
8602F11542J84554j131911m23192J121496O45609j392869j894480k23666J113901
$$ 611542 796096 -335815 -759007 362489 1008098 -384771 -2279251 -2502917 -1389016
8593a389016Q69955M49821N25458j07353j422588j387014M18467J573872P41221
$$ -1389016 -519061 -69240 456218 348865 -1073723 -2460737 -2042270 -468398 272823
8584B72823j74205M54589J161244K54246j047091q41308J51706J18278o50720
$$ 272823 98618 553207 1714451 1968697 921606 80298 232004 350282 -300438
8575c00438o87538j83912l27000p71573k79684Q07011J116830P36540Q07735J037676
$$ -300438 -987976 -1171888 -1498888 -2270461 -2550145 -1743134 -626304 110236 917971 1955647
8565A955647Q6465j595505j813810Q41J683632J437016J76746l02130L4508J9419
$$ 1955647 2042112 446607 -1367203 -1366362 317270 1754286 1931032 1628902 1663410 1682829
8555A682829n34270p00222j34886L45495K9871o49709p08498J05999R60319Q80132
$$ 1682829 1148559 448337 313451 658946 688817 39108 -669390 -563391 396928 1277060
8545A277060j04707r45896p77251O2549M62841o5383p72808o25639L56896J084539
$$ 1277060 1172353 226457 -550794 -488245 -25404 -90787 -863595 -1489234 -1132338 -47799
8535d7799P51300j70242n88323j76261L92834M93832K28803k9816j64556j67550
$$ -47799 703501 533259 -55064 -231325 161509 655341 884144 854328 689772 522222
8525E22222l3201n093l31834o31092k89672L26319J34373q14662j056153R768
$$ 522222 489021 483928 152094 -478998 -768670 -442351 -307978 -1122640 -2178793 -2169025
8515b169025R74100O29515r6789J25604O93215K84763o82692q77480m70955n10709
$$ -2169025 -1194925 -565410 -662199 -536595 156620 441383 -241309 -1118789 -1589744 -2100453
8505b100453n89674L79407J523435R07197r42020j275912O19076K170567J433751
$$ -2100453 -2690127 -2310720 -787285 119912 -822108 -2098020 -1478944 691623 2125374
8496B125374k87093r55642o74814n64600o53263m53519j94704j17171K09546P60660
$$ 2125374 1838281 882639 207825 -356775 -1010038 -1463557 -1658261 -1775432 -1565886 -805226
8486h05226N70897n78126j354113q21945J65836N71023P26193J144591J224724
$$ -805226 -234329 -812455 -2166568 -2988513 -2822677 -2251654 -1525461 -380870 843854
8477H43854M70689k73584j67220J68916j79627q37799r43287n50013j27910L41358
$$ 843854 1314543 1040959 873739 1042655 863028 25229 -918058 -1468071 -1595981 -1254623
8467a254623P71985N68655k25167n48686j6223L25479j32048m28148J57537P54606
$$ -1254623 -482638 86017 -139150 -687836 -704059 -378580 -510628 -938776 -781239 -26633
8457b6633N55045J76035J33259k28022r13725m89705J181901J699362j73159j860743
$$ -26633 528412 704447 837706 609684 -304041 -793746 388155 2087517 1914358 53615
8447E3615q26006J094362O34751j361769j388976P36811J687531L15731p68066
$$ 53615 -772391 321971 956722 -405047 -1794023 -1057212 630319 946050 177984
8438A77984l4439N59283n29555j571568o12415J278933J914886J165458K98533
$$ 177984 143545 702828 173273 -1398295 -2010710 -731777 1183109 2348567 2647100
8429B647100k79520q34077j075108p00778k39425j30417R4619O79619P54635k94732
$$ 2647100 2367580 1533503 458395 -242383 -481808 -612225 -517606 162013 916648 621916
8419F21916j498625j481047k81270R15686J244408O66656k92021p68322k98717
$$ 621916 -876709 -2357756 -2639026 -1723340 -478932 187724 -104297 -872619 -1171336
8410a171336L10291j24220j125647q95370P54359J610627L37143j235161q08470
$$ -1171336 -861045 -985265 -2110912 -3006282 -2251923 -641296 -304153 -1539314 -2347784
8401b347784Q41208J176872j66938j138708o64464M4249j22752n39190l47017
$$ -2347784 -1506576 -329704 -496642 -1635350 -2299814 -2255565 -2378317 -2917507 -3264524
8392c264524L9445p0010l16877O041P24969J158702J131154Q51356L43701k52275
$$ -3264524 -3225079 -3295089 -3611966 -3605925 -2880956 -1722254 -591100 260256 603957 351682
8382C51682l64370J89536N55867l43p02901k43049J002575J175824l20271j720657
$$ 351682 -12688 176848 732715 732372 29471 -213578 788997 1964821 1644550 -76107
8372g6107j351401M2507O14778J28790j77133P1808o3397q57821j158056k10516
$$ -76107 -1427508 -1385001 -770223 -641433 -818566 -746758 -810155 -1667976 -2826032 -3036548
8362c036548J037389J296738O59031J02818n524l8661k08410l48391l57860k90061
$$ -3036548 -1999159 -702421 -43390 59428 53904 15243 -193167 -541558 -899418 -1189479
8352a189479j86522j48618k58391k44547K43742Q55723P78751M0221l41350M3687
$$ -1189479 -1376001 -1524619 -1783010 -2027557 -1783815 -928092 -149341 -109120 -450470 -406783
8342d06783K81899k79218q05911l46696N05272N50591j13773m42913j95986o19
$$ -406783 -124884 -404102 -1210013 -1556709 -1051437 -500846 -614619 -1057532 -1253518 -1254137
8332a254137J2179K97731P49460P13690J72855j73019m2534J73248K61825L55939
$$ -1254137 -1241958 -944227 -194767 518923 691778 518759 476225 649473 911298 1267237
8322A267237L23377p1103n00263n00006l47801m92694m38961M87273J488114J014171
$$ 1267237 1590614 1519511 1019248 519242 171441 -321253 -760214 -272941 1215173 2229344
8312B229344p60486j837670j173446M2969N01539N41944Q40444Q29632j40724
$$ 2229344 1468858 -368812 -1542258 -1499289 -997750 -455806 384638 1214270 1073546
8303A073546j114589o53792Q19412J376722K95234r26458o78180O13566J162729
$$ 1073546 -41043 -694835 124577 1501299 1796533 870075 191895 805461 1968190
8294A968190J94523j152815j407751o24351n6262k19645k53554M41325R63621
$$ 1968190 2162713 1009898 -397853 -1022204 -1078466 -1298111 -1551665 -1110340 -146719
8285a46719K86286q71942r10358K57449J168420J121894Q84835Q12863P5583j423172
$$ -146719 139567 -732375 -1642733 -1385284 -216864 905030 1789865 2602728 2678311 1255139
8275A255139k045028o80046J255500J615438M03674p12065j007993j044578q74874
$$ 1255139 -789889 -1469935 -214435 1401003 1804677 1092612 84619 -959959 -1834833
8266a834833O5164J226656J111374k90252j030657p7648R69433L45966j022365
$$ -1834833 -1769669 -543013 568361 278109 -752548 -830196 139237 485203 -537162
8257e37162q87111Q23114J800771O54064j299518k022385j208892j3133O71888
$$ -537162 -1424273 -601159 1199612 1853676 554158 -1468227 -2677119 -2690252 -2018364
8248b018364P56918M08857j14626l52668r0020K32903J26295j29876J06207P24739
$$ -2018364 -1261446 -852589 -967215 -1319883 -1409903 -1177000 -1050705 -1180581 -1074374 -349635
8238c49635Q46649N3491r00504r04924K07058J397354J465537L43977p54255p18877
$$ -349635 497014 550505 -349999 -1254923 -1047865 349489 1815026 2159003 1404748 685871
8228F85871N8111K31551n28621j012727l50052N60570M07040n07921p95359r4227
$$ 685871 743982 975533 446912 -565815 -915867 -355297 51743 -456178 -1251537 -1345764
8218a345764O29990P15567M57358J43078l10003o34997l45824K12182J39610m48951
$$ -1345764 -715774 -207 457151 600229 290226 -344771 -690595 -478413 -338803 -787754
8208g87754m05848N33871J160156P11410R2910L19747Q54931N51237n21374j225799
$$ -787754 -1193602 -659731 500425 1211835 1304745 1624492 2479423 3030660 2509286 1283487
8198A283487r11143l6997N01469K36261m18513m96627K64454P34455j26912j400612
$$ 1283487 372344 335347 836816 1073077 654564 157937 422391 1156846 1029934 -370678
8188c70678j247433K62281J141395N68716j9021M37428R79707O66113K07245K27639
$$ -370678 -1618111 -1355830 -214435 354281 335260 772688 1752395 2418508 2625753 2853392
8178B853392j21273j185336j398593J37549J439024L86665j744819k122293o56925
$$ 2853392 2732119 1546783 148190 285739 1724763 2111428 366609 -1755684 -2412609
8169b412609K97387r3709l21464M35605J094019Q22009K51923P3423J10086J09834
$$ -2412609 -2115222 -2208931 -2530395 -2094790 -1000771 -178762 73161 146584 256670 366504
8159C66504P1140k26615p54182o67905M07482J228613P30867M9937O39098J376410
$$ 366504 437644 211029 -543153 -1211058 -803576 425037 1155904 1205841 1844939 3221349
8149C221349K78177j655437j590012L51104J018341o01591j796470p84221N70838
$$ 3221349 3499526 1844089 254077 605181 1623522 1021931 -774539 -1558760 -987922
8140i87922L94293q8413O77360J478040O61047o17523l08882R33184Q85037n54829
$$ -987922 -593629 -682042 -4682 1473358 2134405 1516882 1208000 2141184 3026221 2471392
8130B471392j462209j064386l91935n2279M30125J026686Q76745j45168r69538
$$ 2471392 1009183 -55203 -447138 -499417 -69292 957394 1834139 1688971 719433
8121G19433p78155O3065O38632L30610q00934j802201j383816N04665K106127
$$ 719433 -58722 4343 642975 973585 172651 -1629550 -3013366 -2508701 -402574
8112d02574J768192J7802j227576j145248o28276n98623q08827n35546K94392
$$ -402574 1365618 1383420 155844 -989404 -1617680 -2216303 -3025130 -3560676 -3266284
8103c266284J020308J003490L34618j85956O6017P19746Q71355L11590l04278
$$ -3266284 -2245976 -1242486 -907868 -1093824 -1027807 -308061 563294 874884 570606
8094E70606n04248m59731l32607l8545J82727r3888n60966m19043K20267L20615
$$ 570606 66358 -393373 -725980 -764525 -581798 -675686 -1236652 -1655695 -1435428 -1114813
8084a114813l34261o33370Q9758J017489J228957R20300N59288M8572n19912n34974
$$ -1114813 -1449074 -2082444 -1992686 -975197 253760 1174060 1733348 1781920 1262008 727034
8074G27034q4052j61584q14272o29846Q09511J659697N71770q73854n16674Q69523
$$ 727034 642982 481398 -332874 -962720 -153209 1506488 2078258 1204404 687730 1557253
8064A557253Q05747q92388j891750j005881L12797N53710J56616J46419L74597
$$ 1557253 2363000 1470612 -421138 -1427019 -1114222 -560512 -403896 -257477 117120
8055A17120J56792l71074n20798j39195K95506M09822K98536K09878R8378l53110
$$ 117120 273912 -97162 -617960 -757155 -461649 -51827 246709 456587 554965 201855
8045B01855j122535j478913p85568L98810Q66125N06391M17428R41693R46933
$$ 201855 -920680 -2399593 -3185161 -2786351 -1920226 -1413835 -996407 -54714 892219
8036H92219j67315j118411o12509N60650P63072j0831m54489j59098J06248J8577
$$ 892219 724904 -393507 -1006016 -445366 317706 306875 -147614 -306712 -200464 -181887
8026a81887P2812L80618M11650m712m69543p79857r75819p67684J27970J180744
$$ -181887 -109075 271543 683193 678481 208938 -570919 -1546738 -2314422 -2186452 -1005708
8016a005708J455435P80119j45466o09162l50828L89148Q20589K94675n07374
$$ -1005708 449727 1229846 1084380 475218 124390 513538 1334127 1628802 1121428
8007A121428j45446J201521J409625m43844k243849j783393o145P61391M32013
$$ 1121428 975982 2177503 3587128 3143284 899435 -883958 -890103 -128712 303301
7998C03301N07492R01375L24813p28948m46039R30040J177450j65023j055989
$$ 303301 810793 1712168 2036981 1308033 861994 1792034 2969484 2804461 1748472
7989A748472n04725J6822m16816n79054K70442P47022j31555j066683p64377n7964
$$ 1748472 1243747 1260569 843753 264699 535141 1282163 1150608 83925 -680452 -738416
7979g38416q7530k81132J08300K90640l49527n56141O87450J861367J011186j018001
$$ -738416 -825946 -1107078 -998778 -708138 -1057665 -1613806 -926356 935011 1946197 928196
7969I28196j771252p61135L82748O85735N50571J84390n22460q20458R3729J229205
$$ 928196 -843056 -1604191 -1221443 -535708 14863 199253 -323207 -1143665 -1049936 179269
7959A79269Q30287p31794j196795J77112J491112J092451k55782r46133p25763
$$ 179269 1009556 277762 -919033 -741921 749191 1841642 1585860 639727 -86036
7950h6036l12020j271K81916L46909N7342k19147r8355L06331O89876Q51161N07967
$$ -86036 -398056 -399327 -117411 229498 286840 67693 -30662 275669 965545 1816706 2324673
7939B324673m65798j411852j329461k53435O49555O92152M42576M57691K98807
$$ 2324673 1858875 447023 -882438 -1135873 -486318 205834 648410 1106101 1404908
7930A404908m38551j051222o98373J80455M52425r6781p10366r35193r50629p33121
$$ 1404908 966357 -84865 -783238 -602783 -150358 -247139 -957505 -1892698 -2843327 -3576448
7920c576448Q4877J313146J966325J337221j06923j179305j114273j97366N33747
$$ -3576448 -3491571 -2178425 -212100 1125121 1018198 -161107 -1275380 -1472746 -938999
7911i38999K76455o40853j047509l70273N99909Q43887N31103M97262O92707L09207
$$ -938999 -662544 -1303397 -2350906 -2721179 -2121270 -1277383 -746280 -249018 443689 752896
7901G52896n78673q06756M7868Q39052N53077k08297l50484l908k4225m42226
$$ 752896 174223 -632533 -584665 254387 807464 599167 248683 244775 220550 -221676
7891b21676o10529m49581l41837j19376N80400J191840Q29800q1327k75543K14350
$$ -221676 -832205 -1281786 -1623623 -1742999 -1162599 29241 859041 777714 502171 716521
7881G16521N6591r34649j218291j43070P40135K28151m29182K82808J336938P97045
$$ 716521 773112 -161537 -1379828 -1522898 -782763 -554612 -983794 -700986 635952 1432997
7871A432997p23595q49636O16901J275908M2154j167574p28556J12955l13239
$$ 1432997 709402 -140234 476667 1752575 1794729 627155 -101401 11554 -301685
7862c01685j022729q4689J781075J972284Q1441j366460p13815N92822O26154
$$ -301685 -1324414 -1409103 371972 2344256 2425697 1059237 345422 938244 1564398
7853A564398j25578j21587M16339J35117p54008o80023M45307Q37296j63575q51016
$$ 1564398 1438820 1317233 1733572 1868689 1114681 434658 879965 1717261 1553686 702670
7843G02670l9354P82628m4204j285398o45387J254527J509296n09462k006837
$$ 702670 663316 1445944 1401740 116342 -529045 725482 2234778 1725316 -281521
7834b81521r45712J078149J493660L05358p11516q69266p34983m43151K56009
$$ -281521 -1227233 -149084 1344576 1649934 938418 69152 -665831 -1108982 -852973
7825h52973Q03908M04840m82621o96939j99565J8135l19527m65037m7484M41018
$$ -852973 -49065 355775 -126846 -823785 -1023350 -1005215 -1324742 -1789779 -1837263 -1396245
7815a396245N90098M60693Q7092m32359n24896J46837Q10978N41796j97898k29427
$$ -1396245 -806147 -345454 -258362 -690721 -1215617 -1068780 -257802 283994 86096 -143331
7805a43331M01154O05461K30674K46186Q49948J010759K50470o03815q85528r19643
$$ -143331 257823 863284 1093958 1340144 2190092 3200851 3451321 2847506 1961978 1042335
7795A042335r36588n38261K08912M65854m485l85109k50539j68837l29341j0144
$$ 1042335 105747 -432514 -223602 242252 237767 -147342 -397881 -566718 -896059 -906203
7785i06203Q70659J140564K41514o49451m30733K36599K01485l44594n33543l52087
$$ -906203 -35544 1105020 1346534 697083 266350 502949 704434 359840 -173703 -525790
7775e25790k78854k00800J61393M53788L00920j0739k49070o68952r80262k24142
$$ -525790 -804644 -1005444 -844051 -390263 -89343 -100082 -349152 -1018104 -1998366 -2222508
7765b222508J297840J556202k53648j862835r93756J091904J472171k4649r67897
$$ -2222508 -924668 631534 377886 -1484949 -2478705 -1386801 85370 60721 -907176
7756i07176l72592K13496k32548p01070k82819M00282O24212N88566M04644k26158
$$ -907176 -1279768 -1066272 -1298820 -1999890 -2282709 -1882427 -1258215 -669649 -265005 -491163
7746d91163q29869m31626N14167L90237q00055j036880M26002J575871P90509
$$ -491163 -1321032 -1752658 -1238491 -848254 -1648309 -2685189 -2259187 -683316 107193
7737A07193n96485o38496J12995k6971p56708m19526R78770J699389J012597K425
$$ 107193 -489292 -1127788 -1014793 -1041764 -1798472 -2217998 -1239228 460161 1472758 1475183
7727A475183m16694n16938n68122k22555M64696O91760J35359m48054l49311J18002
$$ 1475183 1058489 541551 -26571 -249126 215570 907330 1042689 594635 245324 363326
7717C63326K22601j61601n27515l96851K07386P72008P94620L87033R7842L656
$$ 363326 585927 424326 -103189 -500040 -292654 479354 1273974 1661007 1758849 1762505
7707A762505m12668j120143j113286J08912J401266J356455K60791m82668m20142
$$ 1762505 1349837 229694 -883592 -774680 626586 1983041 2243832 1761164 1341022
7698A341022k62496l74014m43741n17726r19558j137821k87505J131256J461650
$$ 1341022 1078526 704512 260771 -256955 -1176513 -2314334 -2601839 -1470583 -8933
$$ [...]
##END NTUPLES=NMR SPECTRUM
##END=
