##TITLE=31Pdec_E3e1207RHCl
 CDCl3, 24 sc
 13.7.2023
##JCAMPDX= 6.0         $$ Bruker NMR JCAMP-DX V2.0
##DATA TYPE= NMR SPECTRUM
##DATA CLASS= NTUPLES
##ORIGIN= UXNMR, Bruker Analytische Messtechnik GmbH
##OWNER= root
$$ XWIN-NMR		Version 3.5
$$ Thu Jul 13 14:46:28 2023 Russian Standard Time (UT+4h)  she@DPX200
##.OBSERVE FREQUENCY= 81.013821
##.OBSERVE NUCLEUS= ^31P
##.ACQUISITION MODE= SIMULTANEOUS
##.ACQUISITION SCHEME= undefined
##.AVERAGES= 24
##.DIGITISER RES= 16
##SPECTROMETER/DATA SYSTEM= spect
##.PULSE SEQUENCE= zgpg30
##.SOLVENT NAME= DMSO
##.SHIFT REFERENCE= (INTERNAL, DMSO, 0, 248.564)
##AUDIT TRAIL= $$ (NUMBER, WHEN, WHO, WHERE, WHAT)
$$ ##TITLE= Audit trail, XWIN-NMR		Version 3.5
$$ ##JCAMPDX= 5.01
$$ ##ORIGIN= Bruker BioSpin GmbH
$$ ##OWNER= she
$$ F:/spectra/data/she/nmr/P31/1/pdata/1/auditp.txt
$$ ##AUDIT TRAIL=  $$ (NUMBER, WHEN, WHO, WHERE, WHAT)
(   1,<2023-07-13 14:45:24.90 +0400>,<she>,<DPX200>,
      <created by zg, POWCHK disabled, PULCHK disabled
       configuration hash MD5:
       00 E9 B6 7A A2 85 ED C7 34 08 36 98 17 FE 4E 26
       data hash MD5: 32K
       8E 42 EB 73 0C EB A7 25 B7 9A A5 5B DD F3 88 E9>)
(   2,<2023-07-13 14:45:28.15 +0400>,<she>,<DPX200>,
      <Start of raw data processing
       efp BC_mod = 2 LB = 1 FT_mod = 6 PKNL = 1 PHC0 = -10674.51 PHC1 = 40.28482 SI = 64K 
       data hash MD5: 64K
       54 90 A8 72 7F 3E 75 1F D3 85 69 6E 7E 02 09 AE>)
(   3,<2023-07-13 14:45:48.87 +0400>,<she>,<DPX200>,
      <pk PHC0 = 1.065529 PHC1 = 0 
       data hash MD5: 64K
       81 FB E9 D3 9A 6A B4 2D 85 0F A8 3E 7F CF 5D 4C>)
(   4,<2023-07-13 14:45:57.59 +0400>,<she>,<DPX200>,
      <abs ABSG = 5 
       data hash MD5: 64K
       C3 E6 EC 8A 69 FB 2A C8 75 61 F6 A7 FF 0B B2 9C>)
$$ ##END=
$$ 
$$ hash MD5
$$ 11 C4 9F 36 31 92 85 45 1D 07 A1 CE F1 24 4A 8B
##$RELAX= 
##$RELAX= 
##$RELAX= 
##$RELAX= 
##$RELAX= 
##$RELAX= 
##$RELAX= 
##$RELAX= 
##$RELAX= 
$$ Bruker specific parameters
$$ --------------------------
##$DU= <F:/spectra>
##$EXPNO= 1
##$NAME= <P31>
##$PROCNO= 1
##$TYPE= <nmr>
##$USER= <she>
##$AMP= (0..31)
100 100 100 100 100 100 100 100 100 100 100 100 100 100 100 100 100 100 
100 100 100 100 100 100 100 100 100 100 100 100 100 100 
##$AQSEQ= 0
##$AQ_mod= 1
##$AUNM= <au_zg>
##$AUTOPOS= <>
##$BF1= 81.014009
##$BF2= 200.13
##$BF3= 200.13
##$BF4= 200.13
##$BF5= 200.13
##$BF6= 200.13
##$BF7= 200.13
##$BF8= 200.13
##$BYTORDA= 1
##$CFDGTYP= 0
##$CFRGTYP= 5
##$CHEMSTR= <none>
##$CNST= (0..31)
1 1 145 1 1 1 1 1 1 1 1 1 1 1 1 1 1 1 1 1 1 1 1 1 1 1 1 1 1 1 1 1 
##$CPDPRG= <waltz16>
##$CPDPRG1= <>
##$CPDPRG2= <waltz16>
##$CPDPRG3= <>
##$CPDPRG4= <mlev>
##$CPDPRG5= <mlev>
##$CPDPRG6= <mlev>
##$CPDPRG7= <mlev>
##$CPDPRG8= <mlev>
##$CPDPRGB= <>
##$CPDPRGT= <>
##$D= (0..31)
0 1 0 0 0 0 0 0 0 0 0 0.03 2e-05 3e-06 0 0 0 0 0 0 0 0 0 0 0 0 0 0 0 0 
0 0 
##$DATE= 1689245124
##$DBL= (0..7)
120 120 120 11 120 120 24 19 
##$DBP= (0..7)
150 150 150 150 150 150 150 150 
##$DBP07= 0
##$DBPNAM0= <>
##$DBPNAM1= <>
$$ [...]
##$SUBNAM3= <"">
##$SUBNAM4= <"">
##$SUBNAM5= <"">
##$SUBNAM6= <"">
##$SUBNAM7= <"">
##$SUBNAM8= <"">
##$SUBNAM9= <"">
##$SW= 501.771253377433
##$SWIBOX= (0..15)
0 1 3 0 0 0 0 0 0 0 0 0 0 0 0 0 
##$SW_h= 40650.406504065
##$TD= 32768
##$TD0= 1
##$TE= 0
##$TE2= 300
##$TE3= 300
##$TEG= 300
##$TL= (0..7)
0 120 53 12 22 120 120 120 
##$TP= (0..7)
150 150 150 150 150 150 150 150 
##$TP07= 0
##$TPNAME0= <>
##$TPNAME1= <>
##$TPNAME2= <>
##$TPNAME3= <>
##$TPNAME4= <>
##$TPNAME5= <>
##$TPNAME6= <>
##$TPNAME7= <>
##$TPOAL= (0..7)
0.5 0.5 0.5 0.5 0.5 0.5 0.5 0.5 
##$TPOFFS= (0..7)
0 0 0 0 0 0 0 0 
##$TUNHIN= 0
##$TUNHOUT= 0
##$TUNXOUT= 0
##$USERA1= <user>
##$USERA2= <user>
##$USERA3= <user>
##$USERA4= <user>
##$USERA5= <user>
##$V9= 5
##$VALIST= <valist>
##$VCLIST= <CCCCCCCCCCCCCCC>
##$VD= 0
##$VDLIST= <DDDDDDDDDDDDDDD>
##$VPLIST= <PPPPPPPPPPPPPPP>
##$VTLIST= <TTTTTTTTTTTTTTT>
##$WBST= 1024
##$WBSW= 4
##$XGAIN= (0..3)
0 0 0 0 
##$XL= 0
##$YL= 0
##$YMAX_a= 6061
##$YMIN_a= -5992
##$ZGOPTNS= <>
##$ZL1= 120
##$ZL2= 120
##$ZL3= 120
##$ZL4= 120
##$ABSF1= 248.5645
##$ABSF2= -253.2056
##$ABSG= 5
##$ABSL= 3
##$ALPHA= 0
##$AQORDER= 0
##$ASSFAC= 0
##$ASSFACI= 0
##$ASSFACX= 0
##$ASSWID= 0
##$AUNMP= <proc_1d>
##$AZFE= 0.1
##$AZFW= 0.5
##$BCFW= 0
##$BC_mod= 2
##$BYTORDP= 0
##$COROFFS= 0
##$CY= -3
##$DATMOD= 1
##$DC= 0
##$DFILT= <>
##$DTYPP= 0
##$F1P= 0
##$F2P= 0
##$FCOR= 1
##$FTSIZE= 65536
##$FT_mod= 6
##$GAMMA= 0
##$GB= 0
##$INTBC= 1
##$INTSCL= 6.047779e-11
##$ISEN= 30
##$LB= 1
##$LEV0= 0
##$LPBIN= 0
##$MAXI= 10000
##$MC2= 0
##$MEAN= 0
##$ME_mod= 0
##$MI= 50
##$NCOEF= 0
##$NC_proc= -6
##$NLEV= 6
##$NOISF1= 182.463
##$NOISF2= 159.3651
##$NSP= 0
##$NTH_PI= 0
##$NZP= 0
##$OFFSET= 248.5645
##$PC= 4
##$PHC0= -10673.44
##$PHC1= 40.28482
##$PH_mod= 1
##$PKNL= yes
##$PPARMOD= 0
##$PSCAL= 0
##$PSIGN= 0
##$REVERSE= no
##$SF= 81.0140089999694
##$SI= 65536
##$SIGF1= 159.3651
##$SIGF2= -187.1042
##$SINO= 113.3802
##$SIOLD= 16384
##$SREGLST= <1H.CDCl3>
##$SSB= 0
##$STSI= 65536
##$STSR= 0
##$SW_p= 40650.406504065
##$SYMM= 0
##$S_DEV= 0
##$TDeff= 32768
##$TDoff= 0
##$TI= <>
##$TILT= no
##$TM1= 0
##$TM2= 0
##$TOPLEV= 0
##$USERP1= <user>
##$USERP2= <user>
##$USERP3= <user>
##$USERP4= <user>
##$USERP5= <user>
##$WDW= 1
##$XDIM= 65536
##$YMAX_p= 346508087
##$YMIN_p= -9855236
$$ End of Bruker specific parameters
$$ ---------------------------------
##NTUPLES= NMR SPECTRUM
##VAR_NAME=  FREQUENCY,     SPECTRUM/REAL,   SPECTRUM/IMAG
##SYMBOL=    X,             R,               I
##VAR_TYPE=  INDEPENDENT,   DEPENDENT,       DEPENDENT
##VAR_FORM=  AFFN,          ASDF,            ASDF
##VAR_DIM=   65536,         65536,           65536
##UNITS=     HZ,            ARBITRARY UNITS, ARBITRARY UNITS
##FACTOR=    0.620285442955139, 1,           1
##FIRST=     20137.2065510682, 0,            0
##LAST=      -20513.1999529968, 0,           0
##MIN=       -20513.1999529968, -9855236,    0
##MAX=       20137.2065510682, 346508087,    0
$$ Real data points
##PAGE= N=1
##DATA TABLE= (X++(R..R)), XYDATA
$$ [...]
39628I35761k26751n58361k22086L64333O77673L64043l69332p15637j74253O48326
39618G23716P73284K14547j68674q8836j65311p07498j092136p34361N2225N87162
39608f05882O34243L22203j88615n95574n26361q8975J17286j35326l17916L8517
39598a346400O46442R75549R82503Q77757N91962j1269o82834j009842q83533
39589A40335m15773L16259J065332J255955N19391p24847j593881j596332r45797
39580a979358j72319L34570N11137N53182O13982N60142K40648n4094J45389O64000
39570A417279O79114j36137r89896j006734m77101l80910q53382r48865j22386
39561b819018P95822O84529k24120n83757J63795R59227O66298k56722n06697
$$ plain form
39628 935761 709010 150649 -71437 292896 970569 1334612 965280 249643 75390 723716
39618 723716 1497000 1711547 1542873 1454037 1288726 581228 -510908 -1245269 -1193044 -605882
39608 -605882 28361 350564 161949 -433625 -959986 -1048961 -931675 -1067001 -1384917 -1346400
39598 -1346400 -699958 275591 1258094 2135851 2727813 2716544 2033710 1023868 140335
39589 140335 -275438 40821 1106153 2362108 2881499 2156652 562771 -1033561 -1979358
39580 -1979358 -2151677 -1817107 -1305970 -752788 -138806 421336 661984 607890 753279 1417279
39570 1417279 2096393 1960256 970360 -36374 -513475 -894385 -1747767 -2696632 -2819018
39561 -2819018 -2023196 -1338667 -1562787 -2146544 -1982749 -1023522 -357224 -613946 -1120643
39552a120643M2602K62267k53845m74155K67790J013972O90883j40773k73973
39543A4125J73249J80315k85576l12980K44943O00999N23064N08441M19300m63256
39533A602624j734700j851971m32943R16357Q78812J85200J24502N04650L23405
39524E15936l82466o61736k08853L00088L14320O9712J03284N04551P23392K13508
39514A491736n82385m44123P52344J184987m53511k342702j623339J050943J892336
39505I26286l71456k314236j029546J373572J266517p69119j261181L55241J143346
39496f80576k40836j543810q55660N52934P74388K02762J96002O05098M64919
39487e24779o0388j36254J21671Q224l06298n7052O52761R28320N56726K76856
$$ plain form
39552 -1120643 -1078041 -815774 -1069619 -1543774 -1275984 -262012 428871 288098 14125
39543 14125 187374 367689 82113 -230867 14076 615075 1138139 1646580 2065880 1602624
39533 1602624 -132076 -1984047 -2416990 -1500633 -621821 -436621 -312119 192531 515936
39524 515936 133470 -528266 -737119 -437031 -122711 -52999 50285 554836 1278228 1491736
39514 1491736 909351 465228 1217572 2402559 1949048 -393654 -2016993 -966050 926286
39505 926286 554830 -1759406 -2788952 -1415380 -148863 -917982 -2179163 -1823922 -680576
39496 -680576 -921412 -2465222 -3320882 -2767948 -1993560 -1790798 -1594796 -989698 -524779
39487 -524779 -585167 -721421 -599750 -591526 -897824 -954876 -302115 626205 1182931 1459787
39477A459787M31698L54679m73022j402412j409371n39491J45461L3120l12426
39468a711977j59036K91352M07970K64652L83252N76278J54419o24185n54693
39459i71968N87474J326606N34041q14859j007302K9495Q90485P50810J14084
39450A438866k45256r3551L68909O60247K80652n65818r41921m83866q2410m84560
39440a48708j013703p15189K2441K60920K16410P06798J434279J379595N60784
39431B703627j16815m49908q48316j006428l31921N67155N69851j4212k5973K91412
39421A338472k53561j240585r71491M60865J049887L13553P6919R41365R37254
39412B652678q02320j938746o66635J031613N78151q97772o39639Q94753Q54666
$$ plain form
39477 1459787 1891485 2246164 1773142 370730 -1038641 -1578132 -1432671 -1399551 -1711977
39468 -1711977 -1871013 -1579661 -1171691 -907039 -523787 52491 206910 -417275 -971968
39459 -971968 -384494 942112 1476153 661294 -346008 -316513 573972 1324782 1438866
39450 1438866 1193610 1100059 1468968 2129215 2409867 1844049 902128 418262 335852 -148708
39440 -148708 -1162411 -1877600 -1855159 -1594239 -1377829 -671031 763248 2142843 2703627
39431 2703627 2586812 2136904 1288588 282160 -49761 517394 1087245 1073033 1047060 1338472
39421 1338472 1084911 -155674 -1127165 -666300 383587 697140 774059 1715424 2652678
39412 2652678 1850358 -88388 -755023 276590 854741 -43031 -682670 212083 1066749
39403A066749j018017j854064l36664J355266J165863k7251m90713k68960k01850
39394f09641n2852O75860J236732O24928n98095r50927j69685N61727M08130j73610
39384I52567l91624j53231J39595K58721K86253L50866M26406K99511k25010r22292
39374A021762j120048m61472L77544L02944o89954j259798m80487P05442O90495
39365i13572m30492r14299K5883J014057O56630l30420m09177K48129J69475q39116
39355a722902j309867m85655N60011P19176L66622L27871M94587L55432J8146
39346f76579j59319k57600l73424j74433M37936Q88318Q03259O15565O40447L81186
39336B125356m27852r39810l97329M99746N92649O0232m6012L40930K89508m02999
$$ plain form
39403 1066749 48732 -1805332 -2141996 -786730 379133 351882 -138831 -407791 -609641
39394 -609641 -662493 13367 1250099 1875027 1276932 326005 156320 718047 1126177 952567
39384 952567 560943 407712 547307 806028 1092281 1443147 1869553 2169064 1944054 1021762
39374 1021762 -98286 -559758 -182214 120730 -569224 -1829022 -2309509 -1604067 -913572
39365 -913572 -1344064 -2258363 -2232480 -1218423 -561793 -892213 -1301390 -1053261 -883786 -1722902
39355 -1722902 -3032769 -3518424 -2958413 -2239237 -1872615 -1544744 -1050157 -694725 -676579
39346 -676579 -835898 -1093498 -1466922 -1641355 -1203419 -315101 488158 1103723 1744170 2125356
39336 2125356 1697504 757694 360365 860111 1452760 1512992 1466980 1807910 2097418 1694419
39326A694419q22708m62423M4051P9584m1003J80459M92483K96971m14854j013196
39316C3783r73313m07995J01069J41091o5549K1514M42220N84056O2888o30462
39306f90698p28303j22565O72408J194226J267130Q51027J15740n06616p09903
39297A342446o12366m53580k62906k4712J76223L55001N62202N18336r5797q60290
39287F44557r09530k36102K08744L7817m5878K56717J17852p95531j301942n26153
39277b549449M54478K82941l87103l8891J040716J211134J88239o78572p15301
39268a191808n74701n10650N7905R29955R36147m7358n83466J00363Q91171O31510
39258F39068j69171l91135M8690N01032N98511K13905o81577j461940j134138
$$ plain form
39326 1694419 871711 409288 453339 532923 491920 672379 1164862 1461833 1046979 33783
39316 33783 -939530 -1347525 -1246456 -1105365 -1170914 -1149400 -707180 -123124 -60236 -690698
39306 -690698 -1419001 -1541566 -869158 325068 1592198 2443225 2558965 2052349 1342446
39297 1342446 730080 276500 13594 -11118 165105 520106 1082308 1600644 1504847 644557
39287 644557 -264973 -501075 -292331 -254514 -300392 -43675 74177 -721354 -2023296 -2549449
39277 -2549449 -2094971 -1812030 -2199133 -2238024 -1197308 13826 202065 -476507 -1191808
39268 -1191808 -1766509 -2277159 -2219254 -1289299 -353152 -400510 -983976 -883613 7558 639068
39258 639068 469897 78762 127452 628484 1226995 1440900 759323 -702617 -1836755
39249a836755J47930Q99982L60348l96329k61504J83479q4865o10867k48810P97518
39239a049873J229880O45841q3740l27286l53247m00278j76491M27094R28757
39230H40657Q98921M94134J18767p4857j94833l67624n70810o09495l36006O9777
39220B68631K64455K05446J12153j0622k89118m34586k1987N77921M60250l32168
39210H00375o28887N0980O14609J25286o69227o17204j0940J59279J2286L19138
39200A55695P88628M75959l52602m76282J58408K97565m01238p68309k71558k095
39190c95829n90179p92667M59625J928373J712296J86527n88342l4304L32002
39181B217502l75642j009314n00083K62455k2144p88760n26054O19689R77836
$$ plain form
39249 -1836755 -1688825 -788843 -428495 -824824 -1086328 -902849 -987714 -1598581 -1847391 -1049873
39239 -1049873 180007 825848 742108 414822 61575 -338703 -515194 -88100 840657
39230 840657 1739578 2233712 2352479 2277622 2082789 1715165 1144355 534860 198854 268631
39220 268631 533086 738532 850685 840063 550945 116359 94372 672293 1132543 800375
39210 800375 171488 222468 837077 962363 293136 -324068 -335008 -175729 -163443 155695
39200 155695 944323 1420282 1067680 591398 749806 1047371 646133 -122176 -393734 -395829
39190 -395829 -986008 -1778675 -1319050 609323 2321619 2508146 1919804 1885500 2217502
39181 2217502 1841860 832546 332463 594918 572774 -215986 -742040 -122351 855485
39172H55485Q7942n31058P6003P05653J02717p83218l57849P69184O15629q22251
39162G18237j341082K105J404881J198131J83302k44966m62142j266136j687168
39153a494838m49518J320263J328291l39699j348035p29864J01327K34037N59387
39144h18649J391135J316144k05450j301469m99583P68874M73050p36658p96795
39135d09401L36238R06861L56288k34712l64500n34347n95222J10468R24694M58104
39125I54471p73656o84090Q73389J445636j17421j570763p49746J000917J052735
39116A431472m36416j156835m28057J80786k48607p59521m50525K32245O04772
39107a030686O87823N59528j5756q22898j069288m89847K21504M30657L03084
$$ plain form
39172 855485 943427 412369 488372 1194025 1296742 513524 155675 924859 1540488 718237
39162 718237 -622845 -620740 784141 1982272 2165574 1920608 1458466 192330 -1494838
39153 -1494838 -1944356 -624093 704198 364499 -983536 -1713400 -1612073 -1378036 -818649
39144 -818649 572486 1888630 1683180 381711 -117872 651002 1124052 387394 -409401
39135 -409401 -73163 833698 1189986 955274 590774 56427 -538795 -428327 496367 954471
39125 954471 180815 -503275 370114 1815750 1698329 127566 -622180 378737 1431472
39116 1431472 995056 -161779 -589836 -409050 -657657 -1417178 -1867703 -1635458 -1030686
39107 -1030686 -342863 216665 200909 -621989 -1691277 -2181124 -1959620 -1528963 -1225879
39098a225879K66931L89395N02867M35401P0597l77501l83758N2169J02331n43609
39088g11056p41932M19383J673464J097700p56410j372242l2435J166202O59631
39079A402305m37308n78912j34829p1211o4542L97098N04480m62745j388453q49762
39069a683879N08970R62674L37917j36670J55K15291M19839Q40378Q71054j22332
39059B213397j188299q69705L31536N54286m18470q37802J13041J152835J122072
39050B172891M62650j51857q53274j464991j069866L22231J164761M90877o26912
39041D46510p44127k939N81583O99433N70648J60509m14871n50042j19324Q6600
39031G13980k77696l41259M18260R30896J20594j171883j295129k09627O36130
$$ plain form
39098 -1225879 -958948 -569553 -66686 368715 439312 61811 -321947 -269778 -167447 -711056
39088 -711056 -1452988 -1033605 639859 1737559 981149 -391093 -423528 742674 1402305
39079 1402305 964997 386085 251256 180045 115503 512601 1017081 554336 -834117 -1683879
39069 -1683879 -1174909 -212235 125682 -10988 -10833 204458 624297 1464675 2335729 2213397
39059 2213397 1025098 155393 486929 1041215 622745 -215057 -102016 1050819 2172891
39050 2172891 2635541 2483684 1630410 165419 -904447 -582216 582545 1073422 446510
39041 446510 -297617 -300556 281027 980460 1551108 1711617 1296746 746704 627380 713980
39031 713980 436284 95025 513285 1444181 1564775 392892 -902237 -1111864 -475734
39022d75734M97587L6243m8434J12637J24106j37870n93595r23611o51523J25098
39012a935096M81292r4197o75599j22124J041261J197013M3030q45610k16979
39003a127009J156052J613995P37395m28353r19543q05061n13710K7707R51914
38994F93387J515779O48316j265864k195660r31570J068583J530108M32992l59522
38985A136549j67479j57862p76417p61726M09818J161911K81146r62159p95041
38976f31260L32634P92206M54916M09713P44208N38929k72419p49677n09765m5948
38966A063537L07438M85300J19736q73355j540821j029209l8739J91827j68507
38957a482793q4381M01412M43801J86728M55897R29654N32266m32660n12280M07700
$$ plain form
39022 -475734 21853 58096 9662 122299 246405 108535 -485060 -1408671 -2060194 -1935096
39012 -1935096 -1453804 -1548001 -2223600 -2345724 -1304463 -107450 -64420 -910030 -1127009
39003 -1127009 29043 1643038 2380433 1952080 1032537 227476 -286234 -258527 693387
38994 693387 2209166 2857482 1591618 -604042 -1535612 -467029 1063079 1496071 1136549
38985 1136549 969070 811208 34791 -726935 -317117 844794 1125940 163781 -631260
38976 -631260 -298626 493580 948496 1358209 2102417 2641346 2368927 1619250 1109485 1063537
38966 1063537 1370975 1856275 1976011 1102656 -438165 -1467374 -1506113 -1314286 -1482793
38957 -1482793 -1567174 -1165762 -721961 -535233 -79336 850318 1382584 949924 437644 845344
38947H45344Q00832K2178p32116n01641J02105K42911M4092j43550l10895k13368
38937A55892M25696Q82481J32401j185063j266672J4166P31684K3064n08991L94187
38927b01155J393232O66300j188577k052276j173439K78849R52649N30031k94171
38918a088557l72308P35949J834881J332220l49731j073817j67669N07468m06504
38909I51932j539389j059845M28889J026279M03056k52071l32099j96435m1645
38900f11328J63427R8245l46227m78446J57904Q50673Q38838N18916M75221L11189
38890A978412l31033o57563n0934N28901N5661o44458k57995O22404M62598n11846
38880A194147p14191M2880L41707k81831o25017k362O41859L81554l15279m80441
$$ plain form
38947 845344 1646176 1668354 936238 434597 536702 779613 823705 680155 369260 155892
38937 155892 581588 1464069 1596470 411407 -855265 -841099 -109415 -86351 -595342 -201155
38927 -201155 1192077 1858377 669800 -1382476 -2555915 -2277066 -1324417 -794386 -1088557
38918 -1088557 -1460865 -724916 1109965 2442185 2092454 1018637 850968 1358436 951932
38909 951932 -587457 -1647302 -1218413 -192134 210922 -41149 -373248 -569683 -611328
38900 -611328 -447901 -349656 -695883 -1174329 -1016425 -165752 673086 1192002 1667223 1978412
38890 1978412 1647379 989816 938882 1467783 1523444 878986 620991 1243395 1705993 1194147
38880 1194147 479956 522836 864543 582712 -42305 -44667 597192 978746 663467 183026
38870A83026L4722N82012M67854l90295j126070o42745P81661J393317L20317
38861A603799r64610p58690L54160P13848L40265M83659J089478R07782j49213
38852C620478q75310q88079q66994q00323j13474N02121k97457j848273j814584
38843c381895K57806J998449J628324K08784n00266m65283m79936n26866l08413
38834a569296r0445O3162O82379J597572J540081L4156j493074j519413l48226
38825a103104O76522R33365O76486K89384J14109K95990L60948k42193j021895
38816I79612r76976l23042k37852p15224m27095Q31552J454327N54277o22533
38807E17046p61232k49546J31560N87659J224012J203522K52888m86619l39728
$$ plain form
38870 183026 217748 799760 1267614 877319 -248751 -891496 -109835 1283482 1603799
38861 1603799 639189 -119501 234659 948507 1288772 1772431 2861909 3769691 3620478
38852 3620478 2745168 1857089 990095 189772 76298 578419 280962 -1567311 -3381895
38843 -3381895 -3124089 -1125640 502684 711468 211202 -254081 -734017 -1260883 -1569296
38834 -1569296 -1659741 -1596579 -914200 683372 2223453 2257609 764535 -754878 -1103104
38825 -1103104 -426582 506783 1183269 1472653 1586762 1882752 2243700 2001507 979612
38816 979612 2636 -320406 -558258 -1273482 -1700577 -869025 585302 1139579 517046
38807 517046 -244186 -493732 -362172 225487 1449499 2653021 2905909 2419290 2079562
38798B079562l03051j103950j662365r58248J00061K79774O9495M31028Q42100
38789b25594L86956l65088l80129k0582j34491l08261J84629O71667J73598o58412
38779f75707n48778K27805M72115J25092l6330j3043j73994n3752O87415J013902
38769A024725J01131q02419j79340J040816Q84356l72460q35838k99670k34832
38760C26469q25943p75811p171J72436k31924K45738J573033J773063J66299j358746
38750A057443j215680j44925M98883N28050J67671o20286j273985q60767J74026
38741a689570L09533m52754l77098R24243J505636K77320j082753q65090O5171
38732a385362J02257m33005l44297J54465J45924q4462K87159Q82667P87348K88532
$$ plain form
38798 2079562 1776511 672561 -989804 -1948052 -1847991 -1568217 -1498722 -1067694 -225594
38789 -225594 161362 -203726 -583855 -604437 -738928 -1047189 -862560 -190893 -17295 -675707
38779 -675707 -1224485 -996680 -524565 -399473 -435803 -448846 -622840 -676592 10823 1024725
38769 1024725 1125856 323437 144097 1184913 2069269 1696809 860971 561301 326469
38760 326469 -499474 -1275285 -1282456 -1110020 -1341944 -1096206 476827 2249890 2416189 1057443
38750 1057443 -158237 -303162 195721 723771 891442 271156 -1002829 -1863596 -1689570
38741 -1689570 -1380037 -1832791 -2209889 -1285646 219990 497310 -585443 -1450533 -1385362
38732 -1385362 -1283105 -1716110 -2060407 -1905942 -1760018 -1844480 -1557321 -674654 112694 401226
38722D01226L03761O21982L36052l55932l99123J97596K34494o77368j308856
38713f46168n59235Q73111J301740K14714j040911r37470K87388R81061L27064
38704H01294o68784q56108n44370n28147n44033k4220N13925M38072N01908J443869
38694E33406J940088M22123j681998j533467M48079R45235p59441j432571N94171
38685e24375K329174R07123j760037k133621l66429P76871M67859k060k47139
38676e52634p75127q86800L20450J528774P95129r20240q78372R88347J853612
38667A473139M56357j194605j241992m30555j39998k33495n9348J69543J42005
38658a058949K37390O28602P40935L06315r3650n6222Q8340R8625J35880L5215
$$ plain form
38722 401226 704987 1326969 1663021 1307089 907966 1105562 1340056 662688 -646168
38713 -646168 -1205403 -332292 969448 1184162 143251 -794219 -506831 474230 801294
38704 801294 132510 -723598 -1267968 -1796115 -2340148 -2364368 -1850443 -1412371 -910463 533406
38694 533406 2473494 2895617 1213619 -319848 128231 1073466 314025 -1118546 -524375
38685 -524375 1804799 2711922 951885 -1181736 -1548165 -771294 -303435 -305495 -552634
38676 -552634 -1327761 -2214561 -1894111 -365337 429792 -490448 -1368820 -380473 1473139
38667 1473139 1929496 734891 -507101 -937656 -1077654 -1311149 -1370497 -1200954 -1058949
38658 -1058949 -821559 -192957 547978 854293 760643 704421 792761 891386 1027266 1062481
38648A062481n55117j117213o72306M78534Q28759r6110r71970p06792J02439
38639a647295M39745L66014M09643M71441K12772j82766l45983k69267p2574J96239
38629d22031K76537p7407m26962q9557N90968M79412n48477j197601o39429L30211
38619a724336O74611N79067O92183Q32990M57338k23208n72264n79317o99072
38610e62008q77134n43627M14867J262188J179064K21045o21506m34626M94289
38601E32552Q89535J20032q49417p63080J29437N45654J64273p5283K69873L89535
38591A353111l12764j116632j084699m60467j50854l12598k62076L57290R58599
38582a031090P51994j31927n94701O8531R81529O37162q30556j446495j38326
$$ plain form
38648 1062481 507364 -609849 -1282155 -803621 25138 -70972 -1042942 -1749734 -1647295
38639 -1647295 -1207550 -841536 -431893 39548 252320 69554 -276429 -545696 -618270 -422031
38629 -422031 -145494 -222901 -649863 -739420 -148452 330960 -217517 -1415118 -2054547 -1724336
38619 -1724336 -1049725 -470658 221525 1054515 1511853 1288645 716381 137064 -562008
38610 -562008 -1439142 -1982769 -1567902 -305714 873350 1094395 472889 38263 532552
38601 532552 1422087 1542119 692702 -70378 59059 604713 768986 693703 963576 1353111
38591 1353111 1040347 -76285 -1160984 -1621451 -1772305 -2084903 -2346979 -1989689 -1031090
38582 -1031090 -279096 -411023 -1005724 -937193 44336 681498 -149058 -1595553 -1733879
38573a733879J521415J519117K61406m16767k39801m19404j062564r77259r8579
38564a646315K16925k89978k40651P50122J156679K08598o95447m46101j4539
38555a000707l42663m75187M08882R71478r5344j381452p37466J105008J500651
38546d6800l5785j268917p34744N19637J034528P86174L63614n9588k54478K48688
38536E52329J200039J511724O85784m61124r48521p74998n36020n46588o82879
38527b54o21530p8089P79815J227605Q04642N2949j94338k937l6797l47148m35073
38516A148845l46057n90122r82041p39642Q8754M73419K0065m05380j62461J65209
38506a329411m3039k71145J86879Q81435Q76815K70332n9640K4801k18906r73054
$$ plain form
38573 -1733879 -212464 1306653 1568059 1151292 911491 492087 -570477 -1547736 -1646315
38564 -1646315 -1429390 -1719368 -1960019 -1209897 -53218 155380 -540067 -986168 -1000707
38555 -1000707 -1343370 -1818557 -1409675 -438197 -533541 -1914993 -2652459 -1547451 -46800
38546 -46800 -82585 -1351502 -2086246 -1566609 -532081 254093 617707 558119 303641 552329
38536 552329 1752368 3264092 3949876 3488752 2540231 1765233 1229213 682625 -254
38527 -254 -621784 -699873 79942 1307547 2112189 2165138 1970800 1967863 1931066 1583918 1148845
38516 1148845 802788 212666 -769375 -1509017 -1420263 -946844 -926779 -1332159 -1494620 -1329411
38506 -1329411 -1372450 -1643595 -1456716 -575281 301534 571866 512226 537027 318121 -654933
38496f54933j343865o86671L72738Q25383O08991L66876K75638l8763n07399m54678
38486a236683K89054Q79585N81290j78246m88979k33375K0080L5900L9042O9994
38476b22338J6714Q9199M40748N75884R5942k94333K11137P86606o7629j783868
38466a51938j984579j06145J362396N15877j060828q57314O83582J163702J26010
38457c09237n66154K8530O81565K87310n63230q70621n61906K4348P30782J167936
38447D9323P99194j53895q40314j005502j054068q43415K29642J671885J920139
38438G72989N60347q06285p24348K43915P02192M17180O2942j89829o22614r94382
38428e77893p54901m6708M16093L86754K53293K20393L9954l36922m41961P0697
$$ plain form
38496 -654933 -1998798 -2685469 -2312731 -1487348 -878357 -511481 -235843 -274606 -782005 -1236683
38486 -1236683 -947629 -68044 513246 335000 -153979 -387354 -367274 -331374 -292332 -222338
38476 -222338 -205624 -116425 324323 900207 996149 701816 912953 1699559 1631930 -151938
38466 -151938 -2136517 -2242662 -880266 -364389 -1425217 -2282531 -1598949 -435247 -309237
38457 -309237 -875391 -846861 -165296 122014 -441216 -1311837 -1873743 -1849395 -1118613 49323
38447 49323 848517 694622 -145692 -1151194 -2205262 -3048677 -2819035 -1147150 772989
38438 772989 1333336 527051 -197297 46618 748810 1165990 1228932 1039103 416489 -577893
38428 -577893 -1332794 -1379502 -963409 -576655 -323362 -102969 -63015 -399937 -841898 -771201
38418g71201P94795R55664L89175k10112k46391j06350m96214j055455o57428
38409a403517N98429R61467m42609j822867j021854J180889K020930P20618o44705
38400A46781n06318J56020k9251n80147l88601K83328N04965L35002L77229M60298
38390G59306P9122m35106m01873K71R3154j21554j25813J09052J59329r3043m27422
38379d04577o43806m51686L75293J229303R57572l99900j247748p11495k6281
38370a323325m05634q64297M8510J454637J325789j53591p93527J47280J042569
38361D78411O87961j74123o25914q37412q81897k19747P91819P17159o13300j327714
38351b004757k81336J057902R21224p7379k76405K48814J83516n28473o59844
$$ plain form
38418 -771201 23594 979258 1368433 1158321 911930 805580 309366 -746089 -1403517
38409 -1403517 -805088 156379 -286230 -2109097 -3130951 -1950062 70868 791486 146781
38400 146781 -359537 -203517 -232768 -812915 -1201516 -918188 -413223 -78221 299008 759306
38390 759306 838428 403322 1449 1720 94874 -26680 -152493 -43441 115888 22845 -404577
38379 -404577 -1048383 -1500069 -1124776 104527 1062099 662199 -585549 -1297044 -1323325
38370 -1323325 -1728959 -2593256 -2544746 -1090109 235680 82089 -711438 -564158 478411
38361 478411 1166372 992249 366335 -471077 -1352974 -1572721 -780902 -63743 -677043 -2004757
38351 -2004757 -2286093 -1228191 -306967 -384346 -660751 -411937 -228421 -756894 -1416738
38342a416738J38479Q94945R79264P30332M23544m1626l57038L2262Q12884R61117
38332C157425K24099n20523n57300j06803L02899L79190q2041r96973j596786
38323B03187j160163j98999P4061m73015p40240j62447N91249R59955J202306
38314B95894J287152N09256r66167j563913m83519P57555M07258q33492q97989
38305a487965M62991J449794J033881J61802j52968k34135n74560p18217k45401
38296c04778K35627R4826j85137Q5480M88860K37916k99893r6309P33200R19063
38286A908855j8278r62936p72699K25585Q48142N34759k94903q87848p22192J28488
38276a3027P98698L23062r85616j463583j70599J498126J395478l89211j489542
$$ plain form
38342 -1416738 -1278259 -383314 595950 1326282 1749826 1708200 1351162 1383424 2196308 3157425
38332 3157425 3381524 2861001 2303701 2196898 2499797 2878987 2796946 1799973 203187
38323 203187 -956976 -1155975 -1081914 -1554929 -2295169 -2457616 -1866367 -906412 295894
38314 295894 1583046 2092302 1126135 -437778 -921297 -163742 243516 -589976 -1487965
38305 -1487965 -1024974 424820 1458701 1620503 1467535 1233400 658840 -59377 -304778
38296 -304778 -69151 25675 -159462 -73982 414878 652794 352901 256592 989792 1908855
38286 1908855 1890577 927641 154942 380527 1228669 1763428 1468525 580677 -141515 -13027
38276 -13027 785671 1108733 123117 -1340466 -1511065 -12939 1382539 993328 -496214
38267d96214n20241J010828R66701l54223q83031K0133P91164L15891l42453J37900
38257F46455R58418L11546j635671k585383j221399R39670J584955M90386o53796
38248a164819o71739N0823P56103J284175J531354J021815k29484j118726o63756
38239G95746M72052O33861n88493j704350j304317Q4653Q54991N20326P7339K60268
38229A02076N05818O9218o94040q99841m44579Q4238M54772Q28084R45334L56863
38219A307943m71666m48034M00923O76116k47778j053157n11927M57527K92325
38210D02272n26101k60421R83168J221504o5339q91859o270R99285L74955q20067
38200A411127n33941P76482R02689m60635j313127o18776L55295M49167K52619
$$ plain form
38267 -496214 -1016455 -5627 961074 606851 -276180 -256047 535117 851008 508555 646455
38257 646455 1604873 1916419 280748 -2304635 -3526034 -2586364 -1001409 -511023 -1164819
38248 -1164819 -1836558 -1785735 -1029632 254543 1785897 2807712 2578228 1459502 795746
38239 795746 1267798 1901659 1313166 -391184 -1695501 -1610848 -755857 -235531 -158192 102076
38229 102076 607894 677112 -16928 -916769 -1361348 -1277110 -822338 5746 951080 1307943
38219 1307943 836277 388243 789166 1465282 1217504 164347 -347580 109947 402272
38210 402272 -123829 -384250 598918 1820422 1755083 863224 856954 1856239 2231194 1411127
38200 1411127 877186 1653668 2556357 2095722 782595 163819 519114 968281 1220900
38191A220900M89311N76404o4111o80580m02183K95269M57142Q3925l13318p07859
38181I54900j100254r44885r2996N39282L33509R5985O07727J030182K93773p89348
38171I27875o58693L34954M83912l00901l26729Q19897J317239M4061j486072
38162A155543j357228N0734R24436N26128m05246r87764q30348M8843R97297R98944
38152A121339k0953q12925n10093P4727j74232q06213n73143M80194J089089P22241
38142E90031J33367p6047k12116n23991n39462J09976Q96042R83361K78084m98439
38132A140806o49600k18862J26128q1755n05153n09012j83388k40750p51875q10624
38122b684085M6693Q97243O94825j73693n41681j81079J80534K28842L23797N25000
$$ plain form
38191 1220900 1710211 2286615 2222504 1541924 1139741 1435010 1892152 1976077 1662759 954900
38181 954900 -145354 -1090239 -1183235 -643953 -310444 -214459 393268 1423450 1717223 927875
38171 927875 269182 604136 1088048 787147 460418 1280315 2597554 2641615 1155543
38162 1155543 -201685 -150951 773485 1299613 894367 -93397 -923745 -874902 122395 1121339
38152 1121339 1100386 287461 -222632 -147905 -322137 -1128350 -1701493 -1221299 -132210 590031
38142 590031 723398 647351 435235 -88756 -628218 -518242 377800 1361161 1639245 1140806
38132 1140806 491206 272344 398472 316717 -188436 -697448 -880836 -1121586 -1873461 -2684085
38122 -2684085 -2637392 -1740149 -1045324 -1219017 -1760698 -1941777 -1761243 -1532401 -1208604 -683604
38112f83604M74061K88879N08654R79210Q18046j87129j069334j023034m82993
38103c77244l34470o47449p77551l57205L20947P29821N89901N9703l56811k23607
38093a373965L77657R00592Q62451K44951n38150r45710p13819r1632M56814P80407
38083d0404R56955P73616m1915r85331j071298l09907J23836k48347l62948M57466
38073g48277J020870J59727r91091n35091J037367J427482R1594j012126n64979
38064a14524L46959L58374j46396j94647N9014l7137l50284l93678k58330k47469
38054i78118k38449n5543J64787L93951P19184P01810j85177j216310r26136N20995
38044a099006J090424j05020j218964m45080J140333J292714M1306o29252K7930
$$ plain form
38112 -683604 -209543 79336 587990 1567200 2385246 2198117 1128783 105749 -377244
38103 -377244 -711714 -1359163 -2136714 -2493919 -2172972 -1443151 -853250 -793547 -1150358 -1373965
38093 -1373965 -996308 -95716 766735 1011686 473536 -472174 -1185993 -1277625 -820811 -40404
38083 -40404 916551 1690167 1648252 662921 -408377 -718284 -594448 -842795 -1205743 -748277
38073 -748277 272593 432320 -558771 -1093862 -56495 1370987 1462581 450455 -114524
38064 -114524 232435 590809 444413 249766 308780 271643 -78641 -472319 -730649 -978118
38054 -978118 -1216567 -1272110 -1107323 -713372 5812 707622 522445 -693865 -1620001 -1099006
38044 -1099006 -8582 -113602 -1332566 -1777646 -637313 655401 696707 67455 95385
38035I5385O88381K91840n43187p68243k54706M76261Q91064N58533n09565j423071
38025d97308j110765K95220J409197J158217q0926j052826r31962L0832Q61901
38016H1580Q13066J04918l79956j86270K78167M79882L96050J96829r8479l30316
38006A355471j91892J46498R9506l10175l56786K8815j02665r98182j324922j71215
37996a825547J142928Q09491o30300r85658K94519J381159R03304j40874j17367
37987H31655P96879J024302o6605j283360j207816j5772Q07484M21172l59904
37978I48035l83328J38820J49863l84370m22645K48754M98179k28683q39318l34957
37968f09650N51951N55491k05546o48640l81762R9759L13944P2370n06947o60984
$$ plain form
38035 95385 783766 1075606 532419 -235824 -490530 -14269 876795 1435328 925763 -497308
38025 -497308 -1608073 -1312853 96344 1254561 1173635 120809 -811153 -780321 81580
38016 81580 894646 999564 619608 433338 711505 1191387 1587437 1784266 1685787 1355471
38006 1355471 1163579 1310077 1409583 1099408 742622 771437 668772 -329410 -1654332 -1825547
37996 -1825547 -682619 126872 -503428 -1489086 -1194567 186592 1089896 949022 831655
37987 831655 1628534 2652836 2586231 1302871 95055 79283 886767 1307939 948035
37978 948035 564707 703527 853390 469020 46375 295129 793308 564625 -274693 -609650
37968 -609650 -57699 497792 292246 -356394 -738156 -638397 -324453 -252083 -759030 -1420014
37958a420014L76724J764207J475121o62843j984082n94078J616403J658758j57588
37949B072608j079749l43473J40575n61994r39819J06145J313127J083805k17195
37940A574030j088502q55292M2867Q42646R14251J20774r01640j347622j129578
37931a828066o16428J17900R49650J162464L88450m23559k48634L65731L08651
37922A76159j05445J05917M74941j75861j255755j016524L99276R67716J36395
37913b93181l05530O18826J421803P17453n92993r60110m00412J20593K19052
37904E45501O493m05962n73914J6529Q55288P84289j85662p91944n16194j30571
37894c96147k2487K87237O73287L51668l63389k77051L74612J12361q89322p59209
$$ plain form
37958 -1420014 -1043290 720917 2196038 1533195 -450887 -1044965 571438 2230196 2072608
37949 2072608 992859 649386 789961 227967 -711852 -605707 707420 1791225 1574030
37940 1574030 485528 -369764 -326897 515749 1430000 1550774 649134 -698488 -1828066
37931 -1828066 -2444494 -2326594 -1376944 -214480 173970 -249589 -498223 -132492 176159
37922 176159 70714 176631 651572 475711 -780044 -1796568 -1397292 -429576 -293181
37913 -293181 -598711 20115 1441918 2159371 1566378 606268 205856 326449 545501
37904 545501 551994 146032 -427882 -411353 443935 1228224 1042562 250618 -265576 -396147
37894 -396147 -418634 -131397 541890 893558 530169 253118 627730 740091 -149231 -908440
37884i08440N35142O37804j002186j606620L56533K173758J062392j317176j608803
37875a677596N7797R69878M54663J71769N73452L55294o90762j092932k32511
37866a110948P28492P48992Q4754n33748o04350N8281Q54019O14226o53194j247228
37856a060704k67032P14840J43742q09005k23662J143317J036163m87460j161631
37847i71432j40995J026945J068330L68380m02715j048675j164632m66438K88600
37838a442632L17151K98423J095301J720868P56086q78564j072136L1235M20573
37829A246305k50944m07374K31063K17831n40308l55243R61016J397889K32898
37820B733133o83985k38745J80485m46969q82672j99067L27203l11411q53278
$$ plain form
37884 -908440 -373298 264506 -737680 -2344300 -1987767 185991 1248383 -68793 -1677596
37875 -1677596 -1619799 -649921 -195258 -23489 549963 905257 214495 -878437 -1110948
37866 -1110948 -382456 366536 451290 -82458 -686808 -628527 225492 839718 186524 -1060704
37856 -1060704 -1327736 -612896 -469154 -1278159 -1501821 -358504 677659 190199 -971432
37847 -971432 -1112427 -85482 982848 1351228 948513 -100162 -1264794 -1731232 -1442632
37838 -1442632 -1125481 -827058 268243 1989111 2745197 1866633 794497 825732 1246305
37829 1246305 995361 587987 819050 1036881 496573 141330 1102346 2500235 2733133
37820 2733133 2049148 1810403 1990888 1543919 661247 462180 789383 477972 -375306
37811c75306j80111M73535j71673r37015k77296Q78477P86578q4162j64794K79171
37801B27404j04096r20423n35593R77056J766380J024687j40032o94051p60776
37792H40556o07715j38820L91235M42878J26188M0415K22641K12410k0240j53637
37782A355911k38437m20822l54610J43053L82805j69927p73104n46560o0799l13964
37772i96454p60316j65124R57030Q13790o89519j491413l99064J232978J619349
37763A21257Q24861L0668k42153k17922r7956m9973k63691m38269K3779Q64258
37753E54859R70775Q3489n69269j16932N25669J18906q92247j087517k31966N62096
37743h2137N71061J61358j76617m00662m33534p2987M16938M32153n0426l97525
$$ plain form
37811 -375306 -555417 -81882 -253555 -1190570 -1467866 -589389 197189 113027 -51767 227404
37801 227404 123308 -797115 -1332708 -355652 1410728 2435415 2295383 1601332 840556
37792 840556 232841 94021 485256 928134 1054322 1094737 1317378 1529788 1509548 1355911
37782 1355911 1117474 696652 342042 485095 867900 697973 -75131 -621691 -682490 -996454
37772 -996454 -1756770 -1921894 -964864 -151074 -840593 -2332006 -2731070 -1498092 121257
37763 121257 946118 976786 734633 516711 418755 368782 105091 -333178 -309399 554859
37753 554859 1525634 1609123 1039854 922922 1448591 1567497 675250 -412267 -644233 -82137
37743 -82137 488924 650282 473665 73003 -360531 -433518 -16580 415573 365147 -32378
37733c2378l28537k48786l70448l16758M3986J81056j55822l15952K38553R17398
37723c87688Q38405K28117L6676L94997M66806j48905q20026q79162l90179L16431
37713c44528J047727J386262Q21182k69575o68073m0197K84451p52941k024929
37704e60621j636080J62107J137603K99859p15975k15657J029958J084993k17794
37695C68393j151964o57859L89329P29276L75284J06035J04938n0833m03511m58765
37685f49677m7190L10694J48246k69043l32940R0052N54457O29377L23670k4098
37675G33548p4251K18011M56355J12230p61486j329716r01347R0637N86486L46160
37665e23373K08272O94822J078769L97479j058122j937809j388516R4391J344071
$$ plain form
37733 -32378 -360915 -609701 -980149 -1296907 -1252921 -1071865 -1227687 -1543639 -1305086 -387688
37723 -387688 450717 678834 715510 1110507 1577313 1428408 608382 -270780 -660959 -344528
37713 -344528 703199 2089461 2910643 2641068 1972995 1932798 2217249 1464308 -560621
37704 -560621 -2196701 -2034594 -896991 -597132 -1313107 -1528764 -498806 586187 368393
37695 368393 -783571 -1441430 -1052101 -322825 52459 158494 263432 212599 -190912 -649677
37685 -649677 -696867 -386173 -237927 -506970 -839910 -749858 -195401 433976 757646 733548
37675 733548 659297 877308 1333663 1445893 684407 -645309 -1546656 -1456019 -869533 -523373
37665 -523373 -315101 379721 1458490 1855969 797847 -1139962 -2528478 -2434087 -1090016
37656a090016J643198J126354L77402k03792o42479j018378j056411m43665M81895
37647h25892Q65156L41540n13745r32943p00749J6393R62546J570430J138602
37638A921338j71853j089431p04625K64165M77695j32488m44971L6235N01406
37629F57471J77791n27061o93457j69024L19156J39190m95235p77808k44418O25740
37619i87655R25090M14903k55251n01277m45928l60169j09455L42916M90960M7793
37609d38073l41375L4147P49365Q12529J87637k09047N9511M71774N34760L42736
37599B203964J7399n34403j054332r31294j44113M45584J69005n57310q06091
37590a191591k69873N04282P94437M10250j52865k25198K52032N82105J59915
$$ plain form
37656 -1090016 553182 1679536 2056938 1853146 1210667 192289 -864122 -1307787 -825892
37647 -825892 39264 380804 -132941 -1065884 -1766633 -1750240 -787694 782736 1921338
37638 1921338 1749485 660054 -44571 219594 697289 564801 119830 156065 657471
37629 657471 835262 308201 -385256 -554280 -235124 -95934 -591169 -1368977 -1613395 -987655
37619 -987655 -62565 352338 97087 -404190 -850118 -1210287 -1319742 -976826 -485866 -438073
37609 -438073 -779448 -745301 4064 816593 1004230 795183 854694 1326468 1861228 2203964
37599 2203964 2221363 1686960 632628 -298666 -442779 2805 171810 -385500 -1191591
37590 -1191591 -1461464 -957182 -162745 247505 94640 -130558 121474 703579 863494
37581H63494p50569j366563j239999m40939O99806J543932J320508R1265q18541
37572i7606k54772J078464J333651m4583j533205j440847J24430J539647J453698
37563B158877M5152j239765j169074q5152N26306M0007m49267J07577R53641P06330
37553A594632l41554o54131N1351M43040j07889n38115k0517O13383L07770m98511
37543H49459o38952N2367P41476Q11994K84056n64552j278854j246023k88877
37534a277906Q95641J319709O44834o02574j498659j350473k65632Q12736J032467
37525b89857N72263J92121N2168k28559m66198K4792J044310J324878K89586r66641
37515A548863j157691m91713q4857k79245m19152l7276M91502N17078n1608n56017
$$ plain form
37581 863494 112925 -1253638 -2493637 -2934576 -2234770 -690838 629670 720935 -97606
37572 -97606 -352378 726086 2059737 2015154 481949 -958898 -834468 705179 2158877
37563 2158877 2204029 964264 -204810 -289962 236344 276351 -172916 -65339 888302 1594632
37553 1594632 1253078 598947 650298 1093338 985449 447334 426817 1040200 1347970 849459
37543 849459 210507 262874 1004350 1816344 2100400 1535848 256994 -989029 -1277906
37534 -1277906 -382265 937444 1582278 979704 -518955 -1869428 -2135060 -1322324 -289857
37525 -289857 282406 474527 526695 298136 -168062 -143270 901040 2225918 2515504 1548863
37515 1548863 391172 -100541 -185398 -464643 -883795 -921071 -429569 87509 35901 -520116
37505e20116k40473P52449J259218M50751q99286j244593k75474Q02057J027316
37496A111849O71144K39702l34205r64926r71099j58436N16440K40013l90249
37487c9767l02184L99456O90226K01521l97642m82498j52135J86623L08952J83396
37477E95948p4193k18172j34691l8509j65133l75509l29016K8394L80683M18725
37467H8527J56199j17864j42931N1580K22816K42461J78556L8065k39614m32570
37457D5225j53200M50821O68351K42623k26823l41908n51870j071189j084344
37448b022314n6353J006828Q83804K2628l04624p1674j10439k51308K42926P74365
37438A13839R3260j203520j156176L38434J172401M64942q6105P04109J426798
$$ plain form
37505 -520116 -760589 -8140 1251078 1701829 802543 -442050 -717524 84533 1111849
37496 1111849 1782993 2022695 1688490 723564 -247535 -405971 110469 350482 -39767
37487 -39767 -341951 57505 747731 949252 551610 69112 -83023 103600 412552 595948
37477 595948 521755 303583 168892 130383 -34750 -410259 -739275 -710881 -330198 88527
37467 88527 244726 126862 -16069 35511 258327 500788 679344 717409 477795 45225
37457 45225 -107975 342846 1011197 1253820 1026997 685089 133219 -937970 -2022314
37448 -2022314 -2078667 -1071839 -188035 -165407 -470031 -541705 -652144 -903452 -660526 113839
37438 113839 207099 -996421 -2152597 -1814163 -641762 -176820 -262925 441184 1867982
37429A867982N78754q77074j216307o10303k55912j70459K70060O25448J13239
37420C25428o66488m78685N39881J150086Q87271K88928l39568j013326j255549
37411e62022n63652M72486P39484J97931j79116J4864J60386k13058p09856p22155
37401a364708j85510M62927P19837M24273n7976k27894j01209o9684j11226J83724
37391c27446O84300O65591l4517o52751o24022k20329K08621O68014R10824N00779
37381A779064j84859k28883K06026l8377r55142r98666L35512J350636P35915
37372B001226l98120n31135j86054n96066j246523p61293O36526J483286J303669
37363A705516P58077J14213p34713j174787m80199P17676J043720K70857o51418
$$ plain form
37429 1867982 2446736 1569662 353355 -256948 -512860 -683319 -413259 212189 325428
37420 325428 -341060 -819745 -279864 870222 1757493 2046421 1706853 693527 -562022
37411 -562022 -1125674 -653188 86296 284227 105111 119975 280361 67303 -642553 -1364708
37401 -1364708 -1550218 -1087291 -367454 56819 -1157 -229051 -330260 -399944 -511170 -327446
37391 -327446 356854 1022445 987928 335177 -288845 -509174 -300553 367461 1278285 1779064
37381 1779064 1594205 1365322 1571348 1532971 577829 -420837 -85325 1265311 2001226
37372 2001226 1603106 1071971 885917 289851 -956672 -1717965 -1081439 401847 1705516
37363 1705516 2463593 2577806 1843093 668306 188107 905783 1949503 2220360 1568942
37354A568942j113744j149364o62051K94998Q30775J74544r29326j059022j18398
37345b162646P00143P20710L73861J54387P1091L6285l4570k98429n43300j94702
37335a177170O27260Q74545J54889m47488q1935M38451P6458o69760p80300m26477
37325a411527k49762J6229O94643J003906L51420k88724L8442M84579L2588l95810
37315B75984L49647J108565J72381j435684j313560L58727J190898N20702r8920
37306A128740k16861j027609k268940j857491M59140K040685J217391l16606l74141
37297a215692O65048J168697P80701J15222o16120j277186j242709l18528O57140
37288a283427R10697N77411L8926n26526o66591K9765Q95214P76604j75177p19070
$$ plain form
37354 1568942 455198 -694166 -1356217 -1061219 -230444 -55900 -985226 -2044248 -2162646
37345 -2162646 -1462503 -741793 -367932 -213545 -142454 -106169 -140739 -439168 -982468 -1177170
37335 -1177170 -549910 324635 479524 32036 -49899 388552 465010 -204750 -985050 -1411527
37325 -1411527 -1661289 -1645060 -950417 53489 404909 116185 154627 639206 671794 275984
37315 275984 625631 1734196 1906577 470893 -842667 -483940 706958 1227660 1128740
37306 1128740 911879 -115730 -2384670 -4242161 -3783021 -1742336 -524945 -841551 -1215692
37297 -1215692 -550644 618053 1398754 1513976 897856 -379330 -1622039 -1940567 -1283427
37288 -1283427 -372730 204681 243607 -282919 -949510 -919745 -24531 752073 576896 -142174
37278a42174n49029m50898m50427K08607J080304P36020n98423r33314K76798
37269h22536J145568M69680n10180n74520m07234o45710l55091Q69712J416595
37260E86284K08193j143401q01980L62139N12085J978L55295J244279J068149
37251B393021j08954o39456l3801N27014K97664l06262r57319j583081j429441
37242a840615J52364J961018J919841Q2360j207395o88579J36173l56460j268185
37233a109478p23066R79008J603139K60828j181302o41610J272293K028202N51746
37224C039760j369240j503616k4438J056340P59070Q8604N6874J75896l53595
37215A925655j042901q58123l519L11422j45463r8239J250598K586404J858774
$$ plain form
37278 -142174 -691203 -1142101 -1592528 -1383921 -303617 432403 -166020 -1099334 -822536
37269 -822536 323032 792712 282532 -291988 -699222 -1344932 -1700023 -830311 586284
37260 586284 794477 -348924 -1150904 -788765 -276680 -274702 80593 1324872 2393021
37251 2393021 2284067 1644611 1610810 2137824 2435488 2129226 1171907 -411174 -1840615
37242 -1840615 -1688251 272767 2192608 2274968 1067573 378994 515167 158707 -1109478
37233 -1109478 -1832544 -853536 749603 1010431 -170871 -812481 459812 2488014 3039760
37224 3039760 1670520 166904 142466 1198806 1957876 2046480 2103354 2279250 1925655
37215 1925655 882754 24631 21112 332534 187071 88832 1339430 3925834 5784608
37206E784608q90433l124682k691214l57641J309054J106132J51432j79084N3730
37197A161902J23225p4539k53064m07413n24938l39640K5698j2516l70382j42211
37187h13878P26763Q75171l56842j552386j268099j97749K50832K80693P39799
37178a315696R87473j818j190555o12224J364321K297278J199339l87954r69687
37169A370477o98932k09700K30850J72878o64241j362249p82593M93688R19358
37160e30464M22549J97223M14377L01454J41155P56970J297656K44347j520260
37151A725007j609093j28920M32900m13467m27559R99643J468345j09990j385628
37142E51238n75433O71626M79466k02518m798K04928n06699q65217J88767J118827
$$ plain form
37206 5784608 4894175 1769493 -921721 -1279362 29692 1135824 1287256 1108172 1161902
37197 1161902 1285127 1210588 957524 550111 25173 -314467 -288769 -301285 -671667 -813878
37187 -813878 -87115 788056 431214 -1121172 -2389271 -2587020 -2336188 -2055495 -1315696
37178 -1315696 -328223 -330041 -1520596 -2132820 -768499 1528779 2728118 2340164 1370477
37169 1370477 671545 461845 692695 865573 201332 -1160917 -1943510 -1449822 -530464
37160 -530464 -107915 89308 503685 805139 946294 1703264 3000920 3245267 1725007
37151 1725007 115914 -13006 419894 6427 -421132 578511 2046856 1936866 551238
37142 551238 -24195 647431 1126897 924379 919581 1124509 617810 -247407 -58640 1060187
37132A060187L72097q12485o90214o595j53573m23932K00315N67690m60621j317373
37122a664504k95981J054561M49670r05605l15988J484187J414072o35517j593701
37113a008806k83907J052592P48478j40932m12590m78301o50469k10743Q46955
37104e37723J258835N27797k52302k19551J89065L47534J36495n19018j291285
37095c60153r35582J037702K638614J610558r70233j904545n54174N92107K39290
37086A393584o1163N94696O00815r49785k091773j097090N86059P49849j32640
37077d07448k31348M24487N13389R1286K35535P14439L67501n34777n32052M70272
37067A111284R36410K10173n50637l74375J99061L53326J74737k8650l99298q86633
$$ plain form
37132 1060187 1432284 619799 -70415 -77010 -230583 -654515 -454200 113490 -347131 -1664504
37122 -1664504 -1960485 -905924 -456254 -1361859 -1677847 -193660 1220412 584895 -1008806
37113 -1008806 -1292713 -240121 508357 367425 -45165 -523466 -1173935 -1384678 -537723
37104 -537723 721112 1248909 996607 777056 966121 1313655 1450150 931132 -360153
37095 -360153 -1295735 -258033 2380581 3991139 3020906 1116361 562187 1154294 1393584
37086 1393584 1332421 1927117 2527932 1578147 -513626 -1610716 -1024657 -274808 -407448
37077 -407448 -638796 -214309 299080 390366 625901 1340340 1707841 1173064 641012 1111284
37067 1111284 2047694 2257867 1707230 1332855 1531916 1885242 2059979 2031329 1632031 745398
37057G45398r67058n76648l15013k33115L75300J347562J272920j91687j098115
37048C59544Q8812J789788J400041p22910j800079q97611K638m23478q74694j00214
37038a178163Q45004N99476j69655j92051K03480J02337j42871J05619J94238
37029C67414n21136r93770j31793R94025P70166j64388j17471N69716K51017q59681
37019A64099j018986j22351K17319l31892m42065K00439M81959K43352M44160
37010a63966Q17506J06010j149434r56880O05238J215560K27046l61773L38049
37001F77356O17231l77289r02467P9775Q49563M3328q81834l29164O85337N45260
36991A007096k83380n72958m64282m48411k8697Q83057J027522j03078j013596
$$ plain form
37057 745398 -221660 -798308 -1113321 -1346436 -971136 376426 1649346 1457659 359544
37048 359544 448356 2238144 3638185 2915275 1115196 217585 220223 -203255 -1077949 -1178163
37038 -1178163 -333159 266317 96662 -95389 108091 210428 67557 173176 367414
37029 367414 -153722 -1147492 -1279285 -285260 484906 320518 203047 772763 1023780 164099
37019 164099 -854887 -977238 -759919 -1091811 -1533876 -1333437 -851478 -608126 -163966
37010 -163966 653540 759550 -389884 -1346764 -741526 474034 701080 339307 677356
37001 677356 1294587 917298 14831 94606 944169 987497 105663 -223501 461836 1007096
36991 1007096 723716 150758 -313524 -761935 -790632 92425 1119947 1016869 3273
36982C273n96113J02885K4408r099P93249J387818Q08224K3203J11997L66941
36972C016786q6573n74968m35851m49354j064129j088639J52451J237452R12085
36963A619260O9007j47989k58352q40094j032877l00230L07557J68246K25825
36954a89647P39191M06724p65044n89312J457961K543052Q55229j302966j324195
36945A830993k68357k36727n96916P3061P95366J59870p10049k39629N96063K57411
36935A661086m44220k09746J41357l36646m71117N07112P86042p07110j574103
36926f47345J41003K074030J267963q02208q81317O75915J208656M60001J8730
36917C515428j76627r98406j492777o11739K36404l11024o91699N90552J644963
$$ plain form
36982 3273 -592840 -489955 -465547 -474646 318603 1706421 2514645 2537848 2649845 3016786
36972 3016786 2930213 2355245 1919394 1470040 405911 -682728 -530277 707175 1619260
36963 1619260 1688267 1540278 1281926 441832 -591045 -891275 -583718 -415472 -189647
36954 -189647 549544 956268 191224 -398088 1059873 3602925 4458154 3155188 1830993
36945 1830993 1562636 1325909 728993 802054 1597420 1757290 1047241 807612 1403675 1661086
36935 1661086 1216866 1007120 1148477 811831 340714 847826 1633868 926758 -647345
36926 -647345 -506342 1567688 2835651 2033443 1152126 1828041 3036697 3496698 3515428
36917 3515428 3338801 2340395 847618 235879 472283 161259 -530440 60112 1705075
36908A705075N41477p68112O7358J206476k3556j896875j275634O50635O95860
36899I02704m88869j51506J004757L90377j062317m85467J349015J369830j03407
36890B725117k17559R59239R15211l48269o96002k26590o40017j329788n54409
36881E86933P45509N79962j77038L23757J023851J80547p95492m9049P81924k15980
36871B984924j087971K36919J460527J90068j065201M29705K029832O12261j222150
36862D568914r9532J498617K10704j345495K69109K249722R74871p59998N44983
36853H111895J984066O05640J77768L429111N358100L028615K650361P298364
36845C2643920R454940P455903J4199215L2677554L9148755J4262186k2257862
$$ plain form
36908 1705075 2246552 1478440 1545798 2752274 2728718 831843 -443791 206844 902704
36899 902704 413835 262329 1267086 1657463 595146 109679 1458694 2828524 2725117
36890 2725117 2507558 3466797 4382008 4033739 3337737 3111147 2471130 1141342 586933
36881 586933 1332442 1912404 1735366 2059123 3082974 3263521 2468029 2418980 3200904 2984924
36871 2984924 1896953 2133872 3594399 3784467 2719266 3148971 5178803 5791064 4568914
36862 4568914 4469382 5967999 6178703 4833208 5102317 7352039 8326910 7566912 8111895
36853 8111895 10095961 10701601 10879369 14308480 19666580 22695195 25345556 32643920
36845 32643920 42098860 49554763 63753978 96431532 135580287 149842473 127584611
36838A27584611l5307752k2643234j0203039q131576m554097K533389K950323
36831E2228625J425334J0581707J9978128J3424233J3127938N2712930J01547256
36824B65026151Q1481936j6776823r8741491q8366268k7110971J796862n148560
36817A12160836M294712L1269834K6209623j6711201m4770899l2098712j2207547
36810F8146646j2184330j4645795l945098L283336l509373o021228M659334R056978
36802D4840470j11491m47551J4918861J9401870P177896J7165666O4029896R0208901
36794B57184518L9891323n0172183r2116163o2524328j9284236r292753j6980610
36787D6705568j3001723k449287k382162p873272n857059P6877m7300l397589
$$ plain form
36838 127584611 92276859 69633625 59430586 51299010 46744913 49278302 52228625
36831 52228625 53653959 64235666 84213794 97638027 110765965 163478895 265026151
36824 265026151 346508087 329731264 230989773 142623505 115512534 117309396 112160836
36817 112160836 116455548 147725382 173935005 157223804 112452905 80354193 68146646
36810 68146646 55962316 41316521 37371423 40654759 37145386 31124158 35783492 44840470
36802 44840470 44728979 44281428 59200289 78602159 85780055 102945721 166975617 257184518
36794 257184518 297075841 246903658 154787495 92263167 72978931 63686178 46705568
36787 46705568 33703845 31254558 28872396 20999124 15142065 15218942 15171642 11774053
36779A1774053k313559P24235j64996k454146j366691O03296m12677j800013l07250
36770D282252J206556l51902k111308q76839R82345N52337l16776N42120J142281
36761E051066l13620j512777m48574P47802k0347j011546k46055R91220J104020
36752D341189J002791J539664J619904R00840R37064K024136K471986K277754
36744A7115328L488857N532608M603991k97740m881190n446310l542052k374907
36736A4198585k098640j386631o72296q86222j141828k90890Q29960Q34297J11051
36727I497386l4583O05903J433611K352549L610312N009248N927568N557582L189590
36718C7149166o86708l767375l827579j251883J497354K629528J955854k48878
$$ plain form
36779 11774053 9460494 10184729 10019733 7565587 6198896 6802192 6389515 4589502 4282252
36770 4282252 5488808 5136906 3025598 2148759 3131104 3683441 3366665 3908785 5051066
36761 5051066 4737446 3224669 2776095 3523897 3503550 2492004 2245949 3237169 4341189
36752 4341189 5343980 6883644 8503548 9404388 10341452 12365588 14837574 17115328
36744 17115328 20604185 26136793 30740784 30443044 25561854 20115544 16573492 14198585
36736 14198585 12099945 10713314 10041018 9154796 8012968 7722078 8552038 9386335 9497386
36727 9497386 9462803 10068706 11502317 13854866 17465178 22474426 28401994 33959576 37149166
36718 37149166 36462458 32695083 28867504 27615621 29112975 31742503 33698357 33449479
36710C3449479l367001n654272n392615l141712j269505r64534j079014j91222
36702A2389604J466168K646391K855775K888185L590787M245238K886801r30654
36694C2038295m468908m628592k035648j59925n53079j528527j573835j046161
36686A6043620j42823J546525L012593K893679K838293N540254R364024J0712703
36678E1808868J2175744J9998901L0371970K7972635N758109k1338872l2338907
36671I4408448k5010168j4461794j0592628r122633m737810n44113m59499j848339
36663B7631464j084245M66698Q58380K025204N146555P105953O718790R199970
36655E8068769J7809775K4844588J8918031N93172j6238013k0052395j3413600
$$ plain form
36710 33449479 30082478 24428206 19035591 15893879 14624374 13659840 12580826 12389604
36702 12389604 13855772 16502163 19357938 22246123 25836910 30082148 32968949 32038295
36694 32038295 27569387 22940795 20905147 20745222 20192143 18663616 17089781 16043620
36686 16043620 15900797 17447322 20459915 23353594 26191887 31732141 41096165 51808868
36678 51808868 63984612 83983513 114355483 142328118 148086227 126747355 94408448
36671 94408448 69398280 54936486 44343858 35221225 30483415 29939302 29479803 27631464
36663 27631464 26547219 27013917 27872297 29897501 35044056 42150009 48868799 58068769
36655 58068769 75878544 100723132 119641163 120234335 103996322 83943927 70530327
36648G0530327o555068l764414p76198N821994J1770526J0045297J19270j0917663
36640G6274071j6180077j5095469j1257791p377685m351911k865012k937762k980916
36632A3227448j780616n70956r66464j982954j623641l53398j38488q31372o05539
36623D374020M54359M41543o73243o33801J260195K760936K025650O5109j070919
36614I003849p63677J94724O64879p2758j378774j356134P23320K813353K711674
36605A2540456J415910J679372M050190O747456Q513463Q744430N813333j008112
36597D8496498q185491j0433426p268343l605799l010368l805724l128749j399095
36589G659503o39321r28485r14391l33506n6319m62067j041491j077383k20547
$$ plain form
36648 70530327 63975259 60210845 59434647 65256641 77027167 87072464 87191734 76274071
36640 76274071 60093994 44998525 33740734 26363049 22011138 19146126 16208364 13227448
36632 13227448 11446832 10875876 9909412 7926458 6302817 5949419 5810931 4979559 4374020
36623 4374020 4828379 5269922 4596679 3962878 5223073 7984009 10009659 10074768 9003849
36614 9003849 8240172 8434896 9099775 9027017 7648243 6292109 7015429 9828782 12540456
36605 12540456 13956366 15635738 19685928 26433384 34946847 43691277 49504610 48496498
36597 48496498 40311007 29877581 22609238 19003439 15993071 12187347 9058598 7659503
36589 7659503 7020182 6091697 5177306 4843800 4787481 4325414 3283923 2206540 1985993
36580A985993R63553J133902j52616j395935j139010k17145j94199n21635K65279
36571G28187J357915P64661q30430p59829R71758J374562m90337j807568o55802
36562F53117J006384Q13247m28643o99434J6169N31989O56920P39307N05433j11203
36552C683286l19587J39113L13824k84090q27181q13900q81296j162306o93294
36543h45431N90561J181041L99322l99046j57140K28215j64291n51324p4970N04747
36533G11684K31286l74797m36043j73293k0052L22984P71728L15465j093777j639590
36523a384405j80450J646731J557512j84231j402697j102787k78765K860r9151
36514a425383J46257R69011J779342J645727L21379j174355j526261o47830M05823
$$ plain form
36580 1985993 2949546 4083448 3930832 2534897 1395887 1178742 984543 462908 728187
36571 728187 2086102 2850763 2020333 1260504 2232262 3606824 3116487 1308919 653117
36562 653117 1659501 2472748 2044105 1344671 1360840 1892829 2549749 3289056 3794489 3683286
36552 3683286 3363699 3502812 3816636 3532546 2705365 1891465 1010169 -152137 -845431
36543 -845431 -254870 926171 1325493 926447 769307 997522 833231 281907 206937 711684
36533 711684 942970 568173 132130 -41163 -61215 261769 1033497 1348962 255185 -1384405
36523 -1384405 -1564855 81876 1639388 1455157 52460 -1050327 -1329092 -1326232 -1425383
36514 -1425383 -1279126 -310115 1469227 3114954 3436333 2261978 735717 87887 493710
36505D93710Q56754P00921J14042n44552m77236N26142J183537K97416j199290
36496A951444j479110o52146l37144p39679n04770N62175J114457Q28127Q43306
36487A586660J257486P58580o41939j141163k65721J26554r42028j838468j110438
36478b210477K67126Q44828Q29837Q56189N49522k68721o78115k42134J29808
36469G7863n8883j8496N14938N34844k02930m67068J19074K38952n36216p19336
36459e17258K43511O16765n24326j349509l57205R70719P80002o1842J33721P96919
36449G31497M57138l91386l25602L36103L06775k26978j72755K91791J59710m82206
36439F84087p49325n05648j30993M28009J048860R04577j56593q59708l96926
$$ plain form
36505 493710 1350464 2051385 2165427 1620875 1143639 1669781 2853318 3150734 1951444
36496 1951444 472334 -179812 -516956 -1256635 -1761405 -1199230 -84773 743354 1586660
36487 1586660 2844146 3602726 2960787 1819624 1553903 1680457 738429 -1100039 -2210477
36478 -2210477 -1943351 -1098523 -268686 587503 1137025 868304 190189 -51945 77863
36469 77863 18980 484 515422 1050266 847336 380268 499342 738294 202078 -517258
36459 -517258 -273747 343018 -181308 -1530817 -1888022 -917303 -137301 -199143 -65422 731497
36449 731497 1188635 797249 471647 807750 1114525 887547 714792 1006583 1166293 684087
36439 684087 -65238 -570886 -701879 -273870 774990 1679567 1522974 663266 266340
36430B66340K37375O9266k14317J53012M32246l9265l20911L64504R51219M04202
36420B303671l41937j75333J06810n08137j084444l85112Q07668J104921P61363
36411B589470N03432k00169j524940j805549j68902J183371J47153j558452r91149
36402a825735J186087J926807P34719k16611j84973m53726j099780o70313P65739
36393A62214J375051O42036q3983k56919o41614j092063n80029M21732L16253
36384B62678o92852p83788K14589N88169M3205K28661J378576J485031j81092
36375B543177j552214j049530R9313K21313l02638l52136m9221l4403k26591m01015
36365a103945o83687p27668J41453J368770J416944J71960o85420l60485l9761
$$ plain form
36430 266340 503715 572981 358664 511676 943922 904657 583746 948250 1899469 2303671
36420 2303671 1961734 1786401 1893211 1385074 300630 -84482 723186 1828107 2589470
36411 2589470 3092902 2892733 1367793 -437756 -606658 576713 723866 -834586 -1825735
36402 -1825735 -639648 1287159 2021878 1805267 1620294 1166568 66788 -603525 162214
36393 162214 1537265 2179301 2095318 1838399 1196785 104722 -475307 -53575 262678
36384 262678 -430174 -1213962 -999373 -411204 -367999 -139338 1239238 2724269 2543177
36375 2543177 990963 -58567 40746 262059 -40579 -392715 -441936 -476339 -702930 -1103945
36365 -1103945 -1787632 -2515300 -2373847 -1005077 411867 583827 -101593 -462078 -501839
36356e01839m78656n81350M05010J216116N92785o15118r12629l94300l246K63162
36346a010065Q44865J252714P53336k16087o57142n20556m29715l78511J20369
36337b40792Q74664J068265M37175l66044o00383j76233L66018L57604l58067
36328A362207j166189j301029p06804O1377O30704R68066R34467L97880k86571
36319H94108o05495o02838o05672m83155K1008N13944M51499J27157J54196L00667
36309A65419q984m13965k09072J21318m28432j358800j111476L63735J340503
36300a539754R49562K63387K44558M09556K35788J75237M12794K33951m41205
36291I43874m89140M04655P65904l45636j520330j053590M14478J020995N08481
$$ plain form
36356 -501839 -980495 -1561845 -1156835 59281 652066 36948 -875681 -1269981 -1273227 -1010065
36346 -1010065 -165200 1087514 1840850 1624763 967621 447065 17350 -361161 -240792
36337 -240792 633872 1702137 2139312 1773268 1172885 996652 1362670 1720274 1362207
36328 1362207 196018 -1105011 -1811815 -1750438 -1119734 -151668 782799 1180679 894108
36319 894108 288613 -314225 -919897 -1403052 -1382044 -868100 -416601 -289444 -135248 165419
36309 165419 156435 -257530 -466602 -345284 -773716 -2132516 -3243992 -2880257 -1539754
36300 -1539754 -590192 -326805 -82247 327309 563097 738334 1151128 1385079 943874
36291 943874 454734 859389 1625293 1279657 -240673 -1294263 -879785 141210 649691
36282F49691J33034L36737L26014j95982n01367k02108J37053K7534k69332l61035
36272H0239k68314j36121J7537J19625P0066R240J69632M86997P08470P67734
36262B025105O81390K75014m89722j063726p90869J22401O72326K74069n24557
36253A181431p90907l13403L60787P16817O61168K51700m08713r09580p38173
36244A1127p2737J73698l75237p77842n7193J175919J477868P34703K33585M65495
36234B989386L50836p86076j874912j653167m66074M60590O43163L53252p3528
36225e6530j02596P73587J787230J176018j105678k418503q69325J614127J793105
36216B591435k65173j559015o71847P03956Q92359L80950J47024p2697p78802
$$ plain form
36282 649691 782725 1119462 1445476 1249494 748127 546019 683072 710606 441274 80239
36272 80239 -188075 -324196 -306659 -187034 -116968 -107728 61904 548901 1257371 2025105
36262 2025105 2706495 2981509 2491787 1428061 637192 759593 1431919 1705988 1181431
36253 1181431 390524 77121 437908 1154725 1815893 2067593 1658880 749300 11127
36244 11127 -61610 112088 -263149 -1040991 -1098184 77735 1555603 2290306 2523891 2989386
36234 2989386 3340222 2554146 679234 -973933 -1440007 -979417 -336254 16998 -56530
36225 -56530 -159126 614461 2401691 3577709 2472031 53528 -815797 798330 2591435
36216 2591435 2326262 767247 95400 799356 1691715 2072665 2219689 2146992 1368190
36207A368190j444793j291001m05048N83451J226809J300851Q11636J41980l56269
36198A935806p47257r53834m74488M81789N48273p68825j668866n08340J302617
36189h53125J198586m53056r38938L77094J260880N51261j96138J12314K30317
36180A289195p42550j405853n27872O76363N87255k30442k90345L73874P23929
36171D53554N23789J52879l52026q18373n74894L13619O10754k16335r42155n05324
36161a354512L43247N00656K71331L71005M64636O4748k94582j04872N5182k43392
36151G3447k42987N00658R36537K71355m73358k29552J84830l32855r86683n14061
36141h12669L64776J30031p86741p04154M20516J001921M44929k33286k66957
$$ plain form
36207 1368190 -76603 -1367604 -1772652 -1189201 37608 1338459 2150095 2292075 1935806
36198 1935806 1188549 234715 -239773 242016 790289 21464 -1647402 -2155742 -853125
36189 -853125 345461 -107595 -1046533 -669439 591441 1142702 946564 1058878 1289195
36180 1289195 546645 -859208 -1387080 -710717 -123462 -353904 -644249 -270375 453554
36171 453554 977343 1130222 778196 -40177 -615071 -301452 309302 92967 -849188 -1354512
36161 -1354512 -1011265 -510609 -239278 131727 596363 661111 366529 261657 316839 73447
36151 73447 -169540 331118 1267655 1539010 1065652 836100 1020930 688075 -298608 -812669
36141 -812669 -447893 -317862 -1104603 -1808757 -1388241 -386320 58609 -174677 -441634
36132d41634R3081N27383Q51128N54518m52232j101655n87372J49796j05741p22631
36122a235359l73060N67871Q44795P00027J061041J134222l78509k140508j491215
36113a310695J004939J739229m27974k199553q86383J616080K022627L98704p81429
36104A175545n94778j25370P570K12355M97053M04103J07403P8971K9144m70305
36094A321691q06579k15155O10073L65362o88023j030468l00940K56618k6462
36085e13883k61259K35896O73857J83234o49294p09765m8928M22805M01340K73371
36075G374P1774n10351j119921r00261J05168P41580M15730L3998N18229J189978
36065E53298P36940o31226j264023l70335R21606J213687N92190Q6413Q3686J09947
$$ plain form
36132 -441634 -348553 178830 1029958 1584476 1132244 30589 -556783 -406987 -512728 -1235359
36122 -1235359 -1608419 -1040548 -195753 504274 1565315 2699537 2321028 180520 -1310695
36113 -1310695 -305756 1433473 1005499 -1194054 -2080437 -464357 1558270 1956974 1175545
36104 1175545 580767 455397 462967 675322 1172375 1576478 1683881 1762852 1791996 1321691
36094 1321691 515112 299957 910030 1275392 587369 -443099 -744039 -487421 -513883
36085 -513883 -775142 -539246 134611 317845 -331449 -1041214 -1090142 -667337 -265997 7374
36075 7374 79148 -431203 -1551124 -2451385 -2346217 -1604637 -1188907 -1154909 -636680 553298
36065 553298 1290238 659012 -605011 -975346 -53740 1159947 1752137 1838550 1922236 2032183
36055B032183j56213m50217m79687l40855k72791l44926m77031n51853m59842
36046a501232j81754J39622L05601K84723K96712N71828R21455P03616m04166
36037A136405j631905j731767n68001O31717R82920R65816J069903O04002q34385
36028F24705j775625o97544J197389J311045l92516j270292j85863Q75398L42979
36019B9676m59672j0393O37839j5468r49650l68600R52491Q23417o50485j239372
36009a250217j81523R18036Q34628J07909n43277j118074j295737m09582J063600
36000a874237J655036R87971K06525M7053P4088Q6163N12407R96965M36668r53929
35990B174710j469651o02519r680p17170j248706q5038J607280J612831k0854
$$ plain form
36055 2032183 1875970 1425753 946066 605211 332420 -12506 -489537 -1041390 -1501232
36046 -1501232 -1682986 -1543364 -1237763 -953040 -656328 -84500 836955 1540571 1136405
36037 1136405 -495500 -2227267 -2795268 -2163551 -1180631 -214815 855088 1459090 624705
36028 624705 -1150920 -1848464 -651075 659970 267454 -1002838 -1188701 -313303 29676
36019 29676 -429996 -440389 197450 181982 -767668 -1136268 -183777 639640 -10845 -1250217
36009 -1250217 -1431740 -513704 320924 428833 -114444 -1232518 -2528255 -2937837 -1874237
36000 -1874237 -219201 768770 975295 1022348 1096436 1182599 1695006 2691971 3128639 2174710
35990 2174710 705059 102540 92860 -624310 -1873016 -1958054 -350774 1262057 1241203
35981A241203j241946r62072L4351Q23381J253255J119382J9842j573168k297328
35972a583100j500221r0967O26611M02823j0024Q9292O73741J130783R12534J62098
35962H13570l54611j19097M92653P15480L74167m0771j80901k42576m70954o81788
35952C05172n46050j37886R6134r9587m58641n01172n9909N90302J013005Q76011
35942A077379R2599r80445j537334r61136L85118J380856J341027O35669K716
35933A436449k53678j80549Q2863J33766m62398j324668j388991m64260K21350
35924b200116j47078n66463J46208J225737J123615J58010k6258N80809K54601
35915E49065j220368j620531K51090K266514J898471q4716r38344l4812O30953
$$ plain form
35981 1241203 -743 -962815 -928464 -105083 1148172 2267554 2287396 714228 -1583100
35972 -1583100 -3083321 -3174288 -2547677 -2144854 -2154878 -2065586 -1391845 -261062 651472 813570
35962 813570 458959 339862 832515 1547995 1922162 1881391 1700490 1457914 986960 305172
35952 305172 -240878 -378764 -282630 -382217 -840858 -1342030 -1401939 -811637 201368 1077379
35942 1077379 1169978 189533 -1347801 -2308937 -1923819 -542963 798064 1433733 1436449
35933 1436449 1182771 1002222 1085085 1218851 756453 -568215 -1957206 -2421466 -2200116
35924 -2200116 -2347194 -2913657 -2767449 -1541712 -418097 -260087 -286345 294464 549065
35915 549065 -671303 -2291834 -2040744 225770 2124241 2039525 1101181 1066369 1697322
35906A697322j73797j221275j054703j74060N8985m11216n02824J51979P05688
35897i23901M82125q8904k99606k06824k15638j35302M27414R39506L84506r26218
35887e62842j267895L1451J262818P07907o83429p08031O11955J075410j30003
35878C37341j095219k00738J383063J471471j12904j628745j762075p36756M21797
35869a922765Q26357L04511l53369j69466O42587Q28410j2268p33643m36614K31668
35859g94592M15302M58320Q58000R96364L07064l43598l4085L85206l40563j449845
35849D57573j213986N9201L96225n14881q06918K99114J103112L04593q41833
35840g57800o69224L00705N46530O2061o7494K61976K67052n1689L6679M73114
$$ plain form
35906 1697322 1523525 302250 -752453 -926513 -867528 -1278744 -1781568 -1629589 -923901
35897 -923901 -441776 -530680 -830286 -1037110 -1252748 -1388050 -960636 -21130 363376 -562842
35887 -562842 -1830737 -1799286 -536468 171439 -511990 -1220021 -608066 467344 337341
35878 337341 -757878 -958616 424447 1895918 1783014 154269 -1607806 -2344562 -1922765
35869 -1922765 -1096408 -791897 -1145266 -1314732 -672145 156265 143997 -589646 -1026260 -794592
35859 -794592 -379290 79030 937030 1933394 2240458 1896860 1862775 2247981 1907418 457573
35849 457573 -756413 -697212 -300987 -815868 -1622786 -1323672 -220560 84033 -757800
35840 -757800 -1427024 -1126319 -579789 -517728 -585222 -323246 -56194 -107883 -71204 401910
35830D01910M08309k78945p37956n25516j27505J8705J8726o7280l21016l73702
35820a584270K43922J024572R15791Q0697j03887O62718Q00028o27601j960972
35811e49002j159159R39922J572847J2010j491546j098179K14768N86862L3318
35802i38159j35821L65271O25545K48725j56194j18648J53316L62860L48852j67957
35792E87790j118415j519136n11460J039598J281783k0607r73967k50554J013931
35783d71037J027325j3448m41646K93733J011681P15185j26599n17011k46216
35774A231967J60671K13431k12384q93602j280221q40842K69736J125015R70923
35765G44694J48312k98014L2007L48033k04066j178013j263054j51797Q52948
$$ plain form
35830 401910 810219 531274 -206682 -732198 -859703 -840998 -822272 -889552 -1210568 -1584270
35820 -1584270 -1340348 -315776 600015 680712 576825 1239543 2039571 1411970 -549002
35811 -549002 -1708161 -768239 804608 816618 -674928 -1773107 -1558339 -971477 -938159
35802 -938159 -1073980 -708709 -83164 165561 9367 -109281 44035 406895 755747 587790
35792 587790 -530625 -2049761 -2561221 -1521623 -239840 -260447 -1234414 -1484968 -471037
35783 -471037 556288 542840 101194 394927 1406608 2121793 1995194 1478183 1231967
35774 1231967 1392638 1606069 1393685 500083 -780138 -1620980 -1351244 -226229 744694
35765 744694 893006 594992 626999 975032 770966 -407047 -1670101 -1821898 -968950
35756i68950O32975j09042Q525Q00196Q03902k45656q17797K9716J127259R96349
35746B257477j2473n72355m45191l43959l92486j70828R3476j62806n31140j05720
35736c86005P60640P11575l70672r30247j09564Q73137N94597n00525r88140n74156
35726i19360j20019m9019R3228N73092R00883N12831m76887j309693j179437N495
35716a968886J259650J316046J11029r82575q36673L2915L50358j41528o27697
35707a487361o29791m76952l81579j0097P44563J323277J242380P47941L57806
35698A430187J74791P426j87052l44936n10538o75679o14687j79043L95820P09178
35688B05467N85605J26763l76797m69230J27773R28162R04028k31817j378167
$$ plain form
35756 -968950 -335975 -445017 -436492 363704 1167606 921950 104153 133869 1261128 2257477
35746 2257477 2245004 1672649 1227458 883499 491013 320185 413661 250855 -280285 -386005
35736 -386005 374635 1086210 715538 -214709 -324273 548864 1143461 642936 -345204 -919360
35726 -919360 -1039379 -1088398 -995170 -422078 478805 991636 514749 -794944 -1974381 -1968886
35716 -1968886 -709236 606810 717839 -264736 -1101409 -1068494 -718136 -859664 -1487361
35707 -1487361 -2117152 -2594104 -2975683 -2985780 -2241217 -917940 324440 1072381 1430187
35698 1430187 1604978 1612404 1425352 1080416 569878 -105801 -720488 -899531 -503711 205467
35688 205467 791072 917835 541038 71808 199581 1127743 2031771 1799954 421787
35679D21787j329738l93170J13042j87764l31825K47408P15559K08663p17746
35670a253784r39228m26385n418J37067N40196J196376J400631J007956O86495
35661B343906N99566N334j243889j919916j062896M30152R44593L25327k06085
35652B16092J2243L75781K01682l94131r41527j118417o82498L40449J253139
35643g37187J194960K52444n72112o52378l42372j38601K3620L31134O01461O08157
35633E69126M02466M3810m73028q14048m69008L67805P34751J59037o01577n76587
35623f57253J26391N63410J59474p37103j262652q07705K94228Q68233K83644
35614a169333l91613L25454J848428J858021k54118j979708j084748J038362J346140
$$ plain form
35679 421787 -907951 -1301121 -1188079 -1375843 -1707668 -1460260 -744701 -536038 -1253784
35670 -1253784 -2193012 -2619397 -2624815 -2487748 -1947552 -751176 649455 1657411 2343906
35661 2343906 2943472 2948806 1704917 -214999 -1277895 -847743 96850 422177 216092
35652 216092 228335 604116 805798 411667 -529860 -1648277 -2330775 -1990326 -737187
35643 -737187 457773 710217 138105 -514273 -856645 -995246 -971626 -640492 -39031 569126
35633 569126 971592 1015402 542374 -271674 -740682 -372877 361874 520911 -80666 -657253
35623 -657253 -530862 32548 192022 -545081 -1807733 -2615438 -2321210 -1452977 -1169333
35614 -1169333 -1560946 -1235492 612936 2470957 2216839 237131 -847617 190745 1536885
35605A536885m46028j701209q61033O80304J089843M58233j89761o22520j044195
35596a099481j143925n82140K74576Q67284J063896P82060j38704j136050j011722
35587b124206L88998J532169J171578J01107j66736L02148K34929o47463j254303
35578d61779q99997j64238K41168M10873O76742Q82329O62088O455p06269r83109
35568c35737n47701K81290P12449L88555r1860n4777K35615J58465p5689J69266
35558H39876N90593K21136q41079j252858l86358O96143Q48191L73368J64515
35549A253527K43126J42581P673J86419K43653m07893j188929r46449J66554O99822
35539D00084N9695n82348j20003Q08829Q46608j09812r39249q99836k80159L50465
$$ plain form
35605 1536885 1090857 -610352 -1471385 -791081 298762 756995 567234 -55286 -1099481
35596 -1099481 -2243406 -2825546 -2550970 -1683686 -619790 162270 23566 -1112484 -2124206
35587 -2124206 -1735208 -203039 968539 1069646 902910 1205058 1439987 792524 -461779
35578 -461779 -1361776 -1526014 -1284846 -873973 -197231 685098 1347186 1353641 647372 -335737
35568 -335737 -883438 -602148 110301 498856 406996 352219 587834 746299 670610 839876
35558 839876 1430469 1651605 810526 -442332 -828690 -132547 715644 1089012 1253527
35549 1253527 1496653 1639234 1646907 1833326 2076979 1669086 480157 -466292 -299738 400084
35539 400084 459779 -122569 -242572 566257 1412865 1303053 363804 -536032 -816191 -465726
35529d65726O82885N21966r8528o03009l92394K48672M58852P4921k01686n2715
35519A73238j6029l62636n04626j31154M6406m49115p65852l2176R70600Q44081
35509b27263j76397n65242M8699M25534r5449n63341j33665N88250O94577L32898
35499C28601J24826J60189K63055L93244K45259n49410j333034q08498Q19603
35490c56165J553571M11641r96367r42686n7385K53416K81234Q54780J109992
35481B112031o7138j398989q40275P76165P72594q81382j395959J19294J141661
35472C38002N4161j208308n90203P63239Q12741J7302j1006M82441K41660m00028
35462E00001k20638M77464M54607j48746k61149n3054m68929j057307n44875O57843
$$ plain form
35529 -465726 217159 739125 640597 37588 -354806 -106134 352718 427639 225953 173238
35519 173238 157209 -205427 -710053 -841207 -794801 -1243916 -2009768 -2041944 -1071344 -227263
35509 -227263 -403660 -968902 -920203 -494669 -590118 -1153459 -1287124 -698874 -4297 328601
35499 328601 453427 613616 876671 1269915 1515174 965764 -367270 -1175768 -356165
35490 -356165 1197406 1609047 612680 -330006 -387391 -133975 147259 1002039 2112031
35481 2112031 2044893 645904 -194371 581794 1354388 473006 -922953 -803659 338002
35472 338002 392163 -816145 -1406348 -643109 169632 186934 175928 658369 900029 500001
35462 500001 279363 756827 1211434 1062688 801539 748485 279556 -777751 -1322626 -664783
35452f64783Q34122j19674m31554N68378J393729R29030J433l97899o53045j266248
35442A93489j614494j104121l26824L2265L67501J164652J804825J475450N19496
35433B512239j59978l79942m17205j87799K62069J32290j012786j995160j302690
35424b548962N55188J426877M53829p56007m85259P36342J126495K49879o16970
35415A41412n32017o7366q6845l49746j28762L87041L46922k46584l42419N61771
35405c16593J533923J461552N04148l51073o46178o56259o44042o46186p27022
35396d87730p95657m76568K13480N11836J5646l93166K11513J119528R29840r8263
35386G50459l25137N27943P84697m01399j489025r54435K74920L75672m86169
$$ plain form
35452 -664783 169339 49665 -381889 186489 1580218 2509248 2510681 2112782 1459737 193489
35442 193489 -1421005 -2525126 -2851950 -2819685 -2452184 -1287532 517293 1992743 2512239
35433 2512239 2352261 1972319 1555114 1367315 1629384 1761674 748888 -1246272 -2548962
35424 -2548962 -1993774 -566897 -113068 -869075 -1354334 -617992 508503 758382 141412
35415 141412 -390605 -457971 -544816 -894562 -1023324 -636283 -289361 -535945 -878364 -316593
35405 -316593 1217330 2678882 3183030 2831957 2185779 1529520 885478 239292 -487730
35396 -487730 -1283387 -1759955 -1546475 -1034639 -1018993 -1412159 -1200646 -81118 848722 750459
35386 750459 425322 953265 1737962 1336563 -152462 -1106897 -831977 -456305 -942474
35377i42474o55184K27163Q20051L68661l41052n60212n60491n39667M8521J249988
35367h84696J821697P71838r83638j590910n83545P11685J007342M33347p3658
35358F29462o7439J15392K8089l10803n22606l98068j85657k22651l60030j09762
35348a404073N21973Q00560K17636p08800j083892p47316j30538O22676J490363
35339d21411J760440O26486j217985j903668q86668J56651j54318p79868o7011
35330b887352J374575J535444K46723n86615p4154M89317J43958j19544N52591
35321F74943R47983l34882k237350k389182m41125J478234J618658M95722l14517
35312e01516j40818M55830O14092L6454p60192r52390l58434L03464L51448k7641
$$ plain form
35377 -942474 -1597658 -1370495 -550444 -181783 -522835 -1083047 -1643538 -2183205 -2134684 -884696
35367 -884696 937001 1708839 725201 -865709 -1449254 -737569 269773 703120 629462
35358 629462 562023 677415 705504 394701 -127905 -525973 -711630 -934281 -1294311 -1404073
35348 -1404073 -882100 -81540 136096 -572704 -1656596 -2403912 -2534450 -1911774 -421411
35339 -421411 1339029 1965515 747530 -1156138 -2042806 -1886155 -2040473 -2820341 -2887352
35330 -2887352 -1512777 22667 269390 -317225 -391379 97938 241896 122352 674943
35321 674943 1622926 1288044 -949306 -3338488 -3779613 -2301379 -682721 -186999 -501516
35312 -501516 -642334 -186504 427588 464042 -296150 -1248540 -1606974 -1303510 -952062 -979703
35302i79703k47672j79396m0509J34963L52048L82134J91605K03778N75236P52471
35292A144955L90359O8502K79800L97056k81868j054448o99927M81562R32533
35283A658524J30364p31955o10717K3695J55676l30108p28485n36379J6196K75610
35273f77579o9792m94881k55845L99147M08305l45175n52929M05840J084465Q6165
35263a2279j470515j418097J89930J295941J033663N98573Q25710R58750L40993
35254B342669m25314o80350o63483o96540o10861l81832k27387N6920O72569Q78517
35244B64908o240r00768k05699J345740J394927k72630j250849m32214L35592
35235B72767l51823j104100m45698N47428L40154l71664k10158L79588L39261
$$ plain form
35302 -979703 -1227375 -1406771 -1447280 -1312317 -960269 -578135 -386530 -182752 392484 1144955
35292 1144955 1535314 1603816 1883616 2280672 1998804 944356 244429 725991 1658524
35283 1658524 1788888 1056933 446216 469911 625587 295479 -433006 -969385 -953189 -677579
35273 -677579 -747371 -1242252 -1498097 -1098950 -690645 -1035820 -1588749 -1182909 -98444 -12279
35263 -12279 -1482794 -2900891 -2710961 -1415020 -381357 217216 1042926 2001676 2342669
35254 2342669 1917355 1237005 573522 -123018 -733879 -1115711 -1343098 -1286178 -613609 264908
35244 264908 258668 -642100 -847799 497941 1892868 1620238 369389 -62825 272767
35235 272767 -79056 -1183156 -1628854 -1081426 -741272 -1112936 -1323094 -943506 -604245
35226f04245J55198O01794P73100l05749j386927p74330O75908Q53999j56730
35217a67982n18712R1885K91877k44069l85541J20556K78710j11929k24859p4635
35207i44699m51609r24239j90611J317175J506924j42466j601861j286324m2472
35198b760182O81583P82311O70555K09624m51260m45756L73047Q52845L28421
35189B41188k77420o5801L87703K31843j57541j0255M21879L86673j24166n74506
35179D59597p07028m45625K99870J053888Q46089l61174j179838o30986L47981
35170c17226K85245o23328r22214j43014N88700K39148p87817j272412o24572
35161c577490N40913J097235O03878k32088m59125o9229J88988L7247m8563J69932
$$ plain form
35226 -604245 -449047 152747 925847 620098 -766829 -1541159 -865251 -11252 -167982
35217 -167982 -686694 -594809 -302932 -547001 -932542 -811986 -533276 -645205 -870064 -944699
35207 -944699 -1396308 -2320547 -2511158 -1193983 312941 170475 -1431386 -2717710 -2760182
35198 -2760182 -2078599 -1296288 -625733 -416109 -867369 -1313125 -940078 -87233 241188
35189 241188 -36232 -102033 285670 517513 359972 349717 771596 1158269 1034103 459597
35179 459597 -247431 -693056 -393186 660702 1506791 1145617 -34221 -665207 -317226
35170 -317226 -31981 -655309 -1577523 -1720537 -1131837 -892689 -1680506 -2952918 -3577490
35161 -3577490 -3036577 -1939342 -1335464 -1567552 -2026677 -2095906 -1906918 -1869671 -1918234 -1748302
35151a748302K97923J57687J43816L38020J83973l96893m81346M65771J445909
35142D06558J154109j49738j002826p01430N2735L79830K09667p5853k70023l40867
35132c37838k53504m7743J39433K52348L54666M54038M40162K18580j85960o24646
35122D09536q50199o41888m1166N65329P22671L41304j56055k24372J73058M61868
35112G60086K11588j95127j17842K57188J57578l79606l77766L84301O96619j89195
35102A207824j086955o08717N07201M93559n36266p49197L39345J006536J09258
35093F82588j106720j013661K1434N30281K04673p3357J05647K34769l9800l50569
35083h04715k04568L77543Q86689P89427Q2683n50393m16093L26573Q28587N60193
$$ plain form
35151 -1748302 -1450379 -1292692 -1148876 -810856 -626883 -1023776 -1505122 -1039351 406558
35142 406558 1560667 1410929 408103 -293327 -240592 139238 348905 273052 3029 -337838
35132 -337838 -591342 -639085 -499652 -247304 107362 561400 1001562 1220142 1034182 409536
35122 409536 -440663 -1082551 -1123717 -558388 164283 505587 349532 125160 298218 760086
35112 760086 971674 776547 658705 915893 1073471 693865 316099 700400 1397019 1207824
35102 1207824 120869 -487848 19353 512912 -23354 -772551 -433206 573330 682588
35093 682588 -424132 -1437793 -1416359 -886078 -681405 -754762 -649115 -414346 -454146 -804715
35083 -804715 -1009283 -631740 254949 1044376 1127059 576666 160573 487146 1315733 1875926
35073A875926k28110r17293r14007P7205J476368J865392N52518j194235j608835
35064I84929q19588l49864m68343M3325J252669J395782k29205j663554j031720
35055h85569O51062J080782l4822j002205p71450Q2811O65725O92554K65331k78752
35045D65467m58025k43660j62923l33067j80262L21039K48174n92382q79702J32551
35035a682790J050687M31738p42590n73468P11928J328751Q70798M26591J87508
35026B009153o33673j572035j128348M30067R60008j45710q33880K02515J265987
35017E54084M54365j141538j121857N10603J483393O31881p63832j062928k05935
35008f61764P36064R29430L24330n44307j010452q14240k48777L11886P52731
$$ plain form
35073 1875926 1647816 730523 -183484 -106279 1370089 3235481 3787999 2593764 984929
35064 984929 165341 -184523 -652866 -609541 643128 2038910 1809705 146151 -885569
35055 -885569 -234507 846275 811453 -190752 -962202 -879391 -213666 478888 744219 465467
35045 465467 7442 -236218 -399141 -732208 -912470 -591431 -343257 -935639 -1815341 -1682790
35035 -1682790 -632103 -200365 -942955 -1516423 -804495 524256 1395054 1821645 2009153
35026 2009153 1375480 -196555 -1324903 -894836 65172 -80538 -914418 -711903 554084
35017 554084 1008449 -133089 -1254946 -744343 739050 1370931 607099 -455829 -661764
35008 -661764 74300 1003730 1328060 783753 -226699 -1040939 -1289716 -977830 -225099
34999b25099R36547N89288j58084o02811l41774J07362P7384k66952l20640n4902
34989b59681N2422j11220j83151J891K60263N40418R32537J167173P51560j92721
34979B959491p95040m99420J32569J28903n93294j141287q86968k85747j18626
34970a099419k80430K0475Q56500J178266K94209r15170j101985l53633J03345
34961a297842l2022K62419J288131J627078K25052j620733j820204m44730N00710
34952a312141J16560l05827L51935J202546Q68214l34358r60396n21024J78086
34943g16405M00039J18565m40146r13083p07870K05949P08255r8962j211072q85568
34933c540298O13368J241438M10926r8671O84621J069201l47073j855375j127793
$$ plain form
34999 -225099 711448 1300736 1142652 539841 198067 305429 382813 115861 -204779 -259681
34989 -259681 -207259 -318479 -501630 -499739 -239476 300942 1233479 2400652 3152212 2959491
34979 2959491 2164451 1665031 1797600 1926503 1333209 191922 -695046 -980793 -1099419
34970 -1099419 -1379849 -1359374 -502874 675392 969601 54431 -1047554 -1401187 -1297842
34961 -1297842 -1329864 -1067445 220686 1847764 2072816 452083 -1368121 -1812851 -1312141
34952 -1312141 -1195581 -1501408 -1149473 53073 921287 586929 -373467 -894491 -716405
34943 -716405 -316366 -197801 -637947 -1551030 -2258900 -2052951 -1344696 -1443658 -2654730 -3540298
34933 -3540298 -2926930 -1685492 -1274566 -1373237 -688616 380585 33512 -1821863 -2949656
34924b949656Q85169J354688R2219m16457N93192R76859l56811j372156l50618
34915a543571J157058R01845m75605p52202L08523J055015Q10209L78344J07866
34906A947482m26467r04766m10216O95283Q18856m67378j570252j072337L72150
34897a017645J082512N06593l88846m98656J69921O10299R6942p66085p26619
34888i31584L25045J093771Q07755L22560M77263N37139l84207j389004j057824
34879a99086N9836K43084m89403m93960M59732O58342m72457j078595J59968J719984
34869E67445J451929k95420j435450j100671k03999M24419Q74701J167435P51604
34860B201993n37195j701992j383863M94221K178411J750429m42553j832098q43311
$$ plain form
34924 -2949656 -2064487 -709799 -617580 -1034037 -440845 536014 179203 -1192953 -1543571
34915 -1543571 -386513 515332 39727 -712475 -403952 651063 1461272 1839616 1947482
34906 1947482 1521015 616249 206033 901316 1720172 1252794 -317458 -1389795 -1017645
34897 -1017645 64867 571460 182614 -316042 -146121 464178 561120 -204965 -931584
34888 -931584 -606539 487232 1294987 1617547 2094810 2631949 2247742 858738 -199086
34879 -199086 -139250 103834 -385569 -879529 -419797 238545 -233912 -1312507 -1152539 567445
34869 567445 2019374 1723954 288504 -812167 -1016166 -591747 282954 1450389 2201993
34860 2201993 1664798 -37194 -1421057 -926836 1251575 3002004 2559451 727353 -115958
34851a15958Q53699O89744r87221j515044r9023J096897N49281m34605k87498
34842b49728L21324J83873j92639M8956J26762q53752j694961p64847J073364
34833b001648J583700O03869l3236L06833L93756l02558p50884m58118k81788
34824i40074n46316l13435O92717J217707M79244m92423n14583P5452M10357N35984
34814F04630P73396O91515r2469q72409p76519j70607m9566m16692l39828M72429
34804a76120J065965M60488r85586j761603q41649R37282J576940L30538j187962
34795e81707j086672K17047P67774O1314m35423J27276P15063L83319j66015l782
34785a806M64642M89964L13487L47248J66075m54432o33204J05484N36009m37370
$$ plain form
34851 -115958 737741 1427485 440264 -1074780 -1173803 -76906 472375 37770 -249728
34842 -249728 71596 255469 62830 111786 238548 -615204 -2310165 -3075012 -2001648
34833 -2001648 -417948 185921 152685 459518 853274 550716 -200168 -658286 -940074
34824 -940074 -1486390 -1799825 -1107108 110599 589843 97420 -417163 -341711 68646 604630
34814 604630 1378026 2069541 1977072 1104663 328144 157537 107971 -308721 -648549 -176120
34804 -176120 889845 1350333 364747 -1396856 -2238505 -1301223 275717 606255 -581707
34795 -581707 -1668379 -1451332 -683558 -622244 -1057667 -930391 -215328 167991 1976 -1806
34785 -1806 462836 952800 1266287 1613535 1779610 1325178 691974 797458 1333467 896097
34775H96097j652949j269039K92613J045507O01773M08816R35232R48651j1878
34766B194823o47961k03320J70339n40167j399859j085789l0702M10623R8562
34757a033451J2002M86391Q31322N90981J78127J41612M39590N82561K06749n03979
34747A931905r12214o44440j45047p4738k67744j4300O08135O40693k31581j025416
34737a34747q45259p8152L82819L28354J7898m60046q98432p45667O0056O54794
34727a718382M15566m7279J36658P37077R09014N05399K0970k83001l47522L9484
34717C67984O70547O17840m68029j424229j141512l68254m60072r43605k23301
34708c372631J510877K199783J042019l29773m95352j65837l93118n89264J48376
$$ plain form
34775 896097 -756852 -2025891 -1733278 -687771 -85998 322818 1258050 2206701 2194823
34766 2194823 1546862 1343542 1513881 973714 -426145 -1511934 -1542636 -1132013 -1033451
34757 -1033451 -1021449 -535058 296264 887245 1065372 1206984 1646574 2229135 2435884 1931905
34747 1931905 1019691 375251 230204 155466 -112278 -126578 481557 1122250 890669 -134747
34737 -134747 -980006 -1058158 -675339 -346985 -329087 -789133 -1687565 -2433232 -2373176 -1718382
34727 -1718382 -1302816 -1350095 -1213437 -476360 432654 938053 959023 676022 328500 367984
34717 367984 1038531 1656371 1188342 -235887 -1377399 -1745653 -2205725 -3149330 -3372631
34708 -3372631 -1861754 338029 1380048 1050275 554923 389086 -4032 -593296 -444920
34699d44920J006526N28355r43855j597352p44311L73207N27053N6499K8749O30034
34689e80015R93586L99296p57853j350147q50945r165J58572k09576j13880O55065
34679a665062J119267O39473j46647m33250l56702l11721q3335M43296N78722
34670b15959l9869l77850N53498J742180J313833n55119j638048q47857L07768
34661B42577J89678o10380n56998L31116P55695L14697r9591K5252R4926l60864
34651C26108q03662n71838O9369L60119R1249l23133n35361n14273k56132K58478
34641a899076P94933R29546N13931j10216m24170j71481M38503Q16139M16988
34632A305097o49133j503859j297951j43263R69167J154360L65483o82613j047495
$$ plain form
34699 -444920 561606 1089961 146106 -1451246 -2195557 -1822350 -1295297 -1238798 -1210049 -580015
34689 -580015 413571 812867 55014 -1295133 -2146078 -2155243 -1996671 -2206247 -2320127 -1665062
34679 -1665062 -545795 93678 -52969 -486219 -842921 -1154642 -1237977 -794681 -215959
34670 -215959 -255828 -633678 -80180 1662000 2975833 2420714 782666 -65191 242577
34661 242577 432255 -178125 -735123 -404007 351688 666385 566794 592046 686972 326108
34651 326108 -477554 -1049392 -980023 -619904 -528655 -851788 -1387149 -1901422 -2157554 -1899076
34641 -1899076 -1104143 -174597 339334 229118 -195052 -366533 71970 888109 1305097
34632 1305097 655964 -847895 -2145846 -2289109 -1319942 -165582 199901 -482712 -1530207
34623a530207k84686R30854J222051J49579r43328o15051N20833O57774l16083
34614b08264n68491O02513J398092L42095j304099j580578p97795m76583n23729
34605c116839J71606J106230P58893m40527m20774J039501J743100N93662p97229
34596F37623r14695m15958k80580j04154M19202L92468l99282m92839O98937J330164
34586H70886Q4923j234853m76971J171027J047876o27346j287621k60180N68173
34577a44086K20213j31252K59666M92068K8086k96298j2444J36705k22357m12662
34567h2361k00605k52977n55811j84192P20318O59524o67866j431516m42750R06133
34557a532103Q78249K936j86156K43993J21963n32435n54261L14154R81948O61586
$$ plain form
34623 -1530207 -1814893 -884039 338012 487591 -455737 -1070788 -549955 107819 -208264
34614 -208264 -776755 -174242 1223850 1565945 261846 -1318732 -2116527 -2593110 -3116839
34605 -3116839 -2945233 -1839003 -1080110 -1520637 -1941411 -901910 841190 1434852 637623
34596 637623 -277072 -693030 -973610 -1077764 -658562 -266094 -665376 -1158215 -459278 870886
34586 870886 955809 -279044 -756015 415012 1462888 835542 -452079 -712259 -144086
34577 -144086 76127 -55125 204541 696609 724695 428397 415953 552658 330301 -82361
34567 -82361 -282966 -535943 -1091754 -1275946 -555628 103896 -563970 -1995486 -2438236 -1532103
34557 -1532103 -653854 -650918 -837074 -593081 -471118 -1003553 -1557814 -1243660 -261712 399874
34547C99874j97659p46334o64227j56510L67982N33152K66799j70381n15683o19027
34537a502014k80607M75561R84454N71829l14617n26117O9274L77294r2933m19987
34527f57863J26892Q90958J020619P27584M57763q5812j030617j472764p49322
34518g72562K80947M76931J54341K71826O14790K88766m86989o33469m244N15017
34508G05354N39438M48103K47712m12264j097998q90756J6562L77827j92626o74486
34498i33134l77750O0334l2087k39204L5477M69769M35609M8439j35600n553J35343
34487e38357J37885O5201l3746p2977P2417L15466M31101M77894P09354R88496
34477B552734Q29937J49885n82665j044305j277873j145174l85867N45815O30181
$$ plain form
34547 399874 202215 -544119 -1208346 -1364856 -996874 -463722 -196923 -367304 -882987 -1502014
34537 -1502014 -1782621 -1307060 -322606 249223 -65394 -591511 -522237 -144943 -237876 -657863
34527 -657863 -530971 359987 1380606 2108190 2565953 2480141 1449524 -23240 -772562
34518 -772562 -491615 -14684 139657 411483 1026273 1315039 828050 194581 190337 705354
34508 705354 1244792 1692895 1940607 1528343 430345 -460411 -443849 -66022 -258648 -933134
34498 -933134 -1310884 -1250550 -1282637 -1521841 -1486364 -1016595 -580986 -532547 -668147 -673700 -538357
34487 -538357 -400472 -335271 -369017 -441994 -369577 -54111 376990 854884 1564238 2552734
34477 2552734 3382671 3532556 2949891 1905586 627713 -517461 -903328 -357513 272668
34468B72668k58321r07040m18592M71519N12894k72448q08553n10440K59438R23119
34458g35756J050524L54627p92736j196520k03836J059760R94314j28259n49137
34449a47019J85048N25081l80482j055258q8427J255882P38884j263450k019104
34440b248845l48147J718032J857041M12504o35455m77845L4599N3269l56133
34431I020p29834o89033l8100Q91108J202446M51212n53005p13739j52329J26402
34421a95852j36932j99005K97357P28334N40453M079l98929n50819l70432K67832
34411a3914R20008P10217m15048j317925j118507l21956J24559K21581N60646
34402f50339J078288J091445M24566k62985l43449M6231K18733k79802j037090
$$ plain form
34468 272668 14347 -892693 -1311285 -839766 -326872 -599320 -1407873 -1918313 -1658875 -735756
34458 -735756 314768 669395 -123341 -1319861 -1523697 -463937 530377 402118 -147019
34449 -147019 38029 563110 182628 -872630 -961057 294825 1033709 -229741 -2248845
34440 -2248845 -2596992 -878960 978081 1390585 755130 277285 311884 365153 9020
34431 9020 -720814 -1409847 -1447947 -556839 645607 1096819 543814 -169925 -322254 -195852
34421 -195852 -332784 -531789 -234432 493902 1034355 1038434 639505 88686 -281746 -13914
34411 -13914 906094 1616311 1201263 -116662 -1235169 -1557125 -1432566 -1210985 -650339
34402 -650339 427949 1519394 1943960 1680975 1337526 1383757 1602490 1322688 285598
34393B85598j024877J05081J148423O51115q58650j199258L64876J748501R12675
34384B133484j103292j684346m07635O77979L45595l14707j32305L00643J1280
34375a73304n57953m05874K77768M99894J18067n2642L88566R17094R65842N74186
34365B551644N5807m08731p11408p64913o40818m96076l38022r6363J28230J77335
34355e43315J51881K90075N18829M65540J6607m28079m28047k4829L82065N10730
34345I11457L38835q5433o47909r65567n50766N33129J372473J001088l93070
34336A514237j425289j003436L29636R82061K61067p68512p02449L32643Q97090
34327D17048K72856n56111m07903L28495L43394n07610r44483k58127O17392O37140
$$ plain form
34393 285598 -739279 -634198 514225 1165340 306690 -892568 -527692 1220809 2133484
34384 2133484 1030192 -654154 -1061789 -383810 -38215 -352922 -485227 -184584 -173304
34375 -173304 -731257 -1137131 -859363 -359469 -241402 -294044 94522 1011616 1977458 2551644
34365 2551644 2607451 2198720 1487312 722399 81581 -414495 -752517 -848880 -720650 -543315
34355 -543315 -391434 -101359 417470 883010 899617 471538 43491 18662 400727 911457
34345 911457 1250292 1164859 516950 -448617 -999383 -466254 906219 1907307 1514237
34336 1514237 88948 -914488 -584852 397209 658276 -110236 -812685 -480042 417048
34327 417048 689904 133793 -274110 54385 397779 -109831 -1054314 -1312441 -695049 -57909
34317e7909K05068K35279M86969J18634o06480o57168j39142k73555j193671j342545
34307c224520J68529J907415J906952K29188j338306j550300o58491M50347J088168
34298a021018R95330N48006N09948R50234Q53505m27991j856565j868378n13586
34289a830515O65095P15006J08205m36691p55065p11642p7981O90452O42611j93700
34279a184225n29615L41246J335773J069486j68859r29163o38332p6210L3392
34270g46507j05669n3970J38288K72051M70470Q27864R44098L44806p09164j284597
34260I7670p94559K96222R74979P64426J03796l02147k73088j94957m35721q93171
34250f56550j103344p10915J46814Q82297R62814M64917M9739K36684P34381P25752
$$ plain form
34317 -57909 147159 382438 869407 988041 381561 -275607 -414749 -688304 -1881975 -3224520
34307 -3224520 -3055991 -1148576 758376 987564 -350742 -1901042 -2559533 -2109186 -1021018
34298 -1021018 -25688 522318 1032266 1982500 2836005 2408014 551449 -1316929 -1830515
34289 -1830515 -1165420 -450414 -342209 -778900 -1533965 -2245607 -2323588 -1633136 -990525 -1184225
34279 -1184225 -1713840 -1372594 -36821 1032665 863806 -65357 -703689 -779899 -746507
34270 -746507 -852176 -906146 -767858 -495807 -25337 802527 1746625 2091431 1382267 97670
34260 97670 -696889 -400667 574312 1338738 1442534 1140387 867299 672342 236621 -656550
34250 -656550 -1759894 -2470809 -2323995 -1441698 -478884 -13967 35772 272456 1006837 1732589
34240A732589o3233q30821o14468L35346P01871r2470r15742n22436M42363L12394
34230D85393q83365j242417R89J080281M54072p30564o95443r3415o10218j512633
34220c747320n89593J703903K323866M60031r55837J02190J653146J257923q1126
34211B127183k06692K73112m81521j684719j086581Q22056J253326l57369j541225
34202h82430q49840L00474N25480M09887N41680J64649r15022j296409k77657
34193b279188P51621O35515L21624Q36349J166527P9357j370176j286886N2894
34184a092363P50575K94731j3820N26030J048357P67554P6783l75540n50250n83037
34174H49020l95770r1890m0638k89345m38918k82860r1876j29408k88086l08312
$$ plain form
34240 1732589 1669356 838535 224067 559413 1261284 1168814 253072 -269364 172999 485393
34230 485393 -397972 -1640389 -1639400 -559119 -105047 -835611 -1531054 -1624469 -2234687 -3747320
34220 -3747320 -4336913 -2633010 -309144 150887 -804950 -702760 950386 2208309 2127183
34211 2127183 1920491 2193603 1712082 27363 -1059218 -237162 1016164 658795 -882430
34202 -882430 -1732270 -1431796 -906316 -496429 45251 209900 -705122 -2001531 -2279188
34193 -2279188 -1527567 -892052 -570428 265921 1432448 1511805 141629 -1145257 -1092363
34184 -1092363 -341788 -47057 -60877 465153 1513510 2281064 2357847 1982307 1432057 849020
34174 849020 453250 361360 320722 31377 -407541 -690401 -782277 -911685 -1199771 -1508083
34164a508083n8982M07983Q34289Q72389M73649K0916j60212k10198l85796n56878
34154b70923m11238J0274L24257K61270j07533m75102m81337J5273O92017R65690
34144E22648N61444k38748q61903p84081J31084J224231J307163J9675j356244
34135E25269j326882k25455L06687j81996l86814M99230J448685J279179M00085
34126B337988j09643j48384k43734l75990k51623j42559m27927p73037o45145
34117g80054j85145J80774M27511N23836Q1760p62508r40790P3355J165565J052147
34107H36451R7249n03222n59053n82510m33160J93138N82318n471p08872k53142
34097a336274O99536M58519o90366p38916O10978J238265L7495j273875r53774
$$ plain form
34164 -1508083 -1567065 -1159082 -324793 547596 1021245 1042161 881949 671751 285955 -270923
34154 -270923 -682161 -671887 -347630 -86360 -193893 -668995 -1150332 -1135059 -443042 522648
34144 522648 1084092 845344 -16559 -800640 -669556 554675 1861838 1881513 525269
34135 525269 -801613 -1027068 -720381 -902377 -1289191 -789961 658724 1937903 2337988
34126 2337988 2228345 2079961 1836227 1460237 1208614 1066055 638128 -134909 -780054
34117 -780054 -965199 -784425 -356914 166922 248682 -513826 -1454616 -1381261 -215696 836451
34107 836451 933700 430478 -128575 -711085 -1144245 -951107 -368789 -374260 -1083132 -1336274
34097 -1336274 -636738 -178219 -868585 -1607501 -996523 241742 279237 -994638 -1948412
34088a948412K04665N96008L60860M92547P29849K24447n79668n73917N5020K10842
34078b27759j09789J03806Q69805R48423j14639j117410r65055j77197J34832
34069f54983k2165K14704R57960J210747L24585q69052r98768j5454O53319P7342
34059H78235q18474o27941L89537P40427Q8521k74142K96222N84934m53312j706285
34049i02278j341604M85015J807262J442723J25848q54017r85714m74950J21849
34040e75866J14206n82382r39569o379J444468J623313K17414j072051q70082
$$ plain form
34088 -1948412 -1743747 -1147739 -786879 -294332 435517 659964 80296 -493621 -438601 -227759
34078 -227759 -337548 -233742 636063 1584486 1469847 352437 -612618 -789815 -654983
34069 -654983 -677148 -462444 495516 1706263 2030848 1161796 163028 147574 800893 878235
34059 878235 59761 -568180 -178643 561784 650305 376163 672385 1257319 804007 -902278
34049 -902278 -2243882 -1758867 48395 1491118 1616966 762949 -222765 -697715 -575866
34040 -575866 -461660 -1044042 -1983611 -1989990 -545522 1077791 1295205 223154 -646928
$$ [...]
##END NTUPLES=NMR SPECTRUM
##END=
