##TITLE=31Pdec_E3e0806
 CDCl3, 24 sc
 9.6.2023
##JCAMPDX= 6.0         $$ Bruker NMR JCAMP-DX V2.0
##DATA TYPE= NMR SPECTRUM
##DATA CLASS= NTUPLES
##ORIGIN= UXNMR, Bruker Analytische Messtechnik GmbH
##OWNER= root
$$ XWIN-NMR		Version 3.5
$$ Fri Jun  9 13:43:34 2023 Russian Standard Time (UT+4h)  she@DPX200
##.OBSERVE FREQUENCY= 81.013821
##.OBSERVE NUCLEUS= ^31P
##.ACQUISITION MODE= SIMULTANEOUS
##.ACQUISITION SCHEME= undefined
##.AVERAGES= 24
##.DIGITISER RES= 16
##SPECTROMETER/DATA SYSTEM= spect
##.PULSE SEQUENCE= zgpg30
##.SOLVENT NAME= CDCl3
##.SHIFT REFERENCE= (INTERNAL, CDCl3, 0, 248.564)
##AUDIT TRAIL= $$ (NUMBER, WHEN, WHO, WHERE, WHAT)
$$ ##TITLE= Audit trail, XWIN-NMR		Version 3.5
$$ ##JCAMPDX= 5.01
$$ ##ORIGIN= Bruker BioSpin GmbH
$$ ##OWNER= she
$$ F:/spectra/data/she/nmr/P31/1/pdata/1/auditp.txt
$$ ##AUDIT TRAIL=  $$ (NUMBER, WHEN, WHO, WHERE, WHAT)
(   1,<2023-06-09 13:42:49.21 +0400>,<she>,<DPX200>,
      <created by zg, POWCHK disabled, PULCHK disabled
       configuration hash MD5:
       00 E9 B6 7A A2 85 ED C7 34 08 36 98 17 FE 4E 26
       data hash MD5: 32K
       83 56 3F 87 6B E8 87 F8 F0 69 BF E6 08 9D 96 6A>)
(   2,<2023-06-09 13:42:51.81 +0400>,<she>,<DPX200>,
      <Start of raw data processing
       efp BC_mod = 2 LB = 1 FT_mod = 6 PKNL = 1 PHC0 = -10644.93 PHC1 = 2.68486 SI = 64K 
       data hash MD5: 64K
       31 48 83 F3 97 AD FD 32 55 CA 94 41 A3 2C 32 B9>)
(   3,<2023-06-09 13:43:05.45 +0400>,<she>,<DPX200>,
      <pk PHC0 = -0.8490967 PHC1 = 0 
       data hash MD5: 64K
       0C 45 DB 1A 5C 73 2D 2F 74 3E B1 31 57 04 7F 8E>)
$$ ##END=
$$ 
$$ hash MD5
$$ 39 79 F0 A8 04 B3 28 9E 7C 0D 25 90 4D C1 B7 50
##$RELAX= 
##$RELAX= 
##$RELAX= 
##$RELAX= 
##$RELAX= 
##$RELAX= 
##$RELAX= 
##$RELAX= 
##$RELAX= 
$$ Bruker specific parameters
$$ --------------------------
##$DU= <F:/spectra>
##$EXPNO= 1
##$NAME= <P31>
##$PROCNO= 1
##$TYPE= <nmr>
##$USER= <she>
##$AMP= (0..31)
100 100 100 100 100 100 100 100 100 100 100 100 100 100 100 100 100 100 
100 100 100 100 100 100 100 100 100 100 100 100 100 100 
##$AQSEQ= 0
##$AQ_mod= 1
##$AUNM= <au_zg>
##$AUTOPOS= <>
##$BF1= 81.014009
##$BF2= 200.13
##$BF3= 200.13
##$BF4= 200.13
##$BF5= 200.13
##$BF6= 200.13
##$BF7= 200.13
##$BF8= 200.13
##$BYTORDA= 1
##$CFDGTYP= 0
##$CFRGTYP= 5
##$CHEMSTR= <none>
##$CNST= (0..31)
1 1 145 1 1 1 1 1 1 1 1 1 1 1 1 1 1 1 1 1 1 1 1 1 1 1 1 1 1 1 1 1 
##$CPDPRG= <waltz16>
##$CPDPRG1= <>
##$CPDPRG2= <waltz16>
##$CPDPRG3= <>
##$CPDPRG4= <mlev>
##$CPDPRG5= <mlev>
##$CPDPRG6= <mlev>
##$CPDPRG7= <mlev>
##$CPDPRG8= <mlev>
##$CPDPRGB= <>
##$CPDPRGT= <>
##$D= (0..31)
0 1 0 0 0 0 0 0 0 0 0 0.03 2e-05 3e-06 0 0 0 0 0 0 0 0 0 0 0 0 0 0 0 0 
0 0 
##$DATE= 1686303768
##$DBL= (0..7)
120 120 120 11 120 120 24 19 
##$DBP= (0..7)
150 150 150 150 150 150 150 150 
##$DBP07= 0
##$DBPNAM0= <>
##$DBPNAM1= <>
##$DBPNAM2= <>
##$DBPNAM3= <>
##$DBPNAM4= <>
##$DBPNAM5= <>
##$DBPNAM6= <>
##$DBPNAM7= <>
##$DBPOAL= (0..7)
0.5 0.5 0.5 0.5 0.5 0.5 0.5 0.5 
##$DBPOFFS= (0..7)
$$ [...]
##$SUBNAM2= <"">
##$SUBNAM3= <"">
##$SUBNAM4= <"">
##$SUBNAM5= <"">
##$SUBNAM6= <"">
##$SUBNAM7= <"">
##$SUBNAM8= <"">
##$SUBNAM9= <"">
##$SW= 501.771253377433
##$SWIBOX= (0..15)
0 1 3 0 0 0 0 0 0 0 0 0 0 0 0 0 
##$SW_h= 40650.406504065
##$TD= 32768
##$TD0= 1
##$TE= 0
##$TE2= 300
##$TE3= 300
##$TEG= 300
##$TL= (0..7)
0 120 53 12 22 120 120 120 
##$TP= (0..7)
150 150 150 150 150 150 150 150 
##$TP07= 0
##$TPNAME0= <>
##$TPNAME1= <>
##$TPNAME2= <>
##$TPNAME3= <>
##$TPNAME4= <>
##$TPNAME5= <>
##$TPNAME6= <>
##$TPNAME7= <>
##$TPOAL= (0..7)
0.5 0.5 0.5 0.5 0.5 0.5 0.5 0.5 
##$TPOFFS= (0..7)
0 0 0 0 0 0 0 0 
##$TUNHIN= 0
##$TUNHOUT= 0
##$TUNXOUT= 0
##$USERA1= <user>
##$USERA2= <user>
##$USERA3= <user>
##$USERA4= <user>
##$USERA5= <user>
##$V9= 5
##$VALIST= <valist>
##$VCLIST= <CCCCCCCCCCCCCCC>
##$VD= 0
##$VDLIST= <DDDDDDDDDDDDDDD>
##$VPLIST= <PPPPPPPPPPPPPPP>
##$VTLIST= <TTTTTTTTTTTTTTT>
##$WBST= 1024
##$WBSW= 4
##$XGAIN= (0..3)
0 0 0 0 
##$XL= 0
##$YL= 0
##$YMAX_a= 11779
##$YMIN_a= -11124
##$ZGOPTNS= <>
##$ZL1= 120
##$ZL2= 120
##$ZL3= 120
##$ZL4= 120
##$ABSF1= 0
##$ABSF2= 0
##$ABSG= 0
##$ABSL= 0
##$ALPHA= 0
##$AQORDER= 0
##$ASSFAC= 0
##$ASSFACI= 0
##$ASSFACX= 0
##$ASSWID= 0
##$AUNMP= <proc_1d>
##$AZFE= 0.1
##$AZFW= 0.5
##$BCFW= 0
##$BC_mod= 2
##$BYTORDP= 0
##$COROFFS= 0
##$CY= -3
##$DATMOD= 1
##$DC= 0
##$DFILT= <>
##$DTYPP= 0
##$F1P= 0
##$F2P= 0
##$FCOR= 1
##$FTSIZE= 65536
##$FT_mod= 6
##$GAMMA= 0
##$GB= 0
##$INTBC= 1
##$INTSCL= 6.047779e-11
##$ISEN= 30
##$LB= 1
##$LEV0= 0
##$LPBIN= 0
##$MAXI= 10000
##$MC2= 0
##$MEAN= 0
##$ME_mod= 0
##$MI= 50
##$NCOEF= 0
##$NC_proc= -5
##$NLEV= 6
##$NOISF1= 182.463
##$NOISF2= 159.3651
##$NSP= 0
##$NTH_PI= 0
##$NZP= 0
##$OFFSET= 248.5645
##$PC= 4
##$PHC0= -10645.78
##$PHC1= 2.68486
##$PH_mod= 1
##$PKNL= yes
##$PPARMOD= 0
##$PSCAL= 0
##$PSIGN= 0
##$REVERSE= no
##$SF= 81.0140089999694
##$SI= 65536
##$SIGF1= 159.3651
##$SIGF2= -187.1042
##$SINO= 113.3802
##$SIOLD= 16384
##$SREGLST= <1H.CDCl3>
##$SSB= 0
##$STSI= 65536
##$STSR= 0
##$SW_p= 40650.406504065
##$SYMM= 0
##$S_DEV= 0
##$TDeff= 32768
##$TDoff= 0
##$TI= <>
##$TILT= no
##$TM1= 0
##$TM2= 0
##$TOPLEV= 0
##$USERP1= <user>
##$USERP2= <user>
##$USERP3= <user>
##$USERP4= <user>
##$USERP5= <user>
##$WDW= 1
##$XDIM= 65536
##$YMAX_p= 468189350
##$YMIN_p= -180685177
$$ End of Bruker specific parameters
$$ ---------------------------------
##NTUPLES= NMR SPECTRUM
##VAR_NAME=  FREQUENCY,     SPECTRUM/REAL,   SPECTRUM/IMAG
##SYMBOL=    X,             R,               I
##VAR_TYPE=  INDEPENDENT,   DEPENDENT,       DEPENDENT
##VAR_FORM=  AFFN,          ASDF,            ASDF
##VAR_DIM=   65536,         65536,           65536
##UNITS=     HZ,            ARBITRARY UNITS, ARBITRARY UNITS
##FACTOR=    0.620285442955139, 1,           1
##FIRST=     20137.2065510682, 0,            0
##LAST=      -20513.1999529968, 0,           0
##MIN=       -20513.1999529968, -180685177,  0
##MAX=       20137.2065510682, 468189350,    0
$$ Real data points
##PAGE= N=1
##DATA TABLE= (X++(R..R)), XYDATA
$$ [...]
$$ plain form
39708 -297041 -150125 -398922 -666584 -479220 -183972 -471894 -1158356 -1363164 -923061 -625955
39698 -625955 -812829 -773648 -25600 718098 548412 -341179 -1057763 -1204514 -1028751 -800055
39688 -800055 -641043 -633059 -607135 -215910 384223 464940 -171799 -654161 -255468 466071
39678 466071 546071 86247 -106146 43570 -147114 -865215 -1514553 -1668467 -1448180 -955551
39668 -955551 -176272 501952 508243 -32422 -372287 -223011 -56353 -193313 -326358 -168237
39658 -168237 90845 230017 323435 403147 340813 225956 287843 315348 -171539 -981110
39648 -981110 -1226657 -577742 174426 234916 -166174 -367209 -280369 -181937 -5695 434881
39638 434881 837324 727864 234898 -57253 63610 280568 339796 294873 202621 66928
$$ packed form
39708b97041J46916k48797k67662J87364K95248k87922o86462k04808M40103K97106
39698f25955j86874L9181P48048P43698j69686q89591p16584j46751J75763K28696
39688h00055J59012P984K5924L91225O00133Q0717o36739m82362L98693P21539
39678D66071Q0000m59824j92393J49716j90684p18101o49338j53914K20287M92629
39668i55551P79279O78224O291n40665l39865J49276J66658j36960j33045J58121
39658a68237K59082J39172R3418P9712o2334j14857O1887K7505m86887q09571
39648i81110k45547O48915P52168O0490m01090k01035Q6840R8432J76242M40576
39638D34881M02443j09460m92966k92151J20863K16958N9228m4923r2252j35693
$$ plain form
39628 66928 84971 456236 880395 744768 -1018 -601826 -433426 155408 337495 -55095
39618 -55095 -371812 -133683 301439 310997 -121154 -517739 -681761 -828552 -964333 -726690
39608 -726690 -68696 419817 259606 -249396 -540004 -593137 -709028 -769402 -396852 273893
39598 273893 650149 514163 214056 9637 -170507 -282421 -137002 62341 -165996 -720421
39588 -720421 -865895 -358505 84861 -106415 -460362 -303798 81065 -28712 -465079 -286259
39578 -286259 762178 1721899 1642259 767011 117202 204156 562639 499992 -22994 -438388
39568 -438388 -388991 -206559 -381999 -766195 -717125 -68730 509743 381285 -176911 -345361
39558 -345361 144841 685404 582129 -111873 -702524 -700212 -393438 -453072 -1017459 -1471467
$$ packed form
39628F6928J8043L71265M24159j35627p45786o00808J68400N88834J82087l92590
39618e5095l16717K38129M35122R558m32151l96585j64022j46791j35781K37643
39608g26690O57994M88513j60211n09002k90608n3133j15891o0374L72550O70745
39598B73893L76256j35986l00107k04419j80144j11914J45419J99343k28337n54425
39588g20421j45474N07390M43366j91276l53947J56564L84863j09777m36367J78820
39578b86259J048437R59721p9640q75248o49809Q6954L58483o2647n22986m15394
39568d38388M9397J82432j75440l84196M9070O48395N78473j28458n58196j68450
39558c45361M90202N40563j03275o94002n90651K312L06774n9634n64387m54008
$$ plain form
39548 -1471467 -1316018 -921315 -983246 -1459473 -1649556 -1277498 -820326 -651664 -546213 -285924
39538 -285924 -87630 -54423 158154 639020 784656 196785 -469510 -296477 559793 1059178
39528 1059178 647136 -227591 -864891 -967490 -615030 -180961 -236819 -962402 -1675294 -1534057
39518 -1534057 -708044 -216833 -528655 -975366 -773610 -26161 623143 847391 756691 501925
39508 501925 162650 -131433 -256909 -205718 -29653 181056 226170 -49502 -453491 -576141
39498 -576141 -334588 -101125 -152367 -294142 -230301 -12425 149299 294754 605151 995992
39488 995992 1129102 832834 295495 -175387 -412882 -383149 -97861 335620 649486 570620
39478 570620 111519 -394506 -662112 -770684 -938563 -1079325 -909854 -513568 -369099 -629940
$$ packed form
39548a471467J55449L94703o1931m76227j90083L72058M57172J68662J05451K60289
39538b85924J98294L3207K12577M80866J45636n87871o66295J73033Q56270M99385
39528A059178m12042q74727o37300j02599L52460M34069n5858p25583p12892J41237
39518a534057Q26013M91211l11822m46711K01756P47449O49304K24248r0700k54766
39508E01925l39275k94083j25476N1191J76065K10709M5114k75672m03989j22650
39498e76141K41553K33463n1242j41775O3841K17876J61724J45455L10397L90841
39488I95992J33110k96268n37339m70882k37495K9733K85288M33481L13866p8866
39478E70620m59101n06025k67606j08572j67879j40762J69471L96286J44469k60841
$$ plain form
39468 -629940 -805668 -503724 -102503 -200301 -680848 -911353 -712552 -495861 -447969 -219248
39458 -219248 407690 1040255 1096869 403742 -701093 -1556456 -1537188 -670529 166360 195385
39448 195385 -196227 -27919 676248 800231 -122273 -1095905 -1143017 -669984 -567347 -725033
39438 -725033 -445722 193475 483985 315196 208187 240091 -28898 -523722 -570594 -61485
39428 -61485 216753 -239012 -935359 -1252940 -1317981 -1512471 -1701334 -1504948 -952781 -393575
39418 -393575 -44414 31329 -175597 -441037 -389829 -34938 184477 173674 435846 1147083
39408 1147083 1599144 1204299 522699 468585 867820 761664 75 -480038 -99752 557133
39398 557133 722965 469589 290265 257587 151483 25670 78813 170194 -26848 -444543
$$ packed form
39468f29940j75728L01944M01221r7798m80547k30505J98801K16691M7892K28721
39458b19248O26938O32565N6614o93127j104835q55363J9268Q66659Q36889K9025
39448A95385l91612J68308P04167J23983r22504r73632m7112M73033J02637j57686
39438g25033K79311O39197K90510j68789j07009L1904k68989m94824m6872N09109
39428f1485K78238m55765o96347l17581o5041j94490j88863J96386N52167N59206
39418c93575L49161P5743k06926k65440N1208L54891K19415j0803K62172P11237
39408A147083M52061l94845o81600n4114L99235j06156p61589m80113L80286O56885
39398E57133J65832k53376j79324l2678j06104j25813N3143R1381j97042m17695
$$ plain form
39388 -444543 -600121 -215604 389883 617660 206201 -507215 -936253 -868213 -660127 -727830
39378 -727830 -997968 -1101597 -959967 -792973 -603087 -135540 548729 940045 750829 325691
39368 325691 116300 104377 55387 17571 179988 448975 546405 412103 205142 12113
39358 12113 -179197 -318708 -350460 -342919 -367904 -354517 -227865 -68753 -4918 -88684 -332845
39347 -332845 -607424 -487325 320965 1245052 1158592 -147976 -1378727 -1240924 -103626
39338 -103626 593393 270263 -318694 -425254 -206660 -127071 -236282 -364112 -480541 -564394
39328 -564394 -527195 -464573 -581087 -731687 -501934 90071 464834 290494 -40922 -29581
39318 -29581 256429 432215 349473 70550 -365338 -775418 -719314 9398 906117 1155395
$$ packed form
39388d44543j55578L84517O05487K27777m11459p13416m29038O8040K08086o7703
39378g27830k70138j03629J41630J66994J89886M67547O84269L91316j89216m25138
39368C25691k09391j1923m8990l7816J62417K68987R7430j34302k06961j93029
39358A2113j91310j39511l1752P541k4985J3387J26652J59112O3835q3766k44161
39347c32845k74579J20099Q08290R24087q6460j306568j230751J37803J137298
39338a03626O97019l23130n88957j06560K18594P9589j09211j27830j16429q3853
39328e64394L7199O2622j16514j50600K29753N92005L74763j74340l31416J1341
39318b9581K86010J75786q2742k78923m35888m10080N6104P28712Q96719K49278
$$ plain form
39308 1155395 513931 -438293 -935494 -769753 -393345 -357968 -700080 -970687 -890686 -723722
39298 -723722 -792521 -923023 -782423 -537052 -605910 -870352 -789025 -335107 -134145 -494006
39288 -494006 -942569 -984577 -710852 -360481 101851 583981 641071 155812 -246928 -4688
39278 -4688 558063 737723 437310 105186 -27481 -101457 -207278 -286347 -322770 -276095 -14844
39267 -14844 371872 479806 150240 -209677 -259816 -298986 -711244 -1207715 -1227961 -840407
39257 -840407 -615331 -760491 -971480 -1023974 -959580 -778611 -467210 -230392 -213575 -146463
39247 -146463 221772 534406 283352 -320317 -619626 -540537 -590873 -860949 -856954 -465813
39237 -465813 -262593 -546442 -793004 -492226 56981 269003 132106 49181 146768 235963
$$ packed form
39308A155395o41464r52224m97201J65741L76408L5377l42112k70607Q0001J66964
39298g23722o8799j30502J40600K45371o8858k64442Q1327M53918K00962l59861
39288d94006m48563m2008K73725L50371M62332M82130N7090m85259m02740K42240
39278d688N62751J79660l00413l32124j32667p3976j05821p9069l6423M6675K61251
39267a4844L86716J07934l29566l59917n0139l9170m12258m96471k0246L87554
39257h40407K25076j45160k10989n2494O4394J80969L11401K36818J6817O7112
39247a46463L68235L12634k51054o03669k99309P9089n0336k70076L995L91141
39237d65813K03220k83849k46562L00778N49207K12022j36897q2925R7587Q9195
$$ plain form
39227 235963 270258 399572 640722 839278 947631 1074768 1214823 1114873 545522 -316517
39217 -316517 -908235 -845179 -441450 -405646 -933703 -1432405 -1355811 -948854 -786895 -901239
39207 -901239 -869417 -558694 -219657 41884 321341 502690 356474 41324 -52337 28586
39197 28586 -124978 -487001 -511343 -14172 458142 405913 21698 -202312 -69408 350049
39187 350049 889765 1178377 810848 -64114 -716488 -697058 -373654 -322073 -551413 -678879
39177 -678879 -560038 -359513 -197039 -65273 20179 41297 52455 71704 16521 -138451
39167 -138451 -279960 -315130 -271752 -206696 -157444 -151844 -120245 46272 138327 -350390 -1405560
39156 -1405560 -2053746 -1460214 -244717 199235 -342813 -668284 -61755 673971 599339
$$ packed form
39227B35963L4295J29314K41150J98556J08353J27137J40055r9950n69351q62039
39217c16517n91718O3056M03729L5804n28057m98702P6594M06957J61959j14344
39207i01239L1822L10723L39037K61541K79457J81349j46216l15150r3661Q0923
39197B8586j53564l62023k4342M97171M72314n2229l84215k24010J32904M19457
39187C50049N39716K88612l67529q74962o52374J9430L23404N1581k29340j27466
39177f78879J18841K00525J62474J31766Q5452K1118J1158J9249n5183j54972
39167a38451j41509l5170M3378O5056M9252N600L1599J66517R2055m88717j055170
39156a405560o48186N93532J215497M43952n42048l25471O06529P35726p4632
$$ plain form
39147 599339 35271 -195508 -132479 -367542 -890899 -1155314 -1010960 -803507 -722290 -687004
39137 -687004 -703873 -780545 -695984 -363686 -154172 -331113 -488445 -154222 354273 369170
39127 369170 -68126 -315892 -162408 -20695 -139007 -293241 -277409 -97736 318503 1017735
39117 1017735 1624766 1640270 1155482 720087 520941 290406 -340 -64035 13395 -247561
39107 -247561 -831171 -1018180 -415165 390659 609750 231474 -151521 -119325 322196 912545
39097 912545 1212564 821386 -129957 -951987 -1170382 -1068988 -1150676 -1341712 -1159512 -515096
39087 -515096 102896 260219 54783 -125772 -104741 -59037 -248078 -666200 -971152 -807819
39077 -807819 -231587 271244 259552 -208394 -655523 -690490 -374597 -86228 -79381 -260782
$$ packed form
39147E99339n64068k30779O3029k35063n23357k64415J44354K07453Q1217L5286
39137f87004j6869p6672Q4561L32298K09514j76941j57332L34223N08495J4897
39127C69170m37296k47766J53484J41713j18312j54234J5832J79673M16239O99232
39117A017735O07031J5504m84788m35395j99146k30535k90746o3695P7430k60956
39107b47561n83610j87009O03015Q05824K19091l78276l82995L2196M41521N90349
39097I12545L00019l91178r51343q22030k18395J01394q1688j91036J82200O44416
39087e15096O17992J57323k05436j80555K1031M5704j89041m18122l04952J63333
39077h07819N76232N02831j1692m67946m47129l4967L15893K88369O847j81401
$$ plain form
39067 -260782 -415390 -488527 -476042 -197036 460083 1092939 1065408 398249 -94036 141636
39057 141636 655626 721154 359548 74107 -71333 -385808 -765228 -757005 -391546 -205889
39047 -205889 -352165 -389676 -127328 14251 -257942 -619759 -683731 -511450 -292197 -33114
39037 -33114 154432 12335 -309614 -238106 314723 637888 283770 -177272 -66312 322957
39027 322957 309790 21402 107313 538499 641008 261046 -17556 82499 122961 -173120
39017 -173120 -403137 -221305 42659 -30966 -234848 -116394 259590 450510 344909 235268
39007 235268 247921 166135 -92483 -206709 98747 548901 598819 229150 118422 746404
38997 746404 1539066 1409004 217987 -851541 -741717 121329 477529 -64964 -710492
$$ packed form
39067b60782j54608p3137J2485K79006O57119O32856k7531o67159m92285K35672
39057A41636N13990O5528l61606k85441j45440l14475l79420Q223L65459J85657
39047b05889j46276l7511K62348J41579k72193l61817o3972J72281K19253K59083
39037c3114J87546j42097l21949P1508N52829L23165l54118m61042J10960L89269
39027C22957j3167k88388Q5911M31186J02509l79962k78602J00055M0462k96081
39017a73120k30017J81832K63964p3625k03882J18454L75984J90920j05601j09641
39007B35268J2653q1786k58618j14226L05456M50154M9918l69669j10728O27982
38997G46404P92662j30062j191017j069528J09824Q63046L56200n42493o45528
$$ plain form
38988 -710492 -783896 -549554 -505159 -574551 -452441 -250776 -283481 -511440 -669898 -733563
38978 -733563 -823141 -821640 -530777 -125988 -29846 -318074 -593879 -504286 -121058 234082
38968 234082 332627 181196 -4697 38108 337693 582475 430276 -114874 -740055 -1153642
38958 -1153642 -1266767 -1162919 -1018605 -943396 -819619 -487920 -136961 -151220 -428833 -352117
38948 -352117 218429 476887 -201187 -1143901 -1217937 -464438 71908 20013 80775 607274
38938 607274 934769 591244 156737 235785 422625 112955 -321749 -98992 662671 1089479
38928 1089479 765051 37388 -651858 -1023166 -797429 -51870 462721 151255 -450828
38919 -450828 -365592 313587 543979 -57991 -753363 -968815 -999892 -1084023 -794127 41854
$$ packed form
38988g10492p3404K34342M4395o9392J22110K01665l2705k27959j58458o3665
38978g33563q9578J501K90863M04789R6142k88228k75805Q9593L83228L55140
38968B34082R8545j51431j85893M2805K99585K44782j52199n45150o25181m13587
38958a153642j13125J03848J44314P5209J23777L31699L50959j4259k77613P6716
38948c52117N70546K58458o78074r42714p4036P53499N36346n1895O0762N26499
38938F07274L27495l43525m34507P9048J86840l09670m34704K22757P61663M26808
38928A089479l24428p27663o89246l71308K25737P45559N14591l11466o02083
38919d50828Q5236O79179K30392o01970o95372k15452l1077q4131K89896Q35981
$$ plain form
38909 41854 651541 304520 -574867 -1010636 -794772 -514336 -529958 -604452 -479908 -280549
38899 -280549 -250788 -375784 -347361 110659 788830 993109 360751 -438599 -422962 261469
38889 261469 412200 -465926 -1343715 -1152157 -275336 218130 179669 250970 546315 521841
38879 521841 56044 -291267 -197601 2115 -43893 -257931 -452156 -573378 -542026 -293005
38869 -293005 23731 308529 827105 1692415 2231200 1674049 442799 -169140 225224
38860 225224 588663 100131 -612178 -541190 130079 390469 -93245 -701711 -921678 -880451
38850 -880451 -799213 -603806 -272262 -58168 -111817 -226506 -199427 -171364 -346681 -575410
38840 -575410 -530697 -236027 -85345 -245880 -330558 74448 720583 911318 425275 -161386
$$ packed form
38909D1854O09687l47021q79387m35769K15864K80436j5622p4494J24544J99359
38899b80549K9761j24996K8423M58020O78171K04279o32358p99350J5637O84431
38889B61469J50731q78126q77789J91558Q76821M93466l8461P1301K95345k4474
38879E21841m65797l47311R3666J99716m6008k14038j94225j21222L1352K49021
38869b93005L16736K84798N18576Q65310N38785n57151j231250o11939L94364
38860B25224L63439m88532p12309P0988O71269K60390m83714o08466k19967M1227
38850h80451Q1238J95407L31544K14094n3649j14689K7079K8063j75317k28729
38840e75410M4713K94670J50682j60535q4678M05006O46135J90735m86043n86661
$$ plain form
38830 -161386 -239489 113907 467082 733831 1082516 1368863 1228464 707071 265346 87805
38820 87805 -102283 -405373 -459497 -78270 282207 104277 -438900 -728888 -522471 -132408
38810 -132408 122802 267424 426087 529947 425437 174192 95750 421910 918364 1030898
38800 1030898 568726 52401 50282 309943 75345 -696894 -1090477 -525113 287437 259035
38790 259035 -586411 -1231572 -1107770 -693496 -609152 -785335 -815088 -641475 -516507 -564974
38780 -564974 -721379 -913866 -1047739 -980692 -761597 -710706 -977380 -1184963 -869275 -179479
38770 -179479 243528 82558 -342979 -622766 -697400 -619794 -321335 96903 230178 -65635
38760 -65635 -270607 159769 954053 1348568 1124544 745226 511349 243198 -105218 -216793
$$ packed form
38830a61386p8103L53396L53175K66749L48685K86347j40399n21393m41725j77541
38820H7805j90088l03090n4124L81227L60477j77930n43177k89988K06417L90063
38810a32408K55210J44622J58663J03860j04510k51245p8442L26160M96454J12534
38800A030898m62172n16325k119K59661k34598p72239l93583N65364Q12550k8402
38790B59035q45446o45161J23802M14274Q4344j76183k9753J73613J24968m8467
38780e64974j56405j92487j33873O7047K19095N0891k66674k07583L15688O89796
38770a79479M23007j60970m25537k79787p4634P7606K98459M18238J33275k95813
38760f5635k04972M30376P94284L94515k24024l79318k33877k68151l48416j11575
$$ plain form
38750 -216793 -59488 -106436 -521421 -731084 -304397 291596 408686 201040 197571 307621
38740 307621 72439 -364820 -426172 -112871 41656 8792 308365 896719 1003254 412096
38730 412096 -32206 279456 758033 622785 148014 67428 269383 54975 -561968 -791501
38720 -791501 -324013 209115 244660 49878 120929 348522 247294 -258965 -714120 -723421
38710 -723421 -376024 -70788 -117197 -530799 -1056305 -1316572 -1073445 -493244 -81285 -135057
38700 -135057 -269098 202369 1282766 2076697 1886600 1161715 813276 867672 581292 -166409
38690 -166409 -542713 -110050 401786 248278 -165637 -56569 383387 355026 -157107 -386600
38680 -386600 -112990 14590 -342560 -622631 -342054 84457 30080 -387240 -607156 -499224
$$ packed form
38750b16793J57305m6948m14985k09663M26687N95993J17090k07646l469J10050
38740C07621k35182m37259o1352L13301J54527l2864K99573N88354J06535n91158
38730D12096m44302L11662M78577j35248m74771q0586K01955k14408o16943k29533
38720g91501M67488N33128L5545j94782P1051K27593j01228n06259m55155r301
38710g23421L47397L05236m6409m13602n25506k60267K43127N80201M11959n3772
38700a35057j34041M71467J080397P93931j90097p24885l48439N4396k86380p47701
38690a66409l76304M32663N11836j53508m13915J09068M39956k8361n12133k29493
38680c86600K73610J27580l57150k80071K80577M26511n4377m17320k19916J07932
$$ plain form
38670 -499224 -339607 -157297 276501 842530 1004060 484715 -347659 -929099 -1057296 -851693
38660 -851693 -435048 66024 354442 151260 -397426 -775132 -688584 -387009 -220263 -128912
38650 -128912 117338 384679 354371 171192 342596 881539 1156089 874668 604250 830639
38640 830639 1089301 743754 173224 248492 819756 772375 -287178 -1395274 -1647617 -1372447
38630 -1372447 -1337781 -1537649 -1498478 -1254984 -1199635 -1260375 -1019253 -518475 -229898 -264016
38620 -264016 -282023 -208865 -349019 -670406 -653844 -134467 299179 138303 -287798 -349274
38610 -349274 -54556 81418 -84876 -134121 214406 670184 811642 673411 664716 987374
38600 987374 1304160 1058920 130117 -911203 -1327926 -990149 -433329 -118094 62996
$$ packed form
38670d99224J59617J82310M33798N66029J61530n19345q32374n81440j28197K05603
38660h51693M16645N01072K88418k03182n48686l77706Q6548L01575J66746R1351
38650a28912K46250K67341l0308j83179J71404N38943K74550k81421k70418K26389
38640H30639K58662l45547n70530P5268N71264m7381j059553j108096k52343K75170
38630a372447L4666j99868L9171K43494N5349o0740K41122N00778K88577l4118
38620b64016j8007P3158j40154l21387J6562N19377M33646j60876m26101o1476
38610c49274K94718J35974j66294m9245L48527M55778J41458j38231q695L22658
38600I87374L16786k45240r28803j041320m16723L37777N56820L15235J81090
$$ plain form
38591 62996 342230 457448 -70606 -1099517 -1770735 -1447481 -472911 245339 267780 3945
38581 3945 84451 567908 907817 645545 -44628 -605375 -760971 -704544 -651336 -521505
38571 -521505 -202498 164583 408701 611828 870952 975343 696557 272871 177382 435020
38561 435020 591325 385557 43062 -154572 -159687 67706 596936 1150255 1160675 503770
38551 503770 -207549 -364887 -59563 251708 385072 359256 75416 -429824 -687754 -303537
38541 -303537 393494 717222 532766 287673 210648 37197 -409655 -870765 -1037700 -907419
38531 -907419 -608562 -195503 246689 553163 651463 597840 431688 210753 137577 349243
38521 349243 614003 581988 336369 319670 665420 987391 940598 641408 388626 265284
$$ packed form
38591F2996K79234J15218n28054j028911o71218L23254R74570P18250K2441k63835
38581C945Q0506M83457L39909k62272o90173n60747j55596N6427N3208J29831
38571e21505L19007L67081K44118K03127K59124J04391k78786m23686r5489K57638
38561D35020J56305k05768l42495j97634n115K27393N29230N53319J0420o56905
38551E03770p11319j57338L05324L11271J33364k5816k83840n05240k57930L84217
38541c03537O97031L23728j84456k45093p7025j73451m46852m61110j66935J30281
38531i07419K98857M13059M42192L06474R8300n3623j66152k20935p3176K11666
38521C49243K64760l2015k45619j6699L45750L21971m6793k99190k52782j23342
$$ plain form
38511 265284 161172 -46014 -421375 -863763 -1057313 -812966 -438009 -403555 -644714 -629634
38501 -629634 -189040 206616 156440 -152050 -355983 -410649 -398314 -250590 12615 106614
38491 106614 -117470 -366381 -299033 23966 344039 568333 642837 362617 -331292 -1069470
38481 -1069470 -1384006 -1164462 -583027 164589 793521 918013 447578 -230990 -738331
38472 -738331 -1086567 -1323327 -1209994 -670625 -156946 -24954 96109 651399 1159062 696710
38462 696710 -630288 -1532001 -1084301 194630 1118982 1179413 768278 454188 429644 502293
38452 502293 365238 -35843 -320885 -49186 669881 1208146 1156638 742581 385714 171563
38442 171563 -15593 -149168 -175702 -265728 -586358 -913694 -818613 -257279 295162 363504
$$ packed form
38511B65284j04112k07186l75361m42388j93550K44347L74957L4454k41159J5080
38501f29634M40594L95656n0176l08490k03933n4666J2335J47724K63205R3999
38491A06614k24084k48911O7348L22999L20073K24294P4504k80220o93909p38178
38481a069470l14536K19544N81435P47616O28932J24492m70435o78568n07341
38472g38331l48236k36760J13333N39369N13679J31992J21063N55290N07663m62352
38462F96710j326998r01713M47700J278931R24352O0431m11135l14090k4544P2649
38452E02293j37055m01081k85042K71699P19067N38265n1508m14057l56867k14151
38442A71563j87156j33575k6534r0026l20630l27336R5081N61334N52441O8342
$$ plain form
38432 363504 -72346 -683989 -1142483 -1257543 -963540 -367973 239752 580874 595707 405546
38422 405546 155773 19193 235808 879127 1567812 1698990 1109251 287153 -228556 -448811
38412 -448811 -734023 -1201188 -1598526 -1645199 -1270653 -656798 -235008 -396014 -927915 -1051507
38402 -1051507 -416502 269595 165380 -459698 -649911 -238767 9905 -252342 -446284
38393 -446284 -126026 384214 774581 1254618 1792129 1757419 969267 254198 214522 244682
38383 244682 -346579 -1010154 -835141 -123734 144187 -14234 231562 892841 1083707 593879
38373 593879 220242 326344 316612 -106150 -338065 -27741 232812 -12464 -240918 122574
38363 122574 723351 940077 865808 904945 962260 768957 556093 692803 1017326 1154434
$$ packed form
38432C63504m35850o11643m58494j15060K94003N95567O07725L41122J4833j90161
38422D05546k49773j36580K16615O43319O88685J31178n89739q22098n15709k20255
38412d48811k85212m67165l97338m6673L74546O13855M21790j61006n31901j23592
38402a051507O35005O86097j04215o25078j90213M11144K48672k62247j93942
38393d46284L20258N10240L90367M80037N37511l4710p88152p15069l9676L0160
38383B44682n91261o63575J75013P11407K67921j58421K45796O61279J90866m89828
38373E93879l73637J06102r732m22762k31915L10324K60553k45276k28454L63492
38363A22574O00777K16726p4269L9137N7315j93303k12864J36710L24523J37108
$$ plain form
38353 1154434 1128700 1057683 654303 -256259 -1070870 -1040791 -371021 43954 -156506 -546562
38343 -546562 -768362 -881961 -865625 -531085 -82794 -68494 -510725 -676310 -59800 857059
38333 857059 1217511 856499 379843 347429 703727 977656 825673 343227 -74525 -138555
38323 -138555 108958 482358 908916 1341438 1550623 1278314 602754 -55942 -322775 -136147
38313 -136147 299119 640644 574526 104626 -354885 -413381 -187151 -90245 -213259 -269320
38303 -269320 -152805 -114762 -253377 -266930 15887 225176 -52207 -604169 -840574 -585238
38293 -585238 -201083 40638 272112 604423 801188 641350 338875 274959 447310 520624
38283 520624 390523 340290 522936 602206 182357 -563702 -1016675 -858573 -418917 -188732
$$ packed form
38353A154434k5734p1017m03380r10562q14611L0079O69770M14975k00460l90056
38343e46562k21800j13599J6336L34540M48291J4300m42231j65585O16510R16859
38333H57059L60452l61012m76656l2414L56298K73929j51983m82446m17752o4030
38323a38555K47513L73400M26558M32522K09185k72309o75560o58696k66833J86628
38313a36147M35266L41525o6118m69900m59511n8496K26230R6906j23014n6061
38303b69320J16515L8043j38615j3553K82817K09289k77383n51962k36405K55336
38293e85238L84155K41721K31474L32311J96765j59838l02475o3916J72351P3314
38283E20624j30101n0233J82646P9270m19849p46059m52973J58102M39656K30185
$$ plain form
38273 -188732 -236486 -283187 -166180 38595 277031 600038 940347 1071217 919347 701950
38263 701950 567737 303344 -307374 -946741 -986313 -328122 335526 326955 -204127 -546031
38253 -546031 -316520 242620 757824 1121009 1350350 1395389 1228146 904519 419882 -281042
38243 -281042 -1030428 -1404856 -1159723 -551575 -67979 42319 -137958 -381800 -429106 -95050
38233 -95050 497571 899201 762143 226383 -280517 -522773 -550926 -434674 -164546 178243
38223 178243 357338 164650 -371915 -947179 -1170644 -949294 -679693 -812175 -1173508 -1073449
38213 -1073449 -256882 639259 883217 531993 114323 -199121 -532718 -678844 -263393
38204 -263393 490838 869699 669144 469915 703414 1026146 930925 466344 -35822 -506753
$$ packed form
38273a88732m7754m6701J17007K04775K38436L23007L40309J30870j51870k17397
38263G01950j34213k64393o10718o39367l9572O58191O63648q571n31082l41904
38253e46031K29511N59140N15204L63185K29341M5039j67243l23627m84637p00924
38243b81042p49386l74428K45133O08148M83596J10298j80277k43842m7306L34056
38233i5050N92621M01630j37058n35760n06900k42256k8153J16252K70128L42789
38223A78243J79095j92688n36565n75264k23465K21350K69601j32482l61333J00059
38213a073449Q16567Q96141K43958l51224m17670l13444l33597j46126M15451
38204b63393P54231L78861k00555j99229K33499L22732r5221m64581n02166m70931
$$ plain form
38194 -506753 -947397 -1031910 -470737 350700 612719 9751 -881554 -1277761 -997717 -496001
38184 -496001 -261445 -341292 -440698 -360899 -196851 -88419 21262 203751 300605 177055
38174 177055 126224 588877 1398626 1750705 1165177 136115 -492181 -529862 -449647 -569496
38164 -569496 -682051 -522439 -210477 -36872 -35156 9168 214373 475694 681937 857907
38154 857907 984151 843628 288955 -375463 -566435 -94854 542376 698466 256493 -352361
38144 -352361 -643214 -454717 -5888 294432 279213 326308 905581 1738732 1941660 1292185
38134 1292185 724843 996527 1464133 1058866 58027 -213365 642192 1537826 1512960
38125 1512960 888521 446980 346775 338717 335699 265077 -44427 -404276 -298012 252331
$$ packed form
38194e06753m40644q4513N61173Q21437K62019o02968q91305l96207K80044N01716
38184d96001K34556p9847r9406P9799J64048J08432J09681J82489R6854j23550
38174A77055n0831M62653Q09749L52079n85528j029062o28296l7681Q0215j19849
38164e69496j12555J59612L11962J73605J716M4324K05205K61321K06243J75970
38154H57907J26244j40523n54673o64418j90972M71581O37230J56090m41973o08854
38144c52361k90853J88497M48829L00320j5219M7095N79273Q33151K02928o49475
38134A292185n67342K71684M67606m05267j000839k71392Q55557Q95634k4866
38125A512960o24439m41541j00205q058l018p0622l09504l59849J06264N50343
$$ plain form
38115 252331 540155 311220 250165 758105 1081503 467676 -538375 -918226 -728364 -765424
38105 -765424 -1102376 -1095838 -634010 -245358 -27268 423753 953693 844242 109157 -265947
38095 -265947 189304 642135 232677 -636966 -971685 -569471 -20503 311718 596744 951430
38085 951430 1129386 866362 235222 -384171 -590609 -338572 -108429 -474406 -1372218 -2042364
38075 -2042364 -1871420 -1069128 -352101 -180331 -463189 -788688 -766734 -334228 155521 331919
38065 331919 307270 448065 638668 316237 -544340 -1082659 -665307 128505 253373 -386131
38055 -386131 -954695 -950880 -702720 -575017 -422676 -80437 204709 191621 60216 54881
38045 54881 78233 -122 19735 282917 419052 4190 -666574 -846364 -384405 48961
$$ packed form
38115B52331K87824k28935o1055N07940L23398o13827j006051l79851J89862l7060
38105g65424l36952O538M61828L88652K18090M51021N29940j09451p35085l75104
38095b65947M55251M52831m09458q69643l34719M02214N48968L32221K85026L54686
38085I51430J77956k63024o31140o19393k06438K52037K30143l65977q97812o70146
38075b042364J70944Q02292P17027J71770k82858l25499K1954M32506M89749J76398
38065C31919k4649J40795J90603l22431q60577n38319M17352P93812J24868o39504
38055c86131n68564L815K48160J27703J52341L42239K85146j3088j31405n335
38045E4881K3352p8355J9857K63182J36135m14862o70764j79790M61959M33366
$$ plain form
38035 48961 -73562 -459064 -556059 -365035 -284088 -410874 -451405 -253018 -45623 -92223
38025 -92223 -340931 -508793 -400949 -118410 27552 -110942 -230472 112079 820510 1218693
38015 1218693 913445 353911 166919 262648 126265 -239875 -335897 -63304 110306 -5952
38005 -5952 -17065 277415 467008 295268 241337 776710 1468569 1451659 572129 -493026
37995 -493026 -1122550 -1255431 -1092968 -789105 -487446 -324984 -342001 -559843 -1020700 -1524613
37985 -1524613 -1559752 -881551 739 360330 180820 71403 294540 431807 143588 -272189
37975 -272189 -390006 -335736 -537855 -988053 -1188289 -874491 -449000 -465158 -834721 -871391
37965 -871391 -211131 603499 756190 210650 -291139 -273475 -76719 -196586 -560646 -796866
$$ packed form
38035D8961j22523l85502r6995J91024Q0947j26786m0531J98387K07395m6600
38025i2223k48708j67862J07844K82539J45962j38494j19530L42551P08431L98183
38015A218693l05248n59534j86992R5729j36383l66140r6022K72593J73610j16258
38005e952j1113K94480J89593j71740n3931N35373O91859j6910q79530j065155
37995d93026o29524j32881J62463L03863L01659J62462j7017k17842m60857n03913
37985a524613l5139O78201Q82290L59591j79510j09417K23137J37267k88219m15777
37975b72189j17817N4270k02119m50198k00236L13798M25491j6158l69563l6670
37965h71391O60260Q14630J52691n45540n01789J7664J96756j19867l64060k36220
$$ plain form
37955 -796866 -822414 -742084 -486301 -48483 157188 -253478 -920263 -1032965 -377676 379612
37945 379612 537618 91057 -469153 -712253 -487077 108499 793238 1280148 1460939 1346039
37935 1346039 937210 337106 -173278 -422244 -555840 -691942 -607857 -159256 253073 178763
37925 178763 -112126 -11566 371410 314229 -280004 -576783 -68761 596318 553667 -70638
37915 -70638 -471687 -306305 60551 226043 136159 -98786 -345192 -426221 -249621 87950
37905 87950 488416 960391 1344220 1215921 423629 -477793 -742723 -315582 156975 154940
37895 154940 -206717 -499490 -496463 -290420 -120113 -165324 -390320 -561326 -499521 -278369
37885 -278369 -96022 -59846 -206604 -569046 -1013916 -1152704 -704013 81310 602303 518146
$$ packed form
37955g96866k5548Q0330K55783M37818K05671m10666o66785j12702O55289P57288
37945C79612J58006m46561n60210k43100K25176N95576O84739M86910J80791j14900
37935A346039m08829o00104n10384k48966j33596j36102Q4085M48601M12329p4310
37925A78763k90889J00560L82976n7181n94233k96779N08022O65079m2651o24305
37915g0638m01049J65382L66856J65492q9884k34945k46406q1029J76600L37571
37905H7950M00466M71975L83829j28299p92292r01422k64930M27141M72557k035
37895A54940l61657k92773L027K06043J70307m5211k24996j71006O1805K21152
37885b78369J82347L6176j46758l62442m44870j38788M48691P85323N20993q4157
$$ plain form
37875 518146 -21655 -701485 -1291149 -1535475 -1153161 -207533 699088 910140 406942 -196344
37865 -196344 -404425 -369518 -492346 -683338 -422838 361661 914939 544888 -352756 -717287
37855 -717287 -258042 157215 -195150 -792493 -632065 241328 699991 37522 -1130064
37846 -1130064 -1703709 -1362674 -642296 -98877 150318 191567 72324 -122325 -228685 -153063
37836 -153063 82321 449265 868099 1047198 671580 -104950 -643269 -557450 -253716 -387066
37826 -387066 -919853 -1159211 -733592 -59088 333905 497408 758820 1048486 993414 555999
37816 555999 133051 -17284 -89447 -347844 -686473 -750659 -390633 139358 428969 330423
37806 330423 115472 158491 477013 737321 739395 642360 575549 338055 -209788 -708979
$$ packed form
37875E18146n39801o79830n89664k44326L82314R45628R06621K11052n03198o03286
37865a96344k08081L4907j22828j90992K60500P84499N53278l70051q97644l64531
37855g17287M59245M15257l52365n97343J60428Q73393M58663o62469j167586
37846a130064n73645L41035P20378N43419K49195M1249j19243j94649j06360P5622
37836a53063K35384L66944M18834J79099l75618p76530n38319Q5819L03734j33350
37826c87066n32787k39358M25619O74504L92993J63503K61412K89666n5072m37415
37816E55999m22948j50335p2163k58397l38629o4186L60026N29991K89611r8546
37806C30423k14951M3019L18522K60308K074r7035o6811k37494n47843m99191
$$ plain form
37796 -708979 -687736 -263077 -165 -103430 -218456 -81778 135684 292423 580118 1049282
37786 1049282 1245284 765765 -48993 -443534 -195952 162361 105221 -265333 -501808 -459239
37776 -459239 -402745 -535693 -684497 -593880 -393818 -498572 -982941 -1334221 -1057477 -346936
37766 -346936 159529 196189 63226 12442 -119398 -496517 -887196 -977210 -834096 -747642
37756 -747642 -762372 -674727 -418176 -171744 -97468 -187097 -363797 -544179 -597185 -419826
37746 -419826 -77453 268255 559762 809536 883378 561516 -82950 -579090 -531292 -88053
37736 -88053 270996 352352 391882 550762 569972 138647 -580359 -1069913 -1036128 -626770
37726 -626770 -145310 153184 21065 -616650 -1338701 -1470300 -900175 -331528 -411666 -893210
$$ packed form
37796g08979K1243M24659K62912j03265j15026J36678K17462J56739K87695M69164
37786A049282J96002m79519q14758l94541K47582L58313n7140l70554k36475M2569
37776d59239N6494j32948j48804R0617K00062j04754m84369l51280K76744P10541
37766c46936N06465L6660j32963n0784j31840l77119l90679r0014J43114Q6454
37756g47642j4730Q7645K56551K46432P4276q9629j76700j80382n3006J77359
37746d19826L42373L45708K91507K49774P3842l21862o44466m96140M7798M43239
37736h8053L59049Q1356L9530J58880J9210m31325p19006m89554L3785M09358
37726f26770M81460K98494j32119o37715p22051j31599N70125N68647q0138m81544
$$ plain form
37716 -893210 -1033264 -594641 2119 385272 577600 623683 361633 -253638 -919989 -1261664
37706 -1261664 -1146770 -670841 -48750 428288 578571 549837 630368 793019 692724 204569
37696 204569 -311336 -437479 -183025 110744 178580 3930 -268837 -444419 -383666 -114324
37686 -114324 189473 351910 283264 7895 -271723 -248340 145612 551394 587451 358587
37676 358587 255258 300276 90810 -540376 -1180232 -1315867 -891520 -252184 224491 329915
37666 329915 116272 -82920 49032 392632 510634 261941 -3382 16618 172696 197867
37656 197867 131419 134836 125431 -85894 -419052 -578274 -449783 -246016 -251096 -525974 -849557
37645 -849557 -919264 -664810 -345137 -234008 -276707 -235492 -93141 -48672 -161809 -309522
$$ packed form
37716h93210j40054M38623N96760L83153J92328M6083k62050o15271o66351l41675
37706a261664J14894M75929O22091M77038J50283k8734Q0531J62651j00295m88155
37696B04569n15905j26143K54454K93769O7836j74650k72767j75582O0753K69342
37686a14324L03797J62437o8646k75369k79618K3383L93952M05782L6057k28864
37676C58587j03329M5018k09466o31186o39856j35635M24347O39336M76675J05424
37666C29915k13643j99192J31952L43600J18002k48693k65323K0000J56078K5171
37656A97867o6448L417r405k11325l33158j59222J28491K03767n080k74878l23583
37645h49557o9707K54454L19673J11129m2699M1215J42351M4469j13137j47713
$$ plain form
37635 -309522 -461863 -640689 -627532 -169517 464588 650506 304189 87494 435764 894015
37625 894015 845441 468145 419726 834156 1203058 1165900 921987 828015 959397 1142763
37615 1142763 1176227 969260 620434 351033 267247 270354 268799 297518 322024 173095 -141339
37604 -141339 -315317 -178914 -20516 -196968 -622858 -932089 -952473 -724079 -262999 321234
37594 321234 639231 374773 -236411 -648300 -677589 -578880 -494866 -251491 215742 589754
37584 589754 515478 41026 -398717 -353612 268421 1061714 1398507 1007668 244685 -336618
37574 -336618 -553737 -551625 -384776 -6030 396097 464700 171862 -79072 11831 269027
37564 269027 360968 258493 172047 198679 259039 302469 360059 412461 401042 407932 637924
$$ packed form
37635c09522j52341j78826J3157M58015O34105J85918l46317k16695L48270M58251
37625H94015m8574l77296m8419M14430L68902l7158k43913r3972J31382J83366
37615A142763L3464k06967l48826k69401q3786L107j555K8719K4506j48929l14434
37604a41339j73978J36403J58398j76452m25890l09231k0384K28394M61080N84233
37594C21234L17997k64458o11184m11889k9289R8709Q4014K43375M67233L74012
37584E89754p4276m74452m39743M5105O22033P93293L36793l90839p62983n81303
37574c36618k17119K112J66849L78746M02127O8603k92838k50934R0903K57196
37564B69027R1941j02475q6446K6632O0360M3430N7590N2402j1419O890K29992
$$ plain form
37553 637924 1096306 1421009 1241747 663260 149291 -107251 -399135 -926450 -1323600 -1128448
37543 -1128448 -536216 -229069 -484275 -893198 -1015295 -867665 -645565 -412251 -287474
37534 -287474 -519426 -1050636 -1350191 -1033905 -404767 -51988 -139993 -410968 -651103 -781920
37524 -781920 -680356 -306434 100127 283090 295804 255615 593 -569148 -1014567 -818164
37514 -818164 -267577 -216419 -825855 -1201502 -636408 338162 683371 273593 -71499 131021
37504 131021 402910 160875 -364246 -507941 -169625 96045 -62688 -338630 -322643 -128631
37494 -128631 -165527 -504165 -793933 -746648 -463491 -284488 -442556 -821964 -1002010 -693902
37484 -693902 -198694 -152475 -656815 -1021484 -679009 11074 321035 189662 105331 179523
$$ packed form
37553F37924M58382L24703j79262n78487n13969k56542k91884n27315l97150J95152
37543a128448N92232L07147k55206m08923j22097J47630K22100K33314J24777
37534b87474k31952n31210k99555L16286O29138L52779q8005k70975k40135j30817
37524g81920J01564L73922M06561J82963J2714m0189k55022n69741m45419J96403
37514h18164N50587N1158o09436l75647N65094R74570L45209m09778l45092K02520
37504A31021K71889k42035n25121j43695L38316K65670j58733k75942J5987J94012
37494a28631l6896l38638k89768M7285K83157J79003j58068l79408j80046L08108
37484f93902M95208M6219n04340l64669L42475O90083L09961j31373q4331P4192
$$ plain form
37474 179523 37420 -423615 -860278 -1119301 -1389113 -1610695 -1391008 -691541 -13555 294050
37464 294050 350876 226562 -245087 -915200 -1247545 -1091573 -909236 -958215 -921090 -644609
37454 -644609 -482730 -499782 -156291 653066 1079969 582493 -53828 138093 764839 709986
37444 709986 -133285 -875082 -1126627 -1342330 -1667938 -1545270 -755086 6911 34682 -452166
37434 -452166 -661715 -193562 613572 1102492 927077 359725 -37413 -73704 -46297 -144295
37424 -144295 -176195 -116546 -377661 -1085467 -1584910 -1266578 -495091 -73592 -115464 -127965
37414 -127965 55463 143604 11019 -211431 -519876 -904838 -1033894 -695935 -350738 -578310
37404 -578310 -1186448 -1521821 -1414304 -1107436 -571365 254247 805800 481332 -252430 -358800
$$ packed form
37474A79523j42103m61035m36663k59023k69812k21582K19687O99467O77986L07605
37464B94050N6826j24314m71649o70113l32345J55972J82337m8979L7125K76481
37454f44609J61879j7052L43491Q09357M26903m97476o36321J91921O26746n4853
37444G09986q43271p41797k51545k15703l25608J22668P90184P61997K7771m86848
37434d52166k09549M68153Q07134M88920j75415n67352l97138l6291K7407r7998
37424a44295l1900N9649k61115p07806m99443L18332P71487M21499m1872j2501
37414a27965J83428Q8141j32585k22450l08445l84962j29056L37959L45197k27572
37404e78310o08138l35373J07517L06868N36071Q25612N51553l24468p33762j06370
$$ plain form
37394 -358800 213132 528051 246361 63510 351628 493064 4943 -637810 -822166 -645413
37384 -645413 -460234 -293588 -181415 -387943 -810282 -825401 -246590 184204 -166925 -820795
37374 -820795 -833542 -79175 692433 836824 358458 -378459 -1057758 -1521557 -1691206 -1470997
37364 -1470997 -850667 -184971 -60151 -553071 -967784 -811058 -639985 -1205710 -2103924
37355 -2103924 -2258368 -1573049 -988002 -882504 -628669 40380 441815 179348 -145854
37346 -145854 -42917 54029 -273004 -592746 -437639 -121321 -37489 68603 414227 557383
37336 557383 230278 15304 344532 579073 35651 -753982 -858228 -444217 -343010 -571449
37326 -571449 -480164 -100701 -124756 -587136 -708935 -206472 209023 -97397 -860104 -1406603
$$ packed form
37394c58800N71932L14919k81690j82851K88118J41436m88121o42753j84356J76753
37384f45413J85179J66646J12173k06528m22339j5119N78811M30794l51129o53870
37374h20795j2747P54367P71608J44391m78366p36917o79299m63799j69649K20209
37364a470997O20330O65696J24820m92920m14713J56726J71073n65725q98214
37355b103924j54444O85319N85047J05498K53835O69049M01435k62467l25202
37346a45854J02937R6946l27033l19742J55107L16318Q3832J06092L45624J43156
37336E57383l27105k14974L29228K34541n43422p89633j04246M14011J01207k28439
37326e71449R1285L79463k4055m62380j21799N02463M15495l06420p62707n46499
$$ plain form
37316 -1406603 -1392204 -877115 -186585 190696 25186 -276711 -148667 306797 452044 60443
37306 60443 -407666 -547405 -519726 -639626 -831967 -730465 -161154 592343 997344 829549
37296 829549 507972 607841 1021742 1052715 471560 -101296 -163928 -34885 -110762 -78403
37286 -78403 443276 1021489 991590 534720 333535 443983 368968 41472 -153532 -220382
37276 -220382 -528010 -964033 -971231 -500551 -143505 -206618 -373850 -388646 -358535 -261014 145034
37265 145034 742942 1043771 920999 758904 741206 621482 339424 215086 354073 489377
37255 489377 584891 944023 1522400 1794999 1530818 1045203 488653 -351385 -1255283 -1425448
37245 -1425448 -626549 279263 513953 415215 638004 985253 861419 408882 276223 505421
$$ packed form
37316a406603J4399N15089O90530L77281j65510l01897J28044M55464J45247l91601
37306F0443m68109j39739K7679j19900j92341J01502N69311P53497M05001j67795
37296H29549l21577R9869M13901L0973n81155n72856o2632J29043p5877L2359
37286g8403N21679N78213k9899m56870k01185J10448p5015l27496j95004o6850
37276b20382l07628m36023p198M70680L57046o3113j67232j4796L0111R7521M06048
37265A45034N97908L00829j22772j62095j7698j19724k82058j24338J38987J35304
37255D89377R5514L59132N78377K72599k64181m85615n56550q40038r03898j70165
37245a425448P98899R05812K34690r8738K22789L47249j23834m52537j32659K29198
$$ plain form
37235 505421 529643 201854 15526 230396 479390 424577 240567 215872 310319 356101
37225 356101 377126 462985 532540 437504 206044 47556 135361 409893 590543 457477
37215 457477 159693 92821 370779 616859 477373 162759 191777 689978 1241058 1419900
37205 1419900 1200497 798000 352472 -109913 -527915 -737867 -582718 -124471 288895
37196 288895 351080 245411 509523 1287651 2007423 2108808 1837413 1862361 2258328 2424721
37186 2424721 2029893 1449243 1076653 750530 221710 -243330 -200068 286819 744555 930063
37176 930063 973839 1032323 1203248 1646932 2318211 2666050 2153891 1112307 504257 698615
37166 698615 1045072 918323 605544 719978 1195695 1427511 1146251 624304 165942 -140381
$$ packed form
37235E05421K4222l27789j86328K14870K48994n4813j84010k4695R4447M5782
37225C56101K1025Q5859O9555r5036k31460j58488Q7805K74532J80650j33066
37215D57477k97784o6872K77958K46080j39486l14614K9018M98201N51080J78842
37205A419900k19403m02497m45528m62385m18002k09952J55149M58247M13366
37196B88895O2185j05669K64112P78128P19772J01385k71395K4948L95967J66393
37186B424721l94828n80650l72590l26123n28820m65040M3262M86887M57736J85508
37176I30063M3776N8484J70925M43684O71279L47839n12159j041584o08050J94358
37166F98615L46457j26749l12779J14434M75717K31816k81260n21947m58362l06323
$$ plain form
37156 -140381 -290695 -417923 -825633 -1512572 -1831184 -1174283 95804 1013638 1277205
37147 1277205 1464579 1894597 2040706 1442316 555801 149257 246397 216070 -305746 -1044188
37137 -1044188 -1504927 -1396385 -742720 99043 608714 547959 166828 -193975 -511191 -859463
37127 -859463 -1028545 -745717 -178299 174546 113585 -43444 58581 360820 527876 380554
37117 380554 70551 -125034 -99573 26225 124131 226004 372694 412574 167528 -255741
37107 -255741 -581175 -758326 -921431 -965154 -599479 57054 426450 287794 191763 650515
37097 650515 1291608 1354638 797868 316141 322074 491309 410483 156117 -1755 -73323
37087 -73323 -206189 -307044 -143414 249777 535425 472007 165465 -128272 -294951 -330815
$$ packed form
37156a40381j50314j27228m07710o86939l18612O56901J270087R17834K63567
37147A277205J87374M30018J46109n98390q86515m06544R7140l0327n21816p38442
37137a044188m60739J08542O53665Q41763N09671o0755l81131l60803l17216l48272
37127h59463j69082K82828N67418L52845o0961j57029J02025L02239J67056j47322
37117C80554l10003j95585K5461J25798R7906J01873J46690L9880k45046m23269
37107b55741l25434j77151j63105m3723L65675O56533L69396j38656r6031M58752
37097F50515O41093O3030n56770m81727N933J69235q0826k54366j57872p1568
37087g3323j32866j00855J63630L93191K85648o3418l06542k93737j66679l5864
$$ plain form
37077 -330815 -128161 468466 1317757 1896144 1770444 1094246 440949 174593 194900 292831
37067 292831 464801 726989 846931 542759 -65988 -430358 -131538 590876 1025438 770828
37057 770828 197775 -35168 189522 403008 304312 147125 236954 462996 604363 729785
37047 729785 941113 1044868 872797 633809 540160 409647 112060 49787 578708 1246605
37037 1246605 1319384 865126 560899 556059 351691 -193811 -562611 -412721 -14074 284385
37027 284385 414536 376527 285774 566422 1366557 1898953 1287496 27444 -470852 116304
37017 116304 656786 438072 139631 433792 849192 766692 488137 485354 501061 243539
37007 243539 135748 493406 730492 301476 -259901 -178376 314729 515282 451981 580306
$$ packed form
37077c30815K02654N96627Q49291N78387j25700o76198o53297k66356K0307R7931
37067B92831J71970K62188J19942l04172o08747l64370K98820P22414M34562k54610
37057G70828n73053k32943K24690K13486r8696j57187Q9829K26042J41367J25422
37047G29785K11328J03755j72071k38988r3649j30513k97587o2273N28921O67897
37037A246605P2779m54258l04227m840k04368n45502l68800J49890L98647K98459
37027B84385J30151l8009r0753K80648Q00135N32396o11457j260052m98296N87156
37017A16304N40482k18714k98441K94161M15400q2500k78555k783J5707k57522
37007B43539j07791L57658K37086m29016n61377Q1525M93105K00553o3301J28325
$$ plain form
36997 580306 761342 543713 112741 42179 366150 664709 768676 725774 496822 316200
36987 316200 766214 1780034 2280937 1676217 924960 1053683 1422383 831556 -320394
36978 -320394 -622669 -20466 162712 -449043 -687290 87826 902816 787984 175928 -74897
36968 -74897 -9758 -103080 -238876 -16918 399063 478654 142205 -151565 -47739 288593
36958 288593 383963 9750 -449355 -339087 405213 1049078 1002248 583121 403536 446520
36948 446520 402657 504895 1170914 2052349 2369901 2149745 2236374 2985877 3757300 3889164
36938 3889164 3482847 2979618 2537020 2096789 1683190 1432185 1511532 1962639 2444661 2418457
36928 2418457 1893421 1596066 1951233 2351073 2035498 1258039 852718 1016912 1309091
$$ packed form
36997E80306J81036k17629m30972p0562L23971K98559J03967m2902k28952j80622
36987C16200M50014J013820N00903o04720p51257J28723L68700n90827j151950
36978c20394l02275O02203J83178o11755k38247P75116Q14990j14832o12056k50825
36968g4897O5139r3322j35796K21958M15981P9591l36449k93770J03826L36332
36958B88593R5370l74213m59105J10268P44300O43865m6830m19127j79585M2984
36948D46520m3863J02238O66019Q81435L17552k20156Q6629P49503P71423J31864
36938C889164m06317n03229m42598m40231m13599k51005P9347M51107M82022k6204
36928B418457n25036k97355L55167L99840l15575p77459m05321J64194K92179
$$ plain form
36919 1309091 1531223 1774918 1847762 1516805 1143733 1248500 1594643 1511798 978795 598471
36909 598471 647264 924120 1376406 2093810 2834224 3296503 3670629 4209859 4555734 4259788
36899 4259788 3632085 3242953 2966317 2414219 1891510 1903132 2115376 1896034 1501967 1568326
36889 1568326 1798167 1444100 789328 776593 1352132 1575687 1276447 1188606 1465853 1492255
36879 1492255 1244579 1427419 2083098 2422058 2251174 2260656 2647088 2750633 2387802 2316652
36869 2316652 2970234 3788566 4169206 4150832 3920949 3551110 3369605 3718275 4278021 4461097
36859 4461097 4348518 4361018 4325063 3936943 3744807 4369364 5114486 4815212 3789066 3385349
36849 3385349 3804769 4037323 3875904 4227882 5289929 6090317 6139633 6077120 6420217 6990055
$$ packed form
36919A309091K22132K43695P2844l30957l73072J04767L46143q2845n33003l80324
36909E98471M8793K76856M52286P17404P40414M62279L74126N39230L45875k95946
36899D259788o27703l89132k76636n52098n22709J1622K12244k19342l94067O6359
36889A568326K29841l54067o54772j2735N75539K23555k99240q7841K77247K6402
36879A492255k47676J82840O55679L38960j70884R482L86432J03545l62831p1150
36869B316652O53582Q18332L80640j8374k29883l69839j81505L48670N59746J83076
36859D461097j12579J2500l5955l88120j92136O24557P45122k99274j026146m03717
36849C385349M19420K32554j61419L51978J062047Q00388M9316o2513L43097N69838
$$ plain form
36839 6990055 7742132 8924764 10312021 11385241 12230019 13301462 14646415 16296040
36831 16296040 18784469 22294978 26215755 30548417 36513663 44826006 55172051 68310981
36823 68310981 86080023 108601763 136171926 175731535 237435725 316811512 385297931
36816 385297931 409580131 381318879 321169132 255261664 196896100 150039109 117063673
36809 117063673 96515782 81660482 68016600 57501793 51535911 46457975 39873696
36802 39873696 34908576 33510601 31984682 28006657 25467730 27126739 29155782 28560276
36794 28560276 29043395 33493185 38098092 40578870 46157740 57795272 69559812 78662173
36786 78662173 93735938 120072192 149389888 180768101 237499168 334839476 435157479
$$ packed form
36839F990055P52077J182632J387257J073220Q44778J071443J344953J649625
36831A6296040K488429L510509L920777M332662N965246Q312343J0346045J3138930
36823F8310981J7769042K2521740K7570163L9559609O1704190P9375787O8486419
36816C85297931K4282200k8261252o0149747o5907468n8365564m6856991l2975436
36809A17063673k0547891j4855300j3643882j0514807n965882n077936o584279
36802C9873696m965120j397975j525919l978025k538927J659009K029043n95506
36794B8560276M83119M449790M604907K480778N578870J1637532J1764540R102361
36786G8662173J5073765K6336254K9317696L1378213N6731067R7340308J00318003
$$ plain form
36779 435157479 468189350 406793415 298794543 211048129 163365544 133328156 104338435
36772 104338435 81672510 69853007 61222755 50092886 40564359 35902994 32513157
36765 32513157 27975211 25113002 25030504 24397135 22177657 21775221 24318232 26489654 27090921
36756 27090921 29558082 35696341 42311760 46123587 47182950 45765878 40802421 33384359
36748 33384359 27354518 24257961 21505973 17292179 13519233 12007251 11453508 10239169
36740 10239169 9067883 8776309 8354324 7101393 6245573 6604447 6895891 6032549 5013557
36731 5013557 5002779 5444013 5485436 5495309 5896683 6163967 6095073 6486587 7584921 8460313
36721 8460313 8778035 9575812 11461751 13642629 15541327 17853007 21292268 25726013
$$ packed form
36779D35157479L3031871o1395935j07998872q7746414m7682585l0037388k8989721
36772A04338435k2665925j1819503q630252j1129869r528527m661365l389837
36765C2513157m537946k862209q2498o33369k219478m02436K543011K171422O01267
36756B7090921K467161O138259O615419L811827J059363j417072m963457p418062
36748C3384359o029841l096557k751988m213794l772946j511982n53743j214339
36740A0239169j171286k91574m21985j252931q55820L58874K91444q63342j018992
36731E013557j0778M41234M1423R873M01374K67284o8894L91514J098334Q75392
36721H460313L17722P97777J885939K180878J898698K311680L439261M433745
$$ plain form
36713 25726013 30914852 36330342 39852820 38853598 33516722 27197590 22542564 19079104
36705 19079104 15523774 12316965 10385515 9175551 7663422 6112607 5306269 5039288
36697 5039288 4739935 4695660 5360771 6178262 6280460 5793834 5448839 5386785 5176538 4567218
36687 4567218 3602599 2462840 1618761 1547419 1972451 2097851 1826835 1853671 2297970 2322076
36677 2322076 1513353 573989 155821 55533 41458 369126 930234 1026583 615382 644877
36667 644877 1471528 2112720 1863181 1468372 1730357 2076324 1672188 1014490 1141552 1955703
36657 1955703 2560463 2706984 2694514 2305073 1145861 -157549 -383137 580358 1489136
36648 1489136 1425696 862695 718475 1048126 1179251 781239 268249 148842 359503 486749
$$ packed form
36713B5726013N188839N415490L522478r99222n336876o319132m655026l463460
36705A9079104l555330l206809j931450j209964j512129j550815q06338k66981
36697E039288k99353m4275O65111Q17491J02198m86626l44995o2054k10247o09320
36687D567218r64619j139759q44079p1342M25032J25400k71016K6836M44299K4106
36677B322076q08723r39364m18168j00288j4075L27668N61108R6349m11201K9495
36667F44877Q26651O41192k49539l94809K61985L45967m04136o57698J27062Q14151
36657A955703O04760J46521j2470l89441j159212j303410k25588R63495R08778
36648A489136o3440n63001j44220L29651J31125l98012n12990j19407K10661J27246
$$ plain form
36638 486749 460706 598213 914975 950502 594575 502766 1096613 1668722 1313793 385132
36628 385132 47260 572235 1125038 1190876 1118380 1137888 945105 537502 444920 761915
36618 761915 866823 472267 82658 49187 54996 -70521 73196 601523 915985 646972
36608 646972 253337 186810 207033 26023 -85515 164329 595594 999353 1387596 1501362
36598 1501362 927001 70360 42656 1069054 2000434 2000745 1663289 1693472 1586564 685450
36588 685450 -341640 -321660 693091 1654497 2036015 2050500 1760044 1113653 661147 1132210
36578 1132210 2318456 3282449 3679399 4037017 4678418 5160731 4969935 4180976 3235466
36569 3235466 2468152 1963980 1599791 1204606 840446 769102 982297 1071604 799947 433576
$$ packed form
36638D86749k6043J37507L16762L5527l55927r1809N93847N72109l54929r28661
36628C85132l37872N24975N52803O5838p2496J9508j92783m07603r2582L16995
36618G61915J04908l94556l89609l3471N809j25517J43717N28327L14462k69013
36608F46972l93635o6527K0223j81010j11538K49844M31265M03759L88243J13766
36598A501362n74361q56641k7704J026398R31380L11l37456L0183j06908r01114
36588F85450j027090J9980J014751R61406L81518J4485k90456o46391m52506M71063
36578A132210J186246R63993L96950L57618O41401M82313j90796p88959r45510
36569C235466p67314n04172l64189l95185l64160p1344K13195Q9307k71657l66371
$$ plain form
36559 433576 225685 14027 -294533 -309439 283507 1134260 1685502 1856676 1818019 1505420
36549 1505420 902642 432140 489243 869830 1132580 1183288 1065409 654707 98497 9916
36539 9916 546357 842077 189196 -709433 -660660 197515 606110 78280 -555441 -580049
36529 -580049 -288241 -136921 44834 524325 1031349 1154061 915087 588301 328693 258886
36519 258886 523094 968840 1133342 834701 469448 442074 575459 412452 -70338 -385701
36509 -385701 -161928 387573 720747 612608 407803 550936 974125 1168081 849399 288692
36499 288692 -85602 -130323 48129 258517 250325 -71274 -346016 -105277 448160 562358
36489 562358 71052 -268547 6875 243641 -250703 -952732 -866255 -88891 386771 220780
$$ packed form
36559D33576k07891k11658l08560j4906N92946Q50753N51242J71174l8657l12599
36549A505420o02778m70502N7103L80587K62750N0708j17879m10702n56210q8581
36539I916N36441K95720o52881q98629M8773Q58175M08595n27830o33721k4608
36529e80049K91808J51320J81755M79491N07024J22712k38974l26786k59608o9807
36519B58886K64208M45746J64502k98641l65253k7374J33385j63007m82790l15363
36509c85701K23773N49501L33174j08139k04805J43133M23189J93956l18682n60707
36499B88692l74294m4721J78452K10388q192l21599k74742K40739N53437J14198
36489E62358m91306l39599K75422K36766m94344p02029Q6477P77364M75662j65991
$$ plain form
36479 220780 14651 58762 -148711 -863314 -1464427 -1300110 -544711 175289 533593 566314
36469 566314 407637 261196 299677 376569 153433 -335197 -589311 -270017 400133 984548
36459 984548 1264046 1229473 976590 711617 577252 444120 171506 2578 272238 767193
36449 767193 889764 490847 31618 -120217 -17182 263528 700021 923792 468718 -352637
36439 -352637 -554261 199426 1063886 1208603 852882 623994 570915 446208 372335 515354
36429 515354 579089 328164 142662 305351 243786 -596541 -1548080 -1485741 -562151 1305
36419 1305 -186470 -249445 300323 751132 534555 217610 412291 667815 345891 -183970
36409 -183970 -226891 -38655 -328690 -884400 -838494 -148558 311136 163209 -40866 15858
$$ packed form
36479B20780k06129M4111k07473p14603o01113J64317P55399P20000L58304L2721
36469E66314j58677j46441L8481P6892k23136m88630k54114L19294O70150N84415
36459I84548K79498l4573k52883k64973j34365j33132k72614j68928K69660M94955
36449G67193J22571l98917m59229j51835J03035K80710M36493K23771m55074q21355
36439c52637k01624P53687Q64460J44717l55721k28888n3079j24707p3873J43019
36429E15354O3735k50925j85502J62689o1565q40327r51539O2339R23590N63456
36419A305j87775o2975N49768M50809k16577l16945J94681K55524l21924n29861
36409a83970m2921J88236k90035n55710M5906O89936M59694j47927k04075N6724
$$ plain form
36399 15858 -129394 -704766 -1079142 -729672 -98872 146332 116479 296084 629655 731192
36389 731192 651162 693017 694329 251930 -413715 -564052 -15374 521223 386792 -214698
36379 -214698 -591994 -391421 200621 819484 1221124 1308958 1043968 416287 -404139 -930894
36369 -930894 -696421 93570 585905 297653 -218410 -180566 280655 435440 177963 102066
36359 102066 356464 335632 -204489 -556894 -99835 724603 1070864 841172 538213 344830
36349 344830 60627 -248495 -262000 -52436 -71401 -367853 -393680 151005 723987 567738
36339 567738 -308990 -1150558 -1378361 -1154251 -955786 -891567 -704345 -337200 -139399 -382137
36329 -382137 -834251 -1050990 -908085 -594051 -246554 59243 98658 -262485 -622930 -342266
$$ packed form
36399A5858j45252n75372l74376L49470O30800K45204k9853J79605L33571J01537
36389G31192q0030M1855J312m42399o65645j50337N48678N36597j34431o01490
36379b14698l77296K00573N92042O18863M01640Q7834k64990o27681q20426n26755
36369i30894K34473P89991M92335k88252n16063L7844M61221J54785k57477p5897
36359A02066K54398k0832n40121l52405M57059Q24438L46261k29692l02959j93383
36349C44830k84203l09122j3505K09564j8965k96452k5827N44685N72982j56249
36339E67738q76728q41568k27803K24110J98465O4219J87222L67145J97801k42738
36329c82137m52114k16739J42905L14034L47497L05797L9415l61143l60445K80664
$$ plain form
36319 -342266 580394 1374425 1446321 1034450 662465 390887 24389 -295973 -254685 33692
36309 33692 102697 -178832 -429652 -339803 -50412 203950 502984 1007892 1499458 1509342
36299 1509342 967438 426634 417207 746881 780379 375363 95487 330901 681523 613164
36289 613164 343657 496639 1089160 1527608 1568005 1610377 1950282 2398475 2863556 3699743
36279 3699743 5121136 6723307 7924832 8537054 8667517 8450206 8078161 7673419 6947694
36270 6947694 5524512 3808167 2862869 3057739 3534389 3543349 3583865 4461502 5828488
36261 5828488 6614714 6540191 6235449 6079931 5882481 5596371 5357199 4812463 3463058
36252 3463058 1845427 1291025 2074579 2787923 2205624 925752 306301 445444 321241
$$ packed form
36319c42266R22660P94031P1896m11871l71985k71578l66498l20362M1288K88377
36309C3692O9005k81529k50820Q9849K89391K54362K99034N04908M91566R884
36299A509342n41904n40804r427L29674L3498m05016k79876K35414L50622o8359
36289F13164k69507J52982N92521M38448M0397M2372L39905M48193M65081Q36187
36279C699743J421393J602171J201525O12222J30463k17311l72045m04742p25725
36270F947694j423182j716345r45298J94870M76650Q960M0516Q77637J366986
36261E828488P86226p4523l04742j55518j97450k86110k39172n44736j349405
36252C463058j617631n54402P83554P13344n82299j279872o19451J39143j24203
$$ plain form
36243 321241 -371074 -745050 -272496 244786 -161552 -1173691 -1638553 -1140182 -383091
36234 -383091 -81525 -172498 -283519 -339538 -332020 18370 833400 1589971 1616384 970823
36224 970823 343954 149547 181716 144838 33088 -62854 -94388 30929 274970 276548 -170095
36213 -170095 -560736 -276787 327498 284611 -454678 -838398 -369872 100193 -190200 -685052
36203 -685052 -536490 -11919 112868 -85646 10896 362100 450540 330471 442745 632438
36193 632438 407486 562 92592 566431 638024 235706 120237 499174 651180 208624
36183 208624 -260099 -335022 -394065 -690740 -735346 -205928 346320 361426 131160 132228 165292
36172 165292 -99111 -286152 138249 862987 1079450 628375 100572 -76719 -36055 -30785
$$ packed form
36243C21241o92315l73976M72554N17282m06338j012139m64862M98371P57091
36234c83091L01566r0973j11021n6019P518L50390Q15030P56571K6413o45561
36224I70823o26869j94407L2169l6878j11750r5942l1534J25317K44041J578m46643
36213a70095l90641K83949O04285m2887p39289l83720M68526M70065k90393m94852
36203f85052J48562N24571J24787j98514R6542L51204Q8440j20069J12274J89693
36193F32438k24952m06924R2030M73839P1593m02318j15469L78937J52006m42556
36183B08624m68723p4923n9043k96675m4606N29418N52248J5106k30266J068L3064
36172A65292k64403j87041M24401P24738K16463m51075n27803j77291M0664N270
$$ plain form
36162 -30785 -139566 -370405 -619116 -591588 -167612 258788 214859 -165383 -313802 -31247
36152 -31247 305509 342218 156444 3227 -24510 9228 -6097 -173824 -455575 -601585
36142 -601585 -437155 -195152 -288528 -727859 -1072118 -1066941 -1013004 -1245963 -1497252 -1195974
36132 -1195974 -381730 155643 -110032 -658942 -600023 76579 505576 215499 -254609 -253421
36122 -253421 87726 318447 506536 976284 1550827 1740363 1490766 1097799 563364 -245899
36112 -245899 -942142 -949349 -492149 -400999 -833952 -1087932 -895632 -936088 -1597895 -2138815
36102 -2138815 -1753960 -784861 -135897 -31580 -83600 -133667 -262059 -299219 -95003 -44531
36092 -44531 -617565 -1509595 -1924899 -1587407 -859694 -26651 834595 1371949 1141137 376271
$$ packed form
36162c0785j08781k30839k48711K7528M23976M26400m3929l80242j48419K82555
36152c1247L36756L6709j85774j53217k7737L3738j5325j67727k81751j46010
36142f01585J64430K42003r3376m39331l44259N177N3937k32959k51289L01278
36132a195974Q14244N37373k65675n48910N8919O76602M28997k90077m70108J188
36122b53421L41147K30721J88089M69748N74543J89536k49597l92967n34435q09263
36112b45899o96243p207M57200R1150m32953k53980J92300m0456o61807n40920
36102b138815L84855R69099O48964J04317n2020n0067j28392l7160K04216N0472
36092d4531n73034q92030m15304L37492P27713Q33043Q61246N37354k30812p64866
$$ plain form
36082 376271 -115771 -22197 109129 -220722 -755526 -982572 -851224 -630099 -408696 -124521
36072 -124521 140793 245579 267713 438424 816460 1168141 1179087 785258 338153 328585
36062 328585 778714 1059169 627974 -148637 -359082 234937 837244 668574 -89967 -743105
36052 -743105 -1070497 -1373653 -1753885 -1906090 -1655402 -1244836 -948151 -725119 -428977 -101178
36042 -101178 130830 265857 358183 381670 336209 347728 467535 502975 281047 -28809
36032 -28809 -138202 -113912 -281959 -650049 -816862 -582907 -276214 -248142 -381858 -396344
36022 -396344 -335428 -369836 -343920 15681 540272 734111 466783 147612 136893 333734
36012 333734 461462 468971 500176 651103 856444 908137 607838 43392 -371939 -324194
$$ packed form
36082C76271m92042R3574J31326l29851n34804k27046J31348K21125K21403K84175
36072a24521K65314J04786K2134J70711L78036L51681J0946l93829m47105r568
36062C28585M50129K80455m31195p76611k10445N94019O02307j68670p58541o53138
36052g43105l27392l03156l80232j52205K50688M10566K96685K23032K96142L27799
36042a01178K32008J35027R2326K3487m5461J1519J19807L5440k21928l09856
36032b8809j09393K4290j68047l68090j66813K33955L06693K8072j33716j4486
36022c96344O0916l4408K5916L59601N24591J93839k67328l19171j0719J96841
36012C33734J27728P509L1205J50927K05341N1693l00299n64446m15331M7745
$$ plain form
36002 -324194 53047 450087 782125 1021657 917063 357183 -209148 -301659 -184298 -428803
35992 -428803 -829839 -612525 221034 693560 286796 -325880 -427278 -283812 -417163 -613308
35982 -613308 -424316 -68731 -13601 -95645 135784 542100 647816 484666 415153 386039
35972 386039 163305 48877 448643 902394 574075 -295961 -515014 281942 1048337 933608
35962 933608 452481 406460 555678 288323 -41945 417216 1448758 1786824 867407 -361308
35952 -361308 -770379 -465571 -299768 -498984 -545691 -234544 -18381 -154213 -232212 54609
35942 54609 276715 -14335 -409894 -253272 179747 47552 -582302 -687300 54024 643692
35932 643692 330036 -225604 -153318 147366 -176218 -773456 -534587 583578 1440755 1412401
$$ packed form
36002c24194L77241L97040L32038K39532j04594n59880n66331r2511J17361k44505
35992d28803m01036K17314Q33559M72526m06764o12676j01398J43466j33351j96145
35982f13308J88992L55585N5130q2044K31429M06316J05716j63150o9513k9114
35972C86039k22734j14428L99766M53751l28319q70036k19053P96956P66395j14729
35962I33608m81127m6021J49218k67355l30268M59161J031542L38066r19417j228715
35952c61308m09071L04808J65803j99216m6707L11147K16163j35832p7999K86821
35942E4609K22106k91050l95559J56622M33019j32195o29854j04998P41324N89668
35932F43692l13656n55640P2286L00684l23584n97238K38869J118165Q57177k8354
$$ plain form
35922 1412401 1041788 864176 707039 463531 513359 913088 1074113 762913 594751 957897
35912 957897 1232459 774890 1424 -300186 -195111 -276414 -504398 -294954 380786 842281
35902 842281 697275 306448 127542 149009 138653 31907 -90264 -127386 2054 214808
35892 214808 207912 -154438 -487074 -302647 255864 543080 320903 79072 266127 605579
35882 605579 495195 -147921 -778671 -897550 -576665 -273107 -276830 -455398 -514122 -374176
35872 -374176 -178090 -4347 186202 294867 87360 -376718 -634059 -460446 -353149 -884655
35862 -884655 -1700867 -1764663 -718112 542213 939477 437924 -176687 -367760 -188463
35853 -188463 221947 836976 1377093 1332191 642013 -51695 -192460 -42232 -193585 -582387
$$ packed form
35922A412401l70613j77612j57137k43508M9828L99729J61025l11200j68162L63146
35912I57897K74562m57569p73466l01610J05075q1303k27984K09444O75740M61495
35902H42281j45006l90827j78906K1467j0356j06746j22171l7122J29440K12754
35892B14808o896l62350l32636J84427N58511K87216k22177k41831J87055L39452
35882F05579j10384o43116o30750j18879L20885L03558l723j78568n8724J39946
35872c74176J96086J73743J90549J08665k07507m64078k57341J73613J07297n31506
35862h84655q16212o3796J046551J260325L97264n01553o14611j91073J79297
35853a88463M10410O15029N40117m4902o90178o93708j40765J50228j51353l88802
$$ plain form
35843 -582387 -585817 -100969 140843 -353709 -992425 -857027 -1721 626551 468857 -77036
35833 -77036 -449622 -648273 -853702 -854019 -367316 341837 700918 595020 435608 477527
35823 477527 508056 305785 15926 -116451 -90969 -21705 99605 277905 336660 126179
35813 126179 -195860 -334346 -242451 -116812 -72839 -80711 -194563 -535491 -968203 -1084021
35803 -1084021 -688580 -118039 122886 -76399 -381863 -424286 -139093 188094 128960 -453346
35793 -453346 -1081885 -1058618 -359472 225883 167418 -27197 325050 837987 563573 -378822
35783 -378822 -746100 7376 895169 933571 545944 587799 775867 249818 -752294 -1075741
35773 -1075741 -459012 57627 -210992 -602103 -263025 549247 964673 717763 236558
$$ packed form
35843e82387l430M84848K41812m94552o38716J35398Q55306O28272j57694n45893
35833g7036l72586j98651k05429l17M86703P09153L59081j05898j59412M1919
35823D77527L0529k02271k89859j32377K5482O9264J21310J78300N8755k10481
35813A26179l22039j38486R1895J25639M3973p872j13852l40928m32712j15818
35803a084021L95441N70541K40925j99285l05464m2423K85193L27187n9134n82306
35793d53346o28539K3267O99146N85355n8465j94615L52247N12937k74414r42395
35783c78822l67278P53476Q87793L8402l87627M1855J88068n26049j002112l23447
35773a075741O16729N16639k68619l91111L39078Q12272M15426k46910m81205
$$ plain form
35764 236558 -111749 -294339 -346422 -285913 -184159 -49202 205524 502192 561617 303163
35754 303163 -9848 -188079 -320050 -378676 -86801 519709 867612 620640 271635 439065
35744 439065 891291 867281 196521 -487570 -618269 -280558 115525 342922 430306 463011
35734 463011 396960 50055 -577431 -993119 -641962 203189 532704 -55657 -694286 -507243
35724 -507243 31707 -160572 -1065026 -1589610 -1193343 -492162 -161864 -149794 -183814 -243023
35714 -243023 -257718 -79302 14487 -454034 -1198001 -1298925 -649502 -300587 -818567 -1293393
35704 -1293393 -818818 -52251 -149967 -791329 -637166 479133 1209394 698715 -286254
35695 -286254 -663232 -458393 -310372 -315252 -112207 311481 587080 545065 315101 -26636
$$ packed form
35764B36558l48307j82590n2083O0509J01754J34957K54726K96668N9425k58454
35754C03163l13011j78231j31971n8626K91875O06510L47903k46972l49005J67430
35744D39065M52226k4010o70760o84091j30699L37711L96083K27397Q7384L2705
35734D63011o6051l46905o27486m15688L51157Q45151L29515n88361o38629J87043
35724e07243N38950j92279r04454n24584L96267P01181L30298J2070l4020n9209
35714b43023j4695J78416R3789m68521p43967j00924O49423L48915n17980m74826
35704a293393M74575P66567r7716o41362J54163J116299P30261n10679r84969
35695b86254l76978K04839J48021m880K03045M23688K75599m2015k29964l41737
$$ plain form
35685 -26636 -476968 -845862 -860474 -546259 -241711 -210999 -414594 -643524 -725481 -623484
35675 -623484 -465213 -448371 -609324 -733605 -609771 -326015 -191369 -381581 -769682 -1100543
35665 -1100543 -1233579 -1189912 -1036033 -794382 -492699 -265236 -292017 -535553 -602667 -66130
35655 -66130 987743 1860711 1849885 954920 -114678 -655919 -606025 -395789 -276471 -39918
35645 -39918 479304 881781 568921 -384437 -1151871 -1139986 -685008 -465634 -563014 -567071
35635 -567071 -373928 -257966 -192741 214554 907235 1126899 403937 -654063 -1092805 -836553
35625 -836553 -597920 -717585 -774900 -464694 -207973 -473045 -918322 -808783 -170664 88109
35615 88109 -588855 -1533428 -1639251 -771787 122162 283381 -8741 -30737 398540 869311
$$ packed form
35685b6636m50332l68894j4612L14215L04548L0712k03595k28930q1957J01997
35675f23484J58271J6842j60953j24281J23834K83756J34646j90212l88101l30861
35665a100543j33036M3667J53879K41651L01683K27463k6781k43536o7114N36537
35655f6130J053873Q72968j0826q94965j069598n41241M9894K10236J19318K36553
35645c9918N19222M02477l12860r53358p67434J1885M54978K19374r7380m057
35635e67071J93143J15962O5225M07295O92681K19664p22962j058000m38742K56252
35625h36553K38633j19665n7315L10206K56721k65072m45277J09539O38119K58773
35615H8109o76964r44573j05823Q67464Q93949J61219k92122k1996M29277M70771
$$ plain form
35605 869311 1009095 772558 299714 -147407 -257285 -26389 108547 -157664 -497516 -438498
35595 -438498 -118498 -17823 -155024 -223695 -363200 -940111 -1574256 -1372194 -359393 324764
35585 324764 86637 -268589 27933 406041 3390 -796254 -992075 -587507 -407524 -629206
35575 -629206 -676560 -427540 -363306 -507771 -325601 200397 436674 240415 226769 629334
35565 629334 880236 679603 523844 716318 761292 293245 -212537 -264462 -159722 -346636
35555 -346636 -649608 -748735 -795460 -926629 -802724 -288628 46100 -182552 -428642 -144312
35545 -144312 207225 -21400 -449679 -354300 -34681 -268828 -777076 -590167 179976 352164
35535 352164 -396473 -970388 -606478 47027 171963 18230 166053 424375 311478 36106
$$ packed form
35605H69311J39784k36537m72844m47121j09878K30896J34936k66211l39852N9018
35595d38498L20000J00675j37201o8671j39505n76911o34145K02062J012801O84157
35585C24764k38127l55226K96522L78108m02651p99644j95821M04568J79983k21682
35575f29206m7354K49020O4234j44465J82170N25998K36277j96259j3646M02565
35565F29334K50902k00633j55759J92474M4974m68047n05782n1925J04740j86914
35555c46636l02972r9127m6725j31169J23905N14096L34728k28652k46090K84330
35545a44312L51537k28625m28279R5379L19619k34147n08248J86909P70143J72188
35535C52164p48637n73915L63910O53505J24936j53733J47823K58322j12897k75372
$$ plain form
35525 36106 174369 719207 1132886 1124601 859825 594317 497983 629058 775405 584831
35515 584831 103650 -161961 24139 261853 186144 29821 111979 232322 80396 -145456
35505 -145456 -70658 232474 489914 769737 1197929 1434592 1101981 522295 327198 468352
35495 468352 358099 -50718 -126236 376716 878863 889170 688168 709064 801844 607614
35485 607614 250745 113426 164640 34659 -346938 -641736 -610475 -345985 19865 470876
35475 470876 861177 842325 264792 -517062 -963269 -909168 -644399 -482532 -444820 -401133
35465 -401133 -343392 -389672 -591896 -851294 -1000628 -916734 -617414 -310786 -248443 -425035
35455 -425035 -535548 -372071 -128142 -103048 -251546 -334238 -397535 -677830 -1042643 -1030878
$$ packed form
35525C6106J38263N44838M13679q285k64776k65508r6334J31075J46347j90574
35515E84831m81181k65611J86100K37714p5709j56323Q2158J20343j51926k25852
35505a45456P4798L03132K57440K79823M28192K36663l32611n79686j95097J41154
35495D68352j10253m08817p5518N02952N02147J0307k01002K0896R2780j94230
35485F07614l56869j37319N1214j29981l81597k94798L1261K64490L65850M51011
35475D70876L90301j8852n77533p81854m46207N4101K64769J61867L7712M3687
35465d01133N7741m6280k02224k59398j49334Q3894K99320L06628O2343j76592
35455d25035j10513J63477K43929K5094j48498q2692o3297k80295l64813J1765
$$ plain form
35445 -1030878 -583259 -230266 -305137 -463573 -348070 -241370 -521346 -846406 -562767 255901
35435 255901 853456 829308 488112 138280 -268995 -641166 -567178 16719 522025 462581
35425 462581 75302 -201638 -420490 -789845 -1035215 -745124 -167917 11772 -311124 -497954
35415 -497954 -153945 294947 306133 45037 75226 466617 662300 218091 -644070 -1293486
35405 -1293486 -1310778 -781400 -115761 300904 319273 19161 -390367 -651510 -574074 -223375
35395 -223375 50189 -43824 -323025 -243953 467829 1432780 1990423 1865832 1344790 875999
35385 875999 656166 578120 445885 205887 5410 1279 115591 104502 -91343 -254245
35375 -254245 -261999 -324927 -622642 -911841 -834891 -492280 -314460 -420173 -543558 -614826
$$ packed form
35445a030878M47619L52993p4871j58436J15503J06700k79976l25060K83639Q18668
35435B55901N97555k4148l41196l49832m07275l72171P3988N83897N05306n9444
35425D62581l87279k76940k18852l69355k45370K90091N77207J79689l22896j86830
35415d97954L44009M48892J1186k61096L0189L91391J95683m44209q62161o49416
35405a293486j7292N29378O65639M16665J8369l00112m09528k61143P7436L50699
35395b23375K73564r4013k79201P9072P11782R64951N57643j24591n21042m68791
35385H75999k19833p8046j32235k39998k00477m131J14312j1089j95845j62902
35375b54245p754o2928k97715k89199P6950L42611J77820j05713j23385p1268
$$ plain form
35365 -614826 -896813 -1370162 -1487776 -888715 8938 513876 495727 339882 298158 298852
35355 298852 267807 244337 231536 230027 339245 574682 739844 750590 859077 1204517 1408601
35344 1408601 1095843 581758 449790 598407 391180 -290470 -877402 -1057362 -1121224 -1184707
35334 -1184707 -870057 -128000 367808 151875 -333294 -500865 -477182 -581443 -558757 -144896
35324 -144896 84750 -578040 -1642824 -1832348 -875023 70117 28216 -594696 -839998 -521959
35314 -521959 -170195 -125588 -289106 -515052 -719031 -708801 -372364 -23171 -158718 -785188
35304 -785188 -1287238 -1133966 -521073 -107925 -198686 -410236 -209165 400615 881787 761055
35294 761055 48514 -860452 -1455666 -1321117 -425730 669057 1192629 937947 400787
$$ packed form
35365f14826k81987m73349j17614N99061Q97653N04938j8149j55845m1724O94
35355B98852l1045k3470j2801j509J09218K35437J65162J0746J08487L45440K04084
35344A408601l12758n14085j31968J48617k07227o81650n86932j79960o3862o3483
35334a184707L14650P42057M95808k15933m85169j67571K3683j04261K2686M13861
35324a44896K29646o62790j064784j89524R57325R45140m1901o22912k45302L18039
35314e21959L51764M4607j63518k25946k03979J0230L36437L49193j35547o26470
35304g85188n02050J53272O12893M13148r0761k11550K01071O09780M81172j20732
35294G61055p12541r08966n95214J34549Q95387J094787N23572k54682n37160
$$ plain form
35285 400787 9339 -405992 -1078749 -1635145 -1476797 -658720 131808 434393 410239 391438
35275 391438 475918 627339 786886 796653 547195 274303 374809 834700 1158881 986587
35265 986587 499653 114075 27861 174282 368616 389069 126377 -262816 -536998 -715394
35255 -715394 -1008050 -1406659 -1633262 -1520157 -1154482 -646889 -96668 208078 -24122 -608258
35245 -608258 -996741 -1001766 -986716 -1172613 -1216584 -776867 -108602 272923 257512 127319
35235 127319 80662 75267 -3422 -259350 -720178 -1168591 -1245241 -923765 -657942 -813560
35225 -813560 -1150880 -1122864 -535293 292289 855166 780580 41456 -916177 -1431386 -1214732
35215 -1214732 -548401 153421 688346 892047 586977 -16024 -294648 18806 406483
$$ packed form
35285D00787l91448m15331o72757n56396J58348Q18077P90528L02585k4154j8801
35275C91438Q4480J51421J59547R767k49458k72892J00506M59891L24181j72294
35265I86587m86934l85578q6214J46421J94334K0453k62692l89193k74182j78396
35255g15394k92656l98609k26603J13105L65675N07593N50221L04746k32200n84136
35245f08258l88483n025J5050j85897m3971M39717O68265L81525j5411j30193
35235A27319m6657n395p8689k55928m60828m48413p6650L21476K65823j55618
35225h13560l37320K8016N87571Q27582N62877p4586p39124r57633n15209K16654
35215a214732O66331P01822N34925K03701l05070o03001k78624L13454L87677
$$ plain form
35206 406483 313287 -35855 -76079 156147 152191 -160014 -294066 -5767 361856 460221
35196 460221 402077 462384 631424 654980 371405 -68266 -270532 2558 433534 404344
35186 404344 -175499 -628819 -384903 265110 665382 665932 511012 249001 -118270 -228334
35176 -228334 164742 552908 307651 -253269 -325705 -1245 -142152 -850257 -1206194 -789419
35166 -789419 -310086 -275570 -167517 369651 595131 -117318 -984391 -841702 103064 662278
35156 662278 428527 22387 -199707 -541698 -1050018 -1241118 -959670 -671080 -661821 -670939
35146 -670939 -539791 -531383 -728679 -755989 -422503 -83657 -33203 -45275 144732 382694
35136 382694 464605 500879 540697 293498 -326715 -796211 -648960 -218805 -140387 -369733
$$ packed form
35206D06483r3196l49142m0224K32226l956l12205j34052K88299L67623R8365
35196D60221n8144O0307J69040K3556k83575m39671k02266K73090M30976k9190
35186D04344n79843m53320K43916O50013M00272N50j54920k62011l67271j10064
35176b28334L93076L88166k45257n60920p2436L24460j40907p08105l55937M16775
35166g89419M79333L4516J08053N37168K25480p12449q67073J42689R44766N59214
35156F62278k33751m06140k22094l41991n08320j91100K81448K88590R259r118
35146f70939J31148Q408j97296k7310L33486L38846N0454j2072J90007K37962
35136C82694Q1911L6274L9818k47199o20213m69496J47251M30155P8418k29346
$$ plain form
35126 -369733 -362248 -91787 -133196 -605284 -747708 40003 1214036 1668605 1100553 298488
35116 298488 79179 368140 518071 253270 -26909 131377 569664 663325 118797 -556421
35106 -556421 -578790 109979 627646 186496 -810871 -1152495 -379071 540167 469331 -381167
35096 -381167 -851546 -530435 -202431 -466123 -799059 -519392 50250 174922 -3838 276286
35086 276286 1004928 1240619 522306 -395010 -594160 -147087 242791 259954 122009 19586
35076 19586 -73680 -151782 -123205 25463 224504 387930 365063 31495 -437463 -666863
35066 -666863 -626522 -713920 -1042501 -1096951 -540776 60221 -15692 -442784 -207483 832298
35056 832298 1586729 1208726 210002 -363436 -306815 -191151 -287438 -285445 -17583 212775
$$ packed form
35126c69733P485K70461m1409m72088j42424P87711J174033M54569n68052q02065
35116B98488k19309K88961J49931k64801k80179J58286M38287R3661n44528o75218
35106e56421k2369O88769N17667m41150r97367l41624P73424R19238p0836q50498
35096c81167m70379L21111L28004k63692l32936K79667N69642J24672j78760K80124
35086B76286P28642K35691p18313r17316j99150M47073L89878J7163j37945j02423
35076A9586r3266p8102K8577J48668J99041J63426k2867l33568m68958k29400
35066f66863M0341q7398l28581n4450N56175O00997p5913m27092K35301J039781
35056H32298P54431l78003r98724n73438N6621J15664r6287J993K67862K30358
$$ plain form
35046 212775 193052 163052 323911 389972 41121 -408272 -265020 629496 1630566 2021310
35036 2021310 1697072 1019768 356394 2229 217826 916319 1481960 1358881 786875
35027 786875 519281 793077 1051984 809652 292233 -36645 -142288 -232029 -256303 -54238
35017 -54238 228079 324795 316850 472657 721620 738600 512342 369644 408633 368243 162064
35006 162064 92264 329881 565817 462592 181888 150933 449904 713857 614366 250998
34996 250998 29396 203211 547515 545824 -10524 -691998 -868457 -415004 227826 631737
34986 631737 727695 589143 231271 -240866 -570109 -620732 -542362 -538924 -627817 -696594 -625383
34975 -625383 -324996 125828 374272 124941 -375775 -535610 -197744 149011 95604 -157848
$$ packed form
35046B12775j9723l0000J60859O6061l48851m49393J43252Q94516J001070L90744
35036B021310l24238o77304o63374l54165K15597O98493N65641j23079n72006
35027G86875k67594K73796K58907k42332n17419l28878j05643q9741k4274K02065
35017e4238K82317R6716p945J55807K48963J6980k26258j42698L8989m0390k06179
35006A62064o9800K37617K35936j03225k80704l0955K98971K63953r9491l63368
34996B50998k21602J73815L44304j691n56348o81474j76459M53453O42830M03911
34986F31737R5958j38552l57872m72137l29243n0623P8370L438q8893o8777P1211
34975f25383L00387M50824K48444k49331n00716j59835L37866L46755n3407k53452
$$ plain form
34965 -157848 -240576 -182067 -203620 -263242 -193959 -58002 2890 66448 233553 335616 184208
34954 184208 -91442 -302667 -552897 -924791 -1077203 -677782 -59919 129797 -145524 -335703
34944 -335703 -235786 -268281 -706313 -1181141 -1205297 -786568 -340648 -316713 -945169 -1921351
34934 -1921351 -2332989 -1512417 -107225 376734 -578479 -1764223 -1802377 -817317 55616
34925 55616 270601 161851 -10407 -355705 -739204 -749832 -450899 -422119 -792100 -904428
34915 -904428 -334169 347343 346130 -235796 -646514 -598799 -514769 -720871 -1002827 -1087810
34905 -1087810 -1054755 -996028 -673182 91923 908616 1151551 773757 382503 415927 617928
34895 617928 545722 265258 155354 201363 -21723 -616278 -1079211 -983930 -584651 -397775
$$ packed form
34965a57848q2728N8509k1553n9622O9283J35957O0892O3558J67105J02063j51408
34954A84208k75650k11225k50230l71894j52412L99421O17863J89716k75321j90179
34944c35703R9917l2495m38032m74828k4156M18729M45920K3935o28456r76182
34934a921351m11638Q20572J405192M83959r55213j185744l8154R85060Q72933
34925E5616K14985j08750j72258l45298l83499j0628K98933K8780l69981j12328
34915i04428N70259O81512j213n81926m10718M7715Q4030k06102k81956q4983
34905a087810L3055N8727L22846P65105Q16693K42935l77794l91254L3424K02001
34895F17928p2206k80464j09904M6009k23086n94555m62933R5281L99279J86876
$$ plain form
34885 -397775 -435649 -298002 80807 273456 35967 -302975 -362744 -268332 -356254 -579648
34875 -579648 -624005 -481901 -433921 -447762 -115423 607771 1077065 757197 3396 -433108
34865 -433108 -426425 -410106 -430152 -30533 759891 1092888 412714 -675732 -1229027 -1208287
34855 -1208287 -1226931 -1401925 -1285408 -826318 -537596 -595433 -566266 -276014 -207670 -654056
34845 -654056 -1136316 -1147014 -904181 -823457 -748465 -342520 157510 273473 85364 1468
34835 1468 -39667 -380212 -790465 -631870 79821 557411 365049 -48134 -181686 -180973 -353800
34824 -353800 -574102 -591210 -484125 -408645 -274699 -29508 124079 137846 325464 766326
34814 766326 949839 516507 -53125 -93711 223377 210110 -198061 -368184 -11542 414671
$$ packed form
34885c97775l7874J37647L78809J92649k37489l38942n9769R4412q7922k23394
34875e79648m4357J42104M7980j3841L32339P23194M69294l19868p53801m36504
34865d33108O683J6319k0046L99619P90424L32997o80174j088446n53295K0740
34855a208287j8644j74994J16517M59090K88722n7837K9167K90252O8344m46386
34845f54056m82260j0698K42833Q0724P4992M05945N00030J15963j88109q3896
34835A468m1135l40545m10253J58595P11691M77590j92362m13183j33552P13j72827
34824c53800k20302j7108J07085P5480J33946K45191J53587J3767J87618M40862
34814G66326J83513m33332n69632m0586L17088j3267m08171j70123L56642M26213
$$ plain form
34804 414671 478023 326169 243229 156091 -113189 -439421 -523717 -267249 109890 194975
34794 194975 -325194 -1261127 -1904874 -1744291 -1086272 -583474 -322210 46870 422320 312621
34784 312621 -138497 -94414 658969 1192878 772991 -46445 -360417 -277988 -496805 -1018492
34774 -1018492 -1246339 -1063904 -859399 -644396 -111201 483256 468007 -115023 -460165 -243356
34764 -243356 -10845 -99318 -134857 15156 -219393 -1022736 -1531219 -1029815 -97300 267352
34754 267352 56645 -80140 -40910 -153808 -266331 -16774 245964 -68931 -535040 -123034
34744 -123034 1042581 1582696 870883 -27512 -9141 515272 522683 -4205 -315637 -197977
34734 -197977 -73400 -111271 -119381 -147264 -405730 -681926 -560038 -169718 -29400 -183506
$$ packed form
34804D14671O3352j51854q2940q7138k69280l26232q4296K56468L77139Q5085
34794A94975n20169r35933o43747J60583O58019N02798K61264L69080L75450j09699
34784C12621m51118M4083P53383N33909m19887q19436l13972Q2429k18817n21687
34774a018492k27847J82435K04505K15003N33195N94457j5249n83030l45142K16809
34764b43356K32511q8473l5539J50013k34549q03343n08483N01404R32515L64652
34754B67352k10707j36785L9230j12898j12523K49557K62738l14895m66109M12006
34744a23034J165615N40115p11813q98395J8371N24413P411n26888l11432J17660
34734a97977J24577l7871q110k7883k58466k76196J21888L90320J40318j54106
$$ plain form
34724 -183506 -195736 -6625 -53570 -419906 -607116 -400672 -272991 -565659 -872757 -681987
34714 -681987 -145186 256873 417790 492989 423211 97221 -230430 -198052 98360 241420
34704 241420 122608 39395 200425 487951 708855 793710 751326 645918 577532 530441
34694 530441 383486 214835 309513 623985 636075 137235 -253616 19937 442934 165158
34684 165158 -493195 -349478 759173 1544806 1120204 222128 -70258 99558 -19190
34675 -19190 -334894 -174710 404167 658421 378597 86989 38814 -49331 -198548 2255
34665 2255 555453 862000 659799 414360 444665 389096 -23007 -349103 -154245 184435
34655 184435 34709 -493370 -733263 -433410 199 111019 -185146 -656583 -872093 -431389
$$ packed form
34724a83506j2230J89111m6945l66336j87210K06444J27681k92668l07098J90770
34714f81987N36801M02059J60917P5199o9778l25990l27651L2378K96412J43060
34704B41420j18812q3213J61030K87526K20904Q4855m2384j05408o8386m7091
34694E30441j46955j68651R4678L14472J2090m98840l90851K73553M22997k77776
34684A65158o58353J43717J108651P85633m24602q98076k92386J69816j18748
34675a9190l15704J60184N78877K54254k79824k91608m8175q8145j49217K00803
34665B255N53198L06547k02201k45439L0305n5569m12103l26096J94858L38680
34655A84435j49726n28079k39893K99853M33609J10820k96165m71437k15510M40704
$$ plain form
34645 -431389 538331 1261885 1070732 182767 -576986 -705502 -388597 -101168 -128717 -338909
34635 -338909 -229924 524853 1398182 1365246 318619 -468505 25326 998589 859761 -451657
34625 -451657 -1331652 -773505 373062 795184 380612 -133154 -402680 -602100 -781581
34616 -781581 -847477 -929390 -1152805 -1228749 -818126 -169270 126495 -53095 -264702 -197022
34606 -197022 -30736 -43884 -212489 -320258 -245800 -59521 42486 -91436 -365937 -494080
34596 -494080 -374674 -266251 -405996 -621618 -579054 -294244 -96053 -122937 -151130 41718
34586 41718 377029 611733 621000 485197 382336 409486 458543 304799 -134640 -696718
34576 -696718 -1147519 -1332615 -1136218 -525709 243417 708007 681155 462895 373549 308610
$$ packed form
34645d31389R69720P23554j91153q87965p59753j28516L16905K87429k7549k10192
34635c38909J08985P54777Q73329l2936j046627p87124M93831R73263j38828j311418
34625d51657q79995N58147J146567M22122m14572n13766k69526j99420j79481
34616g81581o5896q1913k23415p5944M10623O48856K95765j79590k11607O7680
34606a97022J66286j3148j68605j07769P4458J86279J02007j33922k74501j28143
34596d94080J19406J08423j39745k15622M2564K84810J98191k6884k8193J92848
34586D1718L35311K34704R267j35803j02861K7150M9057j53744m39439n62078
34576f96718m50801j85096J96397O10509P69126M64590k6852k18260q9346o4939
$$ plain form
34566 308610 36955 -266036 -169754 382134 927915 1007987 619237 155719 47173 383226
34556 383226 757828 635857 42034 -343892 -40674 541729 646749 203088 -160294 -18519
34546 -18519 428088 797653 889636 599428 732 -408266 -77772 813392 1448316 1422636
34536 1422636 1176940 1136015 1015361 453397 -146355 -47138 748246 1435259 1393612 801685
34526 801685 250546 95253 246434 359109 168865 -240524 -547779 -644056 -775861 -1066985
34516 -1066985 -1158646 -670991 128177 520195 200147 -379535 -573002 -192049 449795 916020
34506 916020 988863 768691 495031 260102 -4427 -252083 -310345 -285485 -615666 -1389462
34496 -1389462 -1944164 -1626383 -714098 -20658 237704 507117 915301 1030161 732971
$$ packed form
34566C08610k71655l02991R6282N51888N45781Q0072l88750m63518j08546L36053
34556C83226L74602j21971n93823l85926L03218N82403J05020m43661l63382J41775
34546a8519M46607L69565R1983k90208n98696m08998L30494Q91164O34924k5680
34536A422636k45696m0925j20654n61964n99752R9217P95384O87013m1647n91927
34526H01685n51139j55293J51181J12675j90244m09389l07255r6277j31805k91124
34516a066985r1661M87655P99168L92018l20048n79682j93467L80953O41844M66225
34506I16020P2843k20172k73660k34929k64529k47656n8262K4860l30181p73796
34496a389462n54702L17781R12285O93440K58362K69413M08184J14860k97190
$$ plain form
34487 732971 529766 668507 682972 266615 -83402 122272 509009 481845 214345 203606
34477 203606 259428 -129608 -667151 -510241 350615 965309 837216 520903 529148 580486
34467 580486 397382 376991 806057 1128394 782276 231896 319869 949873 1264702 937728
34457 937728 473427 296410 296661 301197 323808 279621 37903 -203898 -153723 1678 -121763
34446 -121763 -320135 -69587 419339 342300 -326832 -623693 -161715 131076 -472007 -1212100
34436 -1212100 -1040974 -326276 -182947 -610855 -613275 17664 371695 2865 -398323 -285352
34426 -285352 -112661 -367235 -688355 -636152 -550237 -853442 -1134732 -818779 -302546 -459746
34416 -459746 -1235174 -1699357 -1489440 -1259292 -1493816 -1729427 -1376252 -647052 -121662 140578
$$ packed form
34487G32971k03205J38741J4465m16357l50017K05674L86737k7164k67500j0739
34477B03606N5822l89036n37543J56910Q60856O14694j28093l16313Q245N1338
34467E80486j83104k0391M29066L22337l46118n50380Q7973O30004L14829l26974
34457I37728m64301j77017K51M536K2611m4187k41718k41801N0175J55401j23441
34446a21763j98372K50548M88926p7039o69132k96861M61978K92791o03083p40093
34436a212100J71126P14698J43329m27908k420O30939L54031l68830m01188J12971
34426b85352J72691k54574l21120N2203Q5915l03205k81290L15953N16233j57200
34416d59746p75428m64183K09917K30148k34524k35611L53175P29200N25390K62240
$$ plain form
34406 140578 451004 751491 666121 218070 -78455 71267 390473 526973 501905 450961
34396 450961 265780 -191125 -735986 -1056697 -1113112 -1025368 -702642 -3572 768174 1019063
34386 1019063 651945 240405 170817 59387 -564241 -1368241 -1604598 -1205767 -842312 -867024
34376 -867024 -855941 -413897 160904 418118 509297 882525 1480200 1776346 1532231 1045602
34366 1045602 637059 307856 1234 -152054 -21334 310456 643312 806671 679093
34357 679093 302741 29079 241348 793078 1053041 759136 505240 959058 1791393 1934342
34347 1934342 954692 -342138 -914667 -688676 -405954 -557508 -929465 -1115904 -1016014
34338 -1016014 -740588 -407793 -203517 -342119 -743499 -978001 -777711 -421683 -346217 -525921
$$ packed form
34406A40578L10426L00487q5370m48051k96525J49722L19206J36500k5068n0944
34396D50961j85181m56905n44861l20711n6415Q7744L22726O99070P71746K50889
34386A019063l67118m11540o9588j11430o23628q04000k36357L98831L63455k4712
34376h67024J1083M42044N74801K57214R1179L73228N97675K96146k44115m86629
34366A045602m08543l29203l06622j53288J30720L31790L32856J63359j27578
34357F79093l76352k73662K12269N51730K59963k93905k53896M53818Q32335J42949
34347A934342r79650j296830n72529K25991K82722j51554l71957j86439R9890
34338a016014K75426L32795K04276j38602m01380k34502K00290L56028P5466j79704
$$ plain form
34328 -525921 -567834 -334546 -93552 -18534 67592 286657 380693 95885 -303620 -267336
34318 -267336 309670 894148 961549 613972 360708 400180 385896 -31294 -655960 -959295
34308 -959295 -738118 -290146 72966 361360 611885 596563 157830 -387303 -598359 -558605
34298 -558605 -707264 -1042904 -1027141 -425450 274304 561501 561743 635745 751065 731213 760045
34287 760045 1035136 1182179 721139 -11718 -203224 125348 4113 -988690 -1931107 -1806728
34277 -1806728 -892554 -203485 -59487 -37155 -12220 -265704 -583092 -239381 821610 1597131
34267 1597131 1271042 252083 -506073 -705043 -682714 -633987 -505939 -420525 -551950 -685710
34257 -685710 -477733 -87377 24436 -100997 43562 501692 625805 49932 -697616 -957575
$$ packed form
34328e25921m1913K33288K40994P5018Q6126K19065R4036k84808l99505L6284
34318b67336N77006N84478O7401l47577k53264L9472j4284m17190o24666l03335
34308i59295K21177M47972L63112K88394K50525j5322m38733n45133k11056L9754
34298e58605j48659l35640J5763O01691O99754K87197K42P4002J15320j9852K8832
34287G60045K75091J47043m61040p32857j91506L28572j21235r92803r42417J24379
34277a806728R14174O89069J43998K2332K4935k53484l17388L43711J060991P75521
34267A597131l26089j018959p58156j98970K2329M8727J28048Q5414j31425j33760
34257f85710K07977L90356J11813j25433J44559M58130J24113n75873p47548k59959
$$ plain form
34247 -957575 -842568 -879970 -1090736 -993691 -388116 392913 1009790 1456031 1784803 1853695
34237 1853695 1518140 885381 240190 -184236 -317171 -253942 -209969 -390753 -838262 -1385842
34227 -1385842 -1730410 -1583731 -909944 -79210 380702 320287 127390 214091 491091 544808
34217 544808 217010 -237121 -527062 -621921 -625759 -541160 -276233 142918 445967 324114
34207 324114 -145099 -420997 -116972 377124 299973 -387617 -803733 -285727 742111 1417525
34197 1417525 1507365 1304411 855471 19409 -863084 -1111000 -598516 67399 359972 325914
34187 325914 216731 159084 277830 613251 812009 457969 -166679 -280089 226920 497649
34177 497649 -41429 -792113 -883615 -423079 -188257 -433687 -706457 -680845 -515147 -389072
$$ packed form
34247i57575J15007l7402k10766R7045O05575P81029O16877M46241L28772O8892
34237A853695l35555o32759o45191m24426j32935O3229M3973j80784m47509n47580
34227a385842l44568J46679O73787Q30734M59912o0415j92897Q6701K77000N3717
34217E44808l27798m54131k89941r4859l838Q4599K64927M19151L03049j21853
34207C24114m69213k75898L04025M94096p7151o87590m16116N18006J027838O75414
34197A417525Q9840k02954m48940q36062q82493k47916N12484O65915K92573l4058
34187C25914j09183n7647J18746L35421J98758l54040o24648j13410N07009K70729
34177D97649n39078p50684r1502M60536K34822k45430k72770K5612J65698J26075
$$ plain form
34167 -389072 -243102 -66375 -18234 -141903 -260851 -260406 -243730 -321234 -404829 -296832 55870
34156 55870 403310 352433 -155901 -594163 -390245 259178 542510 134225 -349278 -270585
34146 -270585 160405 371613 317587 299925 247557 -139274 -704298 -977293 -954911 -1104848
34136 -1104848 -1551269 -1840762 -1633416 -1126266 -661765 -358808 -254391 -396195 -656360
34127 -656360 -794171 -774346 -698856 -470507 18499 407753 185330 -433324 -606699 -74292
34117 -74292 405201 201455 -226640 -66827 629010 1107127 1001206 625263 324376 121938
34107 121938 -12953 -51561 -102105 -321370 -592478 -630830 -420253 -214469 -118521 -29036
34097 -29036 15410 -155406 -418385 -388465 -36655 156267 -83562 -366368 -265681 -38391
$$ packed form
34167c89072J45970J76727M8141j23669j18948M45J6676p7504q3595J07997L52702
34156E5870L47440n0877n08334m38262K03918O49423K83332m08285m83503P8693
34146b70585M30990K11208n4026j7662n2368l86831n65024k72995K2382j49937
34136a104848m46421k89493K07346N07150M64501L02957J04417j41804k60165
34127f56360j37811J9825P5490K28349M89006L89254k22423o18654j73375N32407
34117g4292M79493k03746m28095J59813O95837M78117j05921l75943l00887k02438
34107A21938j34891l8608n0544k19265k71108l8352K10577K05784R5948Q9485
34097b9036M4446j70816k62979K9920L51810J92922k39829k82806J00687K27290
$$ plain form
34087 -38391 -205839 -644025 -712462 -265768 97832 -36124 -315115 -292544 -153638 -267111
34077 -267111 -421226 -162670 316565 351528 -148588 -521629 -347201 43452 276301 480529
34067 480529 755110 730610 200714 -334671 -380619 -266982 -562389 -1030985 -982415 -445590
34057 -445590 -125329 -246848 -321435 -147778 -172447 -604731 -973344 -929771 -793732 -883406
34047 -883406 -938361 -672885 -323986 -145275 101686 591945 881419 556394 29363 -10353
34037 -10353 362810 517162 266095 -64109 -393035 -926737 -1475739 -1507958 -990342 -500812
34027 -500812 -360891 -296182 -114401 -36492 -86092 166739 827335 1232217 828475 56396
34017 56396 -238559 33263 244193 58444 -227944 -318378 -293646 -257015 -102411 177997
$$ packed form
34087c8391j67448m38186o8437M46694L63600j33956k78991K2571J38906j13473
34077b67111j54115K58556M79235L4963n00116l73041J74428L90653K32849K04228
34067D80529K74581k4500n29896n35385m5948J13637k95407m68596M8570N36825
34057d45590L20261j21519p4587J73657k4669m32284l68613M3573J36039q9674
34047h83406n4955K65476L48899J78711K46961M90259K89474l25025n27031l9716
34037a0353L73163J54352k51067l30204l28926n33702n49002l2219N17616M89530
34027e00812J39921O4709J81781P7909m9600K52831O60596M04882m03742p72079
34017E6396k94955K71822K10930j85749k86388r0434K4732L6631J54604K80408
$$ plain form
34007 177997 358098 367858 475266 821083 1071062 864723 404740 214648 391508 488753
33997 488753 183562 -292264 -532710 -483470 -366257 -276688 -134404 41151 60913 -201521
33987 -201521 -658987 -1094045 -1281968 -1094046 -651737 -338387 -457232 -877926 -1200587 -1242358
33977 -1242358 -1146303 -1051453 -955253 -910603 -995320 -1000588 -565056 177765 510077 35900 -671653
33966 -671653 -769010 -229180 265717 335303 230970 204104 144775 -27364 -130012 -82643
33956 -82643 -80298 -194213 -205519 -72747 -139463 -548049 -850111 -644624 -278124 -359039 -772943
33945 -772943 -815575 -301816 97411 -157190 -671330 -679256 -75546 548950 763148 772576
33935 772576 987009 1392269 1514607 952377 -117562 -987950 -1058585 -472676 -9617 -259514
$$ packed form
34007A77997J80101R760J07408L45817K49979k06339m59983j90092J76860R7245
33997D88753l05191m75826k40446M9240J17213Q9569J42284J75555J9762k62434
33987b01521m57466m35058j87923J87922M42309L13350j18845m20694l22661m1771
33977a242358R6055R4850R6200M4650q4717n268M35532P42821L32312m74177p07553
33966f71653r7357N39830M94897O9586j04333k6866n9329j72139j02648M7369
33956h2643K345j13915j1306J32772o6716m08586l02062K05487L66500q0915m13904
33945g72943m2632N13759L99227k54601n14140p926O03710O24496K14198R428
33935G72576K14433M05260J22338n62230j069939q70388p0635N85909M63059k49897
$$ plain form
33925 -259514 -1029290 -1682671 -1889138 -1797779 -1610801 -1347999 -1037345 -767190 -438168 182760
33915 182760 968358 1339897 982564 371552 182506 375976 356705 -32591 -232501 192014
33905 192014 905836 1248931 994177 421888 -72500 -199241 126921 628185 814640 539033
33895 539033 171886 -4062 -229947 -729422 -1098785 -832546 -239782 -106938 -453290 -401951
33885 -401951 468950 1369353 1357364 602903 4403 -73289 -11468 -88189 -124646 -15972
33875 -15972 3701 -182693 -340709 -353596 -511790 -1003313 -1431295 -1253360 -553756 18576
33865 18576 59405 -185747 -283338 -179455 -151140 -385703 -795137 -1154082 -1260298 -1018014
33855 -1018014 -543871 -199307 -328826 -847170 -1202437 -931018 -232051 204523 13952
$$ packed form
33925b59514p69776o53381k06467R1359J86978K62802L10654K70155L29022O20928
33915A82760P85598L71539l57333o11012j89046J93470j9271l89296j99910M24515
33905A92014P13822L43095k54754n72289m94388j26741L26162N01264J86455k75607
33895E39033l67147j75948k25885m99475l69363K66239N92764J32844l46352N1339
33885d01951Q70901R00403j1989p54461n98500p7692O1821p6721l6457J08674
33875a5972J9673j86394j58016j2887j58194m91523m27982J77935O99604N72332
33865A8576M0829k45152r7591J03883K8315k34563m09434l58945j06216K42284
33855a018014M74143L44564j29519n18344l55267K71419O98967M36574j90571
$$ plain form
33846 13952 -392064 -371667 96344 417188 233934 -81756 18329 496576 827645 701876
33836 701876 290870 -112122 -347059 -289119 86813 437445 272940 -325676 -610962 -130155
$$ packed form
33846A3952m06016K0397M68011L20844j83254l15690J00085M78247L31069j25769
33836G01876m11006m02992k34937N7940L75932L50632j64505n98616k85286M80807
$$ [...]
##END NTUPLES=NMR SPECTRUM
##END=
