##TITLE=31Pdec_E3e0607TFA1
 CDCl3, 24 sc
 7.7.2023
##JCAMPDX= 6.0         $$ Bruker NMR JCAMP-DX V2.0
##DATA TYPE= NMR SPECTRUM
##DATA CLASS= NTUPLES
##ORIGIN= UXNMR, Bruker Analytische Messtechnik GmbH
##OWNER= root
$$ XWIN-NMR		Version 3.5
$$ Fri Jul  7 15:00:32 2023 Russian Standard Time (UT+4h)  she@DPX200
##.OBSERVE FREQUENCY= 81.013821
##.OBSERVE NUCLEUS= ^31P
##.ACQUISITION MODE= SIMULTANEOUS
##.ACQUISITION SCHEME= undefined
##.AVERAGES= 24
##.DIGITISER RES= 16
##SPECTROMETER/DATA SYSTEM= spect
##.PULSE SEQUENCE= zgpg30
##.SOLVENT NAME= CDCl3
##.SHIFT REFERENCE= (INTERNAL, CDCl3, 0, 248.564)
##AUDIT TRAIL= $$ (NUMBER, WHEN, WHO, WHERE, WHAT)
$$ ##TITLE= Audit trail, XWIN-NMR		Version 3.5
$$ ##JCAMPDX= 5.01
$$ ##ORIGIN= Bruker BioSpin GmbH
$$ ##OWNER= she
$$ F:/spectra/data/she/nmr/P31/1/pdata/1/auditp.txt
$$ ##AUDIT TRAIL=  $$ (NUMBER, WHEN, WHO, WHERE, WHAT)
(   1,<2023-07-07 14:59:33.62 +0400>,<she>,<DPX200>,
      <created by zg, POWCHK disabled, PULCHK disabled
       configuration hash MD5:
       00 E9 B6 7A A2 85 ED C7 34 08 36 98 17 FE 4E 26
       data hash MD5: 32K
       9C 0F 45 04 A6 23 9B D8 F1 FF 27 98 35 B1 B7 B6>)
(   2,<2023-07-07 14:59:35.95 +0400>,<she>,<DPX200>,
      <Start of raw data processing
       efp BC_mod = 2 LB = 1 FT_mod = 6 PKNL = 1 PHC0 = -10476.69 PHC1 = -393.1151 SI = 64K 
       data hash MD5: 64K
       88 D4 A8 5D 60 8E 99 95 69 D9 4A 4F 52 76 9F 1A>)
(   3,<2023-07-07 14:59:51.73 +0400>,<she>,<DPX200>,
      <pk PHC0 = 1.212806 PHC1 = 0 
       data hash MD5: 64K
       77 F0 FB 29 EC A4 64 A5 92 E3 4F 87 BF 48 F6 2A>)
$$ ##END=
$$ 
$$ hash MD5
$$ B6 AC 94 38 26 66 C3 4D 51 76 F3 46 65 06 6B 61
##$RELAX= 
##$RELAX= 
##$RELAX= 
##$RELAX= 
##$RELAX= 
##$RELAX= 
##$RELAX= 
##$RELAX= 
##$RELAX= 
$$ Bruker specific parameters
$$ --------------------------
##$DU= <F:/spectra>
##$EXPNO= 1
##$NAME= <P31>
##$PROCNO= 1
##$TYPE= <nmr>
##$USER= <she>
##$AMP= (0..31)
100 100 100 100 100 100 100 100 100 100 100 100 100 100 100 100 100 100 
100 100 100 100 100 100 100 100 100 100 100 100 100 100 
##$AQSEQ= 0
##$AQ_mod= 1
##$AUNM= <au_zg>
##$AUTOPOS= <>
##$BF1= 81.014009
##$BF2= 200.13
##$BF3= 200.13
##$BF4= 200.13
##$BF5= 200.13
##$BF6= 200.13
##$BF7= 200.13
##$BF8= 200.13
##$BYTORDA= 1
##$CFDGTYP= 0
##$CFRGTYP= 5
##$CHEMSTR= <none>
##$CNST= (0..31)
1 1 145 1 1 1 1 1 1 1 1 1 1 1 1 1 1 1 1 1 1 1 1 1 1 1 1 1 1 1 1 1 
##$CPDPRG= <waltz16>
##$CPDPRG1= <>
##$CPDPRG2= <waltz16>
##$CPDPRG3= <>
##$CPDPRG4= <mlev>
##$CPDPRG5= <mlev>
##$CPDPRG6= <mlev>
##$CPDPRG7= <mlev>
##$CPDPRG8= <mlev>
##$CPDPRGB= <>
##$CPDPRGT= <>
##$D= (0..31)
0 1 0 0 0 0 0 0 0 0 0 0.03 2e-05 3e-06 0 0 0 0 0 0 0 0 0 0 0 0 0 0 0 0 
0 0 
##$DATE= 1688727573
##$DBL= (0..7)
120 120 120 11 120 120 24 19 
##$DBP= (0..7)
150 150 150 150 150 150 150 150 
##$DBP07= 0
##$DBPNAM0= <>
##$DBPNAM1= <>
##$DBPNAM2= <>
##$DBPNAM3= <>
##$DBPNAM4= <>
##$DBPNAM5= <>
##$DBPNAM6= <>
##$DBPNAM7= <>
##$DBPOAL= (0..7)
0.5 0.5 0.5 0.5 0.5 0.5 0.5 0.5 
##$DBPOFFS= (0..7)
$$ [...]
##$SUBNAM2= <"">
##$SUBNAM3= <"">
##$SUBNAM4= <"">
##$SUBNAM5= <"">
##$SUBNAM6= <"">
##$SUBNAM7= <"">
##$SUBNAM8= <"">
##$SUBNAM9= <"">
##$SW= 501.771253377433
##$SWIBOX= (0..15)
0 1 3 0 0 0 0 0 0 0 0 0 0 0 0 0 
##$SW_h= 40650.406504065
##$TD= 32768
##$TD0= 1
##$TE= 0
##$TE2= 300
##$TE3= 300
##$TEG= 300
##$TL= (0..7)
0 120 53 12 22 120 120 120 
##$TP= (0..7)
150 150 150 150 150 150 150 150 
##$TP07= 0
##$TPNAME0= <>
##$TPNAME1= <>
##$TPNAME2= <>
##$TPNAME3= <>
##$TPNAME4= <>
##$TPNAME5= <>
##$TPNAME6= <>
##$TPNAME7= <>
##$TPOAL= (0..7)
0.5 0.5 0.5 0.5 0.5 0.5 0.5 0.5 
##$TPOFFS= (0..7)
0 0 0 0 0 0 0 0 
##$TUNHIN= 0
##$TUNHOUT= 0
##$TUNXOUT= 0
##$USERA1= <user>
##$USERA2= <user>
##$USERA3= <user>
##$USERA4= <user>
##$USERA5= <user>
##$V9= 5
##$VALIST= <valist>
##$VCLIST= <CCCCCCCCCCCCCCC>
##$VD= 0
##$VDLIST= <DDDDDDDDDDDDDDD>
##$VPLIST= <PPPPPPPPPPPPPPP>
##$VTLIST= <TTTTTTTTTTTTTTT>
##$WBST= 1024
##$WBSW= 4
##$XGAIN= (0..3)
0 0 0 0 
##$XL= 0
##$YL= 0
##$YMAX_a= 7617
##$YMIN_a= -5374
##$ZGOPTNS= <>
##$ZL1= 120
##$ZL2= 120
##$ZL3= 120
##$ZL4= 120
##$ABSF1= 0
##$ABSF2= 0
##$ABSG= 0
##$ABSL= 0
##$ALPHA= 0
##$AQORDER= 0
##$ASSFAC= 0
##$ASSFACI= 0
##$ASSFACX= 0
##$ASSWID= 0
##$AUNMP= <proc_1d>
##$AZFE= 0.1
##$AZFW= 0.5
##$BCFW= 0
##$BC_mod= 2
##$BYTORDP= 0
##$COROFFS= 0
##$CY= -3
##$DATMOD= 1
##$DC= 0
##$DFILT= <>
##$DTYPP= 0
##$F1P= 0
##$F2P= 0
##$FCOR= 1
##$FTSIZE= 65536
##$FT_mod= 6
##$GAMMA= 0
##$GB= 0
##$INTBC= 1
##$INTSCL= 6.047779e-11
##$ISEN= 30
##$LB= 1
##$LEV0= 0
##$LPBIN= 0
##$MAXI= 10000
##$MC2= 0
##$MEAN= 0
##$ME_mod= 0
##$MI= 50
##$NCOEF= 0
##$NC_proc= -6
##$NLEV= 6
##$NOISF1= 182.463
##$NOISF2= 159.3651
##$NSP= 0
##$NTH_PI= 0
##$NZP= 0
##$OFFSET= 248.5645
##$PC= 4
##$PHC0= -10475.48
##$PHC1= -393.1151
##$PH_mod= 1
##$PKNL= yes
##$PPARMOD= 0
##$PSCAL= 0
##$PSIGN= 0
##$REVERSE= no
##$SF= 81.0140089999694
##$SI= 65536
##$SIGF1= 159.3651
##$SIGF2= -187.1042
##$SINO= 113.3802
##$SIOLD= 16384
##$SREGLST= <1H.CDCl3>
##$SSB= 0
##$STSI= 65536
##$STSR= 0
##$SW_p= 40650.406504065
##$SYMM= 0
##$S_DEV= 0
##$TDeff= 32768
##$TDoff= 0
##$TI= <>
##$TILT= no
##$TM1= 0
##$TM2= 0
##$TOPLEV= 0
##$USERP1= <user>
##$USERP2= <user>
##$USERP3= <user>
##$USERP4= <user>
##$USERP5= <user>
##$WDW= 1
##$XDIM= 65536
##$YMAX_p= 386746784
##$YMIN_p= -213477943
$$ End of Bruker specific parameters
$$ ---------------------------------
##NTUPLES= NMR SPECTRUM
##VAR_NAME=  FREQUENCY,     SPECTRUM/REAL,   SPECTRUM/IMAG
##SYMBOL=    X,             R,               I
##VAR_TYPE=  INDEPENDENT,   DEPENDENT,       DEPENDENT
##VAR_FORM=  AFFN,          ASDF,            ASDF
##VAR_DIM=   65536,         65536,           65536
##UNITS=     HZ,            ARBITRARY UNITS, ARBITRARY UNITS
##FACTOR=    0.620285442955139, 1,           1
##FIRST=     20137.2065510682, 0,            0
##LAST=      -20513.1999529968, 0,           0
##MIN=       -20513.1999529968, -213477943,  0
##MAX=       20137.2065510682, 386746784,    0
$$ Real data points
##PAGE= N=1
##DATA TABLE= (X++(R..R)), XYDATA
$$ [...]
13249i84768J33963L28994m183K9653M24511M08168p0751k15201K57904O66403
13239I74693M24252k41323p84574r33468o79046j75344K50700L27435J10969j28370
13229h54076j63789R1708M29098L02896n04872j199830p64769M71089J071122
13220a121423N61358O9256L98480P70789L09338m47229n57949j70651O1084R7450
13210b9497N4587l22584p29885j22948J332279J622489j70583j798636q50636
13201a015414J434770J887893P4841j498351j407279p01177k93981K28602Q07622
13192d82474N23344l88065n20907J14443n9923j108314j050129N59252J334400
13183a078373n7497j398320m61646J276270J133179l34351m12775J207610K016891
$$ plain form
13249 -984768 -850805 -521811 -525994 -496341 -71830 336338 265587 50386 308290 974693
13239 974693 1398945 1157622 373048 -560420 -1239466 -1414810 -1164110 -836675 -725706 -854076
13229 -854076 -1017865 -926157 -497059 -194163 -699035 -1898865 -2663634 -2192545 -1121423
13220 -1121423 -560065 -490809 -92329 678460 987798 540569 -17380 -188031 -126947 -29497
13210 -29497 25090 -297494 -1027379 -1150327 181952 1804441 1633858 -164778 -1015414
13201 -1015414 419356 2307249 2382090 883739 -523540 -1224717 -1518698 -1290096 -482474
13192 -482474 40870 -347195 -868102 -753659 -813582 -1921896 -2972025 -2412773 -1078373
13183 -1078373 -1135870 -2534190 -2995836 -1719566 -586387 -920738 -1333513 -125903 1890988
13174A890988P17949j005448j258331l97004R9132j98777n08289j19181P61171
13165a7790J214466O07292n01302q77478k79702J72214k23254o31106j98152L80853
13155c53959M9532p55178q69702l04346J53462N78109J404813J805360N97080
13146B305171j360854j810153l98965P33229K62816m76567J9995R63959P87264
13137A025895k48758o52993j03737L49811Q0840m85313q33413q13388l02496N46841
13127a436711Q97292J51698q10465n20769Q36667J361731J21821j307786r56107
13118a662629P39763J553278N98098n81578l99598N47687O12103l26644p82930
13109B97550q1846N74786P0097p64620m15122Q36691J161889r9076j394130j164800
$$ plain form
13174 1890988 2608937 1603489 345158 -51846 47286 -151491 -659780 -778961 -17790
13165 -17790 1196676 1803968 1302666 425188 145486 317700 94446 -536660 -734812 -353959
13155 -353959 -304427 -1059605 -1929307 -2233653 -2080191 -1502082 -97269 1708091 2305171
13146 2305171 944317 -865836 -1264801 -531572 -268756 -745323 -725328 238631 1025895
13137 1025895 777137 124144 20407 370218 451058 -34255 -867668 -1681056 -1983552 -1436711
13127 -1436711 -539419 -387721 -1198186 -1718955 -882288 479443 601264 -706522 -1662629
13118 -1662629 -922866 630412 1228510 646932 247334 795021 1407124 1080480 297550
13109 297550 215704 790490 860587 95967 -319155 517536 1679425 1580349 186219 -978581
13099i78581P9539P88720O04620L80554M31689J44119n72677p31804K18301J256493
13089A620973J060702r5643p08689j70391M71702J53639o73437q26135j90445
13080F42276J63445l68707j032479q57799m9737M19069K56263P9723K17704J54685
13070c75557m29339q12105j94681Q97779J144615L20155l58680q1854L81991Q8761
13060E81085m14869l9841P65851M74935r22026j486983k21702J179821P85729
13051G02000n84796o54155P03855J311536J97829r25277m69202O42063O77114
13042A600967k59331q42405p55316o38545n08256N6673N60942J66056n67949k81653
13032a468817Q37470J165070L36475j55474L52952N08139m63462j011495J65645
$$ plain form
13099 -978581 -899042 -110322 494298 874852 1306541 1450660 877983 146179 364480 1620973
13089 1620973 2681675 2586032 1877343 1706952 2178654 2332293 1658856 832721 642276
13080 642276 805721 437014 -595465 -1453264 -1503001 -1083932 -827669 -747946 -530242 -375557
13070 -375557 -804896 -1617001 -1811682 -913903 230712 550867 192187 110333 492324 581085
13060 581085 166216 126375 892226 1367161 445135 -1041848 -1263550 -83729 702000
13051 702000 117204 -536951 166904 1478440 1676269 750992 281790 923853 1600967
13042 1600967 1341636 499231 -256085 -894630 -1402886 -1346213 -785271 -619215 -1187164 -1468817
13032 -1468817 -631347 533723 870198 714724 1067676 1575815 1112353 100858 266503
13023B66503J482603O26945j698164k605546j173631N73514Q83986K84857p7822
13014a436755j32365j14189K76849R85805J117489K74281o27643o96884k99247
13005f52659k01223l83475m59256m25386k89075K00869Q15282Q17306L13042M21415
12995A56840J271064J271654l47819j724679q85429J062807J435916l3612j072716
12986A134026n16813L38302L20507J8930J01212J7832n56378o62927L21315J305494
12976A821500R87913k26096r58354p49253k08519O6004j57686q50599j429397
12967a704487j040209J70242Q73057L92828k15299J32173P52975L74299o84271
12958i48692r97656k80427L40786J75343k67182m34710m54729m67400k12131M16011
$$ plain form
13023 266503 1749106 2376051 677887 -1927659 -3101290 -2527776 -1643790 -1358933 -1436755
13014 -1436755 -1569120 -1683309 -1406460 -420655 696834 971115 343472 -353412 -652659
13005 -652659 -853882 -1237357 -1696613 -2121999 -2411074 -2210205 -1394923 -577617 -264575 156840
12995 156840 1427904 2699558 2351739 627060 -258369 804438 2240354 2206742 1134026
12986 1134026 617213 955515 1276022 1294952 1396164 1413996 857618 194691 516006 1821500
12976 1821500 2809413 2583317 1624963 875710 667191 733195 575509 -275090 -1704487
12967 -1704487 -2744696 -2574454 -1701397 -1308569 -1523868 -1391695 -638720 -264421 -948692
12958 -948692 -1946348 -2226775 -1885989 -1710646 -1977828 -2412538 -2867267 -3334667 -3546798 -3130787
12948c130787J067289J343788J025800P0326j021886j212329j47592R83102Q35240
12939a87049j81733o08381k68253l36268j036373j055341J66411J229977Q80220
12930a396790n6259j03392N56958O64122N7385k81818p5955j34760p82397j183660
12920b736566o30893M42642J171408J268430R40377M12709m3203j07004J54186
12911H72086K34435q3047l44670j36340K40856K71418L6984n6725j02424n19292
12901D13281j100769j012214r357R74157R38386J24855l33250R7486P41720O61010
12891A495305j86188r47711q86343j76167L75448L20032M8544J21459M07568L70641
12881I42588O4618R4090M41170K22525q57410j655595j080471K00324O70167J95554
$$ plain form
12948 -3130787 -2063498 -719710 306090 376416 -645470 -1857799 -2005391 -1022289 -187049
12939 -187049 -368782 -977163 -1245416 -1581684 -2618057 -3673398 -3506987 -2277010 -1396790
12930 -1396790 -1453049 -1556441 -999483 -335361 -277976 -559794 -635749 -770509 -1552906 -2736566
12920 -2736566 -3367459 -2924817 -1753409 -484979 455398 868107 824904 717900 872086
12911 872086 1106521 1023474 678804 542464 783320 1054738 1091722 1034997 932573 413281
12901 413281 -687488 -1699702 -1709059 -734902 203484 328339 -4911 92575 834295 1495305
12891 1495305 1309117 361406 -524937 -701104 -325656 -5624 42920 164379 571947 942588
12881 942588 1007206 1101296 1542466 1764991 907581 -748014 -1828485 -1628161 -957994 -762440
12871g62440K2443N92418Q13413m6642j019880q35758K06685P18217J24120p39592
12861i27016p84013J35710J139378J186194J48683r35472r83609j57496M85813
12852f91828M96649L66452L65853J12458m16925n31892P864M77386L94832K21421
12842H02270K40130j12635r73486j305078m95702M17397L66221q497K94197O15216
12832a59967k04683j452336j418387k19147M06462j1234j79019M00495O17540
12823b220276M7862r8025P57509J275106M01795p68148p41930N0270J76058m84740
12813a604519q13886k87118N14175Q98977O64156K9087l88653l2363O70476O14059
12803B64391k50441n70040K59795Q84705J21200r49076o48700N11858O84010k62213
$$ plain form
12871 -762440 -739997 -147579 665834 619192 -400688 -1236446 -1029761 -311544 -187424 -927016
12861 -927016 -1711029 -1575319 -435941 750253 898936 -36536 -1020145 -1177641 -691828
12852 -691828 -195179 171273 537126 649584 232659 -299233 -291369 186017 580849 802270
12842 802270 1042400 929765 -43721 -1348799 -1844501 -1427104 -1060883 -1069380 -775183 -159967
12832 -159967 -364650 -1816986 -3235373 -3454520 -3048058 -3059292 -3238311 -2837816 -2220276
12823 -2220276 -2172414 -2270439 -1512930 -237824 163971 -604177 -1346107 -1295837 -1119779 -1604519
12813 -1604519 -2418405 -2705523 -2191348 -1292371 -628215 -599128 -987781 -1020144 -349668 264391
12803 264391 13950 -556090 -296295 588410 709610 -239466 -888166 -376308 307702 45489
12793D5489o71162J9558M85734m1962n46714j91939K12267k38694q89867o17801
12783b435091L90853J077192J026175N80182N4242k92692j11596L77462K39139
12774I05866p73536j402492n69309Q20515J119786M44007K83860Q46103O96739
12765B371539o10426j448144n80024Q40501R90195o0458q87606r47961p58536
12756a090920m18693M00575J157284P50615o25057j343650n49026O75541R42554
12747a00777L63045l1746J08459K94226K06974Q1660J72691L07215J4740r20727
12737D95760j874437j629584J65979K019636K054918M56347p34300m87192M80
12728D67607l76960o67421M20941J986148J913158m3460j833056j815335n47961
$$ plain form
12793 45489 -625673 -606115 -120381 -162343 -709057 -900996 -688729 -927423 -1817290 -2435091
12783 -2435091 -2044238 -967046 59129 639311 693553 400861 289265 666727 905866
12774 905866 132330 -1270162 -1839471 -1018956 100830 544837 828697 1674800 2371539
12765 2371539 1761113 312969 -267055 573446 1563641 1503183 615577 -332384 -1090920
12756 -1090920 -1509613 -1109038 48246 798861 173804 -1169846 -1718872 -1043331 -100777
12747 -100777 262268 230522 338981 633207 840181 921841 1094532 1401747 1416487 495760
12737 495760 -1378677 -3008261 -2842282 -822646 1232272 1688619 954319 467127 467607
12728 467607 90647 -576774 -155833 1830315 3743473 3700013 1866957 51622 -496339
12719d96339L82844K67419l60151n84417o2955N66542L54823o11314j070838l33357
12709a947743N97683N54482O8964L86993J210808J086367j20605q55683k34915
12700G46351P47126Q27211J4615r47726j516619j305560k15900R43848J019518
12691C12864P8970o42279o31157o31446r11628n62238O85254J440400O17995p66484
12681a009749j030722j38806O41904O29293J05756m96956o79838J39703J572466
12672b66949J950260M19941j335359j044188R07633J892966O55061j173776j511003
12663D94586l58283P09939N66831n70506j588165j419913r1002J039705P33662
12654d83146m16218o36741N15671J414518O74725q29232j207791j77276P00428
$$ plain form
12719 -496339 -113495 153924 -206227 -790644 -853599 -287057 67766 -543548 -1614386 -1947743
12709 -1947743 -1350060 -795578 -726614 -339621 871187 1957554 1836949 981266 746351
12700 746351 1493477 2320688 2335303 1387577 -129042 -1434602 -1650502 -706654 312864
12691 312864 391834 -250445 -881602 -1513048 -2424676 -2986914 -2301660 -861260 -243265 -1009749
12681 -1009749 -2040471 -2179277 -1537373 -908080 -802324 -1299280 -1979118 -1839415 -266949
12672 -266949 1683311 2103252 767893 -276295 631338 2524304 3179365 2005589 494586
12663 494586 136303 846242 1413073 842567 -745598 -2165511 -2256513 -1216808 -483146
12654 -483146 -899364 -1536105 -1020434 394084 1068809 239577 -968214 -1145490 -445062
12645d45062K76560p27413q80074K8812Q60617P29907O6490j77853J01824J85050
12635A8858k33966n72835l52933J9901k5630k40328L7874P78049J256446J056913
12625A742349M39104k55604r27629j358528j136732k48769O07120O22534k53385
12616g69540j136549r66739L46035J538861J237034k30145r52119P1251J337944
12607D76033Q18273j013646j673503k54874J177373N77692j133205j510787j11255
12598b647899J143538R66325L33979N46485J091988O57645n24426q58134J15003
12589H24504Q26955n6012j549350j649125j91406R29899M87164m44366k44080
12580a065817Q52428J219667K79192p34220n75538M12461R73881N79984j99324
$$ plain form
12645 -445062 -168502 -895915 -1775989 -1747177 -886560 -156653 -90163 -268016 -166192 18858
12635 18858 -215108 -787943 -1140876 -1120975 -1146605 -1386933 -1349059 -571010 685436 1742349
12625 1742349 2181453 1925849 998220 -360308 -1497040 -1745809 -1138689 -516155 -769540
12616 -769540 -1906089 -2872828 -2526793 -987932 249102 18957 -933162 -861911 476033
12607 476033 1294306 280660 -1392843 -1647717 -470344 107348 -1025857 -2536644 -2647899
12598 -2647899 -1504361 -538036 -204057 342428 1434416 2092061 1567635 709501 824504
12589 824504 1651459 1595447 46097 -1603028 -1794434 -864535 -377371 -821737 -1065817
12580 -1065817 -213389 1006278 1285470 551250 -24288 388173 1362054 1942038 1742714
12571A742714o44615o10768l39999l9352J81743K40013J82144K22316M32418M70742
12561A837356l9406p90500q85781o343Q75604N65693p09484j491393j039087k37726
12551a921067j06160k26183M41926J661054J984062P84149p64746j146237k77765
12542D29033O57881P22036N5010n79974o45334k41103J04255N9402q6573J63796
12532F38429O80530P13433n0443q96322r80074m56596j35889k46588k47117J62502
12522h18135N87115O70711N88290M96254J61602m17528o69238l26018m4152l81738
12512a52837p11960j55918Q01910Q57527p7401p08251l71818J38448J51023J36060
12502i3217M70983N24217p2792m59286k6386K55627n77742j538854j046225M45451
$$ plain form
12571 1742714 1098099 487331 147332 107980 289723 529736 711880 934196 1366614 1837356
12561 1837356 1797950 1007450 121669 115326 990930 1556623 847139 -644254 -1683341 -1921067
12551 -1921067 -2027227 -2253410 -1811484 -150430 1833632 2617781 1853035 706798 429033
12542 429033 1086914 1808950 1863960 1283986 638652 397549 501804 561206 474633 638429
12532 638429 1318959 2032392 1981949 1085627 105553 -351043 -486932 -733520 -980637 -818135
12522 -818135 -231020 439691 1027981 1524235 1685837 1268309 599071 273053 228901 -152837
12512 -152837 -864797 -1020715 -218805 638722 561321 -146930 -518748 -380300 -229277 -93217
12502 -93217 377766 901983 829191 369905 343519 599146 21404 -1517450 -2563675 -2118224
12492b118224J090224N92961M55152J191736J381075J17679j371952j522079m98021
12483f81449M80906Q16115O31400J16286l71524k98588K22867L24541k93428p36643
12473B10483k71434N26849P13393K73524k77260q10720j262410j115020j38324
12464b150919R06641J162690P88344M22516J15268l71393p37073n39865n1388
12455d55179J02685j41759l86479m17918k00731K78844O50572L17794m65024n53644
12445a270839L24297Q26669M4740q13102k11018J172410J436372L96476l54675
12436A551330q5458K73448O3773j60779k1734n7303m96229o09936O0843Q70528
12426A388483J022278N15758k23621q43718r78674n33080j55555m72217q94291
$$ plain form
12492 -2118224 -1028000 -435039 20113 1211849 2592924 2710603 1338651 -183428 -681449
12483 -681449 -200543 615572 1246972 1363258 991734 693146 916013 1240554 947126 210483
12473 210483 -60951 465898 1179291 1452815 1175555 364835 -897575 -2012595 -2150919
12464 -2150919 -1244278 -81588 706756 1129272 1244540 873147 136074 -403791 -455179
12455 -455179 -352494 -494253 -880732 -1298650 -1499381 -1220537 -569965 -252171 -717195 -1270839
12445 -1270839 -946542 -119873 -75133 -888235 -1099253 73157 1509529 1906005 1551330
12436 1551330 1465872 1739320 1803093 1642314 1620580 1563277 1067048 457112 517955 1388483
12426 1388483 2410761 2926519 2702898 1859180 880506 347426 191871 -280346 -1174637
12417a174637m07594N21391M40464n18498n13773Q98582J601689J61932j627567
12408f18011j308140N35383J331563M51399k99665Q4592M44648j86746q66061
12399d31038l86625P70295J278845Q38034J16497n10533j064156j181130l81932
12390i51743Q33146J129458l1114j534299j880658r38291J06636L77803K47679
12381b641383M70072R41453R05436K15299k95305M1722P24267P50341P0818k84329
12371H98391L22724J118510Q52814n20084j681464j512367l28790O45372O44428
12362D39534r2215q16349r31645l63767L45490M47877j77237p72204o12592J11715
12352b421393P52250J124720J283478Q10450n60936j763257j237865O97161J722617
$$ plain form
12417 -1174637 -1582231 -1060840 -620376 -1138874 -1652647 -754065 847624 1009556 -618011
12408 -618011 -1926151 -1390768 -59205 392194 92529 177121 621769 435023 -431038
12399 -431038 -817663 -47368 1231477 2069511 2186008 1675475 611319 -569811 -951743
12390 -951743 -118597 1010861 979747 -554552 -2435210 -3373501 -3266865 -2889062 -2641383
12381 -2641383 -2171311 -1229858 -324422 -109123 -404428 -362706 361561 1111902 1182720 898391
12371 898391 1221115 2339625 3192439 2672355 990891 -521476 -850266 -204894 439534
12362 439534 347319 -469030 -1400675 -1764442 -1418952 -971075 -1148312 -1920516 -2533108 -2421393
12352 -2421393 -1669143 -544423 739055 1549505 988569 -774688 -2012553 -1315392 407225
12343D07225N59468j092148q47410J016355J984471P22830j381290k227172j368601
12334b226272M5077Q53903Q31319M48922K11773K30851K81572J69256q8946l89086
12324C68369n90487m89168j05587R5814j87124m01278J39187R04965O60878m92302
12314i6733r46927j0113R22002N15546n29868q49440n08226k98509m8232P09365
12304a141135J261204P00709k65635l00060L23995L20917k40479j85794M39037
12295I12759M10971l52990o42490k41259k48164q28095p74817J87956P32740K08574
12285f34815l42531j53999J46386R2897J87638M45256Q5180n88508j34148J313809
12275D17165J603217J2334j294425p76785K7425m67943r10430L51020J797208
$$ plain form
12343 407225 966693 -125455 -972865 43490 2027961 2750791 1369501 -857671 -2226272
12334 -2226272 -2181195 -1327292 -495973 -47051 164722 395573 677145 846401 757455 368369
12324 368369 -222118 -711286 -816873 -721059 -908183 -1309461 -1170274 -265309 395569 -96733
12314 -96733 -1043660 -1053773 -131771 383775 -146093 -995533 -1503759 -1802268 -1850500 -1141135
12304 -1141135 120069 820778 555143 255083 579078 899995 659516 473722 912759
12295 912759 1323730 970740 328250 86991 -161173 -989268 -1764085 -1576129 -843389 -634815
12285 -634815 -977346 -1131345 -984959 -892062 -704424 -259168 -173988 -762496 -896644 417165
12275 417165 2020382 2032716 738291 -38494 -11069 -479012 -1389442 -1038422 758786
12266G58786J038210r65915j340781j3086M25958p71790j478113m54156Q09626
12257a991261P41883k06265q66935q18679J1341J409717K169885J157858o25731
12248I81813r98295J14706N25283o21937j507641p77733L68686N60647N26670
12239h27801J270879J841639R41010n89708r45267j22758L56189j56331r84922
12230G82930j517679j489051m60512J363734K330900J121373r78052j423625N1638
12221b18344J162779N23377o10155o78683l4267K76071L65006O90264N71350p23727
12211A323671k061429j514283O67106J936334Q37368j000322j220547O2010P84612
12202a85480L6504r30256q28883l1506M46117N32669P34656Q80504L51590o35526
$$ plain form
12266 758786 1796996 831081 -509700 -522786 -96828 -868618 -2346731 -2800887 -1991261
12257 -1991261 -1249378 -1455643 -2322578 -3141257 -3129916 -1720199 449686 1607544 981813
12248 981813 -16482 98224 623507 1570 -1506071 -2283804 -1915118 -1354471 -827801
12239 -827801 443078 2284717 3225727 2636019 1690752 1567994 1924183 1767852 782930
12230 782930 -734749 -2223800 -2684312 -1320578 1010322 2131695 1153643 -269982 -218344
12221 -218344 944435 1467812 857657 178974 144707 420778 785784 1476048 2047398 1323671
12211 1323671 -737758 -2252041 -1584935 351399 1188767 188445 -1032102 -970092 -185480
12202 -185480 -148976 -1079232 -1908115 -1939621 -1493504 -960835 -226179 654325 1005915 370389
12192C70389j011178k95793O98641R29248L50945k68926l78737p7642K86887N51188
12182A155022P06120O71850L07142l32495q98787j071951q93723n82184j53558
12173a092564M08181P30363L92289k66901l87463J38886M05298j02153o42206
12164d16270l68338M24302R33348R77860O58005k65698j540950j805260k73950
12155a676951J552670J560385N1389p33507o444O77055J76726o53773q14810o64622
12145e31882o46437k72415N22533O46692k96539r62767m05110K86502J3256k47184
12135a893351O92583J696644R90235o33318q89644K49444N96231n06208j192610
12126h89994l45858O47944M10491k77537j29594M99944N27634n568l25275l07263
$$ plain form
12192 370389 -640789 -936582 -237941 691307 1042252 773326 394589 316947 603834 1155022
12182 1155022 1861142 2532992 2840134 2507639 1608852 536901 -356822 -939006 -1092564
12173 -1092564 -684383 45980 438269 171368 -216095 -77209 328089 225936 -416270
12164 -416270 -784608 -360306 573042 1550902 2208907 1943209 402259 -1403001 -1676951
12155 -1676951 -124281 1436104 1487493 753986 747542 1424597 1601323 947550 132740 -531882
12145 -531882 -1178319 -1450734 -928201 -281509 -578048 -1540815 -1945925 -1659423 -1646167 -1893351
12135 -1893351 -1200768 495876 1486111 852793 -36851 212593 808824 302616 -889994
12126 -889994 -1235852 -587908 -177417 -454954 -584548 -84604 443030 437462 112187 -195076
12116a95076l11387k79507L3416M42736O82539Q36340Q60970L64084n62199j032074
12106H39842n47361K10693M08215J54689p8645l41621p11162o61927J24361Q92081
12096B89165P28032n6803l95258m8775J68818l09647j004129j012266r2353R49294
12086g83922J001648R844p01897j34632P46432L21539r32965q43361R26413J878992
12076A488091L81606j651063j559103K20102J292215J036108P07733O00360k10111
12067B305938j457366j588821l59583P10739Q39807Q08540Q75317J39393j255106
12058A018858j522198j9336J324078P64837p26552j202532n63798j5910J23278
12049h19275L49333N38531K37647j83246j14605Q1621k03340m70139O5837Q21833
$$ plain form
12116 -195076 -506463 -785970 -752554 -309818 372721 1209061 2070031 2434115 1871916 839842
12106 839842 292481 503174 911389 1066078 987433 645812 -65350 -727277 -602916 289165
12096 289165 1017197 960394 565136 516361 685179 375532 -628597 -1640863 -1733216 -783922
12086 -783922 217726 227570 -474327 -608959 137473 459012 -473953 -1317314 -390901 1488091
12076 1488091 1869697 218634 -1340469 -1120367 171848 1207956 1915689 2516049 2305938
12067 2305938 848572 -740249 -1099832 -389093 450714 1259254 2134571 2273964 1018858
12058 1018858 -503340 -522676 801402 1566239 839687 -362845 -926643 -942553 -819275
12049 -819275 -469942 68589 306236 122990 8385 90006 -113334 -583473 -517636 304197
12039C04197O31359j62861j47013O99185Q13824l32280j199120n43158O50524
12030G14657P08110l15416j009270p62523k70443j06964K1180M16754P22927N45087
12020F64099J37111k0452N1786J2474j36673q8602J62770K77368J66184J37636
12010A363701L22438M20829K01881j92432o05749j004135j074464l84107P06592
12001b45446J073348L17168n66023o73448m51339n57404m84948L30769R31741
11992c25582J45362j094803q08878P98606J402436J72805r36256l49812P84200
11983b11922P30245j02200k12922M32942O37169N3981n04511n15384k79325j77965
11973a49892k61921l91997k38644M64002J235891J064964j76002j228054r55200
$$ plain form
12039 304197 935556 772695 625682 1324867 2138691 1806411 607291 64133 714657
12030 714657 1422767 1107351 98081 -664442 -934885 -1041849 -1020669 -603915 119012 664099
12020 664099 801210 780758 832544 845018 708345 619743 782513 1059881 1226065 1363701
12010 1363701 1686139 2106968 2308849 2116417 1510668 506533 -567931 -952038 -245446
12001 -245446 827902 1145070 579047 -94401 -545740 -1103144 -1588092 -1257323 -325582
11992 -325582 -180220 -1275023 -2083901 -1285295 117141 289946 -646310 -996122 -211922
11983 -211922 518323 416123 203201 636143 1273312 1327293 822782 307398 28073 -149892
11973 -149892 -411813 -803810 -1042454 -578452 657439 1722403 1546401 318347 -636853
11964f36853K82483J267709J268014L48339q63350j375540o90121K89418K63678
11955A53777m53132l83791N24298P20023q8811k42213P34130Q60938q19852k037886
11945a032519q06917J113233J003020m44241o45763M01395N74138l03026l20609
11936d61289Q26809J311874N07374j66199j02917l95311j293489j423961l05907
11927a503016O88211O32130J87527j39785p27352j238204n38271J044143J551140
11918d3477L44358q31017o03491K05576M32885K88555K36571j0944m24761l09036
11908g14781J74066p5982r54911r27254L07734J109080P33006N11454J090156
11899A252568J021863l95854j387981o57526K73766k16379r90248l84919O64283
$$ plain form
11964 -636853 -354370 913339 2181353 2529692 1666342 290802 -399319 -109901 153777
11955 153777 -299355 -683146 -158848 561175 472364 230151 964281 1825219 1005367 -1032519
11945 -1032519 -1839436 -726203 276817 -167424 -813187 -411792 162346 -140680 -461289
11936 -461289 365520 1677394 2184768 2018569 1915652 1520341 226852 -1197109 -1503016
11927 -1503016 -814805 -182675 4852 -134933 -862285 -2100489 -2638760 -1594617 -43477
11918 -43477 300881 -530136 -1133627 -928051 -495166 -206611 29960 19016 -405745 -714781
11908 -714781 -540715 -616697 -1571608 -2498862 -2191128 -1082048 -349042 162412 1252568
11899 1252568 2274431 1878577 490596 -166930 106836 -109543 -1099791 -1484710 -820427
11890h20427L64003o96410p62349n8597K418l37294J22280Q75958N23803l88275
11880a174890j17674J064668J165564j26962r80746n22251P2302n0310k26773
11871h97072K7125J39969j24931j52895J53608Q2455m26341n53742j32255J08423
11861a775656M2210L34320R35495R94716M63314J40949O281o57325j321735n46483
11851a383914J296336J908114N08903q34431m60911M83645L86336j50675J09495
11842A862898M92080k89770j475848j263908J78344R43268L56589l24883j89340
11833B89430K09093K29227L9398j85722n83769q24207l04430N91689P27559J9815
11823B08083l46982P5625K61180l51425p10982k0936O41263M2541r51618o24217
$$ plain form
11890 -820427 -456424 -1152834 -1915183 -1973780 -1971362 -2308656 -2186376 -1310418 -786615 -1174890
11880 -1174890 -1292564 -227896 937668 810706 -170040 -692291 -619989 -670299 -897072
11871 -897072 -869947 -729978 -854909 -1007804 -854196 -771741 -1198082 -1751824 -1884079 -1775656
11861 -1775656 -1733446 -1399126 -463631 531085 994399 1135348 1141629 484304 -837431 -1383914
11851 -1383914 -87578 1820536 2329439 1495008 1034097 1517742 1904078 1753403 1862898
11842 1862898 2354978 2065208 589360 -674548 -496204 447064 803653 478770 289430
11833 289430 498523 727750 767148 581426 -2343 -826550 -1130980 -539291 188268 208083
11823 208083 -138899 -63274 197906 -153519 -864501 -885437 -244174 -201633 -1153251 -1777468
11813a777468P28485J121868m6980j152362q98773o090L47359K69299L63633L95159
11803f55870p0260n04312j02858Q30184J234295P34568j26354p91532j022920
11794d75059o64497R5702N10957J28490m30157l31199J86127K74518j25724l57131
11784a187973k23699m0159K41936Q07636J083784L47390q42101j144723m10244
11775a368153K11246K14336K94423O99894O38499j12387n33328n2611N04196M86630
11765I82745N21266J023070J012190k36633j523963j258705J37657Q99397M34934
11756A991958l18604o75227q15884p53882j63344N80108M88153m84601j014695
11747a166018j37429J324953J739593O76808p14215j251031r85005o25893k59671
$$ plain form
11813 -1777468 -1048983 72885 25905 -1126457 -2025230 -2031320 -1683961 -1414662 -1051029 -655870
11803 -655870 -726130 -1230442 -1333300 -503116 731179 1465747 1339393 547861 -475059
11794 -475059 -1139556 -1043854 -532897 -404407 -834564 -1165763 -979636 -705118 -830842 -1187973
11784 -1187973 -1411672 -1451831 -1209895 -402259 681525 1028915 186814 -957909 -1368153
11775 -1368153 -1156907 -942571 -648148 51746 690245 577858 44530 -8081 496115 982745
11765 982745 1504011 2527081 3539271 3302638 1778675 519970 657627 1557024 1991958
11756 1991958 1673354 998127 182243 -571639 -734983 -154875 333278 -151323 -1166018
11747 -1166018 -1303447 21506 1761099 2437907 1723692 472661 -512344 -1138237 -1397908
11738a397908N18202J297877R01784o57320j460592j74586J658572J532246l73544
11729A844731j502132p63955K23134J46718j21200L44806P04330J12301n41116
11720D47617k90351Q9958l27650o61994K17635J388680J210686K6875n65278l88819
11710A147359m87820q37794m98260K51566J55220o95508q98042j83731K54535
11701a792475P7395L08535J089515J063402k02123j124033m99622O69583R31133
11692E21310N12015L87118M38174R997n58742m47843J07545J64582k93664l29869
11682E10623L53669R04501O25764q9214m84709m41881l17634k73973k91360n42073
11672d6287j111594j414552o34214R57155J821742R72487n43721r30643j24584
$$ plain form
11738 -1397908 -879706 418171 1319955 662635 -797957 -972543 686029 2218275 1844731
11729 1844731 342599 -421356 -198222 -51504 -172704 172102 876432 988733 447617
11720 447617 157266 247224 -80426 -742420 -524785 863895 2074581 2101456 1536178 1147359
11710 1147359 659539 -178255 -676515 -424949 -269729 -965237 -1863279 -2047010 -1792475
11701 -1792475 -1715080 -1406545 -317030 746372 544249 -579784 -1079406 -409823 521310
11692 521310 1033325 1420443 1858617 1868614 1309872 862029 969574 1134156 840492 510623
11682 510623 864292 1768793 2394557 2305343 1820634 1378753 1061119 787146 495786 -46287
11672 -46287 -1157881 -2572433 -3206647 -2249492 -427750 544737 1016 -929627 -1054211
11663a054211K57127m55589q83445J52558J593612J617797L08020o31035m43463
11654D61371q4801l34178n82950r4441N98491M70103l53784o79278M8411Q98603
11644C47547O86810m28036j190331r30043k48269J22466K96871N84367O93002
11635f5616L98183K71884P04511Q74198j3814j055190q12854K53749L93848n32082
11625D16817q14049K23119J179784R30200K9312p97426j541363j684767l47183
11616b405556J520755J543576l50216j216563L72858J842638P59067j195305j127004
11607b55750M28204R12152R0311k97136j2442j79547n22042P7122Q77399K62648
11597A380919j043346q85838M70777O11131q80814j717454p33565N61239Q67404
$$ plain form
11663 -1054211 -797084 -1252673 -2136118 -1983560 -389948 1227849 1535869 904834 461371
11654 461371 376570 42392 -540558 -634999 -36508 433595 79811 -599467 -551056 347547
11644 347547 1034357 606321 -584010 -1514053 -1762322 -1639856 -1342985 -758618 -65616
11635 -65616 332567 604451 1308962 2183160 2169346 1114156 301302 555051 948899 416817
11625 416817 -397232 -174113 1005671 1935871 1965183 1167757 -373606 -2058373 -2405556
11616 -2405556 -884801 658775 308559 -908004 -535146 1307492 2066559 871254 -255750
11607 -255750 172454 1084606 1174917 877781 865339 685792 163750 240872 1118271 1380919
11597 1380919 337573 -548265 -77488 533643 -347171 -2064625 -2798190 -2236951 -1369547
11588a369547Q02687R80765Q38360J57518l70609o38172j133502j256663N3694
11579a935469J832385J843096J71253p25170p9273J01613j074351j571462k7502
11570a464880J698507J506700K00946l50230j64422k52261m96562l41127j43310
11561A93361j80799K24827J091564R65996o14403j618954m52425J260205J075084
11552A944456m72845r77985p2893M35680j23380m63272O0789L64872k69464q84465
11542d58507m86422L52308M82948q8337l99733o5329K52354j6335l83718l4003
11532h44774P41880P50030j87580n85578N46315J862636J406902m76122j646497
11523A567212j241090l99672l6725J30996J91828k70658p25456o667J392970J486142
$$ plain form
11588 -1369547 -566860 413905 1252265 1409783 1039174 401002 -732500 -1989163 -1935469
11579 -1935469 -103084 1740012 1911265 1186095 1106822 1208435 134084 -1437378 -1464880
11570 -1464880 233627 1740327 1941273 1591043 1426621 1174360 677798 336671 193361
11561 193361 12562 237389 1328953 2294949 1680546 61592 -390833 869372 1944456
11552 1944456 1471611 493626 420733 856413 733033 269761 330550 695422 425958 -458507
11542 -458507 -944929 -592621 -109673 -198010 -597743 -663072 -410718 -427053 -810771 -844774
11532 -844774 -102894 647136 459556 -126022 420293 2282929 3689831 3213709 1567212
11523 1567212 326122 -73550 -110275 20721 212549 -58109 -783565 -790232 602738 2088880
11513B088880m2997j082906m57172L05605j27749n98247J50077R34569K07327
11504A377387j058317r51949J88898N85679O6810p3091L59175L37345k18363k70178
11494C43396L62835O82713K66978j91422k14363j11520j45425j97878k38220k49104
11484C07990M4058N43676M30217n77247j307052o93704M46253O16607r515q5313
11474b84030N04714N56541k33369p54086l98503J21374K49702M06144Q17804Q51159
11464A837450J76530m75326m27207o9995p4636k85969j21730L75053N39157l4107
11454A439220j001917j569080j131458J51972J329868J473051O37795k15543l32786
11445G81122P0386K46309j64301q49057j282786j202333o41437K10362R68563
$$ plain form
11513 2088880 2045883 962977 505805 811410 683661 85414 235491 1170060 1377387
11504 1377387 319070 -632879 -443981 141698 208508 135417 494592 831937 613574 343396
11494 343396 706231 1388944 1655922 1464500 1250137 1138617 993192 795314 557094 307990
11484 307990 352048 895724 1325941 748694 -558358 -1252062 -805809 -189202 -198717 -284030
11474 -284030 220684 777225 543856 -210230 -608733 -487359 -237657 168487 986291 1837450
11464 1837450 2013980 1538654 1111447 1041452 966816 680847 559117 934170 1473327 1439220
11454 1439220 437303 -1131777 -2263235 -2111263 -781395 691656 1329451 1113908 781122
11445 781122 851508 1097817 933516 84459 -1198327 -2400660 -3042097 -2831735 -1863172
11436a863172J087693L78217n03377n93781J88986R49022J112227J061954J059970
11427B877739N17566p83961j672215j061886K07847M72897k80178o33666j44588
11418e00445K19204Q217j38324j2711j36664k70984M79555J619627J335814o00885
11408B002404j976441j273674J48206L55930l04813k67193N93861J057364N68109
11399I03753k74069p59417n90715J30306P44902N45789j00825j27963L88552J77512
11389A037825r22597j369522m86440L07679O0430L6109J199020J937224N87524
11380B387252j359831j248099N87948J423207L92883n97627k33473M73884L35404
11371B161548k08564k46429J12139J83678k77755r73347j325430q18521K87085
$$ plain form
11436 -1863172 -775479 -397262 -900639 -1494420 -1305434 -356412 755815 1817769 2877739
11427 2877739 3395305 2611344 939129 -122757 85090 557987 277809 -355857 -500445
11418 -500445 -281241 -273024 -411348 -424059 -560723 -831707 -352152 1267475 2603289 2002404
11408 2002404 25963 -1247711 -1099505 -743575 -1048388 -1315581 -721720 335644 903753
11399 903753 629684 -129733 -720448 -590142 154760 700549 599724 471761 860313 1037825
11389 1037825 115228 -1254294 -1740734 -1433055 -1372625 -1336516 -137496 1799728 2387252
11380 2387252 1027421 -220678 367270 1790477 2183360 1585733 1352260 1826144 2161548
11371 2161548 1952984 1706555 1818694 2002372 1724617 751270 -574160 -1392681 -1105596
11362a105596Q54667K44751o56756o77199m1229K73406K30781M56385P91514O05032
11352I75756J65500J77178K60948m60617j450747j225082J73137R67198L22052
11343i4677m62445j20681O96561O62504k07083q25903o59213j47453J54272J65139
11333h38979J32493L01477O67165R12193P21494J79449l14473m65602k54884J37864
11323A178197L72805J43159m33349q60102q71514o55100l51750J19332N45885
11314h12437M34869j17632l17526J22600M68440J97188j23005R4255L60456L182
11304C10390n80987n76028p7114K35992K83569M45234O13615L62896j94113n63615
11294B59839o41803n98278l08934L55857R67868R49085L03682n26806j120989
$$ plain form
11362 -1105596 -250929 -6178 -662934 -1340133 -1381362 -1107956 -877175 -420790 370724 975756
11352 975756 1141256 1318434 1579382 1118765 -331982 -1557064 -1383927 -416729 -94677
11343 -94677 -557122 -677803 18758 681262 474179 -351724 -1010937 -1158390 -1004118 -838979
11333 -838979 -706486 -405009 262156 1174349 1895843 2075292 1760819 1295217 1040333 1178197
11323 1178197 1551002 1694161 1260812 400710 -470804 -1125904 -1477654 -1358322 -812437
11314 -812437 -377568 -495200 -812726 -690126 -221686 -24498 -147503 -53248 307208 310390
11304 310390 -270597 -846625 -923739 -687747 -404178 41056 654671 1017567 823454 259839
11294 259839 -381964 -980242 -1289176 -933319 34549 983634 1287316 760510 -360479
11285c60479j018985O7326J441072J681018M74620o77569m96202K39357M4167
11276A394325q76870j023818K0826J034395R34471j9188q79853j016478m14208
11267h46398L93637P34871N49103M42616O62216O21835l4345o34804m79892N2318
11257A461157K28550J28186J73072J23036l98217q56552m28925N64858R16128
11248A911293J97004o87126p28387P845O07929M11924k44655m61588j4117K55742
11238A255864k41710p34853k73024N41024M20272l78187m59355K05784K33014
11229E68829n44049o54233K68349O73923j03938o20148n5590K26488o25246j076474
11219a942089N5226J180963N32541o97218l18612J215394J718894P74443j45653
$$ plain form
11285 -360479 -1379464 -1312138 128934 1809952 2284572 1607003 1110801 1350158 1394325
11276 1394325 517455 -506363 -485537 548858 1483329 1464141 584288 -432190 -846398
11267 -846398 -452761 282110 831213 1273829 1936045 2557880 2523535 1888731 1408839 1461157
11257 1461157 1689707 1817893 1990965 2114001 1715784 859232 430307 995165 1911293
11248 1911293 2108297 1421171 692784 700629 1308558 1720482 1475827 1014239 1000122 1255864
11238 1255864 1014154 279301 6277 547301 967573 589386 130031 335815 568829
11229 568829 24780 -629453 -361104 312819 208881 -411267 -466857 -240369 -865615 -1942089
11219 -1942089 -1886863 -705900 -173359 -870577 -1189189 26205 1745099 2519542 2373889
11210B373889l19368k75410k13002N3491N3533o46830j228352p06521L63217P50240
11200B04887M08675Q3425r6139k83357j42501L07533K08578n69994p92169q787
11190f79849M28358q9214l5598J286367J823835K07297j340347m96833J030216
11181B134232L67779j466234j338802N59626J263637K40524j59893P58268J070298
11172C429435K7789q33933q13565r56869j413356r98723J50164M39965k34267
11163a203360k43533P09845J061413K64062m84145o23065p02753m68489P09004
11154i81021J615430N35843j268692q88569J332615K013865L05222q11097K08638
11145B062234J000092k33184j572126r17367N47136Q01355K10753l859j64419
$$ plain form
11210 2373889 2054521 1779111 1566109 1619600 1673133 1026303 -202049 -908570 -545353 204887
11200 204887 613562 696987 600848 317491 174990 482523 691101 121107 -671062 -679849
11190 -679849 -251491 -340705 -376303 910064 2733899 2941196 1600849 1104016 2134232
11181 2134232 2502011 1035777 -303025 256601 1520238 1760762 1600869 2359137 3429435
11172 3429435 3457224 2623291 1809726 852857 -560499 -1559222 -1409058 -969093 -1203360
11163 -1203360 -1446893 -737048 324365 588427 104282 -518783 -1221536 -1690025 -981021
11154 -981021 634409 1170252 -98440 -987009 345606 2359471 2664693 1853596 2062234
11145 2062234 3062326 2829142 1257016 339649 886785 1688140 1898893 1895034 1730615
11136A730615p80572q84811J47774R67301M11377m33243k01890L88842M8383p15415
11126F78361o26956J42581N00638K39694n1068m0670L49561J054742J329041L51194
11116C927118j118224j263863J8484P03551k57246j361522j083835m7397N21435
11107C8501O83765Q12254M08164o84293j328658p34844J94033L35254n0338k46888
11097e73050l50116n42050l15332N17051J111514Q23350J70374j42781j62770
11088E36190j26611l1528j14255n91558p77429J42300J407034J411041J93317
11079B048501o53243o09171o58835r77231n71017M23523N86200j14324n9904R62947
11069C77446J151507l5655p83662j54358M16684P6734P9905Q81662P30623r73092
$$ plain form
11136 1730615 950043 65232 213006 1180307 1591684 1158441 956551 1345393 1393776 678361
11126 678361 51405 193986 694624 934318 883250 842580 1192141 2246883 3575924 3927118
11116 3927118 2808894 1545031 1563515 2267066 2009820 648298 -435537 -482934 38501
11107 38501 722266 1534520 1942684 1258391 -70267 -805111 -611078 -275824 -326162 -573050
11097 -573050 -923166 -1465216 -1780548 -1263497 -151983 671367 841741 698960 536190
11088 536190 409579 378051 263796 -327762 -1105191 -962891 444143 1855184 2048501
11079 2048501 1395258 786087 127252 -849979 -1420996 -997473 -411273 -525597 -585501 377446
11069 377446 1528953 1493298 709636 555278 971962 1048696 1128601 2010263 2740886 1767794
11059A767794j863448l96226J297922Q81591m05402k68985N83553R5886j159200
11050E33485j000059M38495R81012O6605p09685m97162j52382k69785l17153P6673
11040h49956N35430P47063P29955M26835q6389l79236l62232n22158q42995n25419
11030a129102M83826R50226K62693m71403k99081O4256j71916k87383M30218R92701
11020H25035K69077r19479j020975j27940N32103O20442N99967M51532N6962O0463
11010A347187P65817R99653k07017j551658j020774R03225J634562J54176j580796
11001A444375j443889J08931J005326M12407m51340k55949N98869P09741j50151
10992A978320o58608l3597P18249N12221l3878J02149L28923m38525j429199r70128
$$ plain form
11059 1767794 -95654 -491880 806042 1687633 1282231 1013246 1596799 1692685 533485
11050 533485 -466574 -28079 952933 1019538 309853 -187309 -339691 -609476 -926629 -849956
11040 -849956 -314526 432537 1162492 1589327 1502938 1123702 761470 239312 -603683 -1129102
11030 -1129102 -645276 304950 567643 96240 -202841 -138585 -310501 -597884 -167666 825035
11020 825035 1094112 174633 -846342 -974282 -442179 178263 778230 1229762 1286724 1347187
11010 1347187 2113004 3112657 2905640 1353982 333208 1236433 2870995 3025171 1444375
11001 1444375 486 109417 1114743 1527150 1075810 819861 1418730 2128471 1978320
10992 1978320 1319712 1286115 2004364 2516585 2482707 2584856 2913779 2475254 1046055 75927
10982G5927O12837J325050N95185k44022n27762r07345j303715p32262M62169
10973f43938O76685j68403l82401M63944Q22931Q9175m11938r0469n9369o07382
10963c11165m66081M67592N47313m20629m15169J057955J613625N3361j326861
10954G99941n48485Q36186O62401l51701n06509j67507l65768m19520N18851J332775
10944A790664P44868l62259n82856l22791m86448n38548J27808O04320J68390
10935A143148k12536J14936K7357r22338r10039J008600K485483J309712q61581
10926C182742j136042R9693M08837m75394q59587m08335j72127j04671N78197
10917A113313J199610M82690q80639j026964R6027Q31036N39125R3339n1116k96232
$$ plain form
10982 75927 688764 2013814 2608999 2364977 1837215 929870 -373845 -1106107 -643938
10973 -643938 32747 -135656 -518057 -54113 768818 857993 446055 355586 296217 -311165
10963 -311165 -777246 -309654 237659 -182970 -598139 459816 2073441 2126802 799941
10954 799941 251456 1087642 1750043 1398342 891833 724326 358558 -60962 457889 1790664
10944 1790664 2535532 2173273 1590417 1267626 781178 242630 370438 974758 1143148
10935 1143148 930612 1045548 1072905 150567 -759472 249128 2734611 4044323 3182742
10926 3182742 2046700 2146393 2555230 2079836 1220249 811914 639787 535116 1113313
10917 1113313 2312923 2795613 1914974 888010 984037 1815073 2354198 2447537 2396421 2100189
10907B100189o00828m51898J2378J94038N5989r3231k85634m86440k89571K17937
10897C72929K93846j28930k23770J18122R1263j72989L47298J149826M43789j385054
10887I06330j578839M40735J628959K54603j153129k54272J058860K01612j460992
10878D3867j112914O80636J328086O43708L96189Q02207P17277J57942k20869
10869C436129q66942j925731j749215M19395K123637J126575p06145l50058J328385
10860B836030J260834m97888j189683k38236L07634j43892k3481R37144J000838
10851D249300l68162j471586j082075O9832Q01247O65289k61041j226290r87223
10842C89291M18918J136314K52647m80529L84416J215503M9418j716091j466581
$$ plain form
10907 2100189 1499361 1047463 1059841 1253879 1309868 1216637 931003 444563 154992 372929
10897 372929 666775 537845 314075 432197 523460 350471 697769 1847595 2291384 906330
10887 906330 -672509 -231774 1397185 1651788 498659 244387 1303247 1504859 43867
10878 43867 -1069047 -388411 939675 1583383 1979572 2781779 3499056 3656998 3436129
10869 3436129 2569187 643456 -1105759 -686364 1437273 2563848 1857703 1507645 2836030
10860 2836030 4096864 3598976 2409293 2171057 2478691 2334799 2311318 3248462 4249300
10851 4249300 3881138 2409552 1327477 1397309 2198556 2863845 2602804 1376514 389291
10842 389291 808209 1944523 2197170 1716641 2101057 3316560 3365978 1649887 183306
10833A83306K41777P68112j76509n66748R1443K59941m88491q04904j13198O39140
10823C3869Q00480N70467O483p37467p73142K10596Q92989K88976m41618k1174
10813H30459N53182j93861j450556j484208m78704K74293O89217J136274Q32343
10804G08439o51020j706185q92218O03271R70480O41182Q37320J021565K70637
10795A803471n26289k80717K29619J50275L39170J155171R71939o71788j334815
10786A836036J56215J058515n19815j770735p9528J843889N32725j844579j181141
10777C1582J225112J043642j402391k038814k89982P44211N22455J343040K734196
10768C913051J620844j633485l018636j339155L07369J78227J4851P02432O05794
$$ plain form
10833 183306 425083 1193195 1016686 449938 541381 801322 312831 -492073 -605271 33869
10823 33869 834349 1404816 1411299 673832 -99310 111286 1004275 1293251 851633 830459
10813 830459 1383641 1189780 -260776 -1744984 -2223688 -1949395 -1260178 -123904 708439
10804 708439 57419 -1648766 -2540984 -1937713 -967233 -326051 511269 1532834 1803471
10795 1803471 1277182 996465 1226084 1376359 1715529 2870700 3842639 3170851 1836036
10786 1836036 1992251 3050766 2530951 760216 680688 2524577 3057302 1212723 31582
10777 31582 1256694 2300336 897945 -1140869 -1430851 -686640 -164185 1178855 3913051
10768 3913051 5533895 3900410 881774 -457381 -150012 28215 43066 745498 1351292
10759A351292o45335j049345n1775M24293k71688l82053Q09825J762596J537736
10750C485546Q01720k09426j644237k173126m79888J760550J827871K94089k04403
10741C458696L28718j25963j111259m12629J246751J046124o22436o57762R00575
10732D050815P46287j455063k046370J85741J661708j5925k238778j853150K29467
10723g35268J251145O27154l21579n95468j4274R57583J236767L69127m39011
10714B336176j08152L98876p3713n28496J61504N92951o95432j861485n15697
10705b93468J781766J772228j71067j113208o27968m91615n80699M31036J420217
10696B127222M21946j204392p91012O90449M54036p25350j29923J272614M52977
$$ plain form
10759 1351292 705957 -343388 -395163 29130 -242558 -624611 185214 1947810 3485546
10750 3485546 4287266 4077840 2433603 260477 -219411 1541139 3369010 3663099 3458696
10741 3458696 3787414 3661451 2550192 2137563 3384314 4430438 3808002 3150240 4050815
10732 4050815 4797102 3342039 1295669 1481410 3143118 3127193 888415 -964735 -735268
10723 -735268 515877 1143031 821452 225984 211710 1169293 2406060 2775187 2336176
10714 2336176 2228024 2626900 2553187 2024691 2186195 2779146 2083714 222229 -293468
10705 -293468 1488298 3260526 3089459 1976251 1348283 856668 275969 707005 2127222
10696 2127222 2549168 1344776 553764 1244213 1698249 972899 842976 2115590 2568567
10687B568567j533147j020195J367374J521194p18264j273719P89779J853715
10679C555304M25770p41880k43990j26068j195296j413821j80185N31181K31495
10670H42510N66696J325280M33158j581198j773596J14216J270355P77599M42826
10661B417846O35080p3134j157662o77645O31633M03561p22941k73132J013742
10652B197348L49196j711501k211586j146487o10907K5161K372906M060575J851697
10643E176402j736417j652060J214569J821989j10113n46269O31952j05595k098421
10634B596037j207316J845340K136629m15193r86597R86929J056176j368946j920223
10625B722836J88783R03909n59758o37037Q50367K90936j770999r88080J869168
$$ plain form
10687 2568567 1035420 15225 1382599 2903793 2185529 911810 1701589 3555304
10679 3555304 3981074 3239194 2995204 2869136 1673840 260019 79834 611015 842510
10670 842510 1409206 2734486 3167644 1586446 -187150 -72934 1197421 1975020 2417846
10661 2417846 3052926 2979792 1822130 1144485 1776118 2179679 1456738 1183606 2197348
10652 2197348 2546544 835043 -1376543 -2523030 -3133937 -3108776 -735870 3324705 5176402
10643 5176402 3439985 1787925 3002494 4824483 4714370 4168101 4800053 4694458 2596037
10634 2596037 1388721 3234061 5370690 4955497 3968900 4955829 6012005 4643059 2722836
10625 2722836 2911619 3815528 3255770 2618733 3469100 3760036 1989037 1000957 2870125
10616B870125J433718k005348k250849J586865L301519O87024j247059j49105
10608D226890K10381j400263j114293J450300J490534j507287j968927J428494
10600B815829K991121L71864j606511l60457M27499r43078j025246R15627R07080
10591D493728j329387j090643J946357K453668m13635j360808O50411N57901k300049
10582C607543k471868P47832J658304o09544n05925K336441J875144j880508j826641
10573B930778K403298K840598j726150k938190J372952K951989j116413k963568
10565C755294P76638K777461l57720j729462J676849K806914j234944l013758
10557E457272Q07643L003875K2185j574925J031905J305247k433639k473870K575146
$$ plain form
10616 2870125 4303843 2298495 47646 1634511 4936030 5623054 4375995 4226890
10608 4226890 4437271 3037008 1922715 3373015 4863549 3356262 1387335 2815829
10600 2815829 5806950 6178814 4572303 4211846 4639345 3696267 2671021 3586648 4493728
10591 4493728 3164341 2073698 4020055 6473723 6060088 4699280 5349691 5907592 3607543
10582 3607543 1135675 1883507 3541811 2932267 2426342 4762783 6637927 4757419 2930778
10573 2930778 5334076 8174674 6448524 3510334 4883286 7835275 6718862 3755294
10565 3755294 4531932 7309393 6951673 5222211 6899060 9705974 8471030 5457272
10557 5457272 6264915 9268790 9290975 7716050 8747955 10053202 7619563 5145693 7720839
10548G720839L534826j715637l197700K093256L872851j530562l609746J941036
10540I109163M500154q84974l765159J159233L707559j224108l192879K671122
10532A2080111M979236j691923n227821Q71098M560066j330382n039918Q55760
10524A0056227M871269k63070l224887K398936M527572k402474m514971L805477
10516A5254079O721731k176269n429623M270505P807335l193947p782756L911941
10508A9382996R297046k979928q503271N579513J2471064k649463j0181847P186276
10500B9602386J6521899k632384j3238799R250024K2685012k425003j5885464
10493D3877671K0020356M3347911K454780j9306107O7867242J59671713O8813218
$$ plain form
10548 7720839 11255665 9540028 6342328 8435584 12308435 10777873 7168127 9109163
10540 9109163 13609317 12724343 8959184 10118417 13825976 12601868 9408989 12080111
10532 12080111 17059347 15367424 10139603 11010701 15570767 14240385 9200467 10056227
10524 10056227 14927496 14664426 11439539 13838475 18366047 15963573 11448602 15254079
10516 15254079 21975810 19799541 14369918 18640423 26447758 23253811 15471055 19382996
10508 19382996 28680042 25700114 17196843 22776356 35247420 32597957 22416110 29602386
10500 29602386 46124285 43491901 30253102 39503126 62188138 59763135 43877671
10493 43877671 63898027 107245938 109700718 90394611 158261853 317933566 386746784
10486C86746784j66698554k82992820j50533353M7373741Q9508665P947666k7138812
10479i5786683J6240877L6018135R81908j6884540Q670683K1376890j346266j3050725
10471d3779721O132892J6304974q54742j0767287L478976J1570490j923011r699483
10463b9536912K792521J0800600J18697p408353J518159P643921p69658n977842
10455b0818867K433716P447369q04617o135175J068182N769781j012494n050599
10447a7102704J943684O017086r01756n063821J845655O531375J22615n130269
10439a1738135k2456M708038K35707m024558j09241L445045k36884k926845J225311
10430i444018L660691j051141l876577R26026M385664K79478l151609K67048L067399
$$ plain form
10486 386746784 220048230 -62944590 -213477943 -166104202 -76595537 -68647871 -95786683
10479 -95786683 -79545806 -43527671 -42545763 -59430303 -50759620 -29382730 -30728996 -43779721
10471 -43779721 -37646829 -21341855 -22196597 -32963884 -29484908 -17914418 -19837429 -29536912
10463 -29536912 -26744391 -15943791 -15825094 -23233447 -21715288 -14071367 -14841025 -20818867
10455 -20818867 -18385151 -10937782 -11742399 -17877574 -16809392 -11039611 -12052105 -17102704
10447 -17102704 -15159020 -9141934 -10043690 -15107511 -13261856 -6730481 -6607866 -11738135
10439 -11738135 -11760591 -7052553 -6816846 -10841404 -10950645 -7505600 -7742484 -10669329 -9444018
10430 -9444018 -5783327 -6834468 -10711045 -9785019 -5399355 -5119877 -8271486 -8004438 -4937039
10421d937039m14685l140010j6158K202265p63686j962925K070288L375704j648100
10412e234346m109932O54657L834701j20699l098440O85780L656723j5843l172815
10403f920214j4718K644853p96921l461959M59200M051492P70501l207809r63834
10394g439409K490909O55754k268059n56350J894838J27181j885709J99910K029612
10385d751323l83822k032521J231637L757179N18695k950417p57956K384630L54660
10376b629238k930719j396194J881620J304766o72338O07828K409648L31100k660199
10367c753726j867295M02227M4912q75317P17227J894507l63220k318255j64340
10358f283280K474526J207665j031330n593J757929M29723j466852l54181J116184
$$ plain form
10421 -4937039 -5351724 -8491734 -8507892 -6305627 -7069313 -9032238 -6961950 -3586246 -5234346
10412 -5234346 -9344278 -8689621 -4854920 -4975619 -8074059 -7388279 -3731556 -3747399 -6920214
10403 -6920214 -6934932 -4290079 -5087000 -8548959 -8089759 -4038267 -3267766 -6475575 -7439409
10394 -7439409 -4948500 -4292746 -6560805 -7117155 -5222317 -5095136 -6980845 -6780935 -4751323
10385 -4751323 -5135145 -7167666 -5936029 -2178850 -1660155 -4610572 -5368528 -2983898 -2629238
10376 -2629238 -5559957 -6956151 -5074531 -3769765 -4442103 -3834275 -1424627 -1093527 -3753726
10367 -3753726 -5621021 -5218794 -5173882 -6049199 -5331972 -3437465 -3800685 -6118940 -6283280
10358 -6283280 -3808754 -2601089 -3632419 -3638012 -1880083 -1450360 -2917212 -3271393 -2155209
10349b155209n04473k252942l55510K237902J218085j180424p40315J048654P15066
10340a969166l94034L71297J153866m02112j797041l34823J383184L56740j107636
10331b739725j70190R54742k50377j307297J97011J395670l03239j656757N14445
10322c365717K976147J682707j130904j457141m14151p45159j055749N94932J823451
10313a091584L26059j249997k22241R56901k76969j352199J88399J311256p99536
10304b209911k714611o35448K444684J840204q74577j350990O382J25381o88208
10295d057094n04896j60705p65466m86806J476676J937175n95855k056328L76269
10286d837030K762905J141457j504065r76022O58108k00230j446132K78959K414935
$$ plain form
10349 -2155209 -2659682 -4912624 -5268134 -3030232 -1812147 -2992571 -3732886 -2684232 -1969166
10340 -1969166 -2363200 -1991903 -838037 -1240149 -3037190 -3372013 -1988829 -1632089 -2739725
10331 -2739725 -2909915 -1955173 -2205550 -3512847 -3315836 -1920166 -2223405 -3880162 -3365717
10322 -3365717 -389570 1293137 162233 -1294908 -1709059 -2454218 -3509967 -2915035 -1091584
10313 -1091584 -765525 -2015522 -2237763 -1280862 -1557831 -2910030 -2721631 -1410375 -2209911
10304 -2209911 -4924522 -5559970 -3115286 -1275082 -2149659 -3500649 -3494267 -3368886 -4057094
10295 -4057094 -4561990 -4722695 -5488161 -5974967 -4498291 -2561116 -3156971 -5213299 -4837030
10286 -4837030 -2074125 -932668 -2436733 -3412755 -2754647 -2954877 -4401009 -4122050 -1707115
10277a707115R81052j709386j077000J477614J534860k58499j89604J134500L96173
10268E82595j642083j587036J67732N31359n26790q24085o28144j293857j439196
10259f659505M92196K257251J314512l58674J63144J322884L13565j329360p19168
10250c203155P63909K79536r39507l18171P03693l85378j745845m34568J687357
10241c592129J150802o29368n8590J814350J312473r82690j411592J96935Q38231
10232a361578k9016l92209m3605k62901m77889L98331R67537j91931j184011l4265
10222b611537J271234L13463j010154Q0115J920705J412138m28367q72510n99650
10213e24563j379963j636123L99926K133408P38247j217509q6499K009439R21629
$$ plain form
10277 -1707115 -726063 -2435449 -3512449 -2034835 -499975 -758474 -948078 186422 582595
10268 582595 -1059488 -2646524 -2478792 -1947433 -2474223 -3298308 -3926452 -5220309 -6659505
10259 -6659505 -6167309 -3910058 -2595546 -2954220 -2791076 -1468192 -1154627 -2483987 -3203155
10250 -3203155 -2439246 -2159710 -3099217 -3417388 -2713695 -3099073 -4844918 -5279486 -3592129
10241 -3592129 -2441327 -3070695 -3129285 -1314935 -2462 -985152 -2396744 -2199809 -1361578
10232 -1361578 -1390594 -1782803 -1826408 -2089309 -2567198 -2168867 -1201330 -1393261 -2577272 -2611537
10222 -2611537 -1340303 -1026840 -2036994 -1956879 -36174 1375964 947597 75087 -524563
10213 -524563 -1904526 -3540649 -3140723 -1007315 -269068 -1486577 -1573076 436363 1357992
10204A357992j816277j749363M40421N78804j199882j248734M54699P91881m8176
10195b438635O87077K097664Q52688k074535k506209m25018K93625q02675l55124
10186d671142J775493J793435r15879k269571m25867J454034R71683r2093J15978
10177b263929M86504j13398n58245J70294J179045J373016P40704l97459j403193
10168g86661j038816P28292J722356O30715o00806m5758P56540j65818j227097
10159b7053k09131J244203M67605j111955n22693J051778L23998j868627j810785
10150b462660N60235J690219M89184o31262n44776n37016p87593r9215R79686
10141a343198P53206k50630k56526J65499o64395j712843p57244J243242J513037
$$ plain form
10204 1357992 -458285 -2207648 -1767227 -1188423 -2388305 -3637039 -3182340 -2390459 -2438635
10195 -2438635 -1751558 346106 1198794 -875741 -3381950 -3806968 -3513343 -4316018 -4671142
10186 -4671142 -2895649 -1102214 -2018093 -4287664 -4713531 -3259497 -2287814 -2379907 -2263929
10177 -2263929 -1777425 -1890823 -2449068 -2278774 -1099729 273287 1013991 616532 -786661
10168 -786661 -1825477 -1097185 625171 1255886 655080 609322 1365862 1200044 -27053
10159 -27053 -236184 1008019 1475624 363669 -159024 892754 1216752 -651875 -2462660
10150 -2462660 -1902425 -212206 276978 -354284 -899060 -1436076 -2223669 -2322884 -1343198
10141 -1343198 -589992 -840622 -1097148 -931649 -1596044 -3308887 -4066131 -2822889 -1309852
10132a309852K55745j47195K78620k97532j289218o06877R85376R32192l74648
10123a573389l66020Q51092Q49633m85779j041250o24190p75371j089130P216
10114d247188J498492J103048l81702l54735P92903N74019p39490p14996N09588
10105a960061O53952k12437j13319O39553K33839n22207M28631J823068Q47951
10096A818970j378620j336158N81788P79396r40530j226959L76164O94880q45924
10087a476993j036735J010775K054626N25137q92676k60492N61833j82279j154969
10078h51773q10999M0359K92236L64967O46382N52380K9962j86981j54422m24532
10068e02421m24197N32004J229425J88636j455306j511938k88676L01544J12608
$$ plain form
10132 -1309852 -1054107 -1201302 -922682 -1220214 -2509432 -3116309 -2130933 -1198741 -1573389
10123 -1573389 -1939409 -1088317 -238684 -724463 -1765713 -2389903 -3165274 -4254404 -4247188
10114 -4247188 -2748696 -1645648 -2027350 -2382085 -1589182 -1015163 -1754653 -2469649 -1960061
10105 -1960061 -1306109 -1518546 -1631865 -992312 -758473 -1280680 -852049 971019 1818970
10096 1818970 440350 -895808 -314020 465376 -475154 -1702113 -1325949 -631069 -1476993
10087 -1476993 -2513728 -1502953 551673 1076810 184134 -76358 485475 303196 -851773
10078 -851773 -1662772 -1622413 -1330177 -965210 -318828 233552 263514 76533 -77889 -502421
10068 -502421 -926618 -394614 834811 1023447 -431859 -1943797 -2232473 -1930929 -1818321
10059a818321K25651K84924m49934p81682L81690J256039j9153j594099p69340
10050c284225J218103J438663M32278O30534J404383M94278j173581j025701K06588
10041C41320m000r53599k36141J170651O08219r10493n13162P95187l0679j832215
10031a564912r69467J736574K129132R6290o11591M84579K25466j501651j388719
10022a364299O11036Q17929j185530j516305R01806K297534O09952j484337j633732
10013a945946q61638k65024O31357J264521K88306j034955k14535J647286J265817
10004G75189p88213q07323J359463J998024J62158j080715n01693k13111p83616
9995A20163l48826Q60791M98264r71433o76989J096710J205916m28676q31796
$$ plain form
10059 -1818321 -1592670 -1307746 -1757680 -2539362 -2157672 -901633 -920786 -2514885 -3284225
10050 -3284225 -2066122 -627459 -195181 435353 1839736 2334014 1160433 134732 341320
10041 341320 337320 -616279 -852420 318231 926450 15957 -497205 297982 267303 -1564912
10031 -1564912 -2534379 -797805 1331327 1427617 816026 1300605 1526071 24420 -1364299
10022 -1364299 -753263 64666 -1120864 -2637169 -1735363 562171 1172123 -312214 -1945946
10013 -1945946 -2807584 -3072608 -2441251 -1176730 -888424 -1923379 -2137914 -490628 775189
10004 775189 -13024 -820347 539116 2537140 2699298 1618583 1116890 903779 120163
9995 120163 -228663 632128 1130392 158959 -518030 578680 1784596 1355920 524124
9986E24124J54367j01783j249207m39652J468944P56551j944773k065306Q25681
9977b071054K222510O40301n09227J70138J85206q22445j14747J920138J464446
9968C085266j536720k656007p07875N65991k88429m20114R03184Q19227q58308
9959a093785q20374J017453R48034j206245j363780J034737J821775o4998r16287
9950f43470L39648N03258r41997p74854J015721Q84959q75703l60503J829888
9941I76947J182389j645624j478258J259826R31163k224723j962555J995607K958482
9932A993254k90759j495049Q67415J229143j228998q04724K391401J415189l514188
9923E62684l784072J630752L439130r03075k618652J372743K812966j148988k166115
$$ plain form
9986 524124 678491 576708 -672499 -1112151 356793 1113344 -831429 -2896735 -2071054
9977 -2071054 151456 791757 282530 452668 637874 -184571 -299318 1620820 3085266
9968 3085266 1548546 -1107461 -1815336 -1249345 -1537774 -1957888 -1054704 -235477 -1093785
9959 -1093785 -1914159 -896706 51328 -1154917 -2518697 -1483960 337815 272817 -643470
9950 -643470 -303822 199436 -742561 -1517415 -501694 383265 -492438 -852941 976947
9941 976947 2159336 513712 -964546 295280 1226443 -998280 -2960835 -965228 1993254
9932 1993254 1702495 207446 1074861 2304004 1075006 270282 2661683 4076872 562684
9923 562684 -3221388 -1590636 1848494 945419 -1673233 -300490 2512476 1363488 -802627
9914h02627K182777K774325k647928l688588K336587L775588k786351m472371
9906c328588K977725N326337k587847m792719M701400P001840n092794p257655
9898c052301J0830918J3233635k7109484o8127646m7603530K0906945N9573178
9891d1348285L4487327n155278q963032Q460853R759652k751484m072980N094664
9883d488563N604409k545914l910090J887335K256916k802213k302015L369652
9875b930483L706818j491433k476180J779334K754166j009675k211796P80577
9867a098672J862416m77060j250422M67157L10682j886681j621496J102235J528969
9858a062872p82969j393239M04665O55254j295053j646720M99270J671077N62390
$$ plain form
9914 -802627 1380150 4154475 1506547 -2182041 154546 3930134 1143783 -3328588
9906 -3328588 -350863 4975474 2387627 -2405092 2296308 9298148 4205354 -3052301
9898 -3052301 7778617 21012252 -6097232 -74224878 -121828408 -100921463 -41348285
9891 -41348285 -6860958 -12016236 -20979268 -12518415 -2758763 -5510247 -9583227 -4488563
9883 -4488563 1115846 -1430068 -5340158 -3452823 -1195907 -3998120 -6300135 -2930483
9875 -2930483 776335 -715098 -3191278 -1411944 1342222 332547 -1879249 -1098672
9867 -1098672 763744 286684 -963738 -496581 -185899 -2072580 -3694076 -2591841 -1062872
9858 -1062872 -1845841 -3239080 -2834415 -2179161 -3474214 -5120934 -4621664 -2950587 -2388197
9849b388197k49042L18936M33691k68508k8408J050489J007897l082k6756P55024
9839F02044M65780o62805q52119l53627o46214j047263L4791J509612J107792
9830A57991n28173r66699j61179J07219j44573L74130J124264O35426m70990n65251
9820d37835m586m8059j77275N05194Q55243k17295j066620l0085J135735J37955
9810F52372j508762r87142P59718P43898p31702r03451L17733N35903m03982l03816
9800a829231R38007R92191n42060j320188l20160P19431N71613J83375L82399
9791b24623N63728L00511O4367j9666k17116o1400Q47727J323059J03915j562299
9781A118203j375095K71101P32905o16701j376961j6032J711566J400718p00944
$$ plain form
9849 -2388197 -2637239 -2318303 -1884612 -2153120 -2181528 -1131039 -123142 -126224 -152980 602044
9839 602044 1067824 405019 -447100 -800727 -1446941 -2494204 -2459413 -949801 157991
9830 157991 -370182 -1336881 -1498060 -1390841 -1535414 -1161284 -37020 598406 127416 -437835
9820 -437835 -442421 -490480 -667755 -162561 692682 475387 -591233 -621318 514417 652372
9810 652372 -856390 -1843532 -1083814 -339916 -1071618 -1975069 -1657336 -1121433 -1525415 -1829231
9800 -1829231 -891224 100967 -441093 -1761281 -2081441 -1362010 -790397 -607022 -224623
9791 -224623 339105 639616 703983 684317 467201 405801 1253528 2576587 2680502 1118203
9781 1118203 -256892 14209 747114 130413 -1246548 -1262580 448986 1849704 1148760
9772A148760k262294j790930q4785Q91735K42898p95592m55138R87126J450713
9763f67507K01796r40744m57162O31067P60044L19098L95072N87523O9396m92713
9753D05870j32046M66220K41114j56611L35036R20819K59829r31494r75438j29794
9743C03505M7144m31201k60842M49834L31456n46166o19988M02146J028191N18592
9733A222671j61648k93742l66616o43596n64672j21126k06739r68468j213933
9724c317869j74261J235877J589612O34849o26927j021734k25073Q60049R25153
9715a20324r4094p35774o7149P90819L54782p54170o63713P51594J524491M81113
9705A467575j116638j433458l77385O95227P84706K1754q75995j253144q02717
$$ plain form
9772 1148760 -1113534 -2904464 -2989249 -2097514 -1854616 -2650208 -3105346 -2118220 -667507
9763 -667507 -465711 -1406455 -1863617 -1232550 -472506 -153408 241664 829187 898583 405870
9753 405870 273824 740044 981158 824547 1159583 2080402 2340231 1408737 433299 303505
9743 303505 350649 -80552 -341394 108440 439896 -106270 -726258 -324112 704079 1222671
9733 1222671 1061023 767281 400665 -242931 -807603 -928729 -1135468 -2103936 -3317869
9724 -3317869 -3492130 -2256253 -666641 -31792 -658719 -1680453 -1905526 -1045477 -120324
9715 -120324 -214418 -950192 -1017341 -226522 128260 -625910 -1289623 -538029 986462 1467575
9705 1467575 350937 -1082521 -1459906 -764679 20027 41781 -834214 -2087358 -2890075
9696b890075K73049J272912J414820N27319o03156q56144j6592Q94742R22041
9687I38916L87586J31347L0524n93108j357518j082632J72992Q53153J94669o41879
9677i65950m87438R1012l3444o68348p46429n805P84870R35052M78280k6945O189
9666f38956N58020Q34167K93578l72460k22120K78962m7364r23770r09054M3358
9656a105639L58931l55682m94580O30405J274924J15091j355359j111945K88825
9647a755029Q81779L81091L3547K01523J23489l25275m44016j33144q833j48867
9637a193735J6029N66923Q80751N53028k09176r71233j261728p22409L41288R68802
9627a031460O66377P3713K0386M49214P39417N18967k29858j193396j552842o63302
$$ plain form
9696 -2890075 -2617026 -1344114 70706 598025 -5131 -861275 -877867 16875 938916
9687 938916 1326502 1457849 1488373 895265 -462253 -1544885 -1371893 -518740 -324071 -965950
9677 -965950 -1453388 -1362376 -1395820 -2064168 -2810597 -2816402 -2031532 -1096480 -618200 -645145 -638956
9666 -638956 -80936 753231 1046809 674349 452229 731191 683827 -239943 -1148997 -1105639
9656 -1105639 -746708 -1102390 -1596970 -966565 308359 423450 -931909 -2043854 -1755029
9647 -1755029 -873250 -492159 -458612 -257089 -133600 -458875 -902891 -1036035 -1044868 -1193735
9637 -1193735 -1177706 -610783 269968 822996 613820 -357413 -1619141 -2341550 -2000262 -1031460
9627 -1031460 -365083 -291370 -270984 178230 917647 1436614 1206756 13360 -1539482 -2202784
9617b202784P55433J137770K03310n79645j83890N96708O75825K84719J02279
9608G89725m9982n32482q48205l97225M12832P43475M53678k3092l45308l51205
9598a47789j30400j94187p38773q58247K30677J414560R72068m61636n96019O14539
9588A04793O59534j092875j854561p249J869213J038663r95031j163199K09596
9579a231116N18693m83513o91304L87820R56806J28944r55837j292038r77579
9570c639124p1242J354083K120381J025224j027455j920904j209223k36998K86200
9561c319058P58577J025450M84712k32673J08724J041794R05355l15870r15920
9552d58909l31575K64835M34372J022657J808759J245248o30515j606646p63880
$$ plain form
9617 -2202784 -1447351 -309581 -106271 -685916 -869806 -273098 402727 687446 789725
9608 789725 739743 207261 -640944 -1038169 -625337 118138 571816 548724 203416 -147789
9598 -147789 -278189 -472376 -1211149 -2069396 -1838719 -424159 547909 86273 -509746 104793
9588 104793 764327 -328548 -2183109 -2190358 -321145 717518 -277513 -1440712 -1231116
9579 -1231116 -712423 -1195936 -1887240 -1499420 -542614 -413670 -1369507 -2661545 -3639124
9570 -3639124 -3710366 -2356283 -235902 789322 -238133 -2159037 -3368260 -3605258 -3319058
9561 -3319058 -2560481 -1535031 -1050319 -1282992 -1174268 -132474 772881 457011 -458909
9552 -458909 -790484 -525649 -91277 931380 2740139 3985387 3354872 1748226 984346
9543I84346n2134r37677j858703r60126O73706Q43863j90968m24511N41648J243894
9533a36662R79108M53165j2339q01797j443484p94245P67223J272184Q4370q95353
9523e27830j34542J011711M15372j292453j495229L79487J854481R91302r32565
9514B69734j488411m16622N97477N64878K8335l04331k85413J53117Q97123J156947
9504A172834L17067q13917q91141q8243J56217n55801j108472q64431m36500j31712
9494c244099N52111J296104P74009r43734j693937k52982J627788J770900O38923
9485E25083O8447K42653p496p44620q89676k59736K30476K33541K14476J80339
9475b06513k90186q13674m89054M96653Q97703K44882n07791m31309K32418O46888
$$ plain form
9543 984346 932212 -5465 -1864168 -2824294 -2150588 -1306725 -1497693 -1922204 -1380556 -136662
9533 -136662 842446 1295611 1283272 481475 -962009 -1756254 -989031 283153 367523 -527830
9523 -527830 -662372 349339 764711 -527742 -2022971 -1643484 210997 1202299 269734
9514 269734 -1218677 -1635299 -1037822 -472944 -444609 -748940 -1034353 -881236 15887 1172834
9504 1172834 1489901 675984 -215157 -303400 -147183 -702984 -1811456 -2675887 -3112387 -3244099
9494 -3244099 -2691988 -1395884 -621875 -1565609 -3259546 -3512528 -1884740 -113840 525083
9485 525083 593530 836183 828687 84067 -805609 -1065345 -834869 -601328 -386852 -206513
9475 -206513 -496699 -1310373 -1799427 -1302774 -405071 -160189 -667980 -1099289 -866871 -219983
9465b19983M05302k15767n87204l20582K31398L91135K04004L07057N17059j98270
9455E14149j661271j906228K2669K051077J668564m25965j352220j98017J030706
9446b56536N96855q13508j505502q03450P44092J994559J829168K12952j326513
9437F72117j325001k97729J71408r5459R2407R16744J066641l0547j180369j210061
9427a219849l97438M26182R06144Q09111l7961r12052o32983N48721Q81531l09168
9417F2238j393712q38860M71227O88053k13197o75081n5381O82692O87078K52004
9407c32939r5470m35008r00913j056249m33044O35866J227342Q40451n6658n43574
9397a150196k25875L68286M12775k27610p94106n40145K97205P23704K47084m34099
$$ plain form
9465 -219983 185319 -30448 -617652 -938234 -706836 -315701 -111697 195360 712419 514149
9455 514149 -1147122 -3053350 -3030681 -979604 688960 262995 -1089225 -1287242 -256536
9446 -256536 340319 -473189 -1978691 -2782141 -2038049 -43490 1785678 1998630 672117
9437 672117 -652884 -950613 -779205 -874664 -782257 134487 1201128 1170581 -9788 -1219849
9427 -1219849 -1617287 -1191105 -284961 524150 486189 -425863 -1058846 -510125 371406 62238
9417 62238 -1331474 -2170334 -1699107 -1011054 -1224251 -1899332 -1954713 -1272021 -584943 -332939
9407 -332939 -428409 -863417 -1764330 -2820579 -3253623 -2617757 -1390415 -549964 -606622 -1150196
9397 -1150196 -1376071 -1007785 -595010 -822620 -1616726 -2156871 -1859666 -1135962 -888878 -1322977
9387a322977l43610M11353Q17344N04223K61919N89406O75212k25094j178635
9378A89141p69468N00197P26054m35033j192973n31349K38521j34080p10154j73349
9368b292493P31110N21010l29812k20244O51682N24644q11337j423034k59628
9359b908102J238682J435169P20441L08790J80681l55804r46246n94702N13172
9350d07919R98682K68880o01035m31172M13520O38916j31173r40039r18519l39760
9340a449619P4593K31265M26860N21934K06637j36676K03661J008202J172136
9331B258993K38358r70961j541043j434096r34346n2247R58700J312949O39467
9322D75774l43537p12157m32732j03758r1095l31049n18022k11266O82046J379629
$$ plain form
9387 -1322977 -1666587 -1255234 -437890 66333 328252 917658 1592870 1367776 189141
9378 189141 -580327 -80130 645924 210891 -982082 -1513431 -1274910 -1408990 -2119144 -2292493
9368 -2292493 -1561383 -1040373 -1370185 -1590429 -938747 -414103 -1225440 -2648474 -2908102
9359 -2908102 -1669420 -234251 486190 794980 975661 619857 -326389 -921091 -407919
9350 -407919 590763 859643 258608 -172564 240956 879872 748699 -191340 -1109859 -1449619
9340 -1449619 -1375026 -1143761 -716901 -194967 11670 -125006 78655 1086857 2258993
9331 2258993 2497351 1526390 -14653 -1448749 -2383095 -2435342 -1476642 -163693 475774
9322 475774 132237 -579920 -1012652 -1116410 -1207505 -1538554 -2056576 -2267842 -1585796 -206167
9312b06167R44590l13004j077669q30813l01297N7084O08633J155640O83321p22185
9302a867j361392m09530O78003N27281k171L72138R23235K93791q72940q81069
9292g34521J95842P89714M49787J22898J31198j35538o21195n51291J5367K41076
9282i6663O9401J38444K62278l14193j201587j145564r4822O86054O71118N50396
9272d75138N23874o7630j053173j173320j37986O42916J29616r02204j224000
9263c737045p54229n9689O60147J313329J494502J029885L46312j26692l60056
9254a93536l61532r4481J61716J12828P3954M52991P71443K58675p08870r96613
9244e23425n10057k56350n14104l92897M56305J091288P56134p9347o45126p64915
$$ plain form
9312 -206167 738423 425419 -652250 -1483063 -1784360 -1727276 -1118643 36997 720318 -1867
9302 -1867 -1363259 -1772789 -1094786 -567505 -569676 -197538 725697 1019488 146548 -734521
9292 -734521 -538679 251035 700822 823720 954918 819380 198185 -353106 -337739 -96663
9282 -96663 -27262 111182 373460 59267 -1142320 -2287884 -2382706 -1696652 -1025534 -475138
9272 -475138 48736 -18894 -1072067 -2245387 -2383373 -1740457 -1610841 -2513045 -3737045
9263 -3737045 -4491274 -4550963 -3890816 -2577487 -1082985 -53100 293212 166520 -193536
9254 -193536 -555068 -649549 -487833 -375005 -301051 151940 923383 1182058 473188 -523425
9244 -523425 -1033482 -1289832 -1803936 -2196833 -1740528 -649240 106894 27547 -617579 -1382494
9234a382494m59045K30848O97798K41779n98875m91290N70042J069629M09863
9225B88255j17896L44225O30065l72539j493041q97258R32179J681746L97718
9216A393454j401430j873871q37102O27964J505284J383386M46381n59448p61723
9207g7105o28R20092J079771M47045j79744k12190L1807j30664p35988j138157
9197D239r58183n39813l01078j75615K1615K07569L41833N67259P07240L08907
9187A83973m02132m68370K89273O72798j02785j000978p23708K01676L53702k35186
9177a231737l31707K55702M33642j82037o60936l93336Q8539K74016M25604P62524
9167e59726R18915O07856M5606m86141q30733p57245k88655q207k42621l38370
$$ plain form
9234 -1382494 -1841539 -1610691 -912893 -671114 -1269989 -1761279 -1191237 -121608 288255
9225 288255 170359 514584 1144649 772110 -720931 -1618189 -686010 995736 1393454
9216 1393454 -7976 -1881847 -2718949 -2090985 -585701 797685 1244066 684618 -77105
9207 -77105 -77733 842359 1922130 2369175 2189431 1977241 2009048 1878384 1142396 4239
9197 4239 -953944 -1493757 -1794835 -1970450 -1948835 -1741266 -1399433 -832174 -124934 183973
9187 183973 -218159 -686529 -397256 275542 172757 -828221 -1551929 -1350253 -996551 -1231737
9177 -1231737 -1563444 -1307742 -874100 -1056137 -1717073 -2110409 -2021870 -1747854 -1322250 -559726
9167 -559726 359189 967045 1012651 526510 -304223 -1061468 -1350123 -1358330 -1600951 -1939321
9157a939321K79111Q49465L31020p51327r65622j74129M47509L97805L01271M67546
9147g56672N21965M15150L59551k8562r82969j373327j14699J540944J336031
9138I17412m65121j320500l81880M09279j63049o44497L17027J589441J496971
9129A755083L22746o51810j129025j407144j257478m77683L96632Q62368J015818
9120e70493Q51366J97922l28641J42568R49102N04126r31141j294972j37268N37697
9110g9734j96168n34968P01086J751669R13623n74520q60013m75693o29739n99752
9100e84209M99957J234959O8782j486406j002363Q15532J334061K71220m30170
9091G21363k95242n73310j142331m93848J073541J396941K8522j002082n83936
$$ plain form
9157 -1939321 -1660210 -810745 -479725 -1231052 -2196674 -2370803 -1923294 -1525489 -1224218 -756672
9147 -756672 -234707 180443 539994 511432 -471537 -1844864 -1959563 -418619 917412
9138 917412 452291 -868209 -1250089 -840810 -1003859 -1648356 -1331329 258112 1755083
9129 1755083 2077829 1426019 296994 -1110150 -2367628 -2845311 -2448679 -1586311 -570493
9120 -570493 280873 478795 150154 292722 1241824 1745950 814809 -480163 -617431 -79734
9110 -79734 -275902 -810870 -109784 1641885 2555508 1980988 1120975 645282 15543 -584209
9100 -584209 -84252 1150707 1219489 -266917 -1269280 -453748 880313 1151533 721363
9091 721363 426121 -147189 -1289520 -1783368 -709827 687114 715636 -286446 -870382
9082h70382K7724j37495k89974L3184j18189r71924j051438L63713J722674J490169
9072A98062K88907n19221q42280j116779r53358J8623R85483R67709K55178k29129
9062i46805k78047k15998r6801R2440R9349o8686j5181J69520j35316p52803n60711
9051b709039N95177J177442K06227j037005q94508J94646O85279M65061N53264
9042g63456Q60426L24802q20107j024711o2492L21347p21179j460118k31300J642971
9032a933817J549628m50418j518964j10161J838273J757610J939r75996k33793
9023g5699O24907Q0855j162762j381807k26812R94993J075391K05818m73613k19064
9013e57793N29849O71531j98284j145998r89741J47866J003477Q61290K98994
$$ plain form
9082 -870382 -842658 -980153 -1270127 -1236943 -1355132 -2327056 -3378494 -3014781 -1292107 198062
9072 198062 486969 -32252 -874532 -1991311 -2944669 -2926046 -1940563 -972854 -717676 -946805
9062 -946805 -1224852 -1440850 -1537651 -1445211 -1345862 -1414548 -1429729 -1260209 -1395525 -2148328 -2709039
9051 -2709039 -2113862 -936420 -730193 -1767198 -2661706 -2467060 -1781781 -1316720 -763456
9042 -763456 96970 421772 -398335 -1423046 -1485538 -1164191 -1885370 -3345488 -3576788 -1933817
9032 -1933817 -384189 -834607 -2353571 -2463732 -625459 1132151 1134090 158094 -75699
9023 -75699 549208 630063 -532699 -1914506 -2141318 -1146325 -70934 134884 -338729 -557793
9013 -557793 -27944 643587 445303 -700695 -1690436 -1542570 -539093 322197 621191
9004F21191Q1772J59212J60112J10724J25975K9713j99563k23638m9610k03322
8994F12566o76883o00284L00278Q85880K80508n39110j62038R47611J122475Q0412
8984B251415q13970p88570n06482m76695k34712L94851O56468J83778k49315o1985
8974C54783J27483l14046p96695m58324L51922N92579J13206k44971N8068O50040
8964D34045Q69353M49427l52092r48423r18741n49171n36589r30850r37977j64956
8954c585974O19518O06677J91049K34658O03031M88049r9348l15446N8614K72333
8944i26839r1340n07064n10384l25485j01299M56780J131104R27763l68175j308791
8934a623730n93414R29690J380795N22952j41581J78862N67877J50785n63511
$$ plain form
9004 621191 702963 862175 1022287 1133011 1258986 1288699 1089136 865498 815888 612566
8994 612566 -64317 -664601 -364323 521557 802065 262955 100917 1048528 2171003 2251415
8984 2251415 1437445 648875 142393 -334302 -569014 -174163 482305 666083 416768 354783
8974 354783 482266 168220 -628475 -1086799 -734877 -142298 -29092 -274063 -215995 434045
8964 434045 1303398 1752825 1400733 452310 -466431 -1015602 -1552191 -2483041 -3421018 -3585974
8954 -3585974 -2966456 -2359779 -2168730 -1934072 -1331041 -842992 -942340 -1257786 -1199172 -926839
8944 -926839 -1018179 -1525243 -2035627 -2361112 -2462411 -2005631 -874527 53236 -314939 -1623730
8934 -1623730 -2217144 -1287454 93341 616293 474712 653574 1221451 1372236 808725
8925H08725p05130k94485K07137O58034Q76634M19117n52608j023654n16653J05181
8915a7702L6059k06095O6761K59046m36394j279927r42356K01169M73532m76439
8905b322346j140430m80795P25076J275248R64451K00980n86339p73848K9093
8896b108910J014660Q73442k06848o34201Q0534N44003o8918n41559K14168J120412
8886B86783O69331n47780q49971j50442K06742k25402o03667m73365k10202R4205
8876a803768O69803J066802O21210j00723J03570R33010P32988q22569j912646
8867e12323j208898J98640O01581J38747J13844P05216Q42133N4144q41233r48171
8857h56320k85774N05411P79909K26853p81663j235884n25542O16337R03469K15850
$$ plain form
8925 808725 103595 -190890 16247 674281 1550915 1970032 1417424 393770 -122883 -17702
8915 -17702 18357 -187738 -120977 138069 -298325 -1578252 -2520608 -2319439 -1845907 -2322346
8905 -2322346 -3462776 -3943571 -3218495 -1943247 -978796 -777816 -1364155 -2138003 -2108910
8896 -2108910 -1094250 -220808 -427656 -1061857 -981323 -437320 -506238 -1047797 -833629 286783
8886 286783 956114 408334 -441637 -592079 -385337 -610739 -1214406 -1687771 -1897973 -1803768
8876 -1803768 -1133965 -67163 554047 453324 556894 1489904 2222892 1400323 -512323
8867 -512323 -1721221 -1522581 -921000 -782253 -668409 36807 878940 933084 91851 -856320
8857 -856320 -1142094 -636683 143226 370079 -411584 -1647468 -2173010 -1556673 -653204 -437354
8847d37354k94554M0827M94108K56006k30082r1537M34977L71936l15520n43148
8837c14341J91979R21402N25976p24206j544291j169988l0772Q64118Q51303J34744
8827b94076l87906q0999N42885L61809p59637j550445q98324P52992K041583K169865
8817A897747J271554p0701j056027j005810j66466L39070l8576n33675m09197
8808B27919j37839l22169m26243J44831O11512L5572p86498m64293N10052M76987
8798a30169m88068o29739M54652J142540N95613l880K07256L26540l65440r34396
8788A74909n28709P5376k9408l24394j11767Q2712k88668n08036P0085O08035
8778g79865J88780m86486l33653J98108M2288n23985m68980J20908L25816K5183
$$ plain form
8847 -437354 -731908 -691081 -196973 59033 -171049 -262586 172391 544327 228807 -314341
8837 -314341 -122362 799040 1325016 600810 -943481 -2113469 -2144241 -1280123 -428820 -294076
8827 -294076 -681982 -762981 -220096 141713 -617924 -2168369 -3066693 -2313701 -272118 1897747
8817 1897747 3169301 3098600 2042573 1036763 870297 1209367 1170791 637116 227919
8808 227919 90080 -232089 -658332 -513501 98011 133583 -652915 -1117208 -607156 -130169
8798 -130169 -618237 -1247976 -793324 349216 944829 940949 1148205 1474745 1109305 174909
8788 174909 -353800 -278424 -307832 -632226 -743993 -661281 -949949 -1457985 -1387900 -779865
8778 -779865 -591085 -1077571 -1411224 -1213116 -1170828 -1694813 -2163793 -2042885 -1717069 -1691886
8768a691886j72682j42376r7823K06949Q91068J181487M79615m67266o75490m12971
8758i01375l16873k9583P55880R71119k04903j345993o12561J115086J377915
8749H08712R363p75835j54355K30456m89550q16152K90331J329465O32250r26638
8739A38047j365949n56121L2499j55996k04955M45430J021219O61337j96707l24498
8729e05694N76914J282451O17974p43517j043950n8294M37961n06119j302124
8720a244398l51074J147170J010213l09022m91724P00557J082402j58661j182708
8711B02755p93684k88578p38282r33705K16461J398003J065199J46770L27961
8702F02900J033455N63160p60742j145305m72311l10784r10972p61923M78669
$$ plain form
8768 -1691886 -1864568 -2006944 -2104767 -1897818 -1006750 174737 654352 187086 -488404 -901375
8758 -901375 -1218248 -1247831 -491951 479168 274265 -1071728 -1684289 -569203 808712
8749 808712 818075 42240 -112115 118341 -371209 -1187361 -897030 432435 1064685 138047
8739 138047 -1227902 -1784023 -1751524 -1907520 -2112475 -1667045 -645826 15511 -181196 -505694
8729 -505694 71220 1353671 1971645 1228128 184178 125884 563845 57726 -1244398
8720 -1244398 -1595472 -448302 561911 252889 -238835 461722 1544124 1385463 202755
8711 202755 -590929 -879507 -1617789 -2551494 -2335033 -937030 128169 274939 602900
8702 602900 1636355 2199515 1438773 293468 -178843 -489627 -1400599 -2162522 -1683853
8693a683853J064042O3303r29446k83415J141947J467184N50804l28008o67392
8684C95166r29656j023525l45623O95409Q27416o8349n19117L49900J438228J342365
8674B162214L55691l06621m86342r43630j638651j578378m56884P53355J144400
8665i94846Q55520M24471M2374k03817j49144L6129m1960k57339j29267J44529
8655b73350j20055o43496k56169J049198J594332M53487r86183j116602m46947
8646g45785l19957m68941K09406J235565J084218j25589o30325J24047O34800
8637I97439j35083j167500j132435k96039K42635J72222l7077k939L57739Q47695
8627a53343Q30740j62239j344356j192347M19822J648389J023859n49623j139134
$$ plain form
8693 -1683853 -619811 -556508 -1485954 -1769369 -627422 839762 1390566 1062558 395166
8684 395166 -534490 -1558015 -1903638 -1208229 -380813 -449162 -968279 -618379 819849 2162214
8674 2162214 2517905 2211284 1724942 781312 -857339 -2435717 -2892601 -2139246 -994846
8665 -994846 -139326 285145 327519 123702 -25442 10687 -31273 -288612 -417879 -273350
8655 -273350 -393405 -1036901 -1293070 -243872 1350460 1803947 817764 -298838 -745785
8646 -745785 -1065742 -1534683 -1325277 -89712 994506 868917 238592 362639 997439
8637 997439 862356 -305144 -1437579 -1733618 -1490983 -1318761 -1355838 -1358777 -1001038 -153343
8627 -153343 677397 515158 -829198 -2021545 -1601723 46666 1070525 520902 -618232
8618f18232m27079K00372q9069m99219n5736Q33403R52461K0023q81437p38200
8608a302713R9876N35370L01984J58758M86258N97355j02793j044891j266034
8599a536830o71956J69999R26938J390272J054416j72241j233837r88843K13548
8590h48534J014103Q66447L54811m9439l79108m65217p3882K68171j85223r89089
8580d86960r12182J14563P85739M34944q6441J0555L06265K33749Q9497K24858
8570G14587K62834p3794k61441Q1019L79010Q3780l01264j12917K20987j09102
8560H83699p88763p35654J71615Q09484M38022k86467l62417J39459L52564k35
8550F21307k71875n3837R9969l21685o73125m0674J030287R91961l57108j373915
$$ plain form
8618 -618232 -1045311 -844939 -934008 -1433227 -1488963 -655560 296901 316924 -564513 -1302713
8608 -1302713 -1202837 -667467 -365483 -206725 279533 876888 774095 -270796 -1536830
8599 -1536830 -2208786 -2038787 -1111849 278423 1332839 1160598 -73239 -1062082 -848534
8590 -848534 165569 1032016 1386827 1337388 958280 493063 419181 687352 502129 -486960
8580 -486960 -1399142 -1284579 -498840 -63896 -150337 -139782 166483 400232 489729 714587
8570 714587 977421 903627 642186 723205 1102215 1185995 884731 771814 992801 883699
8560 883699 94936 -640718 -469103 340381 778403 491936 129519 268978 621542 621307
8550 621307 349432 295595 395564 73879 -599246 -639920 390367 1382328 1025220 -348695
8540c48695r66098n3838K48029M03530J031080J117646l79443k105600j766748
8531b820137L79964J762266J194674J08671j96403k74381p63804r40760j86847
8522a736757O67100O90825L65480N88427J082567Q93851j12224j101614j248755
8513H8900m17878O94762R47503q0268j286194j226582l7529Q40333P54287L86280
8503F63614K16880q0866n07960n01716j64582k69616p32271o39583j02291k66673
8493b385064r98000n85330J374268K809553K104240L67941n97230q69175j318262
8484i7059j481499m48473J129361J708283R32925k93180j161196j303119o40590
8475a654547J21315r2636q87443m18734J567809K529215P71588j456691j001840
$$ plain form
8540 -348695 -1314793 -1368631 -1120602 -717072 314008 1431654 1052211 -1053389 -2820137
8531 -2820137 -2440173 -677907 516767 625438 429035 154654 -609150 -1549910 -1736757
8522 -1736757 -1069657 -378832 -13352 575075 1657642 2551493 2439269 1337655 88900
8513 88900 -328978 365784 1313287 1233019 -53175 -1279757 -1317286 -476953 277334 663614
8503 663614 880494 799628 291668 -210048 -374630 -644246 -1376517 -2016100 -2118391 -2385064
8493 -2385064 -3383064 -3968394 -2594126 215427 2319667 2687608 2090378 1221203 -97059
8484 -97059 -1578558 -2027031 -897670 810613 1743538 1450358 289162 -1013957 -1654547
8475 -1654547 -1533232 -1625868 -2513311 -2932045 -1364236 1164979 1936567 479876 -521964
8466e21964J375096K144527L26959j430446j194796k00074j32469m79347R549
8457a02965R60701J029989k0242j123395j313887n63063M19810P53379J19774
8448A60101p74119q46075Q6696J081370J207413M88381l61508p20170m64457R2693
8438d9675N35007O73809N06368r482p33853j020513l49051O51942P23442k40520
8428F87474r62816p31117l65960n59890n40899N05247J753062J812312P40125
8419B337538l12350q57371j189234j237946o33882L03024P62071N30620Q7456
8410b10074j37728L0144N70629R59069N06138m21326n30291L32937N85638n39191
8400A145945j370504l60386J145078Q38149q73219j555888n74419L02897P3316
$$ plain form
8466 -521964 853132 2997659 3324618 1894172 699376 499302 366833 -112514 -102965
8457 -102965 857736 1887725 1867483 744088 -569799 -1132862 -713052 40327 160101
8448 160101 -614018 -1460093 -1373397 -292027 915386 1403767 1042259 322089 -142368 -49675
8438 -49675 485332 1159141 1665509 1656027 922174 -98339 -447390 204552 927994 687474
8428 687474 -275342 -1006459 -1372419 -1932309 -2473208 -1967961 -214899 1597413 2337538
8419 2337538 2025188 1167817 -21417 -1259363 -1893245 -1590221 -828150 -297530 -210074
8410 -210074 -347802 -317658 252971 1212040 1718178 1296852 766561 1099498 1685136 1145945
8400 1145945 -224559 -584945 560133 1398282 525063 -1030825 -1605244 -1302347 -1229031
8391a229031j61409N18203J284641J039323l6086j035467j339602p80653K03795
8382a536286N73420j31046q53171m30141N32335O39126K3419q3768L37570K49266
8372f79276k31107K7520Q36724P90109j22653l56198L69643N21532l63148p10362
8362H2784K59645J110062P37435R9066J02761n3227r43269j375626m75807N37010
8352H0834L97832j11155R5545K98653l98583r66913k03365Q32877N18711m23751
8342A20685k61514N28251J56819j023672r37377N04158J070820n0314r69936l35212
8332a197292O48235N63961o16L4376K84064j8469l44527J45946Q88679O84307
8322A688664l86047j090277p51024J72882R13800R99291L53524n06815p37033
$$ plain form
8391 -1229031 -1390440 -872237 412404 1451727 1415641 380174 -959428 -1740081 -1536286
8382 -1536286 -962866 -1093912 -1947083 -2377224 -1844889 -1205763 -1182344 -1266112 -928542 -679276
8372 -679276 -910383 -882863 -46139 743970 621317 265119 634762 1156294 793146 82784
8362 82784 342429 1452491 2189926 2288992 2391753 2338526 1395257 19631 -456176 80834
8352 80834 478666 367511 463056 761709 363126 -603787 -807152 25725 544436 120685
8342 120685 -140829 387422 544241 -479431 -1416808 -912650 158170 107856 -862080 -1197292
8332 -1197292 -549057 14904 14288 48664 332728 314259 -30268 115678 1004357 1688664
8322 1688664 1302617 212340 -538684 -365802 547998 1547289 1900813 1393998 656965
8313F56965k24602J07496l18506p22910k19787N80701M33678m76516p35067Q0132
8303h38416P99207N90996J44352K91801O38693M74982J14414K18134M47694K8082
8293B909939p20687p24523L2122L36660l51592j039726p81316p8890P1784k61893
8283f08122k91421R6285K74509K0420j67751N9179M12459M84077K38863j33155
8273C85343m35223m36621j2095N61168P54792L80987j76642m28425l16573j91032
8263H5679l25794n49931m36746J14262O77612Q89462R70592J203830J137208J04039
8253C870213j447937k106478j317817j51304K74602K09323L73675N53173J69089
8244D26539l81050k09187N06556O40351k01928j104937j062774m0686J209501
$$ plain form
8313 656965 432363 539859 221353 -501557 -721344 -140643 293035 -183481 -918548 -838416
8303 -838416 -39209 551787 696139 987940 1626633 2101615 2216029 2434163 2881857 2909939
8293 2909939 2189252 1464729 1496851 1833511 1481919 442193 -339123 -418013 -346229 -608122
8283 -608122 -899543 -803258 -528749 -508329 -676080 -616901 -204442 279635 518498 385343
8273 385343 -49880 -486501 -498596 62572 817364 1198351 1021709 593284 276711 85679
8263 85679 -240115 -790046 -1226792 -1112530 -434918 454544 1425136 2628966 3766174 3870213
8253 3870213 2422276 315798 -1002019 -1153323 -878721 -669398 -295723 257450 426539
8244 426539 45489 -163698 342858 983209 781281 -323656 -1386430 -1427116 -217615
8235b17615J772490J117652l28079j308930j066076k70438K1227j18329O8831
8226c29267N12925M46081j49989m64136k22451L1953P9892K81263N65078L35192
8216A086541l82979p94643n81186k57857j13700Q7553J81818l41615j055030p35589
8206b906687O69613J550920Q37361n06473j007226o14405j91485l3074J16364
8197b085092K85117M03095O17318P98549M12690m94196r68503m62624L53171P43069
8187c97406R06769J071870O89312m16019j113625m69501O21627O51051k90990
8178A253088q71590n63932L0449M88411Q03559O35015k73764j125510r01696k1866
8168e47836K20567k50488l05273K70689L57911m45616j004984n37393J53810J73398
$$ plain form
8235 -217615 1554875 2672527 2344448 1035518 -30558 -300996 -279769 -398098 -329267
8226 -329267 183658 629739 479750 15614 -206837 -174884 -94992 186271 751349 1086541
8216 1086541 703562 -91081 -672267 -930124 -1043824 -956271 -774453 -1116068 -2171098 -2906687
8206 -2906687 -2237074 -686154 151207 -355266 -1362492 -1976897 -2168382 -2201456 -2085092
8197 -2085092 -1799975 -1396880 -779562 18987 431677 -62519 -1031022 -1493646 -1140475 -397406
8187 -397406 509363 1581233 2270545 1854526 740901 271400 893027 1544078 1253088
8178 1253088 381498 -182434 -151985 336426 1139985 1775000 1501236 375726 -525970 -547836
8168 -547836 -327269 -577757 -883030 -612341 -254430 -700046 -1705030 -2242423 -2088613 -1915215
8158a915215n7856J10855K43403k15619o05919m7025Q74007Q38780j04370n87952
8148a466911l9262N89805M49507o6053l02271m27304p92848r86519m16560N91980
8138b866436J142439R85571O13337K83628j98734o97144o30349O0819N97000M37625
8128b72244K3931m0356P6414o8174l14753k56155k9962P38m5066K2394j89700
8117a092933r03604j223723k49089J130985J130187j71723o95622N07794J750806
8108A83078J295426j43864q43065o94557p05291q18707j73707Q83451R83543q691
8098d2384o55615k14788L13783J2787m72133j97394L97146K26164o07209q85139
8088b124782p4995R24871J089604O07163L71680M85723O0260j233722k137279
$$ plain form
8158 -1915215 -1973071 -1862216 -1618813 -1834432 -2440351 -2487376 -1613369 -774589 -878959 -1466911
8148 -1466911 -1506173 -916368 -466861 -532914 -835185 -1262489 -2055337 -3041856 -3458416 -2866436
8138 -2866436 -1723997 -738426 -125089 158539 -40195 -737339 -1367688 -1306869 -709869 -272244
8128 -272244 -248313 -288669 -212255 -280429 -595182 -851337 -881299 -880561 -925627 -903233 -1092933
8117 -1092933 -1996537 -3220260 -3469349 -2338364 -1208177 -1379900 -2075522 -1567728 183078
8108 183078 1478504 1334640 491575 -202982 -908273 -1726980 -1900687 -1017236 -33693 -42384
8098 -42384 -697999 -912787 -599004 -586217 -1058350 -1255744 -858598 -632434 -1239643 -2124782
8088 -2124782 -2199777 -1274906 -185302 421861 793541 1279264 1339524 105802 -2031477
8079b031477j226436Q54060J769191M98171j174371j048266N36361J410232O97689
8070B85154k86003k35202M91114Q17016M20028k97724q75522r41478l81803K70333
8060g34087L07315l4930J93670R89611J077976p3069j082041o08550M67694L14108
8050H17697r35788j265898J45036J614332J392874N9463o02576k13791P3114l02317
8040G82146n17092j1194L18460n33579j859336j929505l74952J241780J509442
8031a373830Q05463K52023k2961n31627r51442m05128Q35146J304699M03859o79220
8021c63018p27489j33679O8470p7118J89777Q28719J045743O48141K62637K11794
8011A953977J28226k17394n35031n92256m64844j63909K68229L29346l88007j179456
$$ plain form
8079 -2031477 -3257913 -2403853 -634662 -136491 -1310862 -2359128 -1822767 -412535 285154
8070 285154 -849 -236051 255063 1072079 1492107 1194383 318861 -622617 -1004420 -734087
8060 -734087 -426772 -461702 -268032 721579 1799555 1726486 644445 35895 503589 817697
8050 817697 -118091 -1383989 -1238953 375379 1768253 1827716 1225140 1011349 1084463 782146
8040 782146 265054 253860 572320 38741 -1820595 -3750100 -4125052 -2883272 -1373830
8031 -1373830 -568367 -316344 -339305 -870932 -1822374 -2227502 -1392356 -87657 316202 -363018
8021 -363018 -1090507 -1224186 -1155716 -1232834 -1043057 -214338 831405 1479546 1742183 1953977
8011 1953977 2082203 1864809 1329778 737522 272678 108769 376998 706344 318337 -861119
8001h61119q13103O25463J546448R54023k99400r24581q21849n34542q9194N77945
7991f39909Q42181K39585m50497j79013P02423R47536K99243l84563o91357r71748
7981b86119j101608l90373R49988J592790Q94853k36657q14694r49586r04431
7972a245837k18801J198176K118229J407679k44812j225873j136447q03503n57989
7963g09178M3367Q03839O93922m64102j337797q52049K68494N82723m5530m71236
7953a487547m5433O04042O72404K35936j64171l76175n14871m06414J07541M86913
7943h87775k792r56507r46578M86332J815919J420719j17651p99674k1337P56982
7933G47638L17316o73083r21339l44660J99150L09083K77253K86345J25261l70984
$$ plain form
8001 -861119 -1674222 -1048759 497689 1451712 1152312 227731 -594118 -1128660 -1217854 -639909
7991 -639909 202272 441857 -8640 -187653 514770 1462306 1761549 1376986 685629 -286119
7981 -286119 -1387727 -1778100 -828112 764678 1659531 1422874 608180 -341406 -1245837
7972 -1245837 -1464638 -266462 1851767 3259446 3014634 1788761 652314 -151189 -709178
7963 -709178 -665811 138028 831950 367848 -969949 -1821998 -1553504 -970781 -1016311 -1487547
7953 -1487547 -1532980 -928938 -256534 -20598 -184769 -560944 -1075815 -1482229 -1374688 -887775
7943 -887775 -890567 -1847074 -2793652 -2307320 -491401 929318 811667 11993 -9344 747638
7933 747638 1064954 391871 -529468 -874128 -674978 -365895 -88642 197703 322964 -48020
7923d8020r98907j236017n81115P82526J724941J261136m1619o15692j2299N78913
7913H13847K55378l75967n11167m06817m14231Q640J110271J752739R42327m06625
7903B768395p69319l44006m22160j015731r89248k70041L5221k41830m5600P62194
7893e32125Q79302j95406j142673r06880k41281j31766r7802O12486J266740O76465
7883A87060o48215r85799N6527R14690L25666q74699r27962M24850J550427J023463
7873A046008n44966j326387o25013M21274O29259L08792L63633O56220L38221
7864A267041n71757j071021n91812L90885J152093J267245M78418r89656j985247
7855f53811j397781K33199J115940N13574l63268k13333N81036P37620n1043q31029
$$ plain form
7923 -48020 -1046927 -2282944 -2864059 -2081533 -356592 904544 862925 247233 234934 813847
7913 813847 1069225 693258 182091 -224726 -638957 -630317 479954 2232693 3175020 2768395
7903 2768395 1999076 1655070 1232910 217179 -772069 -1042110 -1006889 -1248719 -1294319 -532125
7893 -532125 347177 151771 -990902 -1897782 -2139063 -2270829 -2368631 -1756145 -489405 187060
7883 187060 -461155 -1446954 -1390427 -475737 -150071 -1024770 -1952732 -1527882 22545 1046008
7873 1046008 501042 -825345 -1450358 -1029084 -399825 -91033 272600 928820 1267041
7864 1267041 695284 -375737 -967549 -576664 575429 1842674 2321092 1331436 -653811
7855 -653811 -2051592 -1818393 -702453 -188879 -552147 -765480 -184444 553176 502133 -328896
7845c28896p28663J6659M33310M2317m68264q2535J031518J515493O70669n27902
7835A573706r52055r01290j074196r21358L65693J861962J815710L43451o84554
7826A427069m73828q5985j85668o0391N43889N88181l53223j049657m95622N85477
7816D40242J045832P99665J93265p28913j511990j278465k67848J12781l85631
7807a581062k17566J199508K012955P55918j138288j522537p13370l81198n36193
7798b121833L4833J166370J519153R49925N00440L08223l53127j098952o73539
7789B31493O72371J121062P3578q72883m35235N01227M76606l74896q40011n05563
7779D7749p9103j53748m31813k38867N00654R81394M07622q28515j369365n97723
$$ plain form
7845 -328896 -1057559 -1040900 -607590 -565273 -1033537 -1116072 -84554 1430939 2101608 1573706
7835 1573706 621651 -279639 -1353835 -2275193 -1909500 -47538 1768172 2111623 1427069
7826 1427069 953241 867256 681588 621197 1165086 1753267 1400044 350387 -145235 440242
7816 440242 1486074 2285739 2479004 1750091 238101 -1040364 -1308212 -1195431 -1581062
7807 -1581062 -1798628 -599120 1413835 2169753 1031465 -491072 -1204442 -1585640 -2121833
7798 -2121833 -2087000 -920630 598523 1548448 2048888 2357111 2003984 905032 231493
7789 231493 903864 2024926 2098504 1225621 790386 1291613 1768219 1393323 553312 47749
7779 47749 -31354 -185102 -616915 -855782 -355128 626266 1033888 205373 -1163992 -1761715
7769a761715M77899N91035j17202n50769k96095P4603N8342k52626n58251n98987
7759b933766j88107M52058O60842J80088l22715j13393O06446J073160R16896
7750C31509K81897m93205q82090m81047K79921M84048J21415J10847N42445K93761
7740E89501q87963j495815n52020P57809J061705Q35532R02333N84354o54374
7731A141062j332701j59159J248821O19183j099360j203656J93277M91318p52357
7722h53572j156071J03744Q47358j28955r54449q3971J130327J051879L79140
7713C35430K30156o9794j178447j772284o95510O32563L53948o74176l39532J155902
7703b021744J719410P50078l12789n56263m93234m33958m979N36065L48991l39295
$$ plain form
7769 -1761715 -1283816 -692781 -809983 -1360752 -1656847 -1582244 -1523902 -1776528 -2334779 -2933766
7759 -2933766 -3121873 -2669815 -2008973 -1828885 -2151600 -2264993 -1658547 -585387 331509
7750 331509 613406 120201 -761889 -1242936 -963015 -478967 -357552 -246705 295740 589501
7740 589501 -298462 -1794277 -2346297 -1588488 -526783 308749 1211082 1795436 1141062
7731 1141062 -191639 -350798 898023 1517206 417846 -785810 -592533 -101215 -853572
7722 -853572 -2009643 -1905899 -1058541 -1187496 -2141945 -2225916 -1095589 -43710 335430
7713 335430 565586 495792 -682655 -2454939 -3150449 -2517886 -2163938 -2838114 -3177646 -2021744
7703 -2021744 -302334 447744 134955 -421308 -914542 -1348500 -1353479 -817414 -468423 -807718
7693h07718l22874M92885P46774j00288p60556k23860N81104L72773l86770l94370
7683h02900K31942J96185o68547r56729N7596J138097R36726O1332M0411Q56414
$$ plain form
7693 -807718 -1130592 -637707 109067 8779 -751777 -975637 -394533 -21760 -408530 -802900
7683 -802900 -570958 -374773 -1043320 -2000049 -1942453 -804356 132370 193702 234113 1090527
$$ [...]
##END NTUPLES=NMR SPECTRUM
##END=
