##TITLE=31Pdec_E3e0606M
 , 24 sc
 7.6.2023
##JCAMPDX= 6.0         $$ Bruker NMR JCAMP-DX V2.0
##DATA TYPE= NMR SPECTRUM
##DATA CLASS= NTUPLES
##ORIGIN= UXNMR, Bruker Analytische Messtechnik GmbH
##OWNER= root
$$ XWIN-NMR		Version 3.5
$$ Wed Jun  7 15:22:36 2023 Russian Standard Time (UT+4h)  she@DPX200
##.OBSERVE FREQUENCY= 81.013821
##.OBSERVE NUCLEUS= ^31P
##.ACQUISITION MODE= SIMULTANEOUS
##.ACQUISITION SCHEME= undefined
##.AVERAGES= 24
##.DIGITISER RES= 16
##SPECTROMETER/DATA SYSTEM= spect
##.PULSE SEQUENCE= zgpg30
##.SOLVENT NAME= CDCl3
##.SHIFT REFERENCE= (INTERNAL, CDCl3, 0, 248.564)
##AUDIT TRAIL= $$ (NUMBER, WHEN, WHO, WHERE, WHAT)
$$ ##TITLE= Audit trail, XWIN-NMR		Version 3.5
$$ ##JCAMPDX= 5.01
$$ ##ORIGIN= Bruker BioSpin GmbH
$$ ##OWNER= she
$$ F:/spectra/data/she/nmr/P31/1/pdata/1/auditp.txt
$$ ##AUDIT TRAIL=  $$ (NUMBER, WHEN, WHO, WHERE, WHAT)
(   1,<2023-06-07 15:20:52.15 +0400>,<she>,<DPX200>,
      <created by zg, POWCHK disabled, PULCHK disabled
       configuration hash MD5:
       00 E9 B6 7A A2 85 ED C7 34 08 36 98 17 FE 4E 26
       data hash MD5: 32K
       C0 2A BB 37 22 37 FA E2 5E 78 7C 02 68 83 0A DE>)
(   2,<2023-06-07 15:20:54.37 +0400>,<she>,<DPX200>,
      <Start of raw data processing
       efp BC_mod = 2 LB = 1 FT_mod = 6 PKNL = 1 PHC0 = -10625 PHC1 = -22.31514 SI = 64K 
       data hash MD5: 64K
       FA 29 6A 47 72 21 0B 9F DC C4 32 3A D4 22 DC C0>)
(   3,<2023-06-07 15:21:09.34 +0400>,<she>,<DPX200>,
      <pk PHC0 = -21.92243 PHC1 = 0 
       data hash MD5: 64K
       31 42 D4 0D 8E 53 E7 95 CD F1 16 51 17 17 1D B3>)
(   4,<2023-06-07 15:21:12.56 +0400>,<she>,<DPX200>,
      <abs ABSG = 5 
       data hash MD5: 64K
       50 DA 20 66 29 93 5F A3 A9 69 73 2D E9 58 18 DA>)
$$ ##END=
$$ 
$$ hash MD5
$$ B5 3A 7B 2A FA 94 7E 0B 18 A3 19 37 69 95 6E 04
##$RELAX= 
##$RELAX= 
##$RELAX= 
##$RELAX= 
##$RELAX= 
##$RELAX= 
##$RELAX= 
##$RELAX= 
##$RELAX= 
$$ Bruker specific parameters
$$ --------------------------
##$DU= <F:/spectra>
##$EXPNO= 1
##$NAME= <P31>
##$PROCNO= 1
##$TYPE= <nmr>
##$USER= <she>
##$AMP= (0..31)
100 100 100 100 100 100 100 100 100 100 100 100 100 100 100 100 100 100 
100 100 100 100 100 100 100 100 100 100 100 100 100 100 
##$AQSEQ= 0
##$AQ_mod= 1
##$AUNM= <au_zg>
##$AUTOPOS= <>
##$BF1= 81.014009
##$BF2= 200.13
##$BF3= 200.13
##$BF4= 200.13
##$BF5= 200.13
##$BF6= 200.13
##$BF7= 200.13
##$BF8= 200.13
##$BYTORDA= 1
##$CFDGTYP= 0
##$CFRGTYP= 5
##$CHEMSTR= <none>
##$CNST= (0..31)
1 1 145 1 1 1 1 1 1 1 1 1 1 1 1 1 1 1 1 1 1 1 1 1 1 1 1 1 1 1 1 1 
##$CPDPRG= <waltz16>
##$CPDPRG1= <>
##$CPDPRG2= <waltz16>
##$CPDPRG3= <>
##$CPDPRG4= <mlev>
##$CPDPRG5= <mlev>
##$CPDPRG6= <mlev>
##$CPDPRG7= <mlev>
##$CPDPRG8= <mlev>
##$CPDPRGB= <>
##$CPDPRGT= <>
##$D= (0..31)
0 1 0 0 0 0 0 0 0 0 0 0.03 2e-05 3e-06 0 0 0 0 0 0 0 0 0 0 0 0 0 0 0 0 
0 0 
##$DATE= 1686136851
##$DBL= (0..7)
120 120 120 11 120 120 24 19 
##$DBP= (0..7)
150 150 150 150 150 150 150 150 
##$DBP07= 0
##$DBPNAM0= <>
##$DBPNAM1= <>
##$DBPNAM2= <>
$$ [...]
##$SUBNAM3= <"">
##$SUBNAM4= <"">
##$SUBNAM5= <"">
##$SUBNAM6= <"">
##$SUBNAM7= <"">
##$SUBNAM8= <"">
##$SUBNAM9= <"">
##$SW= 501.771253377433
##$SWIBOX= (0..15)
0 1 3 0 0 0 0 0 0 0 0 0 0 0 0 0 
##$SW_h= 40650.406504065
##$TD= 32768
##$TD0= 1
##$TE= 0
##$TE2= 300
##$TE3= 300
##$TEG= 300
##$TL= (0..7)
0 120 53 12 22 120 120 120 
##$TP= (0..7)
150 150 150 150 150 150 150 150 
##$TP07= 0
##$TPNAME0= <>
##$TPNAME1= <>
##$TPNAME2= <>
##$TPNAME3= <>
##$TPNAME4= <>
##$TPNAME5= <>
##$TPNAME6= <>
##$TPNAME7= <>
##$TPOAL= (0..7)
0.5 0.5 0.5 0.5 0.5 0.5 0.5 0.5 
##$TPOFFS= (0..7)
0 0 0 0 0 0 0 0 
##$TUNHIN= 0
##$TUNHOUT= 0
##$TUNXOUT= 0
##$USERA1= <user>
##$USERA2= <user>
##$USERA3= <user>
##$USERA4= <user>
##$USERA5= <user>
##$V9= 5
##$VALIST= <valist>
##$VCLIST= <CCCCCCCCCCCCCCC>
##$VD= 0
##$VDLIST= <DDDDDDDDDDDDDDD>
##$VPLIST= <PPPPPPPPPPPPPPP>
##$VTLIST= <TTTTTTTTTTTTTTT>
##$WBST= 1024
##$WBSW= 4
##$XGAIN= (0..3)
0 0 0 0 
##$XL= 0
##$YL= 0
##$YMAX_a= 36917
##$YMIN_a= -32780
##$ZGOPTNS= <>
##$ZL1= 120
##$ZL2= 120
##$ZL3= 120
##$ZL4= 120
##$ABSF1= 248.5645
##$ABSF2= -253.2056
##$ABSG= 5
##$ABSL= 3
##$ALPHA= 0
##$AQORDER= 0
##$ASSFAC= 0
##$ASSFACI= 0
##$ASSFACX= 0
##$ASSWID= 0
##$AUNMP= <proc_1d>
##$AZFE= 0.1
##$AZFW= 0.5
##$BCFW= 0
##$BC_mod= 2
##$BYTORDP= 0
##$COROFFS= 0
##$CY= -3
##$DATMOD= 1
##$DC= 0
##$DFILT= <>
##$DTYPP= 0
##$F1P= 0
##$F2P= 0
##$FCOR= 1
##$FTSIZE= 65536
##$FT_mod= 6
##$GAMMA= 0
##$GB= 0
##$INTBC= 1
##$INTSCL= 6.047779e-11
##$ISEN= 30
##$LB= 1
##$LEV0= 0
##$LPBIN= 0
##$MAXI= 10000
##$MC2= 0
##$MEAN= 0
##$ME_mod= 0
##$MI= 50
##$NCOEF= 0
##$NC_proc= -3
##$NLEV= 6
##$NOISF1= 182.463
##$NOISF2= 159.3651
##$NSP= 0
##$NTH_PI= 0
##$NZP= 0
##$OFFSET= 248.5645
##$PC= 4
##$PHC0= -10646.92
##$PHC1= -22.31514
##$PH_mod= 1
##$PKNL= yes
##$PPARMOD= 0
##$PSCAL= 0
##$PSIGN= 0
##$REVERSE= no
##$SF= 81.0140089999694
##$SI= 65536
##$SIGF1= 159.3651
##$SIGF2= -187.1042
##$SINO= 113.3802
##$SIOLD= 16384
##$SREGLST= <1H.CDCl3>
##$SSB= 0
##$STSI= 65536
##$STSR= 0
##$SW_p= 40650.406504065
##$SYMM= 0
##$S_DEV= 0
##$TDeff= 32768
##$TDoff= 0
##$TI= <>
##$TILT= no
##$TM1= 0
##$TM2= 0
##$TOPLEV= 0
##$USERP1= <user>
##$USERP2= <user>
##$USERP3= <user>
##$USERP4= <user>
##$USERP5= <user>
##$WDW= 1
##$XDIM= 65536
##$YMAX_p= 555726901
##$YMIN_p= -39334114
$$ End of Bruker specific parameters
$$ ---------------------------------
##NTUPLES= NMR SPECTRUM
##VAR_NAME=  FREQUENCY,     SPECTRUM/REAL,   SPECTRUM/IMAG
##SYMBOL=    X,             R,               I
##VAR_TYPE=  INDEPENDENT,   DEPENDENT,       DEPENDENT
##VAR_FORM=  AFFN,          ASDF,            ASDF
##VAR_DIM=   65536,         65536,           65536
##UNITS=     HZ,            ARBITRARY UNITS, ARBITRARY UNITS
##FACTOR=    0.620285442955139, 1,           1
##FIRST=     20137.2065510682, 0,            0
##LAST=      -20513.1999529968, 0,           0
##MIN=       -20513.1999529968, -39334114,   0
##MAX=       20137.2065510682, 555726901,    0
$$ Real data points
##PAGE= N=1
##DATA TABLE= (X++(R..R)), XYDATA
$$ [...]
39882b01468n860J3142k6316k3415L4873K6268q9984j48979q934K06495K61920
39871C7742J36105J5587k692j2082q3617j34437q2628L397J3891k8494j3433P6658
39859g4003J34900Q7443J331j4247K6633m764j60737l03367k53518k7479J65105
39848d22703J73382O8252J1153M1041O9170L7666q819p927L1653M7510j560r2894
39836e4076j61329j57184q1414L2372J43603J99300J52884L6688l4714o724K2073
39825I1479m9633j37442q2165P9168J37287K1702j04806j11214n9643k4310M2980
39814a96597J47236J51873M773j16366o3882L9926K0222n3175j7786P1117M6487
39803C3828n3095m8502N7860R7198L6338j573K189n2013j38020j13609Q247N6442
$$ plain form
39882 -201468 -207328 -194186 -220502 -243917 -209044 -182776 -272760 -421739 -430673 -224178 37742
39871 37742 173847 189434 186742 174660 91043 -43394 -126022 -122625 -108734 -137228 -150661 -74003
39859 -74003 60897 148340 149671 135424 162057 157293 -3444 -306811 -560329 -587808 -422703
39848 -422703 -249321 -181069 -169916 -128875 -59705 -22039 -30858 -38785 -7132 40378 38818 -54076
39836 -54076 -215405 -372589 -454003 -421631 -278028 -78728 74156 110844 76130 69406 91479
39825 91479 41846 -95596 -177761 -98593 38694 60396 -44410 -155624 -215267 -239577 -196597
39814 -196597 -49361 102512 107285 -9081 -72963 -33037 -12815 -65990 -83776 -12659 33828
39803 33828 -19267 -67769 -9909 87289 123627 122054 124243 72230 -65790 -179399 -171152 -114710
39791a14710n025l5964L944N709l0748K3829J37653J10485o1058j24290P659R5203
39779A2687q080r5146K0774J64572R5421r2548j46813n1359K6246L7412M9191
39768A2357N8115L1604K2198N0248J2647j11935j49152k2008O0870m2717j12132
39757a89905O0442K39233R9177j83174j79306O5809J00738j48733k32228O4122
39747c03825L44081K33480o2264j48108l6123q49q6980j15850l7746L0751M2473
39736a40960N2742P4601P8958P1543L9701o8789j96859j66904L6214J57906L9359
39725b2488j07695l9407R7346O439k26881k35130L4637K21392J15825m1132K2356
39714a74738J99483K28075R4744k1292n6082q1091j09027r1591n8748p3922q3661
$$ plain form
39791 -114710 -119735 -155699 -151755 -146046 -176794 -152965 -15312 95173 34115 -90175 -82516 12687
39779 12687 4607 -90539 -69765 94807 190228 97680 -49133 -100492 -74246 -36834 12357
39768 12357 70472 102076 124274 174522 187169 75234 -73918 -95926 -35056 -77773 -189905
39757 -189905 -129463 109770 208947 25773 -153533 -87724 13014 -135719 -367947 -303825
39747 -303825 40256 273736 211472 63364 27241 26392 -60588 -176438 -214184 -183433 -140960
39736 -140960 -88218 -13617 65341 136884 176585 107796 -89063 -255967 -219753 -61847 -22488
39725 -22488 -130183 -169590 -72244 -65805 -292686 -527816 -493179 -271787 -155962 -197094 -174738
39714 -174738 24745 252820 347564 326272 270190 189099 80072 -11519 -70267 -144189 -227850
39703b27850J3674J65479K01197P9760n3961q1048k9589M3753J32874J84801Q8542
39692E17632j31970k55697j37766O3344R3365m7909j51969j37916j14234j06633
39682d09753J5092K47793L35860J20786j66948j89526L1601J71695P7953o4759
39672A69794o8522r15o648n8445l4509O8078J41645J28779N8499l2748j12841
39661B52167j26128n7165N670k6558r7365p6520K6170N1981o1997j59598q0177
39650c49520R9271J66249P0811k4573o20N9662L2666m6441n7567P358N1481M0793
39638D9570L0016K7393k5364j10620j11903L589J03193P6105n353j6043K7409
39627D7992L1342O927L2106P2605R684j47289k32971j53828j3801M8291L7745
$$ plain form
39703 -227850 -214176 -48697 152500 232260 178299 97251 67662 111415 244289 429090 517632
39692 517632 385662 129965 -7801 55543 148908 100999 -50970 -188886 -303120 -409753
39682 -409753 -394661 -146868 188992 309778 142830 -46696 -15095 156600 234553 169794
39672 169794 101272 100357 93709 35264 755 68833 210478 339257 397756 365008 252167
39661 252167 126039 68874 74544 47986 -49379 -125899 -99729 -47748 -109745 -269343 -349520
39650 -349520 -250249 -84000 -13189 -37762 -38382 21280 53946 7505 -50062 -42704 8777 49570
39638 49570 79586 106979 81615 -29005 -140908 -137319 -34126 41979 36626 20583 47992
39627 47992 79334 86261 118367 190972 200656 53367 -179604 -333432 -347233 -298942 -261197
39616b61197M4060Q6829J12162R6503P1150N8733M5596J5466k8148p2139r9749
39605F9266q9378l3624L3298M9260q334p4698o0763J7684L6898m9135r5430L3801
39593a71155K03735J46763j21559k62025r0825J39915J27716k9780l8231J00242
39583D796J28962m249q1430j1193M8242J7948K1939Q4126K6335j79426k63767
39572b07717p0983J52005J20538o2461j14083j4559M6176K0325M652m581o6766
39561a97454q5148O4391K42339J84340q1674k49218j77427l5994K7937P4808J47814
39550h5286J44679L7982j8443N3692J02228k878j44297j43630k3457O7058O0763
39539D8411k2951j50116k25139j18059J23330K41785J10809n0537J731J52341
$$ plain form
39616 -261197 -217137 -130308 -18146 78357 149507 208240 253836 269302 241154 169015 69266
39605 69266 -20112 -53736 -20438 28822 20488 -54210 -114973 -97289 -60391 -109526 -204956 -171155
39593 -171155 32580 179343 57784 -204241 -295066 -155151 -27435 -57215 -95446 4796
39583 4796 133758 129509 48079 36886 85128 103076 125015 209141 235476 56050 -207717
39572 -207717 -278700 -126695 -6157 -68618 -182701 -197260 -151084 -130759 -126107 -130688 -197454
39561 -197454 -282602 -218211 24128 208468 126794 -122424 -299851 -335845 -307908 -233100 -85286
39550 -85286 59393 97375 78932 132624 234852 231974 87677 -55953 -79410 -12352 48411
39539 48411 25460 -124656 -349795 -467854 -344524 -102739 8070 -42467 -40736 111605
39529A11605J14328j04065k12381r2521M8663L2079l9961O906J41645J94871R6719
39518B97888o1370j44608r2551L1899Q3828j6608j72716k15797j10714L0311J17211
39507b53227J45790J06146j9960j48939j39972o29R7763O8238J8770L9214M4670
39496d2136m7864j37155r1503K7055O4120J7714M058L3895J1609n8401m9733P3547
39484a94794J77674J43964J5887q6773j04634m9118L5903Q3070M9457j1736k581
39473E6319P0198Q4628j7084j28022j21138k3462L6309J1807j8110J4997O8976
39462C5418N9971j2314o2417m1421o035k4907n9866k1245P2249R5519M922q6001
39450d6127p3701M28N4025Q5175R3484J1670j44215j87328j3114J71092J05105
$$ plain form
39529 111605 225933 121868 -90513 -183034 -134371 -102292 -142253 -135347 6298 201169 297888
39518 297888 236518 91910 -641 31258 115086 98478 -74238 -290035 -400749 -370438 -253227
39507 -253227 -107437 -1291 -21251 -170190 -310162 -310791 -213028 -144790 -126020 -86806 -42136
39496 -42136 -90000 -227155 -318658 -291603 -227483 -209769 -205711 -171816 -160207 -218608 -268341 -194794
39484 -194794 -17120 126844 142731 55958 -48676 -97794 -61891 21179 70636 58900 56319
39473 56319 126517 211145 194061 66039 -55099 -78561 -42252 -30445 -48555 -33558 35418
39462 35418 95389 83075 20658 -20763 -26798 -51705 -111571 -132816 -60567 34952 39874 -46127
39450 -46127 -119828 -119400 -65375 19800 113284 124954 -19261 -206589 -219703 -48611 56494
39439E6494j14915j63925J0467J29383N4948j5529O1526J18795K100j26941o1014
39428d8611R4042J02583j4138n2423J8226M8435j452k3447Q676L142n7466q6871
39416i304n8037k0035K9497J11569J39157K4866j12027p3012R1609J30479q439
39405B46323r4680q898N5568o6456k09638j28526J14156K38169J34599m2856j29948
39394A07813j10597l4317O3402J31416J09913O859r7253j36416j05848l4370L3860
39383f5538M3186k5076j08668j21240n4241K1707N2718N0191M2252L0914J7743
39372a16052K6343O1608P5755K5584m4886m1378M0162P8800m059j02120n7505
39361e7748Q7541J15993n2018k18665j72549K4299J40696Q7589j5509m2010Q520
$$ plain form
39439 56494 -58421 -222346 -211879 -82496 -27548 -43077 18449 137244 139344 12403 -48611
39428 -48611 45431 148014 133876 81453 99679 148114 146662 123215 131891 135033 77567 -9304
39416 -9304 -67341 -87376 -57879 53690 192847 217713 105686 32674 124283 254762 246323
39405 246323 151643 142745 198313 131857 -77781 -206307 -92151 146018 280617 237761 107813
39394 107813 -2784 -37101 26301 157717 267630 274489 177236 40820 -65028 -99398 -65538
39383 -65538 -22352 -47428 -156096 -277336 -331577 -309870 -257152 -206961 -164709 -133795 -116052
39372 -116052 -89709 -28101 47654 73238 28352 -13026 27136 105936 101877 -243 -57748
39361 -57748 29793 145786 93768 -124897 -297446 -273147 -132451 -44862 -60371 -102381 -93861
39350i3861O3394N3791m3724j50296j14478Q8159K43232J40585j07327j78319
39340i8844J8914K14472J53236p3031j83908q2549O1983N8968p8624j64336o4967
39329b38686J22770J72110K4805j11765n7058P0866M5316j01509j36916j4716
39319b24783O7474K1769j642P6809J06118n522r3935j7208Q8013M2448p0574p2823
39307h3856q131l1198r6621l7791J10011J42631K3182p2935n5848j8672j0527
39296a39755M3078J31509J07180n2624j41157k1215J41278J12111o3687j35840
39286a9122j0600J41897J43716K4667o4874n6430q401M784k1687m8314n1198k7528
39274F910K7803J00153J19119J6817j52101k25408j29788M054J2109p0400p0600
$$ plain form
39350 -93861 -30467 23324 -20400 -170696 -285174 -197015 46217 186802 79475 -98844
39340 -98844 -79930 134542 287778 214747 30839 -51710 10273 69241 -9383 -173719 -238686
39329 -238686 -115916 56194 80999 -30766 -87824 -16958 28358 -73151 -210067 -224783
39319 -224783 -157309 -135540 -137182 -60373 45745 40223 -53712 -70920 17093 59541 -11033 -83856
39307 -83856 -91987 -123185 -219806 -257597 -147586 -4955 18227 -54708 -110556 -129228 -139755
39296 -139755 -96677 34832 142012 89388 -51769 -72984 68294 180405 116718 -19122
39286 -19122 -29722 112175 255891 280558 215684 159254 150853 155637 133950 85636 34438 6910
39274 6910 34713 134866 253985 270802 118701 -106707 -236495 -232441 -220332 -290732 -361332
39263c61332M8160J24156M7327o9773o2537M9076J15984Q7122M1335J3318n9924
39252b7088j78905k04701m3032J76741K31545Q9347n4137l8575O8831R8359J3491
39241A31876o4104l4613N6551R0468K5317n6543n5390Q550R926r9771j86567j03952
39229b78252O9230J06807l3906j31673l1701J14385Q6024o4864j06249J7226J29884
39218a23089J07114J7737l2631l4828j9643k196q957m7295m7479M5373J40943
39207d951J09696l348m2777n443l3533j32938j30361K5593J45813Q7069m0793
39196b5973p3741k3011K0548M8766O8997K2239r4642j55492q2435K6892O4242
39185b03610O5199Q1472N3307m9810j11912n1047K4552K878l3007L0178J14394
$$ plain form
39263 -361332 -313172 -189016 -141689 -211462 -273999 -224923 -108939 -21817 19518 32836 -27088
39252 -27088 -205993 -410694 -453726 -276985 -45440 43907 -10230 -48805 20026 118385 131876
39241 131876 67772 33159 89710 180178 205495 148952 93562 102112 112038 12267 -174300 -278252
39229 -278252 -209022 -102215 -136121 -267794 -299495 -185110 -99086 -163950 -270199 -252973 -123089
39218 -123089 -15975 1762 -30869 -65697 -85340 -87536 -96493 -143788 -191267 -145894 -4951
39207 -4951 104745 101397 58620 53177 19644 -113294 -243655 -218062 -72249 14820 -25973
39196 -25973 -99714 -122725 -102177 -53411 15586 37825 -56817 -212309 -294744 -267852 -203610
39185 -203610 -138411 -56939 -3632 -53442 -165354 -216401 -191849 -188971 -221978 -191800 -77406
39174g7406R1804J8095J2686K6106m4828j16994m4850R6172J04662k4195j18817
39163g7565j23775j17542q3304N9145K10873J75062m323p5598J6609O6103L670
39152D9355K3334J80509K06353n1940k99576k03486Q0883J38091p4991j96701
39142a48169m5118J27685O7972r5801r4856O1151J44669P9055o62k6296q8807
39131a9177j99980j91512J2611K01102J42877o7012j43855k7093P7559M8078j3021
39120a79423j8977k8357n6036L014J43893J75259K1717j12201n4370O4917N7396
39109A6832r086J6656O2397j6813j21614n4524J08186J12253n3390j48546q3363
39098a71012j5305k2899J0811J26356J80018R5716j9441r2754j80350k59480j76858
$$ plain form
39174 -77406 14398 32493 45179 71285 26457 -90537 -135387 -39215 65447 41252 -77565
39163 -77565 -201340 -318882 -402186 -343041 -132168 42894 38571 -37027 -20418 45685 49355
39152 49355 72689 253198 459551 407611 108035 -95451 -14568 123523 48532 -148169
39142 -148169 -193287 -65602 2370 -93431 -188287 -127136 17533 96588 95926 69630 -19177
39131 -19177 -219157 -410669 -398058 -196956 -54079 -121091 -264946 -292039 -214480 -166402 -179423
39120 -179423 -198400 -226757 -282793 -279779 -135886 39373 61090 -51111 -105481 -40564 16832
39109 16832 7746 24402 86799 69986 -51628 -106152 2034 114287 60897 -87649 -171012
39098 -171012 -186317 -209216 -198405 -72049 107969 203685 184244 91490 -88860 -348340 -525198
39087e25198P1322K35818J45173m4141q3340L7274J46549J55885J09731N6143
39077C05216o25n8887j07543j24318p5636J6123L7042o6050j41371j9368J85690
39066d9727J95114l274j15928k606J14148L4465j00630p9205K5703J8744o9432
39055c2628o3136L4147N6327k9602p4453N317J11170J16303J1748j12475j49584
39044a26866n7005Q0927J18465L4164k9896J5927O7172R975p0573k7820Q3585
39033I8055P0966r7049k33225j91943m0009P3847J04010J01896J01495Q3904L8192
39022A10139O496L7812J00374R0682k4632j27105r4355J2764L8197k1146k6448
39011A02778L7617K2130r3485r9524J04356K73030J37968j76200l05987j45628
$$ plain form
39087 -525198 -453876 -218058 -72885 -117026 -200366 -163092 -16543 139342 249073 305216
39077 305216 304591 245704 138161 13843 -61793 -45670 -8628 -74678 -216049 -235417 -49727
39066 -49727 145387 142113 26185 23579 137727 172192 71562 -7643 18060 36804 -32628
39055 -32628 -95764 -61617 -5290 -34892 -109345 -104028 7142 123445 135193 22718 -126866
39044 -126866 -183871 -102944 15521 49685 19789 35716 102888 112863 42290 14470 98055
39033 98055 169021 71972 -161253 -353196 -393205 -319358 -215348 -113452 -11957 71947 110139
39022 110139 116635 154447 254821 345503 320871 193766 99411 112175 150372 129226 102778
39011 102778 140395 162525 69040 -30484 73872 346902 484870 308670 2683 -142945
39001a42945O0294J00982L3200q052j6944m0222m8886j590N5928N5574J6852J0716
38989G4907M5564N8860J3462n1327p5283m9814j1865J8483N7003J02738J09019
38978B91747M4646m6589r5707r3054p1415l6962J5548N1824M4365L5890O0244
38967B00537M3068q7170k21708j74259L3957J71786J16982j986m0273k7713l7805
38956b4584m3875k0881l1299q4946o5887O4912J46141N4259p7664o3618L6631
38945a10811L2880p1115r4877J8479J32366J41072P8519j822q6202j26807o6663
38934a54981L8297O3898P551l879P6421J37842R2424K657l9210m8356p6351q8589
38922G724k0967Q1652R4793o393q7952l2936Q0597P0302q8765k06686j35263K8260
$$ plain form
39001 -142945 -82651 18331 51531 43479 26535 -13687 -62573 -64163 -8235 47339 64191 74907
38989 74907 120471 179331 192793 141466 66183 16369 4504 22987 79990 182728 291747
38978 291747 336393 289804 194097 101043 29628 -7334 8214 60038 104403 140293 200537
38967 200537 243605 156435 -65273 -239532 -205575 -33789 83193 81207 40934 13221 -24584
38956 -24584 -68459 -89340 -120639 -205585 -271472 -206560 -60419 -6160 -83824 -147442 -110811
38945 -110811 -77931 -149046 -243923 -225444 -93078 47994 126513 124691 38489 -88318 -154981
38934 -154981 -116684 -52786 -45235 -49114 27307 165149 257573 260230 221020 172664 96313 7724
38922 7724 -13243 68409 163202 156809 68857 35921 116518 186820 98055 -108631 -243894 -215634
38910b15634R8722O6788M8715M4731m0540j52626j05005J03239K23380J17501
38900A89271l4811l5375K9840k1139j42396j54357n4624j57l1516l1062N4666
38889b31660J33684J22329M1151n1977j15957j17754n9031M922L9240P5557J23016
38878c6480J16501L4681k9479j5978n748o2979r0477O830J24994J01476l6457
38867A06884j36300j47447j09446j1919J31904J66589j1727k08267j37182J47600
38857b09311K93288J37967r2609j34186o464R9315P8864k9793j27918j33163n8930
38846a82940j6057m8415l1403J24848K60824J66100p3875j81451j02369l6512
38836a21250n5611o549J42509J79795O077j65745j33319P994P2395O3939O5223
$$ plain form
38910 -215634 -116912 -50124 -1409 43322 2782 -149844 -254849 -151610 71770 189271
38900 189271 154460 119085 148925 127786 -14610 -168967 -223591 -223748 -255264 -286326 -231660
38889 -231660 -97976 24353 65504 13527 -102430 -220184 -279215 -274293 -235053 -159496 -36480
38878 -36480 80021 114702 85223 69245 63497 518 -89959 -83129 41865 143341 106884
38867 106884 -29416 -176863 -286309 -298228 -166324 265 -11462 -219729 -356911 -209311
38857 -209311 83977 221944 129335 -4851 -11315 88000 166864 137071 9153 -124010 -182940
38846 -182940 -198997 -247412 -278815 -153967 106857 272957 199082 17631 -84738 -121250
38836 -121250 -176861 -183410 -40901 138894 144971 -20774 -154093 -146099 -73704 -9765 55458
38825E5458M0865m4699p6568L2260J42940Q0207q4226j41543n8344J8390J1522
38814b3738k0197l4565n2497o1531j7064N9161R5068P6414M6021J5686l1758p6910
38802b5910q4541o5534m5851p924O6455J32725J31001O1705l4979j21622j47251
38791a41726p5064K3105J3220q6759p8587J13024K59637J34786j20414j73995
38781a32773J6333J60802Q1360o4113p7146m605O339m0056m7907k1029k3264k2053
38769a68112N9055J65345J51931Q283j01570o3305M1510P3803K4529j7484j5493
38758A58492n681l782J0801K3878q355o7868p3847q243L5101j7971j04749j13310
38746a75534m4375j68k7177n6775j7296O5422J13359R5990M7937J4015J1096L3848
$$ plain form
38825 55458 96323 51624 -24944 7316 150256 230463 146237 4694 -53650 -35260 -23738
38814 -23738 -43935 -78500 -130997 -192528 -209592 -150431 -55363 21051 67072 82758 51000 -25910
38802 -25910 -110451 -175985 -221836 -229760 -163305 -30580 100421 162126 127147 5525 -141726
38791 -141726 -216790 -193685 -180465 -267224 -345811 -232787 26850 161636 41222 -132773
38781 -132773 -116440 44362 125722 61609 -15537 -20142 -13803 -53859 -101766 -122795 -146059 -168112
38769 -168112 -109057 56288 208219 216502 114932 51627 93137 166940 191469 173985 158492
38758 158492 152811 149029 159830 183708 175353 107485 33638 25395 60496 42525 -62224 -175534
38746 -175534 -219909 -220077 -247254 -304029 -321325 -255903 -142544 -46554 1383 15398 26494 60342
38734F0342O8439R3281Q2098K4550n2519j00666r9766p6020n3308j5990M3399
38723b6160P4631L3141l1509l4935O259m54o0311p2500j20O7590O5945L5351j157
38710E5771q5680j72320j06709J11701K30271R0990r1595m0466J37194J16243
38700B45400j11143k10867l2651J76342J78351O6172K7131L7335j7674j04674
38690B53722j23146r2720q5014p5966k4147O580l8404o3019L8031J75358J79203
38679A50478O0921k0148j5634k5547p9986p4989K7178J00072M1011o4873p0382
38668B8101K2861Q4736M9306j4248k8007j8793n7660j28050j27416j7059R2476
38657a13753P0304m9741j02804k1099P3117N6408j1195N279Q7515Q8291k3184
$$ plain form
38734 60342 128781 222062 304160 328710 276191 175525 75759 -261 -53569 -69559 -26160
38723 -26160 48471 81612 50103 15168 21427 20973 -39338 -111838 -111958 -44368 21577 56928 55771
38710 55771 -29909 -202229 -308938 -197237 33034 124024 32429 -8037 129157 245400
38700 245400 134257 -76610 -109261 67081 245432 311604 338735 376070 358396 253722
38690 253722 130576 37856 -47158 -123124 -147271 -140691 -179095 -242114 -204083 -28725 150478
38679 150478 211399 191251 175617 150070 70084 -4905 22273 122345 163356 98483 28101
38668 28101 50962 135698 185004 170756 142749 123956 66296 -61754 -189170 -206229 -113753
38657 -113753 -43449 -93190 -195994 -217093 -143976 -87568 -98763 -93484 -5969 82322 59138
38646E9138r4275k2864P6535M8017o2032q1960J2540O9177J0746m9770o508P3242
38634C1986P6094J2504n3421j26629j95108j39260Q6208K73921J96368l9414j27538
38623d289k8896J262j15544j26174J01664K99366K00139m0607j04272R805O0061
38612B52515k1324r2596r7880j09741j21003n5130M1833N3143M891P624L1196
38601a06472k8859j08863n6245Q0787J07371R826l9338K479O693m3334j9960O7475
38589a28440N7358m5368l8976J06587J56164j046j57769j24769K764O2152O0889
38578e0454M9519p503q6193n6107Q1517J41137O6332L3607J05056Q1491j10488
38567B47914k07108l4725J60130J11929k1262K4434J17005k6891k80874k64555
$$ plain form
38646 59138 -35137 -58001 18534 66551 4519 -77441 -64901 4276 15022 -34748 -41256 31986
38634 31986 108080 120584 67163 -59466 -254574 -393834 -307626 -33705 162663 123249 -4289
38623 -4289 -33185 -31923 -147467 -273641 -171977 127389 327528 286921 182649 192454 252515
38612 252515 231191 138595 40715 -69026 -190029 -245159 -203326 -150183 -145292 -137668 -106472
38601 -106472 -135331 -244194 -300439 -219652 -112281 -102455 -141793 -139314 -132621 -175955 -195915 -128440
38589 -128440 -71082 -116450 -155426 -48839 107325 106279 -51490 -176259 -173495 -111343 -50454
38578 -50454 -935 -8438 -94631 -150738 -69221 71916 138248 171855 276911 358402 247914
38567 247914 40806 6081 166211 278140 256878 281312 398317 371426 90552 -174003
38557a74003K2387J83466M4330j35084j25916k6133J3751L0455P7864Q4514J7179
38546A2810k6724m47R825l0263k8980M0443O9720K1249P350O8385O9340o3239
38534A49469j84782j51887l8673J1987J1593M3580P9346M6827o499R937N1679
38523B2577N701j00826j25528m0283K5617K897o504Q8689J94284J56061l1q7602
38511A35052k1728O6901L7726m9699m6585L4046L9242n8596j02458j8354M0875
38500E6422m8149j37596k3951J97044K37992N4778q9279m1770J8176q9802k23742
38489h9877j41403R8854K09994R4228n3031o5886q020J4743L6856J05454J29540
38478C31452J6756j41199j85233j26162r7703j13247n4892R0954J72710J00909
$$ plain form
38557 -174003 -151616 31850 76180 -58904 -184820 -210953 -197202 -166747 -88883 -4369 12810
38546 12810 -13914 -14361 -4536 -34799 -63779 -23336 46384 67633 74983 143368 212708 149469
38534 149469 -35313 -187200 -225873 -213886 -202293 -158713 -79367 -32540 -39039 -29102 22577
38523 22577 28278 -72548 -198076 -238359 -212742 -209845 -216349 -127660 66624 222685 222654 135052
38511 135052 113324 180225 217951 168252 121667 155713 194955 136359 33901 15547 56422
38500 56422 8273 -129323 -153274 43770 281762 336540 247261 205491 223667 133865 -89877
38489 -89877 -231280 -132426 77568 171796 118765 52879 44859 59602 96458 201912 331452
38478 331452 348208 207009 21776 -104386 -202089 -315336 -370228 -279274 -106564 -5655
38468e655j9453n4592q038N0396R3781R6975J3830j11472j32796o554J08319O6059
38456I0800o4122j27315r4127j8215Q5547J76237J39920k3536j10683n722R3870
38445A42654j8771j87444j26850R4972J64281M3345m436R3797J07498n1310j59014
38434I8722q3634r83m8611r2080j9420L7524k1507n7013K2552M3630j09600k14979
38422d45399m9328K07821K26069K4520r7822k6471Q2027J18465J33288J38241
38412C11411N1749j17483k20759j57135J121R6037L7233j11795j69257k6749J75013
38401a30614J87713N905r9431K7678K00604J79084K331j22804j15699m7848K596
38390H9515p613p8047j13672k3520Q6528K8604j19424p2797J68584K44301J2724
$$ plain form
38468 -5655 -25108 -79700 -87738 -37342 56439 153414 167244 55772 -77024 -83578 24741 90800
38456 90800 26678 -100637 -194764 -212979 -127432 48805 188725 165189 54506 48784 142654
38445 142654 123883 -63561 -190411 -95439 68842 112187 107751 201548 309046 257736 98722
38434 98722 15088 14105 -34506 -126586 -146006 -108482 -129989 -187002 -164450 -120820 -230420 -445399
38422 -445399 -494727 -286906 -60837 -36317 -134139 -160610 -78583 39882 173170 311411
38412 311411 363160 245677 24918 -132217 -131096 -35059 2174 -109621 -278878 -305627 -130614
38401 -130614 57099 63004 -36427 -8749 191855 370939 373270 250466 134767 86919 89515
38390 89515 81902 3855 -109817 -133337 -46809 -18205 -137629 -210426 -41842 202459 215183
38379B15183j80401o3875J13416L5318j40027j04178L8686k93j37982q3428J07782
38368a99799J37615J0023j3547P5664M9317p9118p1668N0064J6385j69499j93391
38357c87954J8471J60438O6407m8936N25R9100J07136P5456N0742k3334j01195
38346A6856l8807J02629P6034j28248k08928k5528J81343J83492O9773J974m1662
38335A88928j09250j22954n2885j7603o8658q6758n427P8330J05108J32619J43471
38324A84921L4584j28169j31058K4686Q3408l8856j08227J5117J41296R2419k2889
38313A47232n6239n6987q2258m2905P8764J19302J4681o9445m2086l7555j08477
38302a35973q7399O4231J10336l6882r8513J01261K90538J87252l7085p8662R85
$$ plain form
38379 215183 34782 -29093 84323 119641 -20386 -124564 -85878 -86171 -224153 -307581 -199799
38368 -199799 -62184 -52161 -65708 9956 59273 -19845 -91513 -41449 -25064 -194563 -387954
38357 -387954 -369483 -209045 -142638 -191574 -191049 -91949 15187 90643 141385 118051 16856
38346 16856 -21951 80678 156712 28464 -180464 -205992 -24649 158843 228616 230590 188928
38335 188928 79678 -43276 -96161 -113764 -182422 -269180 -274607 -196277 -91169 41450 184921
38324 184921 219505 91336 -39722 -15036 68372 29516 -78711 -63594 77702 170121 147232
38313 147232 90993 34006 -48252 -91157 -12393 106909 121590 52145 10059 -27496 -135973
38302 -135973 -223372 -159141 -48805 -85687 -184200 -82939 207599 394851 357766 279104 280089
38291B80089k6131j09249o8701J6368l0728j06308m631J70839J67450L3280J4319
38280C36597R9898O6391r1403j61886j12148j06852j50862q1950P5013J06978
38270b0224k978l3903P9503J41371N5619k1172J3963M0119l2801r7869p1889n2910
38258c171j13104j33596o181J54042J61581K6908p4515m6766K7626K2779o7312
38247e1709j25754o8973K7594L0385l4871k434J49940K11218N2174j40928j30108
38236h3466K1103P9066J0079l1851r429k5129p4773m5746L9739L7054m7592n1535
38224a82480M0264M7492p6235j24113L2539K17705K09464M8384p5496j03543j05965
38213g1984r8045l2874O5153J04125N6406j1502l8164k4300L663K5992K4627n519
$$ plain form
38291 280089 253958 144709 76008 92376 61648 -44660 -49291 121548 288998 322278 336597
38280 336597 436495 502886 411483 249597 137449 30597 -120265 -202215 -127202 -20224
38270 -20224 -23202 -57105 22398 163769 219388 198216 212179 252298 219497 121628 49739 -3171
38258 -3171 -116275 -249871 -256052 -102010 59571 86479 11964 -34802 -7176 15603 -51709
38247 -51709 -177463 -246436 -218842 -188457 -223328 -225762 -75822 135396 187570 46642 -83466
38236 -83466 -62363 16703 26782 -5069 -14498 -39627 -114400 -160146 -120407 -83353 -130945 -182480
38224 -182480 -142216 -94724 -170959 -295072 -262533 -44828 164636 213020 137524 33981 -71984
38213 -71984 -170029 -202903 -137750 -33625 22781 11279 -26885 -51185 -47522 -21530 3097 -2422
38201b422l2452j1093N3733R6156O7431O416j3786m368m7496j32641j14746O2961
38189g2307K08330J15845j02373j46794K2086J32109M4986l9849L7992J06365
38179C06390k9941k19232j87840K0565J29791O3527p33L0275N3771O970l1893
38168A41650k2785m2040j23082j75779j22353l423Q6919R6306M4806J6171P6689
38157b6921J56486J06835o2319j46960n1252N3151J8430l0661M8083J13505j6965
38146A61412j89469j19988J23478K03458L0784j50157j76569j22581l8441J11954
38136a66119K23156J14514j15543j51900M2787J52821L0218q2023J400J03362
38126A52673L4542q4713r0098o1823r5304o4465J08197K04727M4873j57031j01265
$$ plain form
38201 -2422 -34874 -45967 7766 103922 171353 177769 163983 159615 112119 -20522 -135268 -72307
38189 -72307 136023 251868 149495 2701 24787 156896 201882 162033 200025 306390
38179 306390 276449 57217 -130623 -110058 19733 83260 82527 112802 166573 173543 141650
38168 141650 118865 76825 -46257 -222036 -344389 -347812 -260893 -164587 -119781 -103610 -26921
38157 -26921 129565 236400 174081 27121 -24131 29020 47450 16789 64872 178377 161412
38146 161412 -28057 -148045 -24567 178891 209675 59518 -117051 -239632 -278073 -166119
38136 -166119 57037 171551 56008 -95892 -53105 99716 129934 47911 49311 152673
38126 152673 187215 102502 12404 -49419 -144723 -209188 -100991 103736 148609 -8422 -109687
38115a09687J14316J71089M8668k498P3892P4562p3340j94111j74914j09886p8831
38104b60740l1235M8007P7422M4096L4125N2061P379p5383m6671R9748J63550
38093A12359M3074r7169q9568q321K138k1872K7478R2193L0847j26131k01063
38082b36035j23146J3237J24243J99610K01621Q9102l9271k1358R7836P6272j49931
38071B32180l09872j75283Q7249J56593J5943q1360k4764N2493O5832Q8164J26854
38060B34029O6011q1281j18699J3698J04465N365j25463r4991K1688N8932M5531
38049A29285P5008P2020m1667j10470J7119J51041J5548k48825k40788O0767K34893
38038A13931P0904j29860o6913J12911J18434k9190j15863r8886p8784n5484K9751
$$ plain form
38115 -109687 4629 175718 224386 221888 295780 370342 297002 102891 -72023 -181909 -260740
38104 -260740 -291975 -243968 -166546 -122450 -88325 -36264 -28885 -104268 -150939 -51191 112359
38093 112359 155433 58264 -31304 -39625 -37487 -59359 -31881 60312 91159 -34972 -236035
38082 -236035 -359181 -345944 -221701 -22091 179530 268632 229361 208003 305839 382111 232180
38071 232180 -77692 -252975 -165726 -9133 6810 -74550 -99314 -46821 19011 107175 234029
38060 234029 300040 218759 100060 113758 218223 223588 98125 3134 24822 83754 129285
38049 129285 204293 276313 234646 124176 141295 292336 307884 59059 -181729 -120962 113931
38038 113931 184835 54975 -11938 100973 219407 190217 74354 -24532 -103316 -158800 -129049
38027a29049J08646P3483j9038l3012J8241J7341l6461l9349J6538L3893q280
38016B953k7019M085J2387l2806n8727l751R4411J52339J21967J4495r8811j19707
38004F1816k0812R7515J07239J038j10280j30751n7472M9895J17111R1791m808
37993B02282p1813l1938O4496R0125p071j47553k16416j74762o9420L3004J01256
37982b27810J37526J39704R1523M228o1367n4050L189M8253N7376L8644j7044
37971A60172j02249j38912n8560P2129J13430M3725k4647k9245k6239m8143l7867
37960g6406J7241K8300l4759o0502K2044J04363O8397j5763j1772N2902N0681
37949A44726q188J1245J23575J69197M8547j30443k04965j55383p8608l4716J326
$$ plain form
38027 -129049 -20403 53080 34042 1030 19271 36612 151 -39198 -22660 11233 2953
38016 2953 -24066 -19981 -7594 -40400 -99127 -102878 -8467 143872 265839 280334 181523 61816
38004 61816 41004 138519 245758 246796 136516 5765 -51707 -1812 115299 207090 202282
37993 202282 130469 98531 163027 253152 246081 98528 -117888 -292650 -362070 -329066 -227810
37982 -227810 -90284 49420 140943 145171 83804 29754 32943 81196 138572 177216 160172
37971 160172 57923 -80989 -139549 -67420 46010 89735 65088 35843 9604 -38539 -76406
37960 -76406 -59165 -30865 -65624 -126126 -104082 281 68678 52915 41143 94045 144726
37949 144726 136538 147783 271358 440555 489102 358659 153694 -1689 -80297 -115013 -113687
37938a13687O2857J28534J44364Q7814n86n7528o7838p1499r0687q6596j9563
37927h4415P5752J14498N3110o2959j32719q2201N3066J32556N6790q5270r6909
37916e8701O8120K23104J87703J9240r1338q1002m5399m6120l2026K9103O6443
37905B39127J5811o6062p1215Q991O6393J2217j06719j54461o7440O1442R5169
37894C3253K8328j7783J9961O2405L9405K2986R9512J79836R4428j27330k38514
37883A96487j01259J00790R4193j16135k52074j27932J21455K33878J47242L1774
37873C28419K6719O6553J8798r6616j37468o4327n059m9720r9607k9445Q0085
37862C8332L4345j57553k34966l4008K59072L35159J49690p3610j68069j64468
$$ plain form
37938 -113687 -50830 77704 222068 309882 309296 251768 183930 112431 21744 -64852 -84415
37927 -84415 -8663 105835 158945 95986 -36733 -118934 -65868 66688 123478 38208 -58701
37916 -58701 9419 232523 420226 439466 348128 267126 221727 175607 143581 172684 239127
37905 239127 254938 188876 117661 126652 193045 205262 98543 -55918 -123358 -61916 33253
37894 33253 61581 43798 63759 126164 165569 188555 288067 467903 562331 435001 196487
37883 196487 95228 196018 290211 174076 -77998 -205930 -84475 149403 296645 328419
37873 328419 355138 421691 440489 343873 206405 142078 137019 87299 -12308 -41753 38332
37862 38332 72677 -84876 -319842 -353850 -94778 240381 390071 316461 148392 -16076
37852a6076j14435Q035J55018J58690j8663j50199m6897J30100Q9250j35973k24320
37841a65470o0079R8191L3450j06350p3095Q9341J38846J2166j12680r9357j4120
37830b59157J5697k3262l8053M3365J69084J88156K6516j72382j93696m8009M1369
37819b50372n259J772J66263K64842R1006j57041j42099P9110J38980n9549k04628
37808g6975p6355J40295J72172K6396j12645j52234j03281J6315J46414J78116
37798A58218R8658K8385K8493J1246p0569j09064l7677J8161n7283j52495r2346
37787a76273P7186J52064O0831p7893j55077j69777j39145n6929L9409P4594L8792
37776c32218N216K3663O1253O8476N1142M9441P2383P8578K8242n0336p4829j5866
$$ plain form
37852 -16076 -130511 -122476 32542 191232 172569 22370 -24527 105573 194823 58850 -165470
37841 -165470 -225549 -127358 -93908 -200258 -273353 -184012 -45166 -33000 -145680 -245037 -259157
37830 -259157 -243460 -266722 -304775 -261410 -92326 95830 122346 -50036 -243732 -291741 -250372
37819 -250372 -255631 -253859 -87596 177246 268252 111211 -30888 48222 187202 127653 -76975
37808 -76975 -153330 -13035 159137 185533 72888 -79346 -182627 -166312 -19898 158218
37798 158218 256876 285261 313754 325000 254431 145367 107690 125851 68568 -83927 -176273
37787 -176273 -99087 52977 113808 35915 -119162 -288939 -428084 -485013 -445604 -371010 -332218
37776 -332218 -327002 -303339 -242086 -173610 -122468 -73027 -644 77934 106176 55840 -18989 -34855
37764c4855M4432J5488p0411j06848p1653l9663m2444k5049L8106Q8898Q2139
37753a21860M8887L0464K5732K4352J7921k4941j08416j45764n6113Q4505J18950
37742a06283L4988k6964L260N2052O4376O7973N1334l7843j37454j13138j355
37731a49054R646r3817r1586R7062K40527J54125j2198m3016Q576j4566p0917
37720C4782l8113K3939r188p1658k9436N2202K3690o2280m6393L4447J4506q7404
37708a60906r7653L136O8646O3443Q7681J35841R3275k1557o3498j7312m387l6698
37696E0011j8919J6475m0451j02864J0197J85652J10205j77741k47854N0376K95639
37685A30726J35597j61132j47825J07140J88003j093j69223j49569p1954l8053
$$ plain form
37764 -34855 9577 25065 -45346 -152194 -223847 -263510 -305954 -331003 -292897 -203999 -121860
37753 -121860 -72973 -42509 -16777 7575 25496 555 -107861 -253625 -309738 -225233 -106283
37742 -106283 -71295 -98259 -94999 -42947 21429 89402 140736 102893 -34561 -147699 -149054
37731 -149054 -139408 -233225 -324811 -227749 12778 166903 154705 111689 120265 105699 34782
37720 34782 -3331 20608 11420 -60238 -89674 -37472 -13782 -76062 -122455 -88008 -73502 -160906
37708 -160906 -258559 -255423 -186777 -123334 -35653 100188 193463 171906 108408 91096 86709 50011
37696 50011 31092 47567 7116 -95748 -85551 100101 210306 32565 -215289 -164913 130726
37685 130726 266323 105191 -42634 64506 252509 251416 82193 -67376 -139330 -177383
37675a77383J4751Q7848O9861k9835o2754j3077l1507j32371j21481O5051J97602
37664a33295Q6319j20578j52934R116J58451J59300N6354n1333r8772n5069M4607
37653i7834R3787L4665n2629o3718k1033j4305m0715k2517M0644N9059o82o0157
37641a45435m4912K2356P1779P1773M0899J5038J7638L7104L6117L837k2993j6876
37629H6325k530r070k2989k9249m5520o8139n2606p528j9941j02196j18138J3223
37617c78358J46737J13495o7Q409J06569Q0595p7115j28764Q814J19962N6254
37606E6531l3303L231N4112k4650j32773j11337k1687L26P318J03554J85760R5244
37594A82326p6900j16436l9679l8807j28433j35134j9131P1371P0503O1271O5905
$$ plain form
37675 -177383 -162632 -74784 -4923 -34758 -97512 -110589 -142096 -274467 -395948 -330897 -133295
37664 -133295 -46976 -167554 -320488 -311372 -152921 6379 62733 11400 -87372 -142441 -97834
37653 -97834 -4047 30618 -22011 -85729 -106762 -121067 -161782 -184299 -143655 -84596 -85278 -145435
37641 -145435 -190347 -167991 -96212 -24439 16460 31498 49136 86240 122357 126194 103201 86325
37629 86325 83795 74725 51736 22487 -23033 -91172 -143778 -151306 -171247 -273443 -391581 -378358
37617 -378358 -231621 -118126 -118193 -109784 -3215 77380 265 -128499 -119685 277 56531
37606 56531 23228 26459 80571 55921 -76852 -188189 -209876 -209550 -202232 -98678 87082 182326
37594 182326 105426 -11010 -50689 -89496 -217929 -353063 -372194 -300823 -230320 -169049 -103144
37583a03144K3153j8689N2538J60276J07096p4283j27607R785R6059p508j11444
37572F232k9960J21673J41993M5283l0823m6957k9395K8152Q5298L1608j21334
37561B01770j83077n8104Q5342O9129l1536m3881K8370O5073M6681L6831L8148
37550B54746J6685j0463l4732j05419k04697j93429j4984J64112J62876L1890
37540F6585n0968l2458J0029K5021J3204k5752n8636j4899Q8728J25869M8587
37529A95310l5316n9277j00927j78605j49040L3366J62579Q7684k3837L3680J47028
37518A12645Q8603p6170j02335J5929O3612j6223p6078o5794p3839p9616K6031
37507a83235J62856J19054p2057j29456K6275J36609L6137q7857l9552O1082K4250
$$ plain form
37583 -103144 -79991 -98680 -46142 114134 221230 146947 19340 29125 125184 117676 6232
37572 6232 -23728 97945 239938 285221 254398 207441 178046 206198 291496 323104 201770
37561 201770 18693 -39411 45931 115060 83524 39643 68013 133086 179767 216598 254746
37550 254746 271431 260968 226236 120817 -83880 -277309 -292293 -128181 34695 66585
37540 66585 15617 -16841 -6812 18209 31413 5661 -52975 -67874 20854 146723 195310
37529 195310 159994 100717 -210 -178815 -327855 -294489 -131910 -44226 -68063 -34383 112645
37518 112645 201248 125078 22743 38672 102284 86061 9983 -55811 -129650 -209266 -183235
37507 -183235 -20379 98675 26618 -102838 -76563 60046 96183 8326 -31226 29856 54106
37496E4106o8398l4422O2216K3550j15632j26578K5465J09223l622j39890j07647
37485c21629J9766O3594L7575P9207J61265J11170p4045j71586p6437K1060m8388
37474a98448j41680n3568J02412O1432j28879j55032M5338J66938L5320j12335
37464c78502k6084J59722J68405J2098p7797j7220P2756R1652M4810l3202q6329
37453f9691m4132N4598N5746o9643j26635R425J65346J31075r348l9052L3390
37442I1079L6189m1541n8379o73M994n8695p0933N037P0126O2204J2310n6035
37430d317j28812j37180m3060N7805O2399J9110J3509n4p6437j08610P220J45323
37418a93104J25544J2573j3856J4648n1708j44886o2863J45905K13845P8136m2358
$$ plain form
37496 54106 -14292 -48714 13502 37052 -78580 -205158 -179693 -70470 -74092 -213982 -321629
37485 -321629 -301863 -238269 -200694 -121487 39778 150948 76903 -94683 -171120 -150060 -198448
37474 -198448 -340128 -393696 -291284 -229852 -358731 -513763 -468425 -301487 -266167 -378502
37464 -378502 -404586 -244864 -76459 -64361 -142158 -159378 -86622 5030 49840 16638 -69691
37453 -69691 -113823 -59225 -3479 -73122 -199757 -190332 -24986 106089 96741 57689 91079
37442 91079 127268 85727 27348 26675 31669 -27026 -97959 -92922 -22796 39408 51718 -4317
37430 -4317 -133129 -270309 -313369 -255564 -193165 -174055 -160546 -160600 -237037 -345647 -338427 -193104
37418 -193104 -67560 -54987 -68843 -54195 -105903 -250789 -313652 -167747 46098 124234 81876
37407H1876k3008J9605M423J0981N5989K4352q9263j25069l1395M6181L1093L3906
37395C9671J14961J57441P8175l5406q6395q4635m6809K8373N4359n6379j78367
37384a5011r8550J15911J65820p407j18152r919R9793J0945j35184j33587m5839
37373a71180k4177l9615j4395j0969o0607j5643J82634K95786J24321j31836j54505
37362b0186J584L2889j00289j44693j0213R6319M3036k8356K2368J09009R7837
37351I9305K2979q736Q154J4439n663m3269r8235j21958l0935J44292K34026J49192
37339C63591J6658k1470k6102j12738j90022q4467J15833J28522o7523j50381
37329b8099L2718J79619J0200k41913j76959J17119J99546r770j32349J3356J44195
$$ plain form
37407 81876 58868 78473 82896 93877 149866 174218 84955 -40114 -71509 -25328 5765 39671
37395 39671 154632 312073 390248 354842 268447 183812 137003 165376 219735 163356 -15011
37384 -15011 -113561 2350 168170 160763 42611 32692 132485 143430 8246 -125341 -171180
37373 -171180 -195357 -234972 -249367 -260336 -320943 -336586 -153952 141834 266155 134319 -20186
37362 -20186 -18602 14287 -86002 -230695 -240908 -144589 -101553 -129909 -107541 1468 99305
37351 99305 122284 113548 121702 136141 130478 87209 -11026 -132984 -163919 -19627 214399 363591
37339 363591 380249 358779 332677 219939 29917 -54550 61283 189805 122282 -28099
37329 -28099 4619 184238 194438 -47475 -224434 -107315 92231 82461 -49888 -36532 107663
37318A07663N0971n2721L5424J29003J9991j23120p6888J0487r9086k61107j67516
37307d26899J30708L18404L06208K44630J60562l1896k33649k49621j27205o5498
37297B5744n4715M7274J60722Q8627q3948r2693L9847M7547q6722j04417M4658
37286C1924J17338L3941J0329J44495K50790K06965J19174N3965n8769j84106
37276G26046j78173q0925p5060j28194m8472R7173N4969j04484m4954J98328J92823
37265F09077j36988l11475q7921J30141P175j55296J051K27824J11937j84974
37255B10551j89544J14443L13231K27870P3683J5416j8537p4869o4379M5899J55065
37244H08829J65181O0395j12544k48384k55267j86650j66615j55121p362J93327
$$ plain form
37318 107663 158634 105913 141337 270340 290331 167211 90323 100810 1724 -259383 -426899
37307 -426899 -296191 22213 328421 573051 733613 701717 468068 218447 91242 25744
37297 25744 -28971 18303 179025 267652 183704 91011 130858 178405 91683 -12734 31924
37286 31924 149262 183203 193532 338027 588817 795782 914956 968921 910152 726046
37276 726046 547873 466948 391888 263694 215222 312395 367364 262880 217926 416254 609077
37265 609077 472089 160614 72693 202834 210009 54713 55764 283588 395525 210551
37255 210551 21007 135450 448681 676551 750234 765650 747113 672244 607865 653764 808829
37244 808829 974010 1034405 921861 673477 418210 231560 64945 -90176 -97538 95789
37234I5789J64284j12267k83702j42167Q5814J49902J30146J54669J15025n6912
37224C00581j52703l4465P8949j6507j43931p5811N8336M3540j8310N1922J30638
37213B22239M1485o0585L3926J55147L0701k01841k10004k7545N7864L5245J08845
37202A85477K10099P5923k13301k63451J6754K57224J73483q3695k21126j54251
37192a6864J6456J47347J22399l3076j23195l4491O7849m576j43031j28158J62
37181a29178M9254K1591M3167O6493j8361q9406L0450K00230J44230p0954j37789
37170A09727k3130L3373m925N8787K04335J68254o7470j91663p0840O1498M0237
37159C18183M429N4178M6138q7214j50989k3725J10438O8242m8804p0444k5290
$$ plain form
37234 95789 260073 147806 -135896 -278063 -192249 -42347 87799 242468 357493 300581
37224 300581 147878 113413 192362 175855 31924 -43887 14449 57989 39679 91601 222239
37213 222239 263724 203139 237065 392212 422913 221072 11068 -16477 41387 76632 185477
37202 185477 395576 471499 258198 -5253 11501 268725 442208 358513 137387 -16864
37192 -16864 -408 146939 269338 236262 113067 78576 146425 141849 -1182 -129340 -129178
37181 -129178 -79924 -58333 -15166 51327 32966 -56440 -25990 174240 318470 247516 109727
37170 109727 86597 119970 115045 173832 378167 546421 478951 287288 216448 277946 318183
37159 318183 322612 376790 422928 335714 184725 161000 271438 339680 290876 220432 195142
37148A95142n139K2083P8132N4165q7459j74331p6998O5490O8020k996L1963J45031
37136C13103J49600J4742q8634o2729j8593p7923j74357j53406m491J20537J17354
37125A35203M5821q293o6633j40425r9253J36851L44292K15044j56526l17043
37115H9038q0683K03991J83124j5534p1626K1755M8550l1559q9601r2038p7807
37104H7610m655J22766J31305m4887j55759j1967J35834k7510l11991k79167M8981
37093c09440K25217Q4439p1481l2037M4808J4731j1985M6606P3997R060l6679
37082C7236k9329q0426j64748q3731J71144L26473K32632O6610p477p4299j92384
37071B01701j87497M3962K68711K14689l3552j80504j36799o1022o2835q0164
$$ plain form
37148 195142 190003 212086 290218 344383 256924 82593 5595 71085 139105 136109 168072 313103
37136 313103 462703 477445 388811 326082 307489 229566 55209 -98197 -102688 17849 135203
37125 135203 181024 172731 106098 -34327 -133580 3271 347563 562607 406081 89038
37115 89038 8355 212346 395470 379936 308310 330065 378615 347056 257455 165417 87610
37104 87610 82955 205721 337026 292139 136380 124413 260247 232737 -79254 -358421 -309440
37093 -309440 -84223 216 -71265 -103302 -58494 -43763 -55748 -9142 64855 73915 37236
37082 37236 7907 -72519 -237267 -320998 -149854 176619 409251 475861 468384 394085 201701
37071 201701 14204 58166 326877 541566 508014 327510 190711 129689 66854 -13310
37061a3310l8852K8564N1921K0648j9241l1123k6874k7782l975Q0286J53897Q9218
37049B63377q1938j48914j8608J29860J29014Q3077J40416J79923M515k67220
37039D13502l16627r2166J29226J44116K5542q1927j25601q4591L4641J23904
37029A70019Q2272j1095j5390K6841k2771j13909n8565J44262K73671J94686M436
37018F74457j33620j33819L892J68792J83348L2990n0745Q5298K55719K25006
37008A311318Q5350O3696J18229O2739n0863m7525p442j25740k84935k02023M7900
36997I70704J07390p1384j68926o5296j607r3224j34674k3865M0228m7317q6650
36986D25379N0059J68798Q4534q5501j53140j34321j15633o7805M1186J26973
$$ plain form
37061 -13310 -52162 -23598 28323 48971 29730 -1393 -28267 -56049 -60024 20262 174159 263377
37049 263377 181439 32525 13917 143777 272791 355868 496284 676207 680722 413502
37039 413502 96875 4709 133935 278051 303593 221666 96065 11474 46115 170019
37029 170019 252291 241196 225806 252647 229876 115967 57402 201664 475335 670021 674457
37018 674457 540837 407018 410910 579702 763050 796040 745295 830593 1086312 1311318
37008 1311318 1396668 1460364 1578593 1641332 1590469 1542944 1535502 1409762 1124827 922804 970704
36997 970704 1078094 1006710 837784 772488 770881 677657 542983 519118 559346 512029 425379
36986 425379 475438 644236 728770 643269 490129 355808 240175 172370 213556 340529
36976C40529J14944M0265m5379j13975r5008M1486J46554O1175r7542p7823R7172
36965D12398J54060J0277j16745q1668N44j30n2044q3473o4539L7094J77309J75995
36953E69078k2530j46544L4666K74622J76667j53423k48482k3864J25098m535
36943E80753j58085j24226l0321j178N3864J61773J67340L4311o2557m4864k0278
36932E56532k0652K3864M7505n6268j36903O790J79615L4370k80487k77321N9396
36921A36441K25713L2822j40204o1041K1831m8952n2383R2281J16042l7758l4756
36910B50036J95366K36245o4020k39887L110K47291P5908k18894j66719J06020
36900D24456J82838O4083K4324N9828q135j08413n9953N0300K5750p9387r6300
$$ plain form
36976 340529 455473 495738 450359 336384 241376 282862 429416 490591 393049 315226 412398
36965 412398 566458 576735 459990 378322 378866 378736 326692 243219 178680 215774 393083 569078
36953 569078 546548 400004 434670 709292 885959 732536 484054 460190 585288 580753
36943 580753 422668 298442 268121 266943 320807 482580 649920 684231 621674 576810 556532
36932 556532 535880 559744 607249 550981 414078 420868 600483 634853 354366 77045 136441
36921 136441 362154 394976 254772 193731 215562 166610 114227 206508 322550 284792 250036
36910 250036 445402 681647 617627 377740 380850 628141 704049 485155 318436 424456
36900 424456 607294 671377 695701 755529 747394 638981 579028 629328 655078 575691 479391
36889D79391n1827m5752k3506O0619Q1192j1084l8127P1051Q8766j11348k73428
36878B25947j63498M6850R9375O3028J19263J97759J38833M5p2456q0403o9536
36867E05207q862N7880m068j44189j30760M6138J21515K1563j9217O4262L2073
36856E41542j51945j73177N7435J91448N6633m3328P4116J19877q4260k17928
36846C70413m5610J34118M2867p5535M6087J79368N4525j16700n7837N4284k5241
36835E60739j10882L5019K08854J39379j0635Q286M8626r6035k31700j18242O9219
36824E02628R0325Q1171J93932K01293n2078k21407j4867K34947J17816j33785
36814I99975q2365J22972N3931j93588j83744P6035J83847M3668o4323j8915M2769
$$ plain form
36889 479391 427564 381812 358306 418925 500117 489033 450906 521957 610723 499375 225947
36878 225947 62449 109299 208674 271702 390965 588724 727557 727602 655146 574743 505207
36867 505207 496345 554225 550157 405968 275208 321346 442861 464424 445207 509469 541542
36856 541542 389597 216420 273855 465303 521936 478608 552724 672601 588341 370413
36846 370413 324803 458921 501788 426253 472340 651708 706233 589533 531696 585980 560739
36835 560739 449857 484876 693730 833109 822474 830760 879386 783351 551651 433409 502628
36824 502628 592953 674124 868056 1069349 1017271 795864 780997 1015944 1133760 999975
36814 999975 917610 1040582 1094513 900925 717181 793216 977063 1020731 956408 937493 980262
36803I80262P2140J21034J14779j3362j06024k4399R0883R2539R4194J79439J79379
36792A780864N2339R7815M33282O62437M56720O1767j69483l07395m87869m99942
36782B080535k18171M581j12418k65254j11149J16442O9924p8438k4154P2596
36772A534494m7594j82188m7758J52261R8702o4340m7031N6499N0293N9533K00462
36761A763333K42721M8104j02618l3137o486j44657j22970J41110J91808j10423
36751A866785k13990J18460K80634q0308l38282L07L65435J52468j95404o6983
36741A889122J91771L0488k15072k5080K47806P8202j77128J9999L18501J63289
36731B521898j26980j4659K13480R3444n2092J64957K96794n5066k97788R7153
$$ plain form
36803 980262 1052402 1173436 1288215 1274853 1168829 1144430 1235313 1327852 1422046 1601485 1780864
36792 1780864 1833203 1931018 2364300 3026737 3483457 3545224 3375741 3068346 2580477 2080535
36782 2080535 1862364 1866945 1754527 1489273 1378124 1494566 1564490 1486052 1461898 1534494
36772 1534494 1486900 1304712 1256954 1409215 1507917 1443577 1396546 1453045 1503338 1562871 1763333
36761 1763333 2006054 2054158 1951540 1918403 1911917 1767260 1644290 1785400 1977208 1866785
36751 1866785 1652795 1771255 2051889 1971581 1633299 1633606 1999041 2151509 1956105 1889122
36741 1889122 2080893 2111381 1896309 1871229 2119035 2197237 2020109 2040108 2358609 2521898
36731 2521898 2394918 2380259 2593739 2687183 2635091 2800048 3096842 3041776 2743988 2841141
36721B841141M98595K48364p4374K20747N58213K11788k32352J0605L81266Q7977
36711D751970k92137M6342M70761J14967l39946P1630O52689L10717l16285n4917
36701E415791N60993L85534q4294K23418P38349M13228n0643M41621J043575N45323
36691I632895p0491N91158J469471R73723K11593R73295K134200J740728R80727
36682A8637299K008527L576125L350272K755810M460413O936566P223729P109139
36674E6057880J0061568J4187821J5887753J8131411K5740221L5100423M1042921
36667B16209998N1693425P7805676J03262947Q8383299J8371556o6604613j09571301
36660C79550987r7290007o4420212m3950250l6317611k8373382j9027935j4587298
$$ plain form
36721 2841141 3339736 3588100 3513726 3734473 4292686 4504474 4272122 4282727 4663993 4751970
36711 4751970 4459833 4506175 4976936 5091903 4751957 4823587 5476276 5786993 5470708 5415791
36701 5415791 5976784 6362318 6278024 6501442 7239791 7653019 7602376 8043997 9087572 9632895
36691 9632895 9562404 10153562 11623033 12596756 12808349 13781644 15915844 17656572 18637299
36682 18637299 20645826 24221951 27572223 30328033 34788446 41725012 48948741 56057880
36674 56057880 66119448 80307269 96195022 114326433 140066654 175167077 216209998
36667 216209998 267903423 345709099 448972046 537355345 555726901 489122288 379550987
36660 379550987 282260980 217840768 173890518 137572907 109199525 90171590 75584292
36653G5584292j3769971j0926458o749884n443349o065364m882096k591911k286183
36645B2869076l221049k607412j082959j101266k029787j609549m07174m85321
36637A0324559j315543r92521j3857j56411r40219o66908K27318R2228p46142
36628E812504p34042n3679l1442m91135l19594J89845J2213m52106k05375K60166
36618C987355o6649n97793k17125M74701K20647m95606l65476K78902J85773l88944
36608C015785k52459L75858L38628j79238n2451N53037N09465p3846p8520M84440
36598D640699N93255K33275L22404Q17514Q28016M65558O87702J420927J705364
36589A1714714J599686K068120L072159L716133M210087N514432O812036N621312
$$ plain form
36653 75584292 61814321 50887863 44137979 38694630 32629266 27747170 25155259 22869076
36645 22869076 19648027 17040615 15957656 14856390 12826603 11217054 10809880 10324559
36637 10324559 9009016 8016495 8002638 7846227 6906008 6239100 6466418 6558646 5812504
36628 5812504 5078462 5024783 4993341 4502206 4182612 4372457 4384670 3932564 3727189 3987355
36618 3987355 3920706 3322913 3105788 3580489 3801136 3305530 2940054 3218956 3404729 3015785
36608 3015785 2763326 3139184 3477812 3298574 3246123 3799160 4308625 4234779 4156259 4640699
36598 4640699 5233954 5467229 5789633 6607147 7435163 7900721 8588423 10009350 11714714
36589 11714714 13314400 15382520 18454679 22170812 26380899 31895331 38707367 44328679
36581D4328679J229505l812343o536141o480404n065029l514829k342983j735825
36573A6070630j432090q77904p5955L90303M63972Q27999J689462K401322K759790
36564B2217529L552786N039542N808721M182340L57197l628421n850948n919418
36556B5759328m735062l431983k567730k025386j532664j129824r90016r95679
36548H350984q56744n51462k96894j74909j21580j48340k30285j70084N4537O6376
36538E921599l50969p65180o89009l61495l29276n25782m67537j67907r8406l22641
36528A843397m03731j79774L5827O3588O0238P6381k4017j73012j51606l5359
36518A111932q2506k10834j09097J64455K30220K0332j50226j34212q4465o0608
$$ plain form
36581 44328679 45558184 41745841 35209700 28729296 23664267 20149438 17806455 16070630
36573 16070630 14638540 13760636 13684681 14074984 14538956 15366955 17056417 19457739 22217529
36564 22217529 25770315 30809857 36618578 40800918 41158115 37529694 31678746 25759328
36556 25759328 21024266 17592283 15024553 12999167 11466503 10336679 9346663 8350984
36548 8350984 7494240 6942778 6645884 6470975 6349395 6201055 5970770 5800686 5855223 5921599
36538 5921599 5570630 4805450 4116441 3754946 3425670 2899888 2432351 2264444 2166038 1843397
36528 1843397 1439666 1259892 1295719 1359307 1419545 1495926 1471909 1298897 1147291 1111932
36518 1111932 1029426 818592 709495 873950 1104170 1124502 974276 840064 755599 694991
36508F94991K2166Q9355N604r3156o636J17410M5368m5280J30436L47744J77423
36497A485425k26511l09075j8538J43305k7033j87316j09228K4405P2632J40446
36487I88512K41538K42255J88534K30791K37323l1568m04075m74762k64757j59127
36477G94664k21992j58886M5956P2195j05265j33395P0881J62111j6820j91394
36467C18055j66308q6588n6697L4887J82211J87081L3336n8840k5295k1201o6649
36456B73992k9082M3047j1746r4090J4630J83844R7578j57695j99489j5604M0771
36445A46156p9967n6555J58129K30927P7502N695J12395J17426n9465j24481K4825
36434E52587J10007K0216J0821J69754K18075M7638n3300Q1607K49454L40055
$$ plain form
36508 694991 717157 806512 812116 718960 712324 829734 875102 829822 960258 1308002 1485425
36497 1485425 1258914 949839 931301 1074606 1047573 860257 751029 775434 848066 988512
36487 988512 1230050 1472305 1660839 1891630 2128953 2097385 1693310 1218548 953791 794664
36477 794664 572672 413786 459742 531937 426672 293277 364158 526269 509449 318055
36467 318055 151747 65159 8462 43349 225560 412641 445977 387137 361842 340641 273992
36456 273992 244910 287957 276211 182121 196751 380595 478173 320478 120989 105385 146156
36445 146156 66189 9634 167763 398690 476192 481887 594282 711708 652243 527762 552587
36434 552587 662594 682810 693631 863385 1081460 1129098 1075798 1157405 1406859 1746914
36424A746914N20440P37282N81426m9424o38733p28044m87501l12043k58002j96702
36414I15613j54354j69870j18410M1789J22966L2428m7439L14K0110q9980j68887
36403C84280j05402l8960n9456l3663Q5664J17773P805l1674O8503N4994j80634
36392B69230l25425j21722K03426K86898J33877j6515q5493j27751j14521j4051
36382H7953O7115M2199Q46L8809Q8225O3841J4733Q25j8913o6880p6040k0147
36370B22566L9806P5029Q8594J7399j52992k36228q4983R3295P767k01573j48489
36359b79809J36336K25375J4277j14981K9038J49653M2125n1303N9267J34357
36349C44335m1524k39240j75329J4682M7257m1948l8124O7012J28574J11314O3753
$$ plain form
36424 1746914 2267354 3004636 3586062 3536638 2897905 2169861 1682360 1370317 1112315 915613
36414 915613 761259 591389 472979 514768 637734 670162 622723 623037 643147 553167 384280
36403 384280 278878 239918 180462 146799 232463 350236 358041 326367 394870 449864 269230
36392 269230 -56195 -177917 25509 312407 446284 429769 344276 216525 102004 87953
36382 87953 155068 197267 198113 236922 325147 388988 403721 404546 385633 318753 242713 222566
36370 222566 262372 337401 425995 443394 290402 54174 -30809 62486 70253 -131320 -279809
36359 -279809 -143473 81902 96179 -18802 10236 159889 202014 150711 209978 344335
36349 344335 302811 63571 -111758 -97076 -49819 -91767 -129891 -62879 65695 177009 240762
36338B40762l418m2386L4951J56388J20194o2941j37107k1864N3827k9817q0448
36327B28141K2265R3366n977j20043j07647p3187r0907l6465J05499J20804l4237
36316A01612q4278Q2305J76421K2498r8737N1756K23602J10484j17358j32371
36306C35934o238j2841j15204q6920L5673M3928l0680J5577J65309K00073O0138
36295F04749r8211j55120j15552j7092P1651N7273l6106o5617j0280j2006q4144
36284A39545n3410Q5434Q7916r5370j57893M7478K11499Q1953r8443k3568J50425
36273C75566J17135l9891n4269K2409k8083j37758r0774M4787M5506m3748k0175
36262A90705O8142K3183j02785r8405J0325L0388k4784k111M6836l1820j34687
$$ plain form
36338 240762 237344 194958 229909 386297 506491 443550 306443 284579 338406 308589 228141
36327 228141 250406 343772 337795 217752 110105 36918 -53989 -90454 15045 135849 101612
36316 101612 17334 99639 276060 298558 199821 251577 475179 585663 468305 335934
36306 335934 329696 316855 201651 114731 150404 194332 163652 179229 344538 544611 604749
36295 604749 506538 351418 235866 218774 290425 347698 311592 245975 235695 223689 139545
36284 139545 86135 171569 259485 164115 6222 53700 265199 347152 248709 225141 375566
36273 375566 492701 452810 398541 420950 392867 255109 164335 209122 254628 210880 190705
36262 190705 258847 282030 179245 80840 91165 121553 96769 94658 141494 109674 -25013
36251b5013l7832J69891J88865R791q2713j951L6412o4348j27835m9791K7442
36240D2918j0565o6060k3338P7610J41351J33771O0968l7055p6929l4314m337
36229B04020m2122m6898M7931J06027L20j43624j35049j9114M0182M6538R1492
36218A49703J16222K2535q9609o6904K1444K3249j279Q1670J65530O0396j26055
36207C56902j16658P5009J60188L4986j06388j23343q0630l0314O1314J38283
36197C69349P9424o7396j19950m6960J3963J7271M3413Q0507K6634q5557j09096
36186B01602k9373L7019O6855J15505J20856p526j41283p4094J08987J21103o1501
36175D58150j59737o0368J9345o6549j50397o3350P6805O7716p8565j91326j59470
$$ plain form
36251 -25013 -62845 107046 295911 305702 222989 221038 257450 193102 65267 15476 42918
36240 42918 32353 -33707 -57045 20565 161916 295687 356655 319600 242671 208357 204020
36229 204020 161898 115000 162931 268958 269278 125654 -9395 -28509 11673 58211 149703
36218 149703 265925 288460 198851 131947 153391 176640 175361 257031 422561 482957 356902
36207 356902 240244 315253 475441 510427 404039 280696 200066 169752 231066 369349
36197 369349 448773 381377 261427 214467 228430 245701 289114 369621 396255 310698 201602
36186 201602 172229 209248 276103 391608 512464 504938 363655 289561 398548 519651 458150
36175 458150 298413 238045 257390 190841 40444 -22906 53899 121615 43050 -148276 -307746
36164c07746M298J93232K49769J14595n1387n3937L6672j3921k03693k53958l4193
36153c20269K24441K56391R6344m2076n5893O768O9931Q3449M0789N470L5714
36142D01059O6417j6801j77957k48248j63792l8077L0057O8556J12293J19133
36132A52640O5774J0238M526L2027N7401O0830K4780l4656n0209N2L2686j0098
36120C45991n0735j4643K5375q013k5703O8264J58770Q3616p8369j19770k2104
36109C62679P8533J46505K05954J61940k7102j18895R8572L73351L18568R2320
36099A692425J98909O21808Q23382P45350J027224J805570K046669Q45172j072166
36090H734343k046030j537614n87185j50678P9487P34735J418154J126339k33541
$$ plain form
36164 -307746 -303448 -110216 139553 254148 202761 148824 185496 171575 -32118 -286076 -320269
36153 -320269 -95828 160563 256907 214831 158938 165706 235637 319086 359875 365345 401059
36142 401059 467476 450675 272718 24470 -139322 -177399 -147342 -78786 33507 152640
36132 152640 218414 228652 233178 265205 322606 383436 408216 373560 323351 323403 356089 345991
36120 345991 295256 280613 305988 297975 272272 340536 499306 582922 504553 384783 362679
36109 362679 441212 587717 793671 955611 928509 809614 908186 1281537 1600105 1692425
36099 1692425 1891334 2513142 3336524 4081874 5109098 6914668 8961337 9806509 8734343
36090 8734343 6688313 5150699 4563514 4412836 4492323 5227058 6645212 7771551 7538010
36081G538010j542988j799148j174434n25710l05267l31217l48312l41644l32217
36072H37073k53469j25538q5319j41487j19907M2712J60825Q4189p1848j28496
36062A98735r8089o8344j723J46225K47026J62445j1739q3915o2904r0179j49949
36051A87589r8582M8159J10950M3176r31O2992J17815N1500p5063j42467j23921
36040A81217n8007K1801P6960O9580J7406k2306l4669m6881n2249r724Q0090J58540
36028C81758J66241Q6269l7847j08193o2275K4229K0505n3620m3076P7605J27244
36017E78840m059j70548j85705p0433L5518O3555L787j37490k52885j79557N4063
36006b64914K13026J91898J41885J54778J01962n8967j29338k2434M8813l2244
$$ plain form
36081 7538010 5995022 4195874 3021440 2495730 2190463 1859246 1510934 1169290 837073
36072 837073 583604 458066 372747 231260 111353 154065 314890 399079 327231 198735
36062 198735 100646 32302 30579 176804 423830 586275 574536 490621 427717 337538 187589
36051 187589 89007 137166 248116 291292 290361 353353 471168 522668 447605 305138 181217
36040 181217 123210 145011 221971 291551 308957 286651 251982 205101 152852 143128 223218 381758
36028 381758 547999 634268 596421 488228 425953 450182 470687 417067 373991 451596 578840
36017 578840 574781 404233 218528 148095 183613 247168 250955 113465 -139420 -318977 -264914
36006 -264914 -51888 140010 281895 436673 538635 479668 350330 327896 376709 344465
35996C44465m4067J48002K86393J65026J6797R5370K34204K11016J66512K52281
35986A875999L17256M06878R77628J930980K073122N59056j545246k327234j482318
35977B786121m90149l56486n11367k44304Q7777n5609l57665k92025n2306o4079
35967D49908j65500m785K27473J51505j00515j53578k9806K4948L4200J12969
35957E46819J22499k9411q5394J10257K30616Q093k37706j27309J16693R4096
35947G49253n9218J6762K15601K13864J16175K13988L79422L69857M71408J077941
35937C765053J780070J661538N26209q10669j484288j308678o19181O3118L08640
35928C881812K57227O23869J627279K253247J473334o0611o98773j72166K4532
$$ plain form
35996 344465 300398 448400 734793 899819 916616 1011986 1246190 1457206 1623718 1875999
35986 1875999 2193255 2600133 3577761 5508741 7581863 8140919 6595673 4268439 2786121
35977 2786121 2295972 1939486 1428119 1183815 1271592 1215983 858318 566293 513987 449908
35967 449908 284408 279623 507096 658601 558086 404508 374702 399650 433850 546819
35957 546819 669318 639907 554513 664770 895386 903479 665773 538464 655157 749253
35947 749253 690035 706797 922398 1136262 1252437 1466425 1845847 2215704 2687112 3765053
35937 3765053 5545123 7206661 7732870 6922201 5437913 4129235 3510054 3573172 3881812
35928 3881812 4139039 4762908 6390187 8643434 10116768 10056157 9357384 9185218 9209750
35919I209750j005867k140706j971545q79201k81718n19268o98607l24004Q7749
35910A476583N4152j74895k02846o4477N7780J65733K33327Q9662k34439l95669
35900A004911k19807M105l9976k24392k24527l9546N0037n0290j33683m8836Q9500
35889A67496J20920O9029L6283J4390o1217j56915j81870j33569p3118J937J16065
35878h0569J80348P8390j04131j31598M4560J93126J37413o651n1896j7303j7892
35867B23797l4066J4751Q7194J06579J25278K04420K32364Q2355j32790j94087
35857G15795j00448k8133k5369N144O2701N2367J5121Q6367K21082K28851R7311
35846A330789P23l8647j82917m03794m15510j31144J27946Q8020q1086p4665O8015
$$ plain form
35919 9209750 8203883 6063177 4091632 3212431 2930713 2411445 1712838 1388834 1476583
35910 1476583 1530735 1355840 1152994 1088517 1146297 1312030 1545357 1635019 1400580 1004911
35900 1004911 785104 789209 749233 524841 300314 260768 310805 260515 126832 77996 167496
35889 167496 288416 357445 393728 408118 346901 189986 8116 -125453 -198571 -196634 -80569
35878 -80569 99779 178169 74038 -57560 -13000 180126 317539 310888 258992 241689 223797
35867 223797 189731 204482 291676 398255 523533 727953 960317 1042672 909882 715795
35857 715795 615347 587214 561845 566989 629690 682057 697178 783545 1004627 1233478 1330789
35846 1330789 1331512 1292865 1109948 706154 290644 159500 287446 375466 294380 219715 287730
35835B87730Q7791m2960j03271N372J47008K00268J86793J36292K5751j10160
35825H20614j76690j69694j82743k22315j64586L1816K02096J73328K041j04140
35815B09727o2173N111l1961j29345j37728p79J71159K19017R7800q0434j58898
35804A01496r4102R272L9487K1021N0852J14315Q7942m0509j03617q682Q2587
35793B60062k452j41018q4722J25680J91624J8152j39293p8193O1104N5218o6020
35782B00142j18468m2903P6070J48203J11665l9834j66856q9874J15921J45844
35772C39910q2046k51312j16144J16234J33912N059j4650M5051k5025j69504j40805
35761a59320M4359J18521K2701k7595M3551O3125k8676o0484L5220R3824L1104
$$ plain form
35835 287730 375521 332561 229290 234662 381670 581938 768731 905023 930774 820614
35825 820614 643924 474230 291487 69172 -95414 -63598 138498 311826 313867 209727
35815 209727 147554 152665 120704 -8641 -146369 -147148 24011 243028 340828 260394 101496
35804 101496 7394 16666 56153 77174 128026 242341 330283 289774 186157 177475 260062
35793 260062 257610 116592 31870 157550 349174 367326 228033 149840 210944 266162 200142
35782 200142 81674 38771 114841 263044 374709 334875 168019 78145 194066 339910
35772 339910 257864 6552 -109592 6642 140554 145613 130963 176014 150989 -18515 -159320
35761 -159320 -114961 3560 26261 -1334 42217 105342 76666 16182 51402 145226 176330
35750A76330j8288J3808m25j04678j36670k8996M6581l801r225J40660K40297
35739C15593Q0916j80839k27853k8435J58921J47385q047j48007j59484l1343
35729h1193J26264J65084P3865p552j205N727n8141j11014o7849Q595L0011L4890
35717A17482Q6674J23808N1269q9760j65348j14178J1595J14391J08151j3943
35707B30141j30662j10101L120N0135J6741L9379J18031P0445j26625k17676o3807
35696a20879R8550L3460r1808Q825K29748K22673k5150j59626l1258Q2888m6573
35685B00850k33670j93852J2524J11248M5105R98N5568O0143o8970j66982o3044
35674b40082J34940J74889K0377j10882p6058J4272K3217J6603J11334K21408
$$ plain form
35750 176330 158042 171850 171425 66747 -69923 -98919 -52338 -56139 -65364 75296 315593
35739 315593 396509 215670 -12183 -40618 118303 265688 257641 109634 -49850 -81193
35729 -81193 45071 210155 284020 276468 275263 280990 222849 111835 43986 52581 82592 117482
35717 117482 204156 327964 379233 289473 124125 9947 21542 135933 244084 230141
35707 230141 99479 -10622 -7502 42633 59374 98753 216784 287229 160604 -57072 -120879
35696 -120879 -22329 11131 -80677 -71852 157896 380569 355419 195793 164535 247423 200850
35685 200850 -32820 -226672 -214148 -102900 -57795 -56797 -1229 58914 -10056 -177038 -240082
35674 -240082 -105142 69747 90124 -20758 -96816 -82544 -59327 -42724 68610 290018
35664B90018J64060k8544j20778j8818Q9782J6018j62293k17262o7237J38535
35654H3481J96238N9531j09846j10188N5740J63892O4311r9006r6720M5427J09413
35643C62273L6329j9044J6555L2707k3433m1933K8519O9439M760p0318p5382p1780
35631B48692j00373q3670j915K6238l9670o0720L4476J04195M3565k6652Q499
35620A52665M5988j9948p4838j508P3123L502q0773M764J37738P1771j24511j55460
35608C2513K3479J56487J15163M4759L9814p542j36545j78372l4876J24093J07102
35597B86075j4785l4595Q1717J63332P2438j28223k44582j51728P1060K17531
35587C18240J83177O3236j6038o4433j30240j46053l4307J05438J04706j1051
$$ plain form
35664 290018 454078 425534 304756 285938 375720 391738 229445 12183 -55054 83481
35654 83481 279719 339250 229404 119216 174956 338848 403159 304153 207433 252860 362273
35643 362273 398602 379558 396113 428820 405387 363454 391973 461412 466172 395854 320472 248692
35631 248692 148319 64649 62734 88972 49302 -11418 23058 127253 170818 144166 152665
35620 152665 198653 178705 103867 102359 175482 178984 98211 102975 240713 312484 187973 32513
35608 32513 55992 212479 327642 372401 412215 404673 268128 89756 54880 178973 286075
35597 286075 271290 236695 318412 481744 554182 425959 181377 29649 100709 318240
35587 318240 501417 564653 548615 484182 353942 207889 173582 279020 383726 372675
35577C72675o0436K203L3125m0073j01851n4609K7825L4226k7041p9406q1566
35566B5072k5932O5720J07888K4010j10555j21447K0122J31345O3538j01125j79115
35555a00479j13865J1921J10813J44219R7963l317q0227o4801K1221Q7171O4138
35544A74757l4654j23427j14816j0513Q7068Q7648J9667j9090P913N1989O4514
35533A91056M2097j94m1936n5638l8231j9805m990M1033J03941J01537K3615j3291
35521C29194M6181P5252j5302o3064J12321L44619K80069r3561l72211k76866
35511C66632n125J01258J0896p2271o6979n8176o4175M565J46040K08683R4643
35500F65991q9149j54638n3638Q8191J42268J19051J05873J10392N6213o0894
$$ plain form
35577 372675 312239 314442 347567 307494 205643 151034 178859 213085 186044 106638 25072
35566 25072 -860 64860 172748 196758 86203 -35244 -15122 116223 179761 78636 -100479
35555 -100479 -214344 -202423 -91610 52609 150572 147255 67028 2227 23448 110619 174757
35544 174757 140103 16676 -98140 -108653 -21585 66063 85730 66640 74553 126542 191056
35533 191056 233153 232959 191023 135385 97154 77349 72359 113392 217333 318870 342485 329194
35521 329194 375375 450627 435325 372261 484582 829201 1109270 1015709 643498 366632
35511 366632 361507 462765 473661 401390 334411 276235 212060 216625 362665 571348 665991
35500 665991 576842 422204 368566 456757 599025 718076 823949 934341 990554 929660
35490I29660j28656r1690n4410j06581j57120q9206J7995J5133m3830J2065J45031
35479D48391J36751l4960j27212k2035Q5606K3909q2574n5698L9496N4398K9322
35468D95394O8928R6925j253j02923n662J93957J81356r5108l02326j70156J57823
35457E16955L39167K40366J1951j32227j03592K1813P5557l7439k05189k11707
35447E15655m934K28226K96284K12265J05737K7120o0647j58894k08103j67510
35437G85199n3708P4992J28093L6587j31284j74666R330K44083K60210N3966r8180
35426A134622k2252J19563Q4689r2758j69003n5236P1488M2902p4577j07769k3985
35415I07684N3601L2062m1938n9356J7664J12653J12242r222j46180j67503o1409
$$ plain form
35490 929660 801004 709314 654904 548323 391203 301997 319992 335125 291295 303360 448391
35479 448391 585142 550182 422970 400935 486541 510450 427876 372178 411674 466072 495394
35468 495394 564322 661247 659994 557071 551409 745366 926722 831614 529288 359132 516955
35457 516955 856122 1096488 1108439 976212 872620 894433 969990 932551 727362 515655
35447 515655 510721 738947 1035231 1247496 1353233 1380353 1319706 1160812 952709 785199
35437 785199 731491 806483 934576 971163 839879 665213 674543 918626 1178836 1232802 1134622
35426 1134622 1112370 1231933 1316622 1223864 1054861 999625 1071113 1114015 1039438 931669 907684
35415 907684 961285 993347 951409 892053 909717 1022370 1134612 1125390 979210 811707 750298
35404G50298O0613R7868M8704l0839q9569r0650k7688M4208N3341O666k1075k277
35392G99600J7276J5740J9898J4165n5299j46769j28047J6980J23333P8927j0242
35381G45562m427M9337K4019o9550j27991j28553j01735j9834J21294J96414J11067
35370G95603r960P820J02852Q2527m5165r6269m0439l5149j14796j20329L79Q3877
35358F10951L8128l936N9150J07391J5764j23385j54764q9944l1062P697N4427
35347D90417O4290m823q3208p9412j0746M9399P3992N3602l2066j27229r8896
35336B95320P0785J96939J16152q8068j99404j34816J0399J16111J32488P3562
35326E89468J783j9395k849q709k4062J9877Q9326N5496q6717j69449j00544J074
$$ plain form
35404 750298 810911 908779 957483 926644 837075 746425 718737 762945 816286 822952 801877 799600
35392 799600 816876 832616 852514 866679 811380 664611 536564 553544 676877 755804 745562
35381 745562 741135 790472 814491 744941 616950 488397 386662 366828 488122 684536 795603
35370 795603 785643 793463 896315 978842 933677 837408 796969 761820 647024 526695 527074 610951
35358 610951 649079 645143 704293 811684 827448 704063 549299 459355 428293 435990 490417
35347 490417 554707 549884 466676 387264 376518 425917 499909 553511 521445 394216 295320
35336 295320 366105 563044 679196 591128 391724 256908 267307 383418 515906 589468
35326 589468 591251 571856 569007 560298 536236 556113 645439 700935 614218 444769 344225 345299
35314C45299J3312j4056m796l412m1454k7372P3797J16619P376r9216l3725J03865
35302D36237J11915J0593l6533j6715l6555p7497l5120M9012L8104m9733p0235
35291C23473m852L3924J7475K106m5072j82143k86491j76272O7852J74720R3152
35280A7872M6016J28067J52681O742j28043p3738N9523P7865M811k1442m317l2279
35268B33758o4931J2151J56501J79610O903k05316k55497j22372M0112R8474P8843
35257A58236Q7094J26274Q4537o6899j78808j23978N293L7354j9811k9742J8232
35246I7782P053p2361r5105l4595j6462q8928j28950m8467P3631J38324J49787
35235a8291J26059M5842m4919l5808O0139Q4684j4956q6225k4870M9326M439q0343
$$ plain form
35314 345299 358611 344555 339759 336347 294893 267521 341318 457937 465313 366097 332372 436237
35302 436237 548152 558745 522212 505497 468942 391445 356325 405337 443441 393708 323473
35291 323473 318621 352545 370020 372126 327054 144911 -141580 -317852 -250000 -75280 17872
35280 17872 63888 191955 344636 351378 223335 149597 209120 286985 291796 270354 266037 233758
35268 233758 168827 180978 337479 517089 523992 318676 63179 -59193 -19081 79393 158236
35257 158236 245330 371604 456141 389242 210434 86456 91749 129103 109292 79550 97782
35246 97782 104835 32474 -62631 -97226 -113688 -202616 -331566 -380033 -306402 -168078 -18291
35235 -18291 107768 153610 108691 72883 133022 217706 202750 116525 91655 140981 145420 65077
35223F5077o5479J0436J9402k9963l0570K8959O9427P0052O8867N7224O545l6603
35211B33374q224M9049L9056k9193m8608K0431Q6090M5349q6849j83439j25962
35200h926O5458K26845K17889P9651m3343j03686j53083j71287p5324P5647R1927
35189B01768m7906j12912L8175K19430J89001l168j30556j21276o6802l946Q8573
35178B50381J41202O2704p0804r6814j9643Q965m7051o2493J4317P4032M3121
35167B97917k523O317O505p2707j63754j44326j4884R5534R2328K7587K6634J16572
35155B71200J72397P8343r3702j65697j07551p1561j32569j55017k1882J50863
35145g5176J78746P9053J2765L5477P0340O9568M2874k5566j33618j83718j05052
$$ plain form
35223 65077 -402 10034 29436 -527 -31097 -2138 67289 137341 206208 263432 269977 233374
35211 233374 225150 274199 313255 284062 235454 255885 341975 387324 300475 117036 -8926
35200 -8926 56532 283377 501266 580917 537574 433888 280805 109518 34194 109841 201768
35189 201768 153862 40950 79125 298555 487556 484388 353832 232556 165754 161808 250381
35178 250381 391583 454287 383483 286669 267026 275991 228940 166447 180764 254796 297917
35167 297917 295394 301711 308216 235509 71755 -72571 -87455 8079 100407 127994 154628 271200
35155 271200 443597 521940 428238 262541 154990 83429 -49140 -204157 -226039 -75176
35145 -75176 103570 182623 195388 230865 301205 370773 413647 388081 254463 70745 -34307
35134c4307j640j3198q2554m9724O5236Q7893j1377o6052P601Q7236O0702j5468
35122C4348m9270n0663n4288l1413M1499J20786J58178J47111Q4344k5938j23056
35111B51638j43136j15284r8359n2833P9462J96538J27003q6177j88705n6525
35101h6378J39656J81625O3080p1770j15756n5945M3291O7032l3006j33984q4103
35090h6258N6993Q9320j7518r1895n7074k5089m2344K846J24064J46214O792r6539
35078I512k2348Q2882N4165j7939K264K7900n4186j11841J5953J81296J24159
35067B91817q9213j51207L429J16937K8786j11933j17900j0207Q7841J17739P1701
35056B37790l9843j46609j61879r8056l5184J6238R5663J58632J14899o522q0678
$$ plain form
35134 -34307 -35947 -49145 -131699 -181423 -116187 -28294 -39671 -105723 -98122 -10886 49816 34348
35122 34348 -14922 -65585 -119873 -151286 -109787 10999 169177 316288 400632 374694 251638
35111 251638 108502 -6782 -105141 -157974 -78512 118026 245029 158852 -29853 -86378
35101 -86378 53278 234903 297983 226213 110457 54512 97803 164835 131829 -2155 -86258
35090 -86258 -29265 60055 42537 -49358 -106432 -131521 -173865 -171019 -46955 99259 106051 9512
35078 9512 -12836 70046 124211 106272 108536 136436 82250 -29591 -13638 167658 291817
35067 291817 202604 51397 54826 171763 200549 88616 -29284 -39491 48350 166089 237790
35056 237790 197947 51338 -110541 -208597 -243781 -227543 -131880 26752 141651 135129 54451
35045E4451p0133m1152j8358J7503J9220n2612p7571P7378K72099K20569o2701
35034C38693k30937j10587N3585J4073r9352m8828R0928P8551o7310j04193K0655
35023f4722R3639k017j09545o9935M1084P0742L0215L3074Q6074Q8603O150q2761
35011A20601j15701j17106j11996o1635N1938J42086J08039j5481r3176p6114
35001a68545n3862q9196j06962k2123J05947J47814Q1828N65k3242J3779R0145
34990b3852J56455J30202K548r3639m7735M3834J2573j01509j03863K0409N6927
34979E2350q9470k21428j46481M2170J35346J04057N9892M5425L6917N3473R2452
34968A64703N2111j02791j96806p4449J10106Q4030j11005j62869K0909J71443
$$ plain form
35045 54451 -15682 -56834 -75192 -57689 -38469 -91081 -168652 -91274 180825 401394 338693
35034 338693 107756 -2831 50754 64827 -34525 -83353 7575 86126 18816 -85377 -64722
35023 -64722 28917 26900 -82645 -152580 -111496 -40754 -10539 22535 108609 197212 203362 120601
35011 120601 4900 -112206 -224202 -285837 -233899 -91813 16226 745 -92431 -168545
35001 -168545 -222407 -311603 -418565 -440688 -334741 -186927 -105099 -104534 -127776 -113997 -23852
34990 -23852 132603 262805 265353 171714 123979 167813 180386 78877 -24986 -4577 52350
34979 52350 -37120 -258548 -405029 -362859 -227513 -123456 -63564 -18139 18778 72251 164703
34968 164703 216814 114023 -82783 -157232 -47126 36904 -74101 -236970 -216061 -44618
34958d4618R6891l1390P37R7760N5937p4526j03015m9758q4552j69709q0708J84890
34946b02061L20934J50353j02276j43112j4131L8804m2751j04254o5408J878O0388
34935a01636J50113K23587J48802n7837j82647r4490P2752J23516N9360J0574
34925C52094J1080j2332p7652j10184o0027L5003J01220Q7268o196j06546j14842
34914I8886j7657Q7246J10095N5488l3114j20654j37517j9179J42944J39635n9631
34903B46542k06077j15492N0406M8393n4168k2829J12199R2145j19456k46247
34893b14584j19491R3729J75801J23888K4960j01243k06126j65188L0051J97993
34883a60210K04909J22022N2289j6551q3604o0686M6735Q2830j014m2499L2815
$$ plain form
34958 -44618 52273 20883 21620 119380 175317 100791 -2224 -51982 -136534 -306243 -386951 -202061
34946 -202061 118873 269226 166950 23838 9707 48511 5760 -98494 -163902 -162024 -101636
34935 -101636 48477 272064 420866 363029 180382 85892 158644 282160 341520 352094
34925 352094 363174 350842 273190 163006 102979 137982 239202 326470 320274 213728 98886
34914 98886 81229 168475 278570 334058 300944 180290 42773 23594 166538 306173 246542
34903 246542 40465 -75027 -24621 23772 -30396 -53225 58974 151119 31663 -214584
34893 -214584 -334075 -240346 -64545 59343 84303 -16940 -223066 -388254 -358203 -160210
34883 -160210 44699 166721 219010 202459 118855 58169 104904 187734 186720 144221 177036
34872A77036N0815q2502j49182K2429K03436R4655j72611k31651n0115Q2874O6404
34861A1588P4505J37454N6236j79113k70483o8112J73301J80497L6462l1471j0116
34850A10748k0910n2074n400Q7357J00298J8870m5745k1706N1208Q9242M0497
34839C52385o5891j18655m8345L9233j9988j77127j90236J7608K11663J78171
34829A78818K2619l0990J7942J4848n1010n1936J9730K6376p0576j34103o4185
34818a22467O2295J18453Q2713J8880j3694P339N8771P6505K6380l0578q590P8810
34806C54817J41399J41849J08962L7267j02780k40295k28923n8628P8789L2234
34796B64691r4962r6031L7159J13180L4584o5659m2425L7932J4279j01696j29957
$$ plain form
34872 177036 227851 145349 -3833 18596 222032 316687 144076 -87575 -137690 -54816 11588
34861 11588 86093 223547 279783 100670 -169813 -237925 -64624 115873 152335 120864 110748
34850 110748 89838 37764 32364 119721 220019 238889 193144 171438 222646 311888 352385
34839 352385 286494 167839 119494 158727 138739 -38388 -228624 -211016 647 178818
34829 178818 201437 170447 188389 203237 152227 100291 120021 146397 75821 -58282 -122467
34818 -122467 -60172 58281 140994 159874 146180 153519 212290 288795 315175 284597 276007 354817
34806 354817 496216 638065 747027 784294 681514 441219 212296 153668 232457 264691
34796 264691 169729 73698 110857 224037 258621 192962 150537 188469 202748 101052 -28905
34785b8905K366J38387J13472j2726n6939K0721Q0923K2388q8939j36100r8403
34774d3755l4914P602J7990K591q506K4118Q6929J01407J9997r0615j11338j3778
34762d2272R4933Q8930k4170r6660j6762J27506J34740l7902j86697j24091N9163
34751b3282J23776J7063q6047o7232j1384k3492n9886k8216O3697J46822J84038
34740B35857J51527K6257j30380j77544p4122L9395L1976l7568l7779K6633N0812
34729A05064J0269k5350j9403O412M0259P1073N1148l2490r8344q6059o6956j11797
34717a56174j21506L4271K52271K80399Q2880q9790o0597M3440L4949l5794j984
34706B62365J11272J06338p8731k61115k54654r1558O1439J14139R6491N0664
$$ plain form
34785 -28905 -26539 111848 225320 212594 155655 176376 257299 279687 190748 54648 -43755
34774 -43755 -78669 -71067 -53077 -50486 -58992 -34874 52055 153462 173459 82844 -28494 -42272
34762 -42272 52661 141591 117421 20761 3999 131505 266245 228343 41646 -82445 -23282
34751 -23282 100494 117557 31510 -35722 -47106 -70598 -130484 -158700 -95003 51819 235857
34740 235857 387384 413641 283261 105717 31595 70990 102966 65398 27619 54252 105064
34729 105064 115333 89983 70580 76992 117251 188324 239472 206982 108638 22579 -44377 -156174
34717 -156174 -277680 -243409 8862 289261 372141 282351 221754 265194 300143 264349 262365
34706 262365 373637 479975 401244 140129 -114525 -206083 -144644 -30505 65986 116650
34696A16650j8503q9988j09100n5363K0535N5967L7199j5688p5620r5209k9320
34685b58440Q2175J19075L6679m6158m418J06742J37480O6892L704n104r754j4356
34673B14517K8115O8219l949j40581j54488j7410P0806N914m7312N4357J78151
34662B56339J39445O270l2803K8615N9073L1089J0548q003n7973p4721j079O9079
34650D25879L9296m99O6194J48650J01581l897j3928J8458l8452q7229N0545K62038
34638I68636K80949J45102J25834K22478J60604o8542j27191R6462K86533K45478
34628B336343K05175L60346N10737M67686M40961O69247R82759J109116J146449
34619H228819J344878J650203J862712K027953K216885K091254J214720k32171
$$ plain form
34696 116650 98147 8159 -100941 -156304 -135769 -79802 -42603 -58291 -133911 -229120 -258440
34685 -258440 -176265 -57190 -20511 -66669 -71087 35655 173135 240027 243731 238627 228873 214517
34673 214517 242632 310851 306902 166321 11833 -5577 65229 71143 23831 78188 256339
34662 256339 395784 402054 369251 397866 456939 488028 498576 490573 432600 357879 356800 425879
34650 425879 465175 464676 530870 679520 781101 777204 763276 781734 743282 656053 706598 968636
34638 968636 1249585 1394687 1520521 1742999 1903603 1835061 1707870 1804332 2090865 2336343
34628 2336343 2541518 2901864 3412601 3880287 4321248 4990495 5973254 7082370 8228819
34619 8228819 9573697 11223900 13086612 15114565 17331450 19422704 20637424 20405253
34611B0405253j520111k189638k391653k384143k152621j686832j234646j021015
34603E824594r54193q24189o16664m58065l99695m10369m63295n01283m19478
34594G77363j97467K9410J15109N4834n2641j14693q7228J569M6003k6313j31601
34583D14345j25538j8757L7003j4233o1601k4865K8653J8609l1713p2616j01610
34572D7677j04742l9923O6141J12645O8143J8130K7921O1780P3658O7809L5404
34561D34643n1345j46397j54279q3468m4706n9903k3760Q7049J28538P439j55830
34550f2019j92352r9850J1677Q4936J18164R3304J1760o0169o6359k7426J5759
34539a72575M6400K8440o4492j38267m9241J48049K04196L5792j09058j2735J65664
$$ plain form
34611 20405253 18885142 16695504 14303851 11919708 9767087 8080255 6845609 5824594
34603 5824594 4870401 4046212 3429548 2971483 2571788 2161419 1698124 1196841 777363
34594 777363 579896 609306 724415 779249 726608 611915 524687 526256 572259 545946 414345
34583 414345 288807 270050 307053 292820 231219 206354 235007 253616 221903 149287 47677
34572 47677 -57065 -96988 -30847 81798 149941 168071 195992 257772 331430 399239 434643
34561 434643 383298 236901 82622 -846 -45552 -105455 -129215 -42166 86372 93811 -62019
34550 -62019 -254371 -354221 -342544 -257608 -139444 -46140 -34380 -94549 -160908 -188334 -172575
34539 -172575 -126175 -97735 -162227 -300494 -349735 -201686 2510 38302 -70756 -83491 82173
34528H2173J36278o6051j50643l0875P6669K3630p3768q1219m9114n1026j8121
34517b02067J09447K10694J40265k7429q5977K053N6385m7112j91858j81499l883
34506b20981J54259J34415k0066j28823p6912O5144J16341j7074k16408k54084
34496d64189n1625K03979K65040J16696k9732l0642L4360M2913J7416K4588J3950
34485A42754q7390k01217j90925p8289L553L3629R1806J52332J07230K019R502
34474a4996J20131J09291q6893k14350q2523J19255J05169p5728j43741k2659
34464a87044Q9446N3375m0481n9685n089N1884P8303P6825N6935L7408K4983m393
34452A72467n7166q7626o4273k4130n402J2074L9256L2376j0902p922O0005O5403
$$ plain form
34528 82173 218451 152400 1757 -29118 47551 71181 -2587 -83806 -132920 -183946 -202067
34517 -202067 -92620 118074 258339 230910 144933 146986 203371 156259 -35599 -217098 -220981
34506 -220981 -66722 67693 47627 -81196 -158108 -92964 23377 6303 -210105 -464189
34496 -464189 -515814 -311835 -46795 69901 40169 9527 43887 86800 104216 128804 142754
34485 142754 55364 -145853 -336778 -415067 -411514 -377885 -286079 -133747 -26517 -24498 -14996
34474 -14996 105135 214426 127533 -86817 -169340 -50085 55084 -20644 -164385 -187044
34464 -187044 -97598 -44223 -84704 -144389 -149478 -97594 -19291 57534 114469 151877 176860 172467
34452 172467 115301 27675 -36598 -60728 -66130 -54056 -14800 17576 6674 -1248 58757 124160
34440A24160o8150j92387j24273P1043J71354J17727N1298N7993P1169L1495l2654
34429B78775r6721j52382j28668K8158J92697J67774k0912j31647n3911N0817
34419A33980K8700m7558n5195l7201q8189j57769j32273k7328M9352O7186P3500
34408a92795P4180L8112j2686l0173l1464n8039o8515J3251J45742J80348N6059
34397A14020j05008j43175m0991Q8448J42174J00160m427j10162j28902j1079
34387i8942J55213J93842O1371n7936O410J35473O5059j98591l30365j41468J34496
34376g5438J82082M9224R083R6758Q4584r7932k23154j28579K7677J9487j15019
34365a71227j61160m5200R4443J17429M4450K924O7307J68137J63610J5796j41568
$$ plain form
34440 124160 56010 -136377 -260650 -189607 -18253 99474 150772 208765 279934 311429 278775
34429 278775 182054 29672 -98996 -70838 121859 289633 268721 137074 83163 133980
34419 133980 162680 115122 59927 22726 -65463 -223232 -355505 -382833 -333481 -266295 -192795
34408 -192795 -118615 -80503 -93189 -123362 -154826 -212865 -281380 -268129 -122387 57961 114020
34397 114020 9012 -134163 -175154 -86706 55468 155628 151201 41039 -87863 -98942
34387 -98942 56271 250113 311484 253548 259958 395431 460490 261899 -68466 -209934 -75438
34376 -75438 106644 155868 164951 261709 346293 248361 25207 -103372 -75695 -56208 -171227
34365 -171227 -332387 -377587 -283144 -165715 -121265 -118341 -51034 117103 280713 296509 154941
34354A54941j61878o3272L1982P4858Q6956L8373j05338k37066j95747j5536R4488
34343b97239N0717j1176J1654M4982K6047L5909J21441J58697M1074j29010j79130
34332a26034r3560J8756Q1622P1153j3213r4988n3560R0457J53138N2771n5957
34321C0585l7314P724n5692j42976j04941N904N0055N8858J31088J79331O1104
34310A83726j06852p3817J21086J66362l6279k08336j21592P9375J33724K8849
34300A66246o6525p5839m2931R274Q6035J44640J34565P3713L822p2130j38634
34289B22236j33264m9945O09o2787j47700j06313M3042J36996R8477K1516J940
34278B4807L684l5899o0127K9982J83469K16968O2226j17625j43696o0360l1274
$$ plain form
34354 154941 -6937 -70209 -38227 36631 123587 161960 56622 -180444 -376191 -391727 -297239
34343 -297239 -246522 -257698 -246044 -201062 -175015 -139106 -17665 141032 182106 53096 -126034
34332 -126034 -219594 -200838 -119216 -48063 -61276 -156264 -209824 -119367 33771 86542 30585
34321 30585 -6729 995 -54697 -197673 -302614 -296710 -246655 -187797 -56709 122622 183726
34310 183726 76874 3057 124143 290505 254226 45890 -75702 3673 137397 166246
34300 166246 99721 23882 -19049 -9775 76260 220900 355465 429178 433000 360870 222236
34289 222236 88972 39027 39636 -23151 -170851 -277164 -234122 -97126 1351 22867 24807
34278 24807 28491 -7408 -67535 -37553 145916 362884 425110 307485 163789 103429 72155
34267G2155o4750k4851R2548J08496m3093j66636q3870R9057J63207Q3101j6114
34256B19250r0393j60040j54180o549J46437J09723m7133o5711Q8126J57281Q218
34245B05029j53141j12218L4847O8293k1128p8859n0548q473J7269N9775R7487
34234E8333O3668k6923p4532l2119L2100K9296l8630q4161m6059J5678j7149j34429
34222b54927j59455N536J85335J54364q810k6065J28656J71482j8464j73272o2353
34211e7973J28332J03787o4177q5837N1823Q4568p0787j87998j08173L4381N8156
34200a13898j1553m5929r022M9830Q0308L7911q3089j78293j18899M8146J24443
34189b20045M0879l4954M0796J61319J29599m9023j72367j04369P0302J52880
$$ plain form
34267 72155 7405 -17446 75102 183598 140505 -26131 -110001 -10944 152263 235364 219250
34256 219250 128857 -31183 -185363 -191912 -45475 64248 17115 -48596 39530 196811 205029
34245 205029 51888 -60330 -25483 42810 21682 -57177 -107725 -116198 -98929 -39154 58333
34234 58333 122001 95078 20546 -11573 20527 49823 11193 -72968 -119027 -103349 -120498 -254927
34222 -254927 -414382 -408846 -223511 -69147 -77957 -104022 24634 196116 177652 4380 -57973
34211 -57973 70359 174146 109969 24132 75955 160523 89736 -98262 -206435 -172054 -113898
34200 -113898 -125451 -171380 -180402 -130572 -50264 -12353 -95442 -273735 -392634 -344488 -220045
34189 -220045 -179166 -214120 -173324 -12005 117594 68571 -103796 -208165 -137863 15017
34179A5017M3511j47625k03989n3292J22757J19865O043K1830J90528K44511K0346
34168C79502k77177l46718j64825O5939K00522K12854J05170m9653q2019N7569
34158A01164J56817L2374j48172j03048R4438J13905r1857k12965j00933J6659
34148a41618k8166o2311O2044J57765M5144q3128J8035J88421J11531j37578k08638
34137g8499n2706M5109j2699j7601R2730R7208o8028j40140J0443J27285J8045
34126B1147r0701M3958K24825J32876j21034j73147k032P2825n8708j53971n9924
34115a63886O4466O3048J1403N383j8030j01019j21191J0883J71178J89222P4335
34104A85792m6825j05921r6989j8091P6804P0341n5695j41925o1519O8507L1452
$$ plain form
34179 15017 58528 -89097 -293086 -346378 -223621 -103756 -97713 -75883 114645 359156 379502
34168 379502 102325 -244393 -409218 -343279 -142757 70097 175267 125614 43595 101164
34158 101164 257981 290355 142183 39135 133573 247478 155621 -57344 -158277 -141618
34148 -141618 -169784 -232095 -170051 -12286 32858 -50270 -32235 156186 267717 130139 -78499
34137 -78499 -131205 -86096 -98795 -116396 -23666 73542 5514 -134626 -124183 3102 21147
34126 21147 -69554 -25596 199229 332105 211071 37924 35892 108717 50009 -103962 -163886
34115 -163886 -99420 -36372 -24969 -19586 -37616 -138635 -259826 -248943 -77765 111457 185792
34104 185792 138967 33046 -63943 -82034 -5230 65111 9416 -132509 -194028 -125521 -94069
34093i4069j69746k85605j37823J43916K70586J37624n7542p0778P6411J42070
34083d4956J8772j08667m9157R8764J07404k5619r9077l5401M4509O5139P8021
34072D9732P7778j8844j55293j42491L1018J36256N6643l9296p120M2202j2350
34061A8235o8596j5897M3590J1721P854J12307J27813q8928k69936r6000K41297
34050B3460K76656q154j73033m0704O0357r8573k57216j26059J30633J77618J8812
34039a6203q6523m7567J3744L9007Q3303J32359R6729j5473r1452q1441m2602
34028a6119k1764p632L875p676l5042l9848k471N8456R9922P8342J202n1483k6852
34015C2910Q73n9261j28773n0637J28005J73990K4978j00907n7044J0282m6796
$$ plain form
34093 -94069 -263815 -549420 -687243 -543327 -272741 -135117 -192659 -263437 -187026 -44956
34083 -44956 -26184 -134851 -184008 -85244 22160 -3459 -102536 -137937 -93428 -28289 49732
34072 49732 127510 108666 -46627 -189118 -158100 -21844 34799 -4497 -11617 30585 18235
34061 18235 -50361 -66258 -22668 -10947 -3093 109214 237027 148099 -121837 -217837 23460
34050 23460 300116 291962 118929 78225 138582 40009 -217207 -343266 -212633 -35015 -16203
34039 -16203 -102726 -150293 -136549 -97542 -14239 118120 214849 199376 107924 26483 -16119
34028 -16119 -37883 -45515 -41640 -49316 -84358 -124206 -126677 -68221 31701 110043 111245 59762 32910
34015 32910 33783 -25478 -154251 -204888 -76883 97107 122085 21178 -35866 -25584 -72380
34004g2380j04650j3331R6418L3393r2840n0646R2886Q0726o9538q4997P7987
33993a06972J49741J6819r3304k7119M1176m1909j17926j2506J35687J10954j7383
33982C7258m5534J5321K0999q444L5619Q2201q134j36533q6801Q3777J04499n2103
33970D2125j16253J6045J10872J3662q7667r045J04589M4192r9650j09418q370
33959i8918K5074j2735P468N8977M442j09773r7467K7662M7865p7108j13857N4297
33947b84073K06317J18283r0553j45111l633J41047J58051Q6089p724j03465j66192
33936i0964j41883l7656P0421J15661Q6710K4431N166O8321J25932L7554j66633
33925I7060k57408j05301J10075J37646M521n8625J8273P1686j862q9620o2620
$$ plain form
34004 -72380 -177030 -190361 -93943 -60550 -153390 -204036 -111150 -30424 -99962 -184959 -106972
33993 -106972 42769 59588 -33716 -60835 -19659 -61568 -179494 -192000 -56313 54641 37258
33982 37258 -8276 7045 28044 19600 55219 137420 129286 -7247 -94048 -10271 94228 42125
33970 42125 -74128 -58083 52789 66451 -21216 -30261 74328 118520 18870 -90548 -98918
33959 -98918 -73844 -86579 -79111 -20134 -15692 -125465 -222932 -195270 -147405 -224513 -338370 -284073
33947 -284073 -77756 40527 -50026 -195137 -198770 -57723 100328 186417 178693 75228 -90964
33936 -90964 -232847 -270503 -200082 -84421 2289 26720 31886 100207 226139 263693 97060
33925 97060 -160348 -265649 -155574 -17928 -13407 -72032 -53759 17927 16065 -73555 -136175
33914a36175L4741Q2824N6499J4164j22J7457L7649L465r5807j51785n0008J29736
33902e7362J66953K668j57187j22681K8754R0257N954j07101j35877n6439Q9219
33891b52842J98015J58729J071q9763j6052P5873K3103q0130l6955J02319R8966
33880A82334p5342j70347n4593P6528K4869r9957q4279M3122R4100M5282L8137
33869A9854R8393R5223k940n2759J8622Q3596K9099o0100o1937k9055p9700j64562
33857a06266j25455M0585J51807R9725j2683m3464L307M0798M6498M9315L7166
33846A81333j8893q1532q2691l0200L309m979l121L5822O4783M3692R740K0790
33834A38053O0383M5698o8178k11908k46301j03626J12586K11319J27591K041
$$ plain form
33914 -136175 -101434 -18610 37889 52053 51931 69388 107037 110502 14695 -137090 -187098 -57362
33902 -57362 109591 112259 -44928 -167609 -138855 -48598 -42644 -149745 -285622 -342061 -252842
33891 -252842 -54827 103902 104973 15210 -842 75031 98134 18004 -18951 83368 182334
33880 182334 106992 -63355 -117948 -41420 -16551 -116508 -200787 -157665 -63565 -18283 19854
33869 19854 118247 213470 210530 157771 176393 259989 289088 228988 167051 137996 58296 -106266
33857 -106266 -231721 -191136 -39329 60396 47713 4249 7556 48354 94852 144167 181333
33846 181333 162440 80908 -1783 -31983 -28674 -33653 -36774 -952 63831 107523 117263 138053
33834 138053 198436 244134 175956 -35952 -282253 -385879 -273293 -61974 65617 67658
33824F7658j0066N0679L5864n2243n4863O3576J13934k8014j87902j30787O6879
33813f5285J13075n3507j62102k4166J80277J84533K9825l5548M4893Q1324k4828
33802B68491j23973p5599K6706J7961p7628j00949o539Q9325R0265K7803j9130
33791A16733j8371J6690N1582M3616j5039p2434q6073q9346j19787j21825k5010
33780c19264J08904J46014Q1343L7557N2098K9210n5285q1796k336N2361J294
33769E0100l0326N3341J01605l8343k01370j15354J41703K14860Q556j72343j01164
33758h8735N4344N2438m4550l3083P3980R7515j368q7460p3842L909R5409J56583
33746B05140J08599n9553j86366j09825P9697J40706K8082n8388j873O0891j6999
$$ plain form
33824 67658 57592 108271 144135 91892 37029 100605 214539 186525 -1377 -132164 -65285
33813 -65285 47790 -5717 -167819 -191985 -11708 172825 202650 167102 211995 293319 268491
33802 268491 144518 68919 95625 113586 35958 -64991 -71530 17795 108060 135863 116733
33791 116733 98362 115052 166634 210250 195211 122777 36704 -52642 -172429 -294254 -319264
33780 -319264 -210360 -64346 16997 54554 106652 135862 80577 -1219 -3555 48806 50100
33769 50100 19774 73115 174720 136377 -64993 -180347 -38644 176216 184772 12429 -88735
33758 -88735 -34391 18047 -26503 -59586 14394 111909 110541 23081 -50761 -46852 48557 205140
33746 205140 313739 254186 67820 -42005 37692 178398 206480 148092 146219 207110 190111
33735A90111j54179j75300o5159M3491O1714Q513o4767j12305r1861j0086N9354
33724c10474O9125O8064J10258J47972J03770N791n0813n0043n5162p7615o2983
33713a02110j3253o54l0142j1327P7677J20820M6311l3871P327R0398M0182j22406
33701F8952j86838p0868N3774L1494m9026l0289M2200Q264j14884j37347L28J25812
33689b58428J03138L1673O0493J35897R5445n4604j33568o1148K1252l3575j56671
33678b50096j56822J6979K08151K47607J40236K5198l119J8020N231n0153q1390
33667A19842m6517J5032L5124m846o4422r0377n8774O570M5135J8181k8527j097
33655e4676J11562J87927J12855o1972j68848j28030k4485K9982K8134K0107J0312
$$ plain form
33735 190111 35932 -139368 -204527 -161036 -99322 -90809 -155576 -267881 -359742 -369828 -310474
33724 -310474 -241349 -173285 -63027 84945 188715 194506 143693 93650 38488 -39127 -102110
33713 -102110 -115363 -116017 -146159 -157486 -79809 41011 87322 53451 60778 151176 191358 68952
33701 68952 -117886 -188754 -134980 -103486 -152512 -182801 -140601 -132337 -247221 -384568 -384240 -258428
33689 -258428 -155290 -123617 -63124 72773 168218 113614 -19954 -81102 -59850 -93425 -250096
33678 -250096 -406918 -389939 -181788 65819 206055 231253 228134 246154 251385 201232 119842
33667 119842 73325 88357 123481 118635 54213 -36164 -94938 -88368 -43233 -25052 -53579 -54676
33655 -54676 56886 244813 357668 295696 126848 -1182 -25667 4315 32449 52556 62868
33644F2868k2867m6496j789Q7452J13150J8117j19657j74785j13641q781O2640
33633a43789Q9984R9923R7497O2588m396n7937m7971J1503L7047k9957j30662
33622a6170j38795k2933R3024Q0956k0052n8747J7363R8523Q0564M633k7652p160
33610H3554l314l6269n0390r467N0940P3199L3914m3184q9462l3650R5955J44729
33598B16555L786k03982k33328l7802J50520J31293k678l5174M4388N7561n3359
33587C7780j29166n3469O3441O7474M01R985R4535J07304K958r0354q5938o7275
33575d2324j13398j36174l2816J01649R5676j6380l7473O6298J05121o069q4161
33564a00051J8982J48788Q8776p7461r8122L3055P3598o2368j72111j02845K5460
$$ plain form
33644 62868 40001 -6495 -8284 79168 192318 210435 90778 -84007 -197648 -206429 -143789
33633 -143789 -53805 46118 143615 206203 201807 143870 95899 107402 144449 114492 -16170
33622 -16170 -154965 -177898 -84874 -3918 -23970 -82717 -65354 33169 113733 118366 90714 83554
33610 83554 80240 43971 -6419 -15886 35054 108253 142167 98983 9521 -24129 71826 216555
33598 216555 220341 16359 -216969 -254771 -104251 27042 24364 -10810 33578 91139 37780
33587 37780 -91386 -144855 -81414 -13940 -13539 -3554 90981 198285 201243 110889 24951 -42324
33575 -42324 -155722 -291896 -324712 -223063 -127387 -143767 -181240 -114942 -9821 -15890 -100051
33564 -100051 -81069 67719 156495 79034 -19088 13967 87565 25197 -146914 -249759 -224299
33553b24299M9766O015j049P830j5515m836Q5537J30684J9312j11024m4402J66525
33541F4544K58326J47434K4497K3177L0667p1772j82849j52923m3012l0279j21869
33530e4059j40526M071J74748J87985M5417q3662p3492K6909P7210J5360r1716
33519H8245j50516j40320r2049k2651N7624J08337R5974N2582L4494L6763J7785
33508H6268p436J0917M6409J8028n4837m3320Q4952J72555Q6934p0605j04019
33497B25846m198O2354J6305n1728p5708j17838k05951k18885n8937J59044K32772
33486c6924J39885M6183O2505J22142J17260M3966l2906p5463q2379o1791l7866
$$ plain form
33553 -224299 -174533 -168518 -169567 -161737 -177252 -182088 -96551 34133 53445 -57579 -101981 64544
33541 64544 322870 470304 494801 517978 548645 476873 294024 141101 98089 67810 -54059
33530 -54059 -194585 -190514 -15766 172219 217636 133974 60482 87391 164601 179961 88245
33519 88245 -62271 -202591 -294640 -317291 -259667 -151330 -55356 -2774 31720 68483 86268
33508 86268 78832 89749 136158 154186 99349 56029 140981 313536 400470 329865 225846
33497 225846 221648 284002 300307 248579 172871 55033 -150918 -369803 -428740 -269696 -36924
33486 -36924 102961 149144 211649 333791 451051 495017 462111 386648 304269 242478 204612
$$ [...]
##END NTUPLES=NMR SPECTRUM
##END=
