##TITLE=31Pdec_E3e-N3
 CDCl3
  24 sc
 23.11.2023
##JCAMPDX= 6.0         $$ Bruker NMR JCAMP-DX V2.0
##DATA TYPE= NMR SPECTRUM
##DATA CLASS= NTUPLES
##ORIGIN= UXNMR, Bruker Analytische Messtechnik GmbH
##OWNER= root
$$ XWIN-NMR		Version 3.5
$$ Thu Nov 23 15:04:35 2023 Russian Standard Time (UT+4h)  she@DPX200
##.OBSERVE FREQUENCY= 81.013821
##.OBSERVE NUCLEUS= ^31P
##.ACQUISITION MODE= SIMULTANEOUS
##.ACQUISITION SCHEME= undefined
##.AVERAGES= 24
##.DIGITISER RES= 16
##SPECTROMETER/DATA SYSTEM= spect
##.PULSE SEQUENCE= zgpg30
##.SOLVENT NAME= CDCl3
##.SHIFT REFERENCE= (INTERNAL, CDCl3, 0, 248.564)
##AUDIT TRAIL= $$ (NUMBER, WHEN, WHO, WHERE, WHAT)
$$ ##TITLE= Audit trail, XWIN-NMR		Version 3.5
$$ ##JCAMPDX= 5.01
$$ ##ORIGIN= Bruker BioSpin GmbH
$$ ##OWNER= she
$$ F:/spectra/data/she/nmr/P31/1/pdata/1/auditp.txt
$$ ##AUDIT TRAIL=  $$ (NUMBER, WHEN, WHO, WHERE, WHAT)
(   1,<2023-11-23 15:03:42.14 +0400>,<she>,<DPX200>,
      <created by zg, POWCHK disabled, PULCHK disabled
       configuration hash MD5:
       00 E9 B6 7A A2 85 ED C7 34 08 36 98 17 FE 4E 26
       data hash MD5: 32K
       A1 66 D7 47 3D 05 37 7B 6B 25 20 76 B3 44 B0 7F>)
(   2,<2023-11-23 15:03:44.90 +0400>,<she>,<DPX200>,
      <Start of raw data processing
       efp BC_mod = 2 LB = 10 FT_mod = 6 PKNL = 1 PHC0 = -11328.54 PHC1 = -23.5066 SI = 64K 
       data hash MD5: 64K
       13 AC C5 90 B2 26 08 1A 87 28 DF D0 11 CE D6 9D>)
(   3,<2023-11-23 15:04:00.17 +0400>,<she>,<DPX200>,
      <pk PHC0 = -1.92633 PHC1 = 0 
       data hash MD5: 64K
       FD 99 8C 1C 2D 0D 0F CE 16 99 6F 6D 08 09 F9 DE>)
(   4,<2023-11-23 15:04:07.96 +0400>,<she>,<DPX200>,
      <abs ABSG = 5 
       data hash MD5: 64K
       43 1A C8 2A 2D 1F 98 CC 65 08 81 4D 80 6B 2A 66>)
$$ ##END=
$$ 
$$ hash MD5
$$ 97 11 D5 C4 DB 9C C0 03 22 95 22 C9 87 DD 28 B1
##$RELAX= 
##$RELAX= 
##$RELAX= 
##$RELAX= 
##$RELAX= 
##$RELAX= 
##$RELAX= 
##$RELAX= 
##$RELAX= 
$$ Bruker specific parameters
$$ --------------------------
##$DU= <F:/spectra>
##$EXPNO= 1
##$NAME= <P31>
##$PROCNO= 1
##$TYPE= <nmr>
##$USER= <she>
##$AMP= (0..31)
100 100 100 100 100 100 100 100 100 100 100 100 100 100 100 100 100 100 
100 100 100 100 100 100 100 100 100 100 100 100 100 100 
##$AQSEQ= 0
##$AQ_mod= 1
##$AUNM= <au_zg>
##$AUTOPOS= <>
##$BF1= 81.014009
##$BF2= 200.13
##$BF3= 200.13
##$BF4= 200.13
##$BF5= 200.13
##$BF6= 200.13
##$BF7= 200.13
##$BF8= 200.13
##$BYTORDA= 1
##$CFDGTYP= 0
##$CFRGTYP= 5
##$CHEMSTR= <none>
##$CNST= (0..31)
1 1 145 1 1 1 1 1 1 1 1 1 1 1 1 1 1 1 1 1 1 1 1 1 1 1 1 1 1 1 1 1 
##$CPDPRG= <waltz16>
##$CPDPRG1= <>
##$CPDPRG2= <waltz16>
##$CPDPRG3= <>
##$CPDPRG4= <mlev>
##$CPDPRG5= <mlev>
##$CPDPRG6= <mlev>
##$CPDPRG7= <mlev>
##$CPDPRG8= <mlev>
##$CPDPRGB= <>
##$CPDPRGT= <>
##$D= (0..31)
0 1 0 0 0 0 0 0 0 0 0 0.03 2e-05 3e-06 0 0 0 0 0 0 0 0 0 0 0 0 0 0 0 0 
0 0 
##$DATE= 1700737421
##$DBL= (0..7)
120 120 120 11 120 120 24 19 
##$DBP= (0..7)
150 150 150 150 150 150 150 150 
##$DBP07= 0
##$DBPNAM0= <>
##$DBPNAM1= <>
$$ [...]
##$SUBNAM3= <"">
##$SUBNAM4= <"">
##$SUBNAM5= <"">
##$SUBNAM6= <"">
##$SUBNAM7= <"">
##$SUBNAM8= <"">
##$SUBNAM9= <"">
##$SW= 501.771253377433
##$SWIBOX= (0..15)
0 1 3 0 0 0 0 0 0 0 0 0 0 0 0 0 
##$SW_h= 40650.406504065
##$TD= 32768
##$TD0= 1
##$TE= 0
##$TE2= 300
##$TE3= 300
##$TEG= 300
##$TL= (0..7)
0 120 53 12 22 120 120 120 
##$TP= (0..7)
150 150 150 150 150 150 150 150 
##$TP07= 0
##$TPNAME0= <>
##$TPNAME1= <>
##$TPNAME2= <>
##$TPNAME3= <>
##$TPNAME4= <>
##$TPNAME5= <>
##$TPNAME6= <>
##$TPNAME7= <>
##$TPOAL= (0..7)
0.5 0.5 0.5 0.5 0.5 0.5 0.5 0.5 
##$TPOFFS= (0..7)
0 0 0 0 0 0 0 0 
##$TUNHIN= 0
##$TUNHOUT= 0
##$TUNXOUT= 0
##$USERA1= <user>
##$USERA2= <user>
##$USERA3= <user>
##$USERA4= <user>
##$USERA5= <user>
##$V9= 5
##$VALIST= <valist>
##$VCLIST= <CCCCCCCCCCCCCCC>
##$VD= 0
##$VDLIST= <DDDDDDDDDDDDDDD>
##$VPLIST= <PPPPPPPPPPPPPPP>
##$VTLIST= <TTTTTTTTTTTTTTT>
##$WBST= 1024
##$WBSW= 4
##$XGAIN= (0..3)
0 0 0 0 
##$XL= 0
##$YL= 0
##$YMAX_a= 13122
##$YMIN_a= -13703
##$ZGOPTNS= <>
##$ZL1= 120
##$ZL2= 120
##$ZL3= 120
##$ZL4= 120
##$ABSF1= 248.5645
##$ABSF2= -253.2056
##$ABSG= 5
##$ABSL= 3
##$ALPHA= 0
##$AQORDER= 0
##$ASSFAC= 0
##$ASSFACI= 0
##$ASSFACX= 0
##$ASSWID= 0
##$AUNMP= <proc_1d>
##$AZFE= 0.1
##$AZFW= 0.5
##$BCFW= 0
##$BC_mod= 2
##$BYTORDP= 0
##$COROFFS= 0
##$CY= -3
##$DATMOD= 1
##$DC= 0
##$DFILT= <>
##$DTYPP= 0
##$F1P= 0
##$F2P= 0
##$FCOR= 1
##$FTSIZE= 65536
##$FT_mod= 6
##$GAMMA= 0
##$GB= 0
##$INTBC= 1
##$INTSCL= 6.047779e-11
##$ISEN= 30
##$LB= 10
##$LEV0= 0
##$LPBIN= 0
##$MAXI= 10000
##$MC2= 0
##$MEAN= 0
##$ME_mod= 0
##$MI= 50
##$NCOEF= 0
##$NC_proc= -6
##$NLEV= 6
##$NOISF1= 182.463
##$NOISF2= 159.3651
##$NSP= 0
##$NTH_PI= 0
##$NZP= 0
##$OFFSET= 248.5645
##$PC= 4
##$PHC0= -11330.47
##$PHC1= -23.5066
##$PH_mod= 1
##$PKNL= yes
##$PPARMOD= 0
##$PSCAL= 0
##$PSIGN= 0
##$REVERSE= no
##$SF= 81.0140089999694
##$SI= 65536
##$SIGF1= 159.3651
##$SIGF2= -187.1042
##$SINO= 113.3802
##$SIOLD= 16384
##$SREGLST= <1H.CDCl3>
##$SSB= 0
##$STSI= 65536
##$STSR= 0
##$SW_p= 40650.406504065
##$SYMM= 0
##$S_DEV= 0
##$TDeff= 32768
##$TDoff= 0
##$TI= <>
##$TILT= no
##$TM1= 0
##$TM2= 0
##$TOPLEV= 0
##$USERP1= <user>
##$USERP2= <user>
##$USERP3= <user>
##$USERP4= <user>
##$USERP5= <user>
##$WDW= 1
##$XDIM= 65536
##$YMAX_p= 373609899
##$YMIN_p= -9483946
$$ End of Bruker specific parameters
$$ ---------------------------------
##NTUPLES= NMR SPECTRUM
##VAR_NAME=  FREQUENCY,     SPECTRUM/REAL,   SPECTRUM/IMAG
##SYMBOL=    X,             R,               I
##VAR_TYPE=  INDEPENDENT,   DEPENDENT,       DEPENDENT
##VAR_FORM=  AFFN,          ASDF,            ASDF
##VAR_DIM=   65536,         65536,           65536
##UNITS=     HZ,            ARBITRARY UNITS, ARBITRARY UNITS
##FACTOR=    0.620285442955139, 1,           1
##FIRST=     20137.2065510682, 0,            0
##LAST=      -20513.1999529968, 0,           0
##MIN=       -20513.1999529968, -9483946,    0
##MAX=       20137.2065510682, 373609899,    0
$$ Real data points
##PAGE= N=1
##DATA TABLE= (X++(R..R)), XYDATA
$$ [...]
40159D15284j8182j9906k0543j9687j7410j4234j0828p608m522j143K977Q009
40147B92207J3736J9788K5904L2006L7925M3096M6529M7227M4602L8625K9655
40136F71300J8149M497j0881k7283m3496n7950o9098p5825p7513p4000o5614n3301
40124A38985l8544k3065q524L618J2259J6920J8053J7001J5527J5161J6721K0164
40112B04276K4707K9171L2421L3816L3414L1816K9657K7197K4268K0661J6480
40101E07884J2156Q107M499J284j581m103o389q744j1498j4732j8183k1341k3629
40088D23730k4499k3501k0345j5076q164m75O881J2738J5993J5787J1754M343
40076C99166n151j4885k2943k7679k7894k3044j3581j053J2230K3914L2205L6152
$$ plain form
40159 415284 397102 377196 356653 336966 319556 305322 294494 286886 282364 281221 284198 292207
40147 292207 305943 325731 351635 383641 421566 464662 511191 558418 603020 641645 671300
40136 671300 689449 693946 683065 655782 612286 554336 485238 409413 331900 257900 192286 138985
40124 138985 100441 77376 68852 72470 84729 101649 119702 136703 152230 167391 184112 204276
40112 204276 228983 258154 290575 324391 357805 389621 419278 446475 470743 491404 507884
40101 507884 520040 528147 532646 533930 532349 528246 521857 513113 501615 486883 468700 447359 423730
40088 423730 399231 375730 355385 340309 332145 331670 338551 351289 367282 383069 394823 399166
40076 399166 394015 379130 356187 328508 300614 277570 263989 262936 275166 299080 331285 367437
40064C67437L5546L0721K2279J0904k672j7477l2073m4510n2765n5478n2640m5739
40052A63533l7301k9994k5721k5089k7394l1072l4356l5959l5472l3399l0869
40041a83093k9089k8835l0149l2375l4463l5370l4382l1236k6047j9057j0458
40030d94554l86J0851K2520L3554M3057N0914N7974O5469P4090Q3303R1483R6627
40018A34902R7191R2561Q3004O9348N2646L4108J5217k225j6357k5811l0157k9955
40006D74472k6429k1000j4910r011l710Q40M424O588O923N625L768K881M029P092
39992D41582J0836J3653J4494J3363J1180R273Q762J0124J2927J5799J6881J4643
39980E93517Q670j76j0390k0655l0246l8829m5969n0916n2797n1148m6353l9681
$$ plain form
40064 367437 402983 433704 455983 466887 464215 446738 414665 370155 317390 261912 209272 163533
40052 163533 126232 96238 70517 45428 18034 -13038 -47394 -83353 -118825 -152224 -183093
40041 -183093 -212182 -241017 -271166 -303541 -338004 -373374 -407756 -438992 -465039 -484096 -494554
40030 -494554 -494940 -484089 -461569 -428015 -384958 -334044 -276070 -210601 -136511 -53208 38275 134902
40018 134902 232093 324654 407658 477006 529652 563760 578977 576752 560395 534584 504427 474472
40006 474472 448043 427043 412133 403122 399412 400252 404676 411264 418187 423812 427580 430461 434490 441582
39992 441582 452418 466071 480565 493928 505108 514381 523143 533267 546194 561993 578874 593517
39980 593517 602187 602011 591621 570966 540720 501891 455922 405006 352209 301061 254708 215027
39968B15027l2827k7191k3364k1034j9359j7568j5450j3461j2397j2940j5399
39957D037j9751k5799l3188m1237m8700n3710n4174m8458l6067j7963L629K5738
39945c45643M5306N9848O7955O9499O5448N7387M7021L5897K5382J6721J0912
39934A55733Q382Q768J0930J3247J4039J1941O209l145j5473k9708m4548n8648
39922G7727p0783p9935q5266q6013q1634p2199n8705m3010k7340j3735l522K927
39910e41488O184P392P633P425O578M447M04n746j3531k1779k8788l2711l2137
39897f36117k6624j6862m304R554K3723L7768N1492O4527P6143Q5262R0698R1548
39885a53192Q7692Q0080P0467O0686N1908M4330L7391L0207K2074J2770K661p481
$$ plain form
39968 215027 182200 155009 131645 110611 91252 73684 58234 44773 32376 19436 4037
39957 4037 -15714 -41513 -74701 -115938 -164638 -218348 -272522 -320980 -357047 -375010 -371381 -345643
39945 -345643 -300337 -240489 -172534 -103035 -37587 19800 66821 102718 128100 144821 155733
39934 155733 164115 172883 183813 197060 211099 223040 229249 226104 210631 180923 136375 77727
39922 77727 6944 -72991 -158257 -244270 -325904 -398103 -456808 -499818 -527158 -540893 -544415 -541488
39910 -541488 -535304 -527912 -520279 -512854 -506276 -501829 -501425 -507171 -520702 -542481 -571269 -603980 -636117
39897 -636117 -662741 -679603 -683907 -674353 -650630 -612862 -561370 -496843 -420700 -335438 -244740 -153192
39885 -153192 -65500 14580 85047 145733 197641 241971 279362 309569 331643 344413 347074 339593
39873C39593j6783k4456k9792l2254l1683k8458k3344j7119j0274l084M070J0370
39861A36786J4525J5037J0756J495j1626k6341l9856m9667n4218n3132m7028l7157
39849a40426k5047j2303n13Q825J4478J5771J2918P091J16o152j0486j2626j3149
39836a61503j2952j2692j2459j1872j0390p632l492J882Q076J4382J9816K3386
39824a65450K4482K3191K0238J6619J3149J0253Q077O787O739Q259J1168J4499
39812a989J6791J6897J4629J0753O369K181j852o308j1653j7536k2587k4985k3441
39799d2731j7952r872j368N381Q978R310P559N541M755N653P548R164R395P873
39785I234N051J907m28r41J157O338J4650K5581L8005N0341O0840O7973P0747
$$ plain form
39873 339593 322810 298354 268562 236308 204625 176167 152823 135704 125430 122346 126416 136786
39861 136786 151311 166348 177104 178599 166973 140632 100776 51109 -3109 -56241 -103269 -140426
39849 -140426 -165473 -177776 -178289 -169464 -154986 -139215 -126297 -119206 -119090 -125242 -135728 -148354 -161503
39836 -161503 -174455 -187147 -199606 -211478 -221868 -229500 -232992 -231110 -223034 -208652 -188836 -165450
39824 -165450 -140968 -117777 -97539 -80920 -67771 -57518 -49441 -42654 -35915 -27656 -16488 -1989
39812 -1989 14802 31699 46328 57081 63450 65631 63779 57471 45818 28282 5695 -19290 -42731
39799 -42731 -60683 -70555 -71923 -66542 -57564 -48254 -40695 -35154 -30399 -24746 -17198 -8034 1361 9234
39785 9234 14285 16192 15764 14823 15980 22318 36968 62549 100554 150895 211735 279708 350455
39772C50455O8878O2865N3918M3685L3824K5589J9654J6126J4660J4634J5335
39761G19623J6218J7050J7836J8484J8466J6802J2556N586l054j1416j7524k0194
39749G90433j9323j5680j0454m841J73L901N891N897L908K64m336r012j3041j6158
39735G17622j8637k1028k3688k6366k8216k8243k5922k1547j6091j0750o595m350
39723D86189m404o838j1431j7607k4334l0206l3830l4404l2010k7300k0840j2825
39711B30160l398O759J6257K3434K7020K6596K2618J6147Q476Q28n778j0461j2406
39698C46252j1018o332O55Q130J4079J7113J6951J4386J0739P122L859L28m647
39685D17617j2089k2173l4022m6019n6417o3867o7619o7448o3471n6054m5808
$$ plain form
39772 350455 419333 482198 536116 579801 613625 639214 658868 674994 689654 704288 719623
39761 719623 735841 752891 770727 789211 807677 824479 837035 842621 839567 828151 810627 790433
39749 790433 771110 755430 744976 740135 740308 744209 750100 755997 759905 760169 755833 746821 733780 717622
39735 717622 698985 677957 654269 627903 599687 571444 545522 523975 507884 497134 490539 486189
39723 486189 481785 474947 463516 445909 421575 391369 357539 323135 291125 263825 242985 230160
39711 230160 226762 233521 249778 273212 300232 326828 349446 365593 374069 374897 369119 358658 346252
39698 346252 335234 328902 329557 337687 351766 368879 385830 400216 410955 418077 421936 422264 417617
39685 417617 405528 383355 349333 303314 246897 183030 115411 47963 -15508 -71562 -117370
39674a17370l3731k1284j0169j852K949M478L771K244J233J677L895P637J2316
39661a44206J7295K2026K6048K8880L0007K9057K6082K1727J7009J2776R191N651
39649A01543J210m789j2160j9716k5538k7673k4922j7371o328O151J7973K7518
39637A5898L3844L6613L5959L2381K6615J9356J1047J984p315j5897k2647k6867
39625A40971k8559k8235k6557k4172k1792k0229k0201k2047k5582l0195l5099
39614a41697l9588m3243m6053m8428n1067n4619n9276o4517o9148p1702p0938
39603g60276o6225n7619m5716l1476j6088q06J3364K5962L7113M7185N6251O3709
39591g34622O8336O8818O4494N5835M4368L2052K0501J0578K458l989q793j1803
$$ plain form
39674 -117370 -151101 -172385 -182554 -184406 -181457 -176979 -173208 -170964 -169731 -168054 -164159 -156522 -144206
39661 -144206 -126911 -104885 -78837 -49957 -19950 9107 35189 56916 73925 86701 95892 101543
39649 101543 102753 97964 85804 66088 40550 12877 -12045 -29416 -35744 -29593 -11620 15898
39637 15898 49742 86355 122314 154695 181310 200666 211713 213697 206382 190485 167838 140971
39625 140971 112412 84177 57620 33448 11656 -8573 -28774 -50821 -76403 -106598 -141697
39614 -141697 -181285 -224528 -270581 -319009 -370076 -424695 -483971 -548488 -617636 -689338 -760276
39603 -760276 -826501 -884120 -929836 -961312 -977400 -978206 -964842 -938880 -901767 -854582 -798331 -734622
39591 -734622 -666286 -597468 -532974 -477139 -432771 -400719 -380218 -369640 -367182 -371171 -379964 -391767
39579c91767j2903j2359j0862r129p413n438k942k43J826K716K899L858P227J3783
39565d20747K2919L2909M1690M7745N0616N0830M9344M6965M4081M0698L6587
39554D3637L1442K5177J8289J2029Q092P908J1926J9387K8621L7700M5021M9557
39542C38786N0778M8533M3105L5398K6915J9325J3757J0259P838N048Q00n131
39530E95411j2137j9134k4914k8323k8405k4676j7467q135J160Q047J0681Q292
39518D60400J313q872k0392l1402m0539m7228n1764n5021n7959o1069o4165o6649
39506d3347o8067o8543o8649o8740o8357o6211o0990n2343m1304k9777j9534j1488
39494f67350n725j992n4L60k41j127j686j749j637j871k780m186n319n023k184
$$ plain form
39579 -391767 -404670 -417029 -427891 -437020 -444433 -449871 -452813 -453056 -451230 -448514 -445615 -441757 -434530 -420747
39565 -420747 -397828 -364919 -323229 -275484 -224868 -174038 -124694 -77729 -33648 7050 43637
39554 43637 75079 100256 118545 130574 138666 146574 158500 177887 206508 244208 289229 338786
39542 338786 389564 438097 481202 516600 543515 562840 576597 586856 594694 599742 600542 595411
39530 595411 583274 564140 539226 510903 482498 457822 440355 432220 433380 441427 452108 460400
39518 460400 461713 452841 432449 401047 360508 313280 261516 206495 148536 87467 23302 -43347
39506 -43347 -111414 -179957 -248606 -317346 -385703 -451914 -512904 -565247 -606551 -636328 -655862 -667350
39494 -667350 -673075 -675067 -675121 -674761 -675002 -676129 -677815 -679564 -681201 -683072 -685852 -690038 -695357 -700380 -702564
39479g02564L742J2432K2826L3623M3732N2414N9257O4160O7478P0009P2748P6447
39467a23696Q1313Q6876R2087R5578R6132R3135Q6754P7713O6816N4574M1190
39456G48472K6816J1912k601j5430k5183l0750l1644k8167k1274j2259k505O562
39444F23949J3473J6897J5969J0486Q81j1972k6870m2302n6529o7804p4691p6265
39432C25222p2146o2461m7956l0204j1637M941J7193K3971K5475K2849J7542J0868
39420B23657L918k282o796r141r757r993j1452j5026k0303k5736k9401k9899k6890
39407C0899k1014j3285m502M938J4799K4668L3728M0761M4331M3259L7141K6640
39395B62363J3314q97j4205k5385l3967m0115m4298m6910m8154m8172m7134m5066
$$ plain form
39479 -702564 -698822 -686390 -663564 -629941 -586209 -533795 -474538 -410378 -342900 -272891 -200143 -123696
39467 -123696 -42383 44493 136580 232158 328290 421425 508179 585892 652708 707282 748472
39456 748472 775288 787200 784599 769169 743986 713236 681592 653425 632151 619892 617387 623949
39444 623949 637422 654319 670288 680774 681655 669683 642813 600511 543982 476178 401487 325222
39432 325222 253076 190615 142659 112455 100818 105759 122952 146923 172398 195247 212789 223657
39420 223657 227575 225293 218497 209356 199599 189606 178154 163128 142825 117089 87688 57789 30899
39407 30899 9885 -3400 -7902 -2964 11835 36503 70231 110992 155323 198582 235723 262363
39395 262363 275677 274780 260575 235190 201223 161108 116810 69900 21746 -26426 -73560 -118626
39383a18626m1683l6451k9012j9568q974J538J0764J7858K2481K4804K5396K4999
39371a26474K4130K2697J9912J4847P330j433r205j3864j4560j2151q739o752
39359a04262q089j3586k2940l4928m7791n9489o7945p1288o8277n8712m3650k5241
39347f26198o247J0680K3622L1816L5729L6766L6632L6684L7529L9065M0805M2186
39335b60931M2677M1817L9226L4672K8194K0351J2397O072K924L486O926J1457
39323a0732J5265J7360J7777J7148J6032J4491J2162Q559L401l210j0806j8783
39311G8664k6658l4108m0707m5675m7942m6446m0408k9471j3985M682K4018M0893
39299a77143N2448N6941N4142M5325L2938K0020R405K886O85J454K910K852Q6
$$ plain form
39383 -118626 -160309 -196760 -225772 -245340 -254314 -252776 -242012 -224154 -201673 -176869 -151473 -126474
39371 -126474 -102344 -79647 -59735 -44888 -37558 -38991 -48196 -62060 -76620 -88771 -97510 -104262
39359 -104262 -112351 -125937 -148877 -183805 -231596 -291085 -359030 -430318 -498595 -557307 -600957 -626198
39347 -626198 -632445 -621765 -598143 -566327 -530598 -493832 -457200 -420516 -382987 -343922 -303117 -260931
39335 -260931 -218254 -176437 -137211 -102539 -74345 -53994 -41597 -35525 -32601 -29115 -22189 -10732
39323 -10732 4533 21893 39670 56818 72850 87341 99503 108062 111463 108253 97447 78664
39311 78664 52006 17898 -22809 -68484 -116426 -162872 -203280 -232751 -246736 -242054 -218036 -177143
39299 -177143 -124695 -67754 -13612 31713 64651 84671 94076 96962 97647 99101 102011 104863 104949
39286A04949n184j1680j7841k2609k5840k8152l0411l3080l5791l7336l6157l1122
39274b10254k2187j0485K172J4099K4265L2342L8363M2299M3848M2543L8156L0987
39262F6148K1804J1561J146q672j7247k4093k8796l0762k9059k2696j1366M055
39250f7977K1560L8669N3197O3805P0165P2704P2099O8842O3182N5454M6463L7498
39238E95661K9980K4921K2524K2135K2544K2475K0964J7535J2219N542j596q286
39226G86618j4036j8990k3700k8604l3637l8232m1548m2718m0955l5661k6696
39215D41841j4753j464J1026K0805K6746K8518K6262K0389J1660J304r185j8564
39203E44585k6295l2629l8281m4001n0298n7370o5079p2785p9332q3339q3839
$$ plain form
39286 104949 99765 88085 70244 47635 21795 -6357 -36768 -69848 -105639 -142975 -179132 -210254
39274 -210254 -232441 -242926 -240754 -226655 -202390 -170048 -131685 -89386 -45538 -2995 35161 66148
39262 66148 87952 99513 100659 91987 74740 50647 21851 -8911 -37970 -60666 -72032 -67977
39250 -67977 -46417 -7748 45449 109254 179419 252123 324222 393064 456246 511700 558163 595661
39238 595661 625641 650562 673086 695221 717765 740240 761204 778739 790958 796500 794904 786618
39226 786618 772582 753592 729892 701288 667651 629419 587871 545153 504198 468537 441841
39215 441841 427088 425624 436650 457455 484201 512719 538981 559370 571030 572334 563149 544585
39203 544585 518290 485661 447380 403379 353081 295711 230632 157847 78515 -4824 -88663
39192h8663q0741p4820o7218n8905n0411m1822l2846k2939j1587J230J4654K7043
39180d87025L6583M2024M3060M0226L4663K7912K1661J7227J4921J3781J1969
39169a82998P700J98r881k0740l0261l6750l9313l7825l2871k5667j7819j0780
39157d37007n247r60L008P666J3673K1205L0073L9830M9774N8829O5475O7970
39145h5711O4856N5623M1153K3678O275p948j6670j8966j5487q109Q16R317J6334
39132F5161K1772K6139L0054L3776L7040L9285M0126L9748L8824L8021L7400L6171
39120D83517L2977K6588J6656M065r318k1388l0639l6649m0069m2294m4950m9318
39108B89178n5824o3808p1716p7665p9924p7196o8777n4908l7115j8147j242J0883
$$ plain form
39192 -88663 -169404 -244224 -311442 -370347 -420758 -462580 -495426 -518365 -529952 -528722 -514068 -487025
39180 -487025 -450442 -408418 -365358 -325132 -290469 -262557 -240896 -223669 -208748 -194967 -182998
39169 -182998 -175298 -175100 -184981 -205721 -235982 -272732 -312045 -349870 -382741 -408408 -426227 -437007
39157 -437007 -442254 -443214 -440206 -432540 -418867 -397662 -367589 -327759 -277985 -219156 -153681 -85711
39145 -85711 -20855 34768 75921 99599 105874 97926 81256 62290 46803 38694 39510 48827 65161
39132 65161 86933 113072 143126 176902 213942 253227 293353 333101 371925 409946 447346 483517
39120 483517 516494 543082 559738 563803 554485 533097 502458 465809 425740 383446 338496 289178
39108 289178 233354 169546 97830 20165 -59759 -136955 -205732 -260640 -297755 -315902 -317144 -306261
39096c06261J6877J7013J2949P042J527k190l812l983l746l879m522n282n756
39083b84023n893n971o345p340r295j2486j6874k1921k6751l0451l2254l1583
39071d91187k8110k1897j3457l677O456J6124K4910L2741L9510M4692M7274M6164
39059c00457M0848L1859K0779R750Q61m353n058j115O930J7834K9774M0771M9205
39046f2372N4162N5500N3643M9248M2980L5433K7165J8709J0410K327n658j3490
39034B68057k0696k6516l0239l1494l0327k7095k2374j6864j1301o304k296M87
39022D3038J916J830k4l807r260j5453k0849k3794k3119j8650j1273k590N658
39009g6377J2137J6217J8059J8551J8983K0518K3592K7652L1409L3401L2566K8552
$$ plain form
39096 -306261 -289384 -272371 -259422 -252380 -250853 -253043 -256855 -260838 -264584 -268463 -272985 -278267 -284023
39083 -284023 -289916 -295887 -302232 -309572 -318867 -331353 -348227 -370148 -396899 -427350 -459604 -491187
39071 -491187 -519297 -541194 -554651 -558328 -551872 -535748 -510838 -478097 -438587 -393895 -346621 -300457
39059 -300457 -259609 -227750 -206971 -197221 -196360 -200713 -205771 -206886 -199956 -182122 -152348 -111577 -62372
39046 -62372 -8210 47290 100933 150181 193161 228594 255759 274468 284878 287205 281547 268057
39034 268057 247361 220845 190606 159112 128785 101690 79316 62452 51151 44847 42551 43038
39022 43038 44954 46784 46760 42953 33693 18240 -2609 -26403 -49522 -68172 -79445 -82035 -76377
39009 -76377 -64240 -48023 -29964 -11413 7570 28088 51680 79332 110741 144142 176708 205260
38997B05260K1721J2845K717q203j9857l2438m6046o0358p4453q6952r6513j02276
38985b84553j04081j02329r7713r0972q2689p3136o2274n0004l6466k2181p963
38974a014361N380J7248K7401L5958M3281M9783N5682O0843O4776O6801O6254
38963e20954O2724N6278M7557L7760K8328K0508J4891J1232Q657O159L006j072
38951b24926n869j0720j4571j6392j5790j3373j0485q490q107r216j1025j2504
38939c61468j2888j2008j0292q420p001o423o808p893q985r165p817n031j696
38926d65895Q77J569R5k726n325o306n300l157j302q08j882m010o523r047j1552
38911e21292j4030j6144j7227j6666j4299j0470n628M0O478J3256J9270K3163
$$ plain form
38997 205260 226981 239826 242543 234340 214483 182045 135999 75641 1188 -85764 -182277 -284553
38985 -284553 -388634 -490963 -588676 -679648 -762337 -835473 -897747 -947751 -984217 -1006398 -1014361
38974 -1014361 -1008981 -991733 -964332 -928374 -885093 -835310 -779628 -718785 -654009 -587208 -520954
38963 -520954 -458230 -401952 -354395 -316635 -288307 -267799 -252908 -241676 -233019 -226860 -223854 -224926
38951 -224926 -230795 -241515 -256086 -272478 -288268 -301641 -312126 -320616 -328723 -337939 -348964 -361468
38939 -361468 -374356 -386364 -396656 -405076 -412077 -418500 -425308 -433201 -442186 -451351 -459168 -464199 -465895
38926 -465895 -465018 -463449 -463354 -466080 -471405 -477711 -483011 -486168 -487470 -488278 -490160 -494170 -500693 -509740 -521292
38911 -521292 -535322 -551466 -568693 -585359 -599658 -610128 -615756 -615716 -609238 -595982 -576712 -553549
38899e53549K4199K2955K1252K1332K4749L1513M0013M7689N2156N2120M7704
38888a67867M0193L1442K3215J6528J1227O130k50q652j8439k7854l4971l8638
38876a67936l8722l5738l0365k3253j5149o976K61N767R291J1326J2978J5436
38864b63080J9333K4413K9794L4616L8610M2207M6051N0359N4546N7463N7983
38853A92295N5541N0274M2844L4126K4866J5516O206l002j1803j9503k5170k8030
38841C34160k7848k5033k0364j4527p772m6Q527J7082K3844K6623K3750J5029
38829C53425K057j2261k4777l3209l6816l6379l3569l0098k7029k4516k1915j8134
38817E6779j2175l686O785J8013K8587L7243M2952M4991M3160L8034L0873K3170
$$ plain form
38899 -553549 -529350 -506395 -485143 -463811 -439062 -407549 -367536 -319847 -267691 -215571 -167867
38888 -167867 -127674 -96232 -73017 -56489 -45262 -39132 -39382 -48034 -66473 -94327 -129298 -167936
38876 -167936 -206658 -242396 -272761 -296014 -311163 -318139 -317878 -312111 -302820 -291494 -278516 -263080
38864 -263080 -243747 -219334 -189540 -154924 -116314 -74107 -28056 22303 76849 134312 192295
38853 192295 247836 298110 340954 375080 399946 415462 421668 418666 406863 387360 362190 334160
38841 334160 306312 281279 260915 246388 238616 238570 247097 264179 288023 314646 338396 353425
38829 353425 355482 343221 318444 285235 248419 212040 178471 148373 121344 96828 74913 56779
38817 56779 44604 40918 47703 65716 94303 131546 174498 219489 262649 300683 331556 354726
38805C54726J6059R979M773J01m182p920j0807j2569j3048j2209j0161p118l366
38792C04258P73M933Q737J1939J4505J6525J7953J8446J7431J4433R407K889m237
38779D37992j1131j7337k2815k7679l1878l5045l6582l6049l3539k9832k6096
38768A30009k3398k2327k2970k5113k8518l3055l8632m4864n0772n4785n5306
38757b69731n1513m3861l3868k3308j3441m752K767R211J4611J8993K2431K4893
38745c47568K6046K5285K2105J6638R950L842K52O06N490J4465K5997L7642M6740
38732a12510N1460N1467M7728M1659L4372K6432J8099R738K128l507n854m191
38720A57021J109Q581J6309K2684K6819K8440K7484K3881J7591Q843j721j3065
$$ plain form
38805 354726 370785 380764 385537 385638 381456 373536 362729 350160 337112 324903 314742 307624 304258
38792 304258 305031 309964 318701 330640 345145 361670 379623 398069 415500 429933 439340 442229 437992
38779 437992 426861 409524 386709 359030 327152 292107 255525 219476 185937 156105 130009
38768 130009 106611 84284 61314 36201 7683 -25372 -64004 -108868 -159640 -214425 -269731
38757 -269731 -321244 -365105 -398973 -422281 -435722 -440474 -437707 -428496 -413885 -394892 -372461 -347568
38745 -347568 -321522 -296237 -274132 -257494 -247544 -243702 -243450 -242844 -237354 -222889 -196892 -159250 -112510
38732 -112510 -61050 -9583 38145 79804 114176 140608 158707 168445 170573 167066 161212 157021
38720 157021 158130 166711 183020 205704 232523 260963 288447 312328 329919 338762 337041 323976
38708C23976k3914l2979l9245m2291m2538m1192l9816l9649m0985m3031m4160
38697a05824m2553l6864k6834j3583O13J3140K2082K6936K8591K8667K8604K8911
38685d8114K8996K7500K3062J5012L772r205k1906l2391l9363m2382m1781l8384
38673a75184l3314k7840k3089j9672j7372j5340j2694r243n725l401l334n799
38661c52007j0202j5330j9770k2313k2230j9341j3765n653M748J6703K8719L8890
38649c91551M5660M8448M7580M3744L7516K9290J9689R957J991k231j529L900
38637a07536J2498K1978L0014L4749L5082L0868K3003J3219L592m095q895j0895
38625G3582j1016j0459j0119j0320j0985j1975j3242j4702j5993j6379j4908j0725
$$ plain form
38708 323976 300062 267083 227838 185547 143009 101817 62001 22352 -18633 -61664 -105824
38697 -105824 -148377 -185241 -212075 -225658 -225045 -211905 -189823 -162887 -134296 -105629 -77025 -48114
38685 -48114 -19118 8382 31444 46456 50228 41023 19117 -13274 -52637 -95019 -136800 -175184
38673 -175184 -208498 -236338 -259427 -279099 -296471 -311811 -324505 -333748 -339473 -342874 -346208 -352007
38661 -352007 -362209 -377539 -397309 -419622 -441852 -461193 -474958 -480611 -475863 -459160 -430441 -391551
38649 -391551 -345891 -297443 -249863 -206119 -168603 -139313 -119624 -109667 -107676 -109907 -111436 -107536
38637 -107536 -95038 -73060 -43046 -8297 26785 57653 80656 93875 97467 93372 84477 73582
38625 73582 62566 52107 41988 31668 20683 8708 -4534 -19236 -35229 -51608 -66516 -77241
38613g7241l430O680J8683L1275M3092N2934N9877O3377O3218N9301N1572M0227
38601D09565K6199J1324k082j2042j7632j9184j7983j5581j3046j0564p655l802
38589C27517R97O172J0894J4419J6233J5960J3239P785m15j0762k1975l2359m0307
38576C07398m4669m4800m0477l1972k0245p017N576J5685K2397K6019K7971L0303
38564B46169L5039M3382N5053O8094P9370Q5610Q4539P5633O0189M0752K0227
38553H94057J066j5109k7465l5760m0181m1291l9964l7210l3910l0603k7440k4309
38541E41881k1028j7523j3986j0814q448p034o214n266l582j145J265K344P82
38528D51232m291j3036k4824l8250n1305o1860o8355p0342o8481o4010n8039n1068
$$ plain form
38613 -77241 -80671 -73991 -55308 -24033 19059 71993 131870 195247 258465 317766 369338 409565
38601 409565 435764 447088 445006 432964 415332 396148 378165 362584 349538 338974 331319 327517
38589 327517 328514 334686 345580 359999 376232 392192 405431 413216 412801 402039 380064 347705 307398
38576 307398 262729 217929 177452 145480 125235 118218 123794 139479 161876 187895 215866 246169
38564 246169 281208 324590 379643 447737 527107 612717 697256 772889 833078 873830 894057
38553 894057 895123 880014 852549 816789 776608 735317 695353 658143 624233 593630 566190 541881
38541 541881 520853 503330 489344 478530 470082 463048 456834 451568 447986 446841 448106 450450 451232
38528 451232 446941 433905 409081 370831 319526 257666 189311 118969 50488 -13522 -71561 -122629
38516a22629m3024l3614k2816j1205O5R600J6129J8680J6694J0130k61j2759k4907
38503a99917l4081l8243l6459k8989j7003k178J3561K8224L9907M7076M8909M5644
38491a33549L8675L0214K2447J6568J2380Q723M355j361q183j5121k0827k4250
38479f9929k5249k4633k3443k2065k0010j6502j1255m779J938P923J2407J4755
38467a80842J4393J1028N039k303r096j3516j4444j1700n906J714R561J6013J9906
38454a60153K0875J9355J6272J2729R703P697O507N409L792J810M62J177N184
38441d9181J3032K4260L7289M9686N8822O2650O0233N1836L8718K2678N504j1485
38429C64042k7550m2299n5377o6292p4469p9392q0766p8652p3478o5932n6768
$$ plain form
38516 -122629 -165653 -199267 -222083 -233288 -233223 -223623 -207494 -188814 -172120 -161990 -162251 -175010 -199917
38503 -199917 -233998 -272241 -308700 -337689 -354692 -356870 -343309 -315085 -275178 -228102 -179193 -133549
38491 -133549 -94874 -64660 -42213 -25645 -13265 -4542 -187 -1548 -9731 -24852 -45679 -69929
38479 -69929 -95178 -119811 -143254 -165319 -185329 -201831 -213086 -217865 -215927 -208004 -195597 -180842
38467 -180842 -166449 -155421 -150382 -152685 -161781 -175297 -189741 -201441 -207347 -205633 -196072 -180059 -160153
38454 -160153 -139278 -119923 -103651 -90922 -81219 -73522 -67015 -61606 -57814 -56004 -55542 -54365 -49181
38441 -49181 -36149 -11889 25400 75086 133908 196558 256791 308627 347345 370023 375527 364042
38429 364042 336492 294193 238816 172524 98055 18663 -62103 -140755 -214233 -280165 -336933
38418c36933m6658l6146k5620j5244m885N752J6739K7553L7068M4023M7627M7902
38406b38822M5689M2420L9743L8939M0361M3310M6544M9073N0604N1302N1168
38395B60331M9673M5980L9514L0381J9302P154n415j8029l0232m1131m9387n3678
38383B54463n3313m8481l9975k8692j5407r04J3716K7039L7621M4473M7297M6396
38371B84233M2294L5513K6649J6533O175l518j1780j7775k0528j9354j4579p909
38359C15954k068J17l251j2448k6063m1498n5798o6356p1389p0256o3519n2676
38347a49251l9559k5814j2748j557O517J0312R182L480n220j4389k1347k4277
38335b64671k2881j8330j2574p446l961k005n56J647N256R918J4623J8515K1408
$$ plain form
38418 -336933 -383591 -419737 -445357 -460601 -465486 -459734 -442995 -415442 -378374 -334351 -286724 -238822
38406 -238822 -193133 -150713 -110970 -72031 -31670 11640 58184 107257 157861 209163 260331
38395 260331 310004 355984 395498 425879 445181 452335 446920 428891 398659 357528 308141 254463
38383 254463 201150 152669 112694 84002 68595 67691 81407 108446 146067 190540 237837 284233
38371 284233 326527 362040 388689 405222 411397 407879 396099 378324 357796 338442 323863 315954
38359 315954 313886 314003 310752 298304 272241 230743 174945 108589 37200 -33056 -96575 -149251
38347 -149251 -188810 -214624 -227372 -228929 -222412 -212100 -202918 -199438 -204658 -219047 -240394 -264671
38335 -264671 -287552 -305882 -318456 -325902 -329863 -331868 -332424 -330777 -325521 -315603 -300980 -282465 -261057
38322b61057K3693K5896K8387L1312L4592L7851M0429M1632M1056L8824L5644
38311A18259L2667L1172L2066L5427M0285M4898M7414M6534M1782L3301K1505
38300E25310O958r467k6412m2138n4901o3494o7662o8226o6701o4515o2296n9664
38288e3208n5599m9165m0066k8757j6192l383Q863J9998K9627L7445M3154M6418
38276f0865M6831M4080L8240K9984K0520J1293L570j780m289l786k94N961J4489
38263A43954K4462L4710M3805N0236N2670N0301M3201L2479K0169Q744M10l509
38251E01632k925J149O951J2487J6026J6605J4408J0650P003M861M970P460J1990
38238F13267J7761K3515K7832K9650K8646K5251K0382J5134J0558P488O263O469
$$ plain form
38322 -261057 -237364 -211468 -183081 -151769 -117177 -79326 -38897 2735 43791 82615 118259
38311 118259 150926 182098 214164 249591 289876 334774 382188 428722 470504 503805 525310
38300 525310 532268 522801 496389 454251 399350 335856 268194 199968 133267 68752 6456 -53208
38288 -53208 -108807 -157972 -198038 -226795 -242987 -246370 -237507 -217509 -187882 -150437 -107283 -60865
38276 -60865 -14034 30046 68286 98270 118790 130083 133653 131873 127584 123798 123504 129465 143954
38263 143954 168416 203126 246931 297167 349837 400138 443339 475818 495987 504731 505141 501632
38251 501632 498707 499856 506807 519294 535320 551925 566333 576983 583986 588847 593817 601277 613267
38238 613267 631028 654543 682375 712025 740671 765922 786304 801438 811996 819484 825747 832216
38226H32216O963O391M003J68l784o312o496m575j976q27l062r602j9998l2753
38212G60356m5962n7892o7239p3223p5572p4367o9748o1699n0193l5827k0288
38201A28346o042M830J1700J5371J6956J6740J3994P816j847j3829k6205l7174
38189A30656m5713n1574n4816n5429n3329m8684m2091l4484k6806j9687j3213
38178c15170o901K3Q179J7593K7466L6275M2179M3595L9776L1127J9190O300m999
38165e5367j2656j5636j4099r155k453M177R015J0744Q751L315m586j3763k3310
38152a15023l2680m1393m8754n3900n6109n4995n0512m2919l2850k1303r459J636
38140e58261J1259J9032K4912K9251L2828L6632M1462M7502N4299O1049O6922
$$ plain form
38226 832216 839179 845570 849573 849741 845957 839645 833149 828574 826598 825771 822709 813107 793109 760356
38212 760356 714394 656502 589263 516040 440468 366101 296353 234654 184461 148634 128346
38201 128346 122304 127134 138834 154205 171161 187901 201895 209711 207864 194035 167830 130656
38189 130656 84943 33369 -21447 -76876 -130205 -178889 -220980 -255464 -282270 -301957 -315170
38178 -315170 -322071 -322048 -313869 -296276 -268810 -232535 -190356 -146761 -106985 -75858 -56668 -50368 -55367
38165 -55367 -68023 -83659 -97758 -106913 -109366 -105189 -96174 -85430 -76679 -73364 -77950 -91713 -115023
38152 -115023 -147703 -189096 -237850 -291750 -347859 -402854 -453366 -496285 -529135 -550438 -559897 -558261
38140 -558261 -547002 -527970 -503058 -473807 -440979 -404347 -362885 -315383 -261084 -200035 -133113
38129a33113P1128P2888P1560O6897N9102M8556L5495K0062K726j5311l2126m5513
38117B22351n3627n5552n1615m3221l2246k0273q086M242J6801K9168M0105M7762
38105I5809N0306M6687L7172K3461Q319n101j4014j6675j2762l439R010K1808
38093B40581L2478L9463M2411M2033L9597L6376L3313L0906K9138K7371K4394
38082F18061J8809R751k521j6486k9853m0322m6269m7049m3001l5303k5804j6694
38070C43319j0046p329r100j5013k3970l4319m4069n1231n4270n2500m6183l6329
38058d1040k4383j1976p22Q088J3839J6794J7894J8240J8541J8869J8844J8082
38046G1070J6575J4712J2971J1533J0137Q327N866K984K99j541k208j849j027
$$ plain form
38129 -133113 -61985 10903 82463 149360 208462 257018 292513 312575 315301 299990 267864 222351
38117 222351 168724 113172 61557 18336 -13910 -34183 -42269 -38027 -21226 7942 48047 95809
38105 95809 146115 192802 229974 253435 261754 256653 242639 225964 213202 209763 218773 240581
38093 240581 273059 312522 354933 396966 436563 472939 506252 537158 566296 593667 618061
38082 618061 636870 646621 644100 627614 597761 557439 511170 464121 421120 385817 360013 343319
38070 343319 333273 325944 316844 301831 277861 243542 199473 148242 93972 41472 -4711 -41040
38058 -41040 -65423 -77399 -78121 -70033 -56194 -39400 -21506 -3266 15275 34144 52988 71070
38046 71070 87645 102357 115328 126861 136998 145325 151191 154175 154474 152933 150725 148876 147849
38033A47849m83p99k098l929n488o090n603m623m224n430q571j2935j6979j9000
38019E1597j7881j3441o373K031J0193J6664K0622K2108K1799K0408J8251J5247
38007A61225J1297O638J915k010m415m868l128J163Q512J9148L2406M6467N8847
37994C33197O7255P0356O8025O1161N1294M0125K9024J8641Q809j129j1704k2758
37982G12296l3319m1961m7431m9205m7758m4446m0991l8805l8520m0003m2733
37971B47124m6107m9437n1873n2577n1257m8562m5841m4227m3678m2722l9225
37960b68382l1681k0119o004Q628K1998L2861M0323M3733M2829L7972L0136K0738
37948d6968J1408L794p64j577J205O715J3719K0966K7432L2413L5570L7004L7195
$$ plain form
38033 147849 147366 146567 144469 140540 135052 128962 123359 118736 114512 109082 100511 87576 70597 51597
38019 51597 33716 20275 13902 15933 26126 42790 63412 85520 107319 127727 145978 161225
38007 161225 172522 179160 181075 179065 174650 169782 166654 167817 176329 195477 227883 274350 333197
37994 333197 400452 470808 538833 599994 651288 691413 720437 739078 747887 746758 735054 712296
37982 712296 678977 637016 589585 540380 492622 448176 407185 368380 329860 289857 247124
37971 247124 201017 151580 99707 47130 -4127 -52689 -98530 -142757 -186435 -229157 -268382
37960 -268382 -300063 -320182 -326186 -317558 -295560 -262699 -222376 -178643 -135814 -97842 -67706 -46968
37948 -46968 -35560 -31766 -32530 -34107 -32902 -26187 -12468 8498 35930 68343 103913 140917 178112
37935A78112L6748L6006L4832L2934L0354K7690K5729K5024K5850K8497L3288
37924E15064M0115M7879N4459N7450N5151M7225L4694J9381L290j1712k3986l2188
37912H06822l5588l4484l0278k5069k0847j8804j9153k1471k5151k9651l4455
37901E11871l8913m2220m3543m2315l8526l2804k6261k0133j5442j2782j2218
37890A86714j3299j5159j6727j7085j5845j3430j0884r236q758q713p711m363
37878D5504K132J1711K3409L5620M6490N4300N7830N6666N1405M3532L4888K7099
37866D90586K1241J7860J6982J8053J9931K1201K0665J7761J2583N654k251j0098
37854F50168j6540k0120j9689j4809n897N876J8821L1033M0801M6892M8669M6046
$$ plain form
37935 178112 214860 250866 285698 318632 348986 376676 402405 427429 453279 481776 515064
37924 515064 555179 603058 657517 714967 770118 817343 852037 871418 874708 862996 839010 806822
37912 806822 771234 736750 706472 681403 660556 641752 622599 601128 575977 546326 511871
37901 511871 472958 430738 387195 344880 306354 273550 247289 227156 211714 198932 186714
37890 186714 173415 158256 141529 124444 108599 95169 84285 75049 66291 57578 49867 45504
37878 45504 47636 59347 82756 118376 164866 219166 276996 333662 385067 428599 463487 490586
37866 490586 511827 529687 546669 564722 584653 605854 626519 644280 656863 662517 660266 650168
37854 650168 633628 613508 593819 579010 573113 578989 597810 628843 669644 716536 765205 811251
37842H11251L9462K9837J8372O211n789j7002k6814l4523l9504m1570m1240l9761
37830F58930l8693l9190m1362m4091m5538m3995l8612k9576j7816m642Q443J9871
37818C43729K8247L2696L3042K9749K3668J5814P194j307q997j5374k0120k3070
37806D45271k4186k3496k1129j7471j3297r640p482p445r654j3715j8758k3674
37794B55324k7559l0118l1703l2873l3893l4464l3883l1432k6783k0154j2185
37783e9723l674M626J2071J8184K2807K6191K8828L1193L3629L6415L9759M3579
37771B33885M7309M9981N0613M8594M3894L7016K8768J9888J0746J250q858j9489
37759E43597k9803l8345m3761m5608m4690m2530m0457l8928l7488l5222l1329
$$ plain form
37842 811251 850713 880550 898922 905133 899344 882342 855528 821005 781501 739931 698691 658930
37830 658930 620237 581047 539685 495594 450056 406061 367449 337873 320057 315415 323858 343729
37818 343729 371976 404672 437714 467463 491131 506945 514139 512832 503835 488461 468341 445271
37806 445271 421085 397589 376460 358989 345692 336052 328570 321125 311471 297756 278998 255324
37794 255324 227765 197647 165944 133071 99178 64714 30831 -601 -27384 -47538 -59723
37783 -59723 -63397 -58771 -46700 -28516 -5709 20482 49310 80503 114132 150547 190306 233885
37771 233885 281194 331175 381788 430382 474276 511292 540060 559948 570694 571944 563086 543597
37759 543597 513794 475449 431688 386080 341390 298860 258403 219475 181987 146765 115436
37748A15436k5458j7807r001P8Q416J5072J9443K1540K1993K1741K1607K2093
37736B15153K3346K5156K6941K7796K6789K3239J6841P667l709j6012k7300l5614
37724C10293l9939m0809m0033l9679m0991m3844m6962m8723m8060m4987m0541
37713a64275l6250l3584l3560l6581m2302m9644n6909o2074o3227n9006m9042
37702f86454l4179j6222K715K1024L7967N3453O7406P9369Q8564R4300R6184R4076
37690a01797Q8006P8390O6409N4106M3887L7598L5724L7160L9665M0761L8703
37679D58612L3055K4564J4430L496p953j9751l1281m1394m8952n3553n5811n7023
37667B18439n8457o0808o4091o7828p1250p3350p3054o9489o2316n1745l8363
$$ plain form
37748 115436 89978 72171 63170 63248 71664 86736 106179 127719 149712 171453 193060 215153
37736 215153 238499 263655 290596 318392 345181 368420 385261 392928 389219 373207 345907 310293
37724 310293 270354 229545 189512 149833 108842 64998 18036 -30687 -78747 -123734 -164275
37713 -164275 -200525 -234109 -267669 -304250 -346552 -396196 -453105 -515179 -578406 -637412 -686454
37702 -686454 -720633 -736855 -734140 -713116 -675149 -621696 -554290 -474921 -386357 -292057 -195873 -101797
37690 -101797 -13791 64599 131008 185114 229001 266599 302323 339483 379148 419909 458612
37679 458612 491667 516231 530661 534157 526204 506453 475172 433778 384826 331273 275462 218439
37667 218439 159982 99174 35083 -32745 -103995 -177345 -250399 -319888 -382204 -433949 -472312
37656d72312k2884o067J1157K7503M1330N0980N5464N4940N0664M4389L7690L1585
37644i5561K6507K2491J9506J7730J7627J9618K3584K8614L3143L5550L4813L0947
37632B14569K4936J8170J1814O326J387l895j0495j8906k8680l8379m5939m9264
37620H1644m6793l7942k3203l986J7724L9612N9211P4218Q3072Q5410Q2040P4459
37608D85466O4299N3165M2592L4051K8743K7370K9929L5505M2267M7846N0124
37597I41357M8036M1891L3168K4021J6623J2474J1839J3683J6259J7927J7741
37586A195019J5506J1510O249K53o073j2682k0001k8732l9395n1945o5659p9253
37574I24797r0972r8774j00769r6000q5070p0107n3980l9244k7330j8467j2181
$$ plain form
37656 -472312 -495196 -501263 -490106 -462603 -421273 -370293 -314829 -259889 -209225 -164836 -127146 -95561
37644 -95561 -69054 -46563 -27057 -9327 8300 27918 51502 80116 113259 148809 183622 214569
37632 214569 239505 257675 269489 275815 277202 273307 262812 243906 215226 176847 130908 81644
37620 81644 34851 -3091 -26294 -30280 -12556 27056 86267 160485 243557 328967 411007 485466
37608 485466 549765 602930 645522 679573 708316 735686 765615 801120 843387 891233 941357
37597 941357 989393 1031284 1064452 1088473 1105096 1117570 1129409 1143092 1159351 1177278 1195019
37586 1195019 1210525 1222035 1228284 1228537 1222464 1209782 1189781 1161049 1121654 1069709 1004050 924797
37574 924797 833825 735051 634282 538282 453212 383105 329125 289881 262551 244084 231903
37563B31903q046o089o723j0410j7249k6714l7534m7905n6057o0845o1950n9557
37551a67176n3855m4782l2128j5959K995K3268M2995O0431P4300Q3919Q9220R0792
37539A54020Q9672Q6833Q2719P7249P0355O2439N4331M6878M0577L5545L1570
37528H32188K8107K4292J9261J2687N049k637r578j5745k1824k8604l6302m4256
37516G62638n1108n5318n5746n2115m5183l6471k7649j9928j3761q990n228k266
37504C88875k80K21j293n044j0819j8062k6005l3630l9542m2120m0077l3153k2500
37491A16571j0457K77P584J0531R502N888J548j821l231k617n44K301N439Q557
37477A49528J1296J3182J3798J2949J0768P633M053M97k718n485p762r401j0065
$$ plain form
37563 231903 223857 217768 211045 200635 183386 156672 119138 71233 15176 -45669 -107619 -167176
37551 -167176 -221031 -265813 -297941 -313900 -310905 -287637 -244642 -184211 -109911 -25992 63228 154020
37539 154020 243692 330525 413244 490493 560848 623287 677618 724496 765073 800618 832188
37528 832188 860295 884587 903848 916535 921584 918947 909369 893624 871800 843196 806894 762638
37516 762638 711530 656212 600466 548351 503168 466697 439048 419120 405359 396369 391141 388875
37504 388875 388595 388816 387523 382479 371660 353598 327593 293963 254421 212301 172224 139071 116571
37491 116571 106114 106391 113975 124506 134008 139896 141444 139623 136392 133775 133231 135532 140971 149528
37477 149528 160824 174006 187804 200753 211521 219154 223207 223704 220986 215501 207739 198338 188273
37464A88273r338o925k866K397Q091J3323J7350J9760K0479J9632J7394J3923
37452C01493R337L785k363q389j3308j6221j6692j4824j1054n903J49O576J2717
37439B45303J7807K1228K2905K3460K3895K4945K6558K7900K7894K5890K1986
37428E09771J6897J1457O404K446N06J573O094J3356K1371K7631L0293K9116K5580
37415G02495K2047K0555K1943K5634L0103L3605L4893L3585L0078K5201J9867
37404A000006J4897J0915Q251O870O445O565O965P685Q997J0988J3127J4227J2986
37391A128924Q757J969o071j3664j9259k1800k0837j6537r656j611N642J0078
37379A045935J0369O431o18q993j7041k3905k9878l6233m4468n5421o8696q2741
$$ plain form
37464 188273 178935 172010 169144 171541 179632 192955 210305 230065 250544 270176 287570 301493
37452 301493 310830 314615 312252 303863 290555 274334 257642 242818 231764 225861 226010 232586 245303
37439 245303 263110 284338 307243 330703 354598 379543 406101 434001 461895 487785 509771
37428 509771 526668 538125 544529 546975 547481 549054 555148 568504 589875 617506 647799 676915 702495
37415 702495 724542 745097 767040 792674 822777 856382 891275 924860 954938 980139 1000006
37404 1000006 1014903 1025818 1034069 1040939 1047384 1053949 1060914 1068599 1077596 1088584 1101711 1115938 1128924
37391 1128924 1137681 1139650 1133579 1119915 1100656 1078856 1058019 1041482 1031826 1030215 1035857 1045935
37379 1045935 1056304 1062735 1062117 1053124 1036083 1012178 982300 946067 901599 846178 777482 694741
37367F94741r5479j05052j10318j10826j06495r7326q3432o5396m4459k2439j303
37356a47784J7297L2388M3786N1866N7111N9680N9352N5914M9628M1430L2692
37345C53360K4763J8590J4607J2836J3057J4815J7364J9734K0967K0450J8037
37334E48580J4037R066L866r12m986q519j1884j5247j8359k0758k2208k3056k4145
37321D25475k6309k9666l3280l5426l4470k9746k1893j2505l373M184R650J3241
37309B25882J5615J7445J9196K1119K3432K6323K9622L2458L3341L0835K4279
37298D99547J4130J684j1422k3743l4304m2634m8453n1272n0344m5106l5802k3634
37286A48647j0373K348J3480K2702L0250L6644M2343M7565N2303N6511O0212O3450
$$ plain form
37367 694741 599262 494210 383892 273066 166571 69245 -14187 -79583 -124042 -146481 -147784
37356 -147784 -130487 -98099 -54313 -2447 54664 114344 173696 229610 279238 320668 353360
37345 353360 378123 396713 411320 424156 437213 452028 469392 489126 510093 530543 548580
37334 548580 562617 571683 575549 574637 569651 561132 549248 534001 515642 494884 472676 449620 425475
37321 425475 399166 369500 336220 300794 266324 236578 214685 202180 198807 202991 212641 225882
37309 225882 241497 258942 278138 299257 322689 349012 378634 411092 444433 475268 499547
37298 499547 513677 515361 503939 480196 445892 403258 354805 303533 253189 208083 172281 148647
37286 148647 138274 140622 154102 176804 207054 243698 286041 333606 385909 442420 502632 566082
37274E66082O6112O7828O8060O6387O2805N7871N2554M7864M4487M2493M1275
37263A183818L9669L6369L0449K1837J1376N74q897j5657j8883j8362j4398p671
37251A240224Q32R993J8785K6503L2774L7354L9923M0094L7590L2456K5099J6157
37239A557784O265m089j4517k4478l3091l9187m1669l9910l3958k4347j1777L163
37227A300189J9792L6953N2756O4835P1043P0210O2581M9798L4467J9445O970
37216A789039j874p234j0003j1281j2018j2981j4756j7707k1948k7420l3931m1010
37204A576876m7712n2697n4757n3469m9410m3799l7794l1965k6132j9632j1835
37193A147674k611P545J7774K7196L5084M0749M3607M3500M1062L7657L4764L3190
$$ plain form
37274 566082 632194 700022 768082 834469 897274 955145 1007699 1055563 1100050 1142543 1183818
37263 1183818 1223487 1259856 1290305 1312142 1323518 1324092 1315195 1299538 1280655 1262293 1247895 1240224
37251 1240224 1241056 1251049 1269834 1296337 1329111 1366465 1406388 1446482 1484072 1516528 1541627 1557784
37239 1557784 1564049 1559960 1545443 1520965 1487874 1448687 1407018 1367108 1333150 1308803 1297026 1300189
37227 1300189 1319981 1356934 1409690 1474525 1545568 1615778 1678359 1728157 1762624 1782069 1789039
37216 1789039 1787165 1779931 1769928 1758647 1746629 1733648 1718892 1701185 1679237 1651817 1617886 1576876
37204 1576876 1529164 1476467 1421710 1368241 1318831 1275032 1237238 1205273 1179141 1159509 1147674
37193 1147674 1145063 1152608 1170382 1197578 1232662 1273411 1317018 1360518 1401580 1439237 1474001 1507191
37181A507191L2706L2369L1162K8531K4442J9208J3250P030R25m954j0923j7529
37169A663408k4976l2470l8114l9544l5032k4479r726N908J8634K5406K4892J7845
37157A551752O688n434j5705k2404k5230k5017k3049k0219j6696j2231o832j097
37145A384526M122Q340J1877J5670K0702K7288L4704M1355M5445M5826M2525L6743
37133A719123L0385K5382K3092K4060K8198L5229M4953N7167P1259Q5961R9522
37122B244331J10216J16805J18624J15369J07006R3972P7534N9703M2663K8024
37112C114247J6461Q036K877J727N901J6599L4090N7199Q3550J10278J34874J55788
37100C741627J72661J86286J98271K10606K25109K42975K64531K89215L15803
$$ plain form
37181 1507191 1539897 1572266 1603428 1631959 1656401 1675609 1688859 1695889 1696814 1691860 1680937 1663408
37169 1663408 1638432 1605962 1567848 1528304 1493272 1468793 1459067 1464975 1483609 1509015 1533907 1551752
37157 1551752 1558440 1553006 1537301 1514897 1489667 1464650 1441601 1421382 1404686 1392455 1385623 1384526
37145 1384526 1388648 1396988 1408865 1424535 1445237 1472525 1507229 1548584 1594029 1639855 1682380 1719123
37133 1719123 1749508 1774890 1797982 1822042 1850240 1885469 1930422 1987589 2058848 2144809 2244331
37122 2244331 2354547 2471352 2589976 2705345 2812351 2906323 2983857 3043560 3086223 3114247
37112 3114247 3130708 3138744 3141621 3143348 3149249 3165848 3199938 3257137 3340687 3450965 3585839 3741627
37100 3741627 3914288 4100574 4298845 4509451 4734560 4977535 5242066 5531281 5847084
37091E847084L42769L68623L92099M11966M26610M33604M29872M12483L79754
37082I444864L32079K72080K04236J34058O7035P524m2043q1368j11917j36213
37072A0090335j56986j76341j95029k12214k25898k33913k34879k28479k14975
37063H211621j94528j67079j33046r4137n3497j4800J9099M7000O9389Q7882J04524
37052G882428J21118J38528J56219J72378J84621J90848J89720J80716J64028
37043I380604J40425J11115P7718M2350P845k2421m5149n7923n9706n0821l2710
37032I491327p747K0986N0035P6068R6282J08564J11533J04626Q8314O4255L5167
37021A0239410M335k5110n0883p1897q8181j00505j09889j17269j23435j29119
$$ plain form
37091 5847084 6189853 6558476 6950575 7362541 7789151 8222755 8652627 9065110 9444864
37082 9444864 9776943 10049023 10253259 10387317 10454352 10461876 10419833 10338465 10226548 10090335
37072 10090335 9933349 9757008 9561979 9349765 9123867 8889954 8655075 8426596 8211621
37063 8211621 8017093 7850014 7716968 7622831 7569334 7554534 7573633 7620633 7690022 7777904 7882428
37052 7882428 8003546 8142074 8298293 8470671 8655292 8846140 9035860 9216576 9380604
37043 9380604 9521029 9632144 9709862 9752212 9760057 9737636 9692487 9634564 9574858 9524037 9491327
37032 9491327 9483580 9504566 9554601 9630669 9726951 9835515 9947048 10051674 10139988 10204243 10239410
37021 10239410 10243745 10218635 10167752 10095855 10007674 9907169 9797280 9680011 9556576 9427457
37011I427457j35011j41452j47940j52909j54120j49647j38909j23027j04347
37002H180095q5356o7692n1773l7099k2871q494O216K1053L5447M8568N9541O7750
36990H145385P3216P6811Q0069Q4607R1300R9848J09020J17397J24094J28956
36980I130703J32282J34385J35344J35107J33792J31945J30478J30399J32496
36971A0326931J37253J44891J55425J68604J83846K00376K17486K34876K52794
36962A2022482K71884K92815L15831L40444L65484L89539M11550M31277M49326
36953A5290632M66814M84871N04320N25550N48580N73230N99411O27372O57739
36944B0278519O91194P28028P67940Q10300Q54645R01109R50482J004029J063195
$$ plain form
37011 9427457 9292446 9150994 9003054 8850145 8696025 8546378 8407469 8284442 8180095
37002 8180095 8094739 8027047 7975274 7938175 7915304 7906810 7913026 7934079 7969526 8018094 8077635 8145385
36990 8145385 8218601 8295412 8375481 8460088 8551388 8651236 8760256 8877653 9001747 9130703
36980 9130703 9262985 9397370 9532714 9667821 9801613 9933558 10064036 10194435 10326931
36971 10326931 10464184 10609075 10764500 10933104 11116950 11317326 11534812 11769688 12022482
36962 12022482 12294366 12587181 12903012 13243456 13608940 13998479 14410029 14841306 15290632
36953 15290632 15757446 16242317 16746637 17272187 17820767 18393997 18993408 19620780 20278519
36944 20278519 20969713 21697741 22465681 23275981 24130626 25031735 25982217 26986246 28049441
36935B8049441J129219J202843J284269J373493J470829J577356J695070J826616
36927C9609136J974820K142246K330998K542759K778876L040432L328459L644424
36919F1392150L990677M370527M787820N246253N748769O297253O892634P535169
36911A06261252Q224571Q959671R737664J0553244J1397731J2258155J3116338
36904A80508626J3948106J4722732J5402621J5943671J6297056J6412768J6244397
36897B89479977J5753905J4915312J3717078J2163850J0277854Q099265N684167
36890C70091408L099783M18708k285293m939145p471553r814890j1907589j3695842
36882C23495587j5135008j6192499j6852887j7122906j7032966j6633492j5987439
$$ plain form
36935 28049441 29178660 30381503 31665772 33039265 34510094 36087450 37782520 39609136
36927 39609136 41583956 43726202 46057200 48599959 51378835 54419267 57747726 61392150
36919 61392150 65382827 69753354 74541174 79787427 85536196 91833449 98726083 106261252
36911 106261252 114485823 123445494 133183158 143736402 155134133 167392288 180508626
36904 180508626 194456732 209179464 224582085 240525756 256822812 273235580 289479977
36897 289479977 305233882 320149194 333866272 346030122 356307976 364407241 370091408
36890 370091408 373191191 373609899 371324606 366385461 358913908 349099018 337191429 323495587
36882 323495587 308360579 292168080 275315193 258192287 241159321 224525829 208538390
36875B08538390j5161783j4220303j3218681j2201919j1203555j0246203r343059
36868A22942887q500186p719024o998484o336339n729894n176165m671759m212661
36860G3598375l794241l411643l060404k736940k438631k163472j909533j674671
36852E2408840j456612j253245j062697q83132p12507n48571l89045k31601p3628
36843D5797802Q7959K56482M34936O25497Q29410J047268J279440J526360J788659
36834E3673813K067101K362496K675564L006809L356436L724320M109848M511457
36826G9487844M925786N346925N765878O170258O543757O865331P108452P241381
36818A29455612P229442P040038O649760O051432N258051M301755L228081K087880
$$ plain form
36875 208538390 193376607 179156304 165937623 153735704 142532149 132285946 122942887
36868 122942887 114442701 106723677 99725193 93388854 87658960 82482795 77811036 73598375
36860 73598375 69804134 66392491 63332087 60595147 58156516 55993044 54083511 52408840
36852 52408840 50952228 49698983 48636286 47753154 47040647 46492076 46103031 45871430 45797802
36843 45797802 45885761 46142243 46577179 47202676 48032086 49079354 50358794 51885154 53673813
36834 53673813 55740914 58103410 60778974 63785783 67142219 70866539 74976387 79487844
36826 79487844 84413630 89760555 95526433 101696691 108240448 115105779 122214231 129455612
36818 129455612 136685054 143725092 150374852 156426284 161684335 165986090 169214171 171302051
36810A71302051R29839k03610j275666k250783l090340l752723m199441m404544
36802A53054783m362144m088176l616072k988887k251242j443666o00446K49716
36794A33953866J081671J871802K596325L229846L744353M109382M294257M272675
36786A59154177M028707L562073K890118K045266J069008M951j106796k232516
36778A69414988l344412m416544n419076o314744p061361p620426p967544q099209
36770A19171672q033082p802675p449416p015038o536171o041728n552621n082767
36762F5658174m640547m230319l853719l510530l199144k916929k660851k428263
36754C8217872k217368k027161j856845j705162j570044j448824j338916j238440
$$ plain form
36810 171302051 172231890 172028280 170752614 168501831 165411491 161658768 157459327 153054783
36802 153054783 148692639 144604463 140988391 137999504 135748262 134304596 133704150 133953866
36794 133953866 135035537 136907339 139503664 142733510 146477863 150587245 154881502 159154177
36786 159154177 163182884 166744957 169635075 171680341 172749349 172754300 171647504 169414988
36778 169414988 166070576 161654032 156234956 149920212 142858851 135238425 127270881 119171672
36770 119171672 111138590 103335915 95886499 88871461 82335290 76293562 70740941 65658174
36762 65658174 61017627 56787308 52933589 49423059 46223915 43306986 40646135 38217872
36754 38217872 36000504 33973343 32116498 30411336 28841292 27392468 26053552 24815112
36746B4815112j146368j062110r84959r13948q48224p87608p32744o84608o43601
36737A7010942o08936n78813n51246n24860m99101m73845m48930m24028l98807
36728A2502376l73154l47146l20899k94517k68184k42287k17333j93752j71812
36719A0073292j51850j34644j21525j14008j13112j18775j29712j43716j58183
36710H887767j70603j78982j82236j80455j74821j67086j58880j51270j44828
36701G378606j39826j36351j34201j32921j31981j31016j29853j28379j26411
36692F187667j23764j20565j17534j15935j16953j20874j26627j32215j35650
36683E077550j35784j32554j26721j19399j11579j03782r5902q7385p7508o5654
$$ plain form
36746 24815112 23668744 22606634 21621675 20707727 19859503 19071895 18339151 17654543 17010942
36737 17010942 16402006 15823193 15271947 14747087 14247986 13774141 13325211 12901183 12502376
36728 12502376 12129222 11782076 11461177 11166660 10898476 10656189 10438856 10245104 10073292
36719 10073292 9921442 9786798 9665273 9551265 9438153 9319378 9189666 9045950 8887767
36710 8887767 8717164 8538182 8355946 8175491 8000670 7833584 7674704 7523434 7378606
36701 7378606 7238780 7102429 6968228 6835307 6703326 6572310 6442457 6314078 6187667
36692 6187667 6063903 5943338 5825804 5709869 5592916 5472042 5345415 5213200 5077550
36683 5077550 4941766 4809212 4682491 4563092 4451513 4347731 4251829 4164444 4086936 4021282
36673D021282n1504l5242j7756o53J4101K4850L0818L2320L0473K6690K2246J8033
36661D115658J4468J1420Q271M084k065j0809k2264l5977n0891o5484p8037q7006
36649C801368r1311r0433q4459p4153o1037m7287l5249k6784k2788k3169k7156
36638C217542l3713m1786n0393n8584o5455p0280p2693p2772p0889o7425o2653
36627B550899n6846n0444m4005l7981l2628k8233k5389k4954k7570l3059m0166
36616B149624m6843n0998n1280m7502m0448l1250k0846r850J234J1775K1036K8307
36604A912959L3052L4954L3918L0050K3651J5167N071o353j9048l2919m7441o1545
36592A921516p3950q3613q9877r2274r0378q3986p3479o0039m5426l1467j9536
$$ plain form
36673 4021282 3969778 3934536 3916780 3916127 3930228 3955078 3985896 4018216 4048689 4075379 4097625 4115658
36661 4115658 4130126 4141546 4149817 4153901 4151836 4141027 4118763 4082786 4031895 3966411 3888374 3801368
36649 3801368 3710057 3619624 3535165 3461012 3399975 3352688 3317439 3290655 3267867 3244698 3217542
36638 3217542 3183829 3142043 3091650 3033066 2967611 2897331 2824638 2751866 2680977 2613552 2550899
36627 2550899 2494053 2443609 2399604 2361623 2328995 2300762 2275373 2250419 2222849 2189790 2149624
36616 2149624 2102781 2051783 2000503 1953001 1912553 1881303 1860457 1850607 1851841 1863616 1884652 1912959
36604 1912959 1946011 1980965 2014883 2044933 2068584 2083751 2088822 2082469 2063421 2030502 1983061 1921516
36592 1921516 1847566 1763953 1674076 1581802 1491424 1407438 1333959 1273920 1228494 1197027 1177491
36581A177491j0436m584k270l603q216j5036k2357k8162l0487k7842j9705p012
36569I97781P802K1528L1367L6049L6181L3857L1756L2136L6009M2717N0125N5324
36557A412632N5626M9533L7379K1262M231j0960k2786l1164l6973m1319m4873
36546A392588m7596m9032m8963m7823m6466m5403m4315m2300l8675l3638k8288
36535I20089k4083k2113k2585k4727k6980k7416k4249j6335l501J3417L2760N2326
36523H26603O9702Q2607Q9186Q8258P9526O3797M3120K0580k67j6217k5273k7146
36511A294476k3154j5513o473K149R055J3478J5264J4882J3037J0181O306J205
36499A334893n088j2041j8767k4409k8429l0465k9989k6230j8573p147O984K2106
$$ plain form
36581 1177491 1167055 1162471 1160201 1156598 1148382 1133346 1110989 1082827 1052340 1024498 1004793 997781
36569 997781 1005583 1027111 1058478 1094527 1130708 1164565 1196321 1228457 1264466 1307183 1357308 1412632
36557 1412632 1468258 1517791 1555170 1576432 1580663 1569703 1546917 1515753 1478780 1437461 1392588
36546 1392588 1344992 1295960 1246997 1199174 1152708 1107305 1062990 1020690 982015 948377 920089
36535 920089 896006 873893 851308 826581 799601 772185 747936 731601 728100 741517 774277 826603
36523 826603 896305 978912 1068098 1156356 1235882 1299679 1342799 1363379 1363112 1346895 1321622 1294476
36511 1294476 1271322 1255809 1249336 1251485 1260540 1274018 1289282 1304164 1317201 1327382 1333688 1334893
36499 1334893 1329805 1317764 1298997 1274588 1246159 1215694 1185705 1159475 1140902 1133755 1140739 1162845
36487A162845L6370M8121N6098N9565N8504N3681M6500L8551L1066K4569J8934
36476A634804J3730Q508K819l911j2359k2945l5327m8205n9727o8327p3326p4878
36464A260856p3422o9251o2571n3784m3575l2717k1891j1820l512J841L354R11
36452H94419m822j2744k1601l0035l6696m0648m1887m1452m0996m2032m5294n0446
36440D85766n6231o0970o3118o1787n7099n0283m3367l8422l6657l7939m0933
36429f1040m3696m4506m2558l8275l2997k8234k5042k3835k4583k6988l0550l4507
36417d56811l7899l9751l9443l7031l3165k8555k3410j7357r881q55R183J9044
36405f95931K7123L1846L2178K7963J9979R817l89q492j3112j4185j2770j0214
$$ plain form
36487 1162845 1199215 1247336 1303434 1362999 1421503 1475184 1521684 1560235 1591301 1615870 1634804
36476 1634804 1648534 1657042 1659861 1655950 1643591 1620646 1585319 1537114 1477387 1409060 1335734 1260856
36464 1260856 1187434 1118183 1055612 1001828 958253 925536 903645 891825 888313 890154 893508 894419
36452 894419 889597 876853 855252 825217 788521 747873 705986 664534 623538 581506 536212 485766
36440 485766 429535 368565 305447 243660 186561 136278 92911 54489 17832 -20107 -61040
36429 -61040 -104736 -149242 -191800 -230075 -263072 -291306 -316348 -340183 -364766 -391754 -422304 -456811
36417 -456811 -494710 -534461 -573904 -610935 -644100 -672655 -696065 -713422 -723303 -724158 -714975 -695931
36405 -695931 -668808 -636962 -604784 -576821 -556842 -547025 -547414 -555906 -569018 -583203 -595973 -606187
36393f06187p320m151l74M330J0113J6958K4684L2876M0871M7802N2729N4857
36381c32812N3871N0225M5174M0312L6899L5396L5537L6791L8778M1310M4162
36370A25643M6819M8335M7388M2621L3256J9694L627j2568k6682l7228m3540m5685
36358B01680m4432m1086l7036l3208k9841k6718k3557k0294j7095j4141j1284
36347i7012p765k335O108J7739L1462M5335N7447O6682P2875P6401P7544P6123
36335D20604P1591O3496N1871L7434K1460N542q831k0703k9989l7363m3729m9572
36323D81811n4563n7668n7685n3941m6769l7486k7783j8895j1111l963L066R924
36311A24937J5837J9630K0234J7158J0796K538n565j1542j4261j3700j0576n710
$$ plain form
36393 -606187 -613507 -617658 -618032 -613702 -603589 -586631 -561947 -529071 -488200 -440398 -387669 -332812
36381 -332812 -278941 -228716 -183542 -143230 -106331 -70935 -35398 1393 40171 81481 125643
36370 125643 172462 220797 268185 310806 344062 363756 367383 354815 328133 290905 247365 201680
36358 201680 157248 116162 79126 45918 16077 -10641 -34198 -54492 -71587 -85728 -97012
36347 -97012 -104777 -107112 -101004 -83265 -51803 -6468 50979 117661 190536 266937 344481 420604
36335 420604 492195 555691 607562 644996 666456 671998 663167 642464 612475 575112 531383 481811
36323 481811 427248 369580 311895 257954 211185 173699 145916 127021 115910 111947 115013 124937
36311 124937 140774 160404 180638 197796 208592 211130 205565 194023 179762 166062 155486 149776
36299A49776L47P307J4912K2783L0364L6950M1815M4376M4328M1635L6427K8984
36287E00004J9848R844o6r118j6952k3557k9033l3375l6471l8114l8054l6078
36275B68878l2212k6936k1172j5937j1933r410q424r230j2429j8676k8101l9919
36263C4499n2464o3717p1949p6123p5906p1457o3191n1708l7802k2409o459R209
36251e49477K3747L6024M4557M7944M5642L8572K9003J9716J2992R938J0437J3521
36239b17384J7888K2249K5366K5948K2694J4728K199j3380k9325m2471n0013n0356
36227b71857m3662l1893j8185n818K758O521N940K584j573m850o278n661l441
36214c75415m25K525M861O574Q167J0426J4121J9666K6801L4474M1155M5479M6942
$$ plain form
36299 149776 150123 157430 172342 195125 225489 262439 304254 348630 392958 434593 471020 500004
36287 500004 519852 529696 529630 520512 503560 480003 450970 417595 381124 343010 304956 268878
36275 268878 236666 209730 188558 172621 160688 151278 142854 133624 121195 102519 74418 34499
36263 34499 -17965 -81682 -153631 -229754 -305660 -377117 -440308 -492016 -529818 -552227 -558686 -549477
36251 -549477 -525730 -489706 -445149 -397205 -351563 -312991 -283988 -264272 -251280 -241342 -230905 -217384
36239 -217384 -199496 -177247 -151881 -125933 -103239 -88511 -86312 -99692 -129017 -171488 -221501 -271857
36227 -271857 -315519 -347412 -365597 -371415 -368657 -362136 -356196 -353612 -355185 -360035 -366313 -371974 -375415
36214 -375415 -375840 -373315 -368454 -361880 -353713 -343287 -329166 -309500 -282699 -248225 -207070 -161591 -114649
36201a14649M6173M4625M3702M3866M4274M3356L9938L4055K6946K0364J5776
36190B88426J3861J4292J5763J6212J3405N741o962k3120l9724n3269o0923o1374
36178A22328n5014m3528k9211j4322p62J0059J7245K0475J9914J6114R873K293
36166G5464n163j0992j4245j4997j4116j2487j0334p210k532L859J1597K0005
36154A8849K8475L6577M3995N0284N4781N6753N5684N1516M4706L6156K6989J8150
36142E22915J0023K326n525j3820k2169k9631l5290l8827m0716m1885m3040m4111
36130B20250m4087m1366l4477k2831p171J0552K7809M2178N1774N5368N2436M3327
36118C53762K9413J2965l332j7186k7378l4066l8507m2335m6762n2021n7305o1230
$$ plain form
36201 -114649 -68476 -23851 19851 63717 107991 151347 191285 225340 252286 272650 288426
36190 288426 302287 316579 332342 348554 361959 367700 360738 337618 297894 244625 183702 122328
36178 122328 67314 23786 -5425 -19747 -20509 -10450 6795 27270 47184 63298 73171 75464
36166 75464 70301 59309 45064 30067 15951 3464 -6870 -14080 -16612 -12753 -1156 18849
36154 18849 47324 83901 127896 178180 232961 289714 345398 396914 441620 477776 504765 522915
36142 522915 532938 535264 529739 515919 493750 464119 428829 390002 349286 307401 264361 220250
36130 220250 176163 134797 100320 77489 70318 80870 108679 150857 202631 257999 310435 353762
36118 353762 383175 396140 392808 375622 348244 314178 275671 233336 186574 134553 77248 16018
36106A6018o2535o0648n5857m9203m2274l7018l5409l8930m7912o1094p5746q8445
36094f39053r6211r7459r2204q1619o7265n0599l2779j4716K926J9814L5984N1735
36082a061446O7328Q2674R7168J09683J18673J22430J19632J10124R5419P8329
36072e9986O1848M7877L6642K7043J7635P599k720j2046j8942k2672k3558k2718
36060C6002k1413k0530k0336k0453k0013j8010j3890q078k004K587M659M529L709
36047i3241M080O979J2729K0690K9632L8169M5129M9744N1654N0725M6934M0376
36035C03600L1361K0518Q879k057j0481j4850j4679j1071o382l181l037n856j0118
36022B82646j3747j5124j3637r597l725L266J0777J8172K4686K9544L2112L1971
$$ plain form
36106 16018 -46517 -107165 -163022 -212225 -254499 -291517 -326926 -365856 -413768 -474862 -550608 -639053
36094 -639053 -735264 -832723 -924927 -1006546 -1073811 -1124410 -1157189 -1171905 -1168979 -1149165 -1113181 -1061446
36082 -1061446 -994118 -911444 -814276 -704593 -585920 -463490 -343858 -233734 -138315 -59986
36072 -59986 1862 49739 86381 113424 131059 138658 135938 123892 104950 82278 58720 36002
36060 36002 14589 -5941 -26277 -46730 -66743 -84753 -98643 -106721 -108725 -106138 -101479 -96950 -93241
36047 -93241 -89161 -82182 -69453 -48763 -19131 19038 64167 113911 165565 216290 263224 303600
36035 303600 334961 355479 364358 362301 351820 336970 322291 311220 304838 301657 298620 292764 282646
36022 282646 268899 253775 240138 230541 226816 230082 240859 259031 283717 313261 345373 377344
36010C77344K8890K2789J3818K441j0497k3815l6187m6345n3293n6369n5237m9928
35998A13611m1051k9949j8571q974k599J96K07j013j743o98K611P838J4127K0606
35984E4598K6679L1982L6082L8365L8214L5378L0120K3108J5164P034p38p929
35972C28057j4620k0994k7003l2125l5364l5596l2032k4655j4397k943P863J6739
35960A12930K3301K7725L0061K9774K6013J8324P273n456j7571k7011l2717l4863
35948A57783l4507l2907l1034k9411k8168k7172k6223k5077k3429k0827j6963
35937a37935j2094p197l459j510j006q74N5K386N797R111J0863R997O309M32o501
35922a25626j3266j8875k2803k5028k5916k6051k6021k6293k7095k8431l0245
$$ plain form
36010 377344 406234 429023 442841 445282 434785 410970 374783 328438 275145 218776 163539 113611
35998 113611 72560 42611 24040 15066 12467 12663 12870 11857 10114 9416 12027 19865 33992 54598
35984 54598 81277 113259 149341 187706 225920 261298 291418 314526 329690 336724 335986 328057
35972 328057 313437 292443 265440 233315 197951 162355 130323 105668 91271 88328 96191 112930
35960 112930 136231 163956 194017 223791 249804 268128 275401 269945 252374 225363 192646 157783
35948 157783 123276 90369 59335 29924 1756 -25416 -51639 -76716 -100145 -120972 -137935
35937 -137935 -150029 -157226 -160685 -162195 -163201 -164075 -164020 -161634 -155837 -146726 -135863 -125866 -119557 -119125 -125626
35922 -125626 -138892 -157767 -180570 -205598 -231514 -257565 -283586 -309879 -336974 -365405 -395650
35911c95650l2574l5449l8561m0969m1257l8183l1368k1612j0569p5Q541J4721
35899f63005J8531K0260K0180J8630J6204J3798J2298J2250J3742J6616K0775
35888d79721K6318L3300M1254M8863N4235N5821N3260M7466L9939L1942K4145
35877b3178J6649R186J273p544j7402k7939l8395m7876n5625o1223o4656o6210
35865c82940o6254o5075o2789n9336n4427m7626l8567k7306j4480j110J1825K3673
35853g84412L4033M2514M8626N1889N2064M9318M4318L8203L2442K8399K6849
35842c35757K7614K9618L1317L1289K8665K3189J5010M456q002k1648l5352m7588
35830b57189n6663o1070n9793n2462l9432k1900j919J7955L5361M8719N7384O1389
$$ plain form
35911 -395650 -428224 -463673 -502234 -543203 -584460 -622643 -654011 -675623 -686192 -686267 -677726 -663005
35899 -663005 -644474 -624214 -604034 -585404 -569200 -555402 -543104 -530854 -517112 -500496 -479721
35888 -479721 -453403 -420103 -378849 -329986 -275751 -219930 -166670 -119204 -79265 -47323 -23178
35877 -23178 -6529 2657 3930 -3614 -21016 -48955 -87350 -135226 -190851 -252074 -316730 -382940
35865 -382940 -449194 -514269 -577058 -636394 -690821 -738447 -777014 -804320 -818800 -819910 -808085 -784412
35853 -784412 -750379 -707865 -659239 -607350 -555286 -505968 -461650 -423447 -391005 -362606 -335757
35842 -335757 -308143 -278525 -247208 -215919 -187254 -164065 -149055 -144599 -152601 -174249 -209601 -257189
35830 -257189 -313852 -374922 -434715 -487177 -526609 -548509 -550428 -532473 -497112 -448393 -391009 -329620
35818c29620O1171N7441N1150M3358L5005K6674J8375R508p08j2502k4857l5449
35806a00454m1319m0006l0562j4033O792K8279M7008O0493O7436O7585O1567N0707
35794A63493L6763K1525O421p705k0565l2157m2373n0758n6548n9035n7943n3512
35782a52394m6322l7088k6563j5623n333L105Q653J0846J0050P304L775K71k965
35769b42284o136r613j3606j7904k1837k4616k5853k5829k5274k4856k4690k4212
35757d86710k2404j8221j1026q65J1435K4291L5594M3253M5962M3815L8322L1748
35745b64806K6324K3705K4780K9526L6796M4345M9517N0385M6680L9839L2203
35734A39294K5922K2174K0883K0935K0659J8436J3233M886n952j8143l0479m1956
$$ plain form
35818 -329620 -268449 -211008 -159858 -116500 -81495 -54821 -36446 -26938 -27646 -40148 -65005 -100454
35806 -100454 -141773 -181779 -212341 -226374 -219582 -191303 -144295 -83802 -16366 51219 112786 163493
35794 163493 200256 221781 228202 220497 199932 167775 125402 74644 18096 -40939 -98882 -152394
35782 -152394 -198716 -235804 -262367 -277990 -283323 -280218 -271565 -260719 -250669 -243365 -239590 -239319 -242284
35769 -242284 -248420 -258033 -271639 -289543 -311380 -335996 -361849 -387678 -412952 -437808 -462498 -486710
35757 -486710 -509114 -527335 -538361 -539226 -527791 -503500 -467906 -424653 -378691 -334876 -296554 -264806
35745 -264806 -238482 -214777 -189997 -160471 -123675 -79330 -29813 20572 67252 107091 139294
35734 139294 165216 187390 208273 229208 249867 268303 281536 286422 280470 262327 231848 189892
35722A89892n1787n9285o3711o4321o0646n2907m2320l0924k0877j3643r498p675
35710b87702o848n691l331K95M285P018O923L406k725r709j5986k1106k5702l0589
35696c87462l5759m0129m2115m0551l5313k7300j7915q468R7P073J1878J4158
35684f01806J4018J2124R379O491L637N68k913o469r214j0319r739q368p457p741
35670f17809q914r880r469p167l271J566O887J2587J8701K5209L2119L9399M6657
35657d73385N2818N6324N5902N1291M3413L3922K4481J6205R513M407Q02j333
35645a25640k109j904j277p35m90m64n91j024k109l932n985p220o497l076L194
35630a59859J1869K1993L2221M1002M6845M8590M5650L8087K6538J2021m201k0614
$$ plain form
35722 189892 138105 78820 15109 -49212 -109858 -162765 -205085 -236009 -256886 -270529 -280027 -287702
35710 -287702 -294550 -300241 -303572 -303277 -298992 -291974 -285051 -281645 -284370 -294079 -310065 -331171 -356873 -387462
35696 -387462 -423221 -463350 -505465 -546016 -581329 -608629 -626544 -635012 -634915 -627842 -615964 -601806
35684 -601806 -587788 -575664 -566285 -559794 -556157 -555589 -558502 -564971 -574185 -584504 -594243 -602611 -610068 -617809
35670 -617809 -626723 -636603 -646072 -653239 -656510 -654944 -648057 -635470 -616769 -591560 -559441 -520042 -473385
35657 -473385 -420567 -364243 -308341 -257050 -213637 -179715 -155234 -139029 -129516 -125109 -124307 -125640
35645 -125640 -127749 -129653 -130930 -131665 -132155 -132619 -133210 -134234 -136343 -140275 -146260 -153480 -159977 -163053 -159859
35630 -159859 -147990 -125997 -93776 -52774 -5929 42661 88311 126398 152936 164957 160756 140142
35618A40142l5585m7690n6124o0771o1868n9609n4051m5414l4410k2261j0278
35607c47919O27J0165J8475K5629L1251L4408L3950K9134K0215Q685l079j2493
35595a50952j7493j7059j1417j912R493K0756L0135L6335L8654L7177L2807K6969
35583C3493K1031J5865J1715Q394N557K876J1l524q319j4707k2220k9344l3923
35570a3095l4116k9341k0748j0848k545J944J837k201q543j5344k1154k5219k7436
35557b06809k8019k7000k3881j7758p851N767K1798L7861N1178N9469O1732N8513
35545a5000N1515M2766L3780K5162J6742Q064j077j0292j8542k4416k6610k4435
35533E7657j8150q950J389J1061J8688K3576K5634K5115K2400J7860J2013N718
$$ plain form
35618 140142 104557 56867 743 -60028 -121896 -181505 -235556 -280970 -315380 -337641 -347919
35607 -347919 -347292 -337127 -318652 -293023 -261772 -227364 -193414 -164280 -144065 -135380 -138459 -150952
35595 -150952 -168445 -185504 -196921 -198833 -189340 -168584 -138449 -102114 -63460 -26283 6524 33493
35583 33493 54524 70389 82104 90498 96055 98931 98942 95418 87099 72392 50172 20828 -13095
35570 -13095 -47211 -76552 -97300 -108148 -110693 -108749 -106912 -109113 -117656 -133000 -154154 -179373 -206809
35557 -206809 -234828 -261828 -285709 -303467 -311318 -305551 -283753 -245892 -194714 -135245 -73513 -15000
35545 -15000 36515 79281 113061 138223 154965 163029 161952 151660 133118 108702 82092 57657
35533 57657 39507 30557 31946 43007 61695 85271 110905 136020 158420 176280 188293 194011
35521A94011K39l061l236k79M770J0130J3917J4763J2207O720m89p799j3567j6544
35507B11782j6207j2916p861k716Q02J555n63m478q360j0417r598n892j55O270
35493A41246J1920J5638J6926J6071J3824J0908P712M385J024k356o077j0820
35481B20401j7189k5007l2956l8885m0741l7433k9217j7454m086Q909J9923K7939
35469C4204L2493L3590L1642K7509K2394J7478J3458J0342P505M020r21p571j5433
35456B10710k3523l0897l6988m1424m3542m2147l5812k3710o408J3872L3874N0448
35444B4453O1524O6424O5558N9938N0835L9653K7780J6490O725j074o984j1360
35432C99962j4531j6618j7575j7296j5685j2690q439l392J643N755Q234Q767P405
$$ plain form
35521 194011 194250 191189 187953 187674 192444 202574 216491 231254 243461 250181 249692 241893 228326 211782
35507 211782 195575 182659 174798 172082 172884 174439 173876 169398 161038 150621 141023 135131 134976 141246
35493 141246 153166 168804 185730 201801 215625 226533 234245 238630 239654 237298 231221 220401
35481 220401 203212 178205 145249 106364 65623 28190 -1027 -18481 -22567 -13658 6265 34204
35469 34204 66697 100287 131929 159438 181832 199310 212768 223110 230615 234635 233714 226143 210710
35456 210710 187187 156290 119302 77878 34336 -7811 -43623 -67333 -73741 -59869 -25995 24453
35444 24453 85977 152401 217959 277897 328732 368385 396165 412655 419380 418306 411322 399962
35432 399962 385431 368813 351238 333942 318257 305567 297128 293736 295379 301134 309368 318135 325540
35419C25540M437K48m761j0176j5566k0518k4826k8665l2554l7005m2078m7182
35407F6894n1331n3602n3482n0834m5618l7688k6931j3771M69J3719K3940K9993
35395a98242L2059L1423K9798K8508K7958K7588K6378K3570J9098J3503P435J157
35383G0233n586j3219k1793l0573l8132m2864m3583l9956l2598k3015j3261n351
35371b39698m73J507J870K232L606O036Q880J1443J3424J5000J6645J8873K2068
35358a18587K6322L1403L6705M1347M4377M5103M3417L9866L5465L1340K8430
35347B85188K7278K7889K9634L1343L1626K9308K3852J5548N478m688j3065j8003
35335D71388j8526j4600p217J758R995J5247J5905J1280J744j1281k5454l8008
$$ plain form
35419 325540 329977 330225 325464 315288 299722 279204 254378 225713 193159 156154 114076 66894
35407 66894 15563 -38039 -91521 -142355 -187973 -225661 -252592 -266363 -265894 -252175 -228235 -198242
35395 -198242 -166183 -134760 -104962 -76454 -48496 -20908 5470 29040 48138 61641 69076 70233
35383 70233 64647 51428 29635 -938 -39070 -81934 -125517 -165473 -198071 -221086 -234347 -239698
35371 -239698 -240171 -238664 -236794 -234562 -230956 -224920 -216040 -204597 -191173 -176173 -159528 -140655 -118587
35358 -118587 -92265 -60862 -24157 17190 61567 106670 150087 189953 225418 256758 285188
35347 285188 312466 340355 369989 401332 432958 462266 486118 501666 507144 502456 489391 471388
35335 471388 452862 438262 431045 432803 442798 458045 473950 485230 486974 475693 450239 412231
35323D12231m6564m9939m8453m3584l7269l1201k6373k2891k0069j6779j1937
35312E7172m947M060J4247K4296L2836L8900M2181M2793M0716L5378K5888J1874
35300C65394n645k4163m0422n1715n6840n6306n1768m5167l8123l1668k6172k1366
35288h3961j6428j0336k248Q055J9847L1291L9698M2415L8012K7060J2016l663
35276A01758j6633k4531k6434k2852j5367o131K627Q996J1855J1211Q167M290
35264C6956P63k082m595p178r811j2004j3142j2945j1666r978q591p915p909q124
35250g8221p816o212k865K008P484J2271J5213J5679J3694R860N065J02m635r122
35236b7495j3402j7141j9421j8898j4391n665O070J8378K8631L5327L8819M0981
$$ plain form
35323 412231 365667 315728 267275 223691 186422 155221 128848 105957 85888 69109 57172
35312 57172 52225 56285 70532 94828 127664 166564 208745 251538 292254 327632 353520 365394
35300 365394 359749 335586 295164 243449 186609 130303 78535 33368 -4755 -36423 -62595 -83961
35288 -83961 -100389 -110725 -112973 -104918 -85071 -53780 -14082 28333 66345 93405 105421 101758
35276 101758 85125 60594 34160 11308 -4059 -10190 -7563 1433 13288 24499 32666 36956
35264 36956 37719 35637 31042 23864 14053 2049 -11093 -24038 -35704 -45682 -54273 -62188 -70097 -78221
35250 -78221 -86037 -92249 -95114 -93106 -85622 -73351 -58138 -42459 -28765 -18905 -13840 -13738 -18373 -27495
35236 -27495 -40897 -58038 -77459 -96357 -110748 -116413 -110343 -91965 -63334 -28007 10812 51793
35224E1793M3930M8709N4709O0108O2902O1852N6910M9087L9921L0757K2263J4373
35212E97314O634j305r363j6871k2627k5225k3680j8070r781j109N586Q639P494
35199D97636K659m590j2539j9417k3777k4795k2476j7598j1499n713j522M34K64
35186C57067j406l746n994p518p907p098n391l352j610p48j248l381p088j2037
35172B88543j7874k4456l1768l9545m7005n3106n7139n9076n9438n8717n6990
35161b16571n3880m8871m1579l1874j9771n231J1797L1044N1489P1183Q7689R8952
35149f5623J04107J03796R9715R3754Q7187Q0313P2765O4085N4218M3487L2211
35138G70015K0443Q102m528j6521k6629l3941l8334m0432m1137m1155m0744l9694
$$ plain form
35224 51793 95723 144432 199141 259249 322151 384003 440913 490000 529921 560678 582941 597314
35212 597314 603948 602643 593280 576409 553782 528557 504877 486807 477026 475917 481503 490142 497636
35199 497636 500295 495705 483166 463749 439972 415177 392701 375103 363604 357891 356369 356803 357067
35186 357067 355661 351915 345921 338403 330496 323398 318007 314655 313045 312297 311049 307668 300580 288543
35172 288543 270669 246213 214445 174900 127895 74789 17650 -41426 -100864 -159581 -216571
35161 -216571 -270451 -319322 -360901 -392775 -412546 -417777 -405980 -374936 -323447 -252264 -164575 -65623
35149 -65623 38484 142280 241995 335749 422936 503249 576014 640099 694317 737804 770015
35138 770015 790458 798560 794032 777511 750882 716941 678607 638175 597038 555883 515139 475445
35126D75445l7464l3509k7572j9861j1012j850O827J4338K0095K3657K4921K4313
35114D58328K2709K0977J9531J8321J7177J6108J5118J3845J1467P106L68q493
35102F12562j8785k9610l9889m8262n3252n3756m9538m1390l0743j9009p133M479
35090B25674J5580K5728L4216M0317M3600M4034M1864L7433L1104K3341J4722
35079E77613N901k491r945j6102k0704k3534k4350k2933j9175j3147n140M279
35067D30272J4076K2798K9038L2224L3093L3313L4507L7316M1207M4930M7157
35056G99931M6933M3888L8316L1088K3349J6068R697M093j292p105j3920k2110
35044I68936l1803m2826n4716o6801p8252q8120r5373r9092r8815r4799q7938
$$ plain form
35126 475445 437981 404472 376900 357039 346027 344177 351004 365342 385437 409094 434015 458328
35114 458328 481037 502014 521545 539866 557043 573151 588269 602114 613581 620687 621055 612562
35102 612562 593777 564167 524278 476016 422764 369008 319470 278080 247337 228328 221195 225674
35090 225674 241254 266982 301198 341515 385115 429149 471013 508446 539550 562891 577613
35079 577613 583514 581023 571078 554976 534272 510738 486388 463455 444280 431133 425993 430272
35067 430272 444348 467146 496184 528408 561501 594814 629321 666637 707844 752774 799931
35056 799931 846864 890752 929068 960156 983505 999573 1009270 1013363 1012071 1004966 991046 968936
35044 968936 937133 894307 839591 772790 694538 606418 511045 411953 313138 218339 130401
35033A30401p9287o9637n9412m8902l8530k8838k0289j3099p268k726N57K664
35021b34366M004N499Q355J3380K0290K7649L3511L6310L5360L0849K3609J4904
35009A9354O290n99m389m407j022M263R262J1992J1633Q876N382K650J147K55
34995G0687j015l208o000q391r192p623l708J529O240Q257N862j480j2680k5190
34981A4088l5698m1180l9825l1626j8408l340R998J8652K1034J7065P817m947
34969h6370j9070l2228m2321m7974m8851m5636l9706l2723k6189k1044j7445j4847
34957d74404j2377r188m695J438R345J8896K9502L9890M8215N2537N1400M4186
34945b05255L1139J3214q012l0392n1359o8310p9126q2689p9054o9200n4540l6529
$$ plain form
35033 130401 51114 -18523 -77935 -126837 -165367 -194205 -214494 -227593 -234861 -237587 -237030 -234366
35021 -234366 -230362 -224863 -216508 -203128 -182838 -155189 -121678 -85368 -50008 -19159 4450 19354
35009 19354 25644 25045 20656 16249 15227 19490 28752 40744 52377 61253 66635 69285 70432 70687
34995 70687 69672 66464 60464 52073 42881 35258 31550 33079 39319 47576 53438 51958 39278 14088
34981 14088 -21610 -62790 -102615 -134241 -152649 -155989 -145991 -127339 -106305 -89240 -81423 -86370
34969 -86370 -105440 -137668 -179989 -227963 -276814 -322450 -362156 -394879 -421068 -442112 -459557 -474404
34957 -474404 -486781 -495969 -500664 -499226 -489881 -470985 -441483 -401593 -353378 -300841 -249441 -205255
34945 -205255 -174116 -160902 -168914 -199306 -250665 -318975 -398101 -480790 -559844 -629044 -683584 -720113
34933g20113j6509M179K4169M2152N7090O8308P5385P7966P5786O8964N8339M5460
34921a38824L2233K0439J1272N031J048j957n180r156j3642j7941k1199k2509
34909a60385k0929j5711o759M987J7531K8363L5284L7128L3982K6892J7352O893
34897D628l071j1283j6745j8992j8452j6464j4829j4980j7330k1188k5256k8342
34885b02304k9744k9191k6624k2082j5840q466o44P151J4867K2773L1192M0220
34873b18692M9606N8873O7504P4996Q0744Q4003Q4199Q1365P6247O9926O3287
34862E72058N6800N0610M4721L9038L3380K7578K1680J6034J1175P501M985L149
34850H88709J366q19l614p213j1946j8205k6123l5353m5113n4441o2440o8441
$$ plain form
34933 -720113 -736622 -732443 -708274 -666122 -609032 -540724 -465339 -387373 -311587 -242623 -184284 -138824
34921 -138824 -106591 -86152 -74880 -69849 -68801 -70758 -75938 -85094 -98736 -116677 -137876 -160385
34909 -160385 -181314 -197025 -203784 -198797 -181266 -152903 -117619 -80491 -46509 -19617 -2265 4628
34897 4628 1557 -9726 -26471 -45463 -63915 -80379 -95208 -110188 -127518 -148706 -173962 -202304
34885 -202304 -232048 -261239 -287863 -309945 -325785 -334251 -334895 -327744 -312877 -290104 -258912 -218692
34873 -218692 -169086 -110213 -42709 32287 113031 197034 281233 362598 438845 508771 572058
34862 572058 628858 679468 724189 763227 796607 824185 845865 861899 873074 880575 885560 888709
34850 888709 890075 889256 885642 878429 866483 848278 822155 786802 741689 687248 624808 556367
34838E56367p2088p3356p2568p0267o7120o3803o0928n8891n7621n6409n4042
34827a50726m9385m2062l2806k3215j5054r674p779r366j3648j8917k2832k3237
34815d18701j9078j0770K15J2184K3777L4070M2344M7891N0064M8510M3309L4922
34803a11263K4074J1729q38j2050k0345k4667k4875k1837j7159j2632r587q467
34791b27917q763r336q942o725k535L067R126J4755J9535K3597K7388L1298L5325
34778a00127L9017M1650M2538M1331L8187L3907K9928K8067K9954L6359M6715
34767C07526N9082P0463P7469P7216O8257N1131K8163K618k2321m4311o2066p5175
34755E38052q3689q7751q7490q3176p5400o5070n3277m1133k9657j9564j1166
$$ plain form
34838 556367 484279 410923 338355 268088 200968 137165 76237 17346 -40275 -96684 -150726
34827 -150726 -200111 -242173 -274979 -298194 -313248 -322922 -330701 -340067 -353715 -372632 -395464 -418701
34815 -418701 -437779 -448549 -448334 -436150 -412373 -378303 -335959 -288068 -238004 -189494 -146185 -111263
34803 -111263 -87189 -75460 -76298 -88348 -108693 -133360 -158235 -180072 -197231 -209863 -219450 -227917
34791 -227917 -236680 -246016 -254958 -261683 -264218 -261151 -252025 -237270 -217735 -194138 -166750 -135452 -100127
34778 -100127 -61110 -19460 23078 64409 102596 136503 166431 194498 224452 260811 307526
34767 307526 366608 437071 514540 591756 660013 711144 739307 741925 719604 675293 613227 538052
34755 538052 454363 366612 279122 195946 120546 55476 2199 -38934 -68591 -88155 -99321
34744i9321m419P59M194N526M551J601k318n726p042n102M29Q899J8899K8789
34730e0281L7165M3156M6449M7174M5760M2828L9092L5269L1896K9169K6903K4713
34718C99293K2351J9996J8222J7627J8320J9734K0936K1239K0679J9946J9869
34707F18212K0671K1612K1297J8516J3085N975j279p387j1794j4622j6431j7876
34695F49979j9452k1331k3368k5197k6274k5885k3255j7890r946l93R098J6536
34683D82622K0180J9218J4175O681j302q333j3814j7752k0305k1587k1729k1008
34671D17046j9833j8635j7781j7599j8354k0035k1969k2624j9941j2238P90J7678
34659B46505L5684N1858O4034P1260P3630P1788O6461N8221M7569L5137K1812
$$ plain form
34744 -99321 -103740 -102981 -98787 -93261 -88710 -87109 -89427 -95153 -102195 -107297 -106868 -97969 -79070 -50281
34730 -50281 -13116 30040 76489 123663 169423 212251 251343 286612 318508 347677 374580 399293
34718 399293 421644 441640 459862 477489 495809 515543 536479 557718 578397 598343 618212
34707 618212 638883 660495 681792 700308 713393 719368 718089 710702 698908 684286 667855 649979
34695 649979 630527 609196 585828 560631 534357 508472 485217 467327 457381 456988 466086 482622
34683 482622 502802 522020 536195 542876 541574 533241 519427 501675 481370 459783 438054 417046
34671 417046 397213 378578 360797 343198 324844 304809 282840 260216 240275 228037 228827 246505
34659 246505 282189 334047 398081 469341 542971 614759 681220 739441 787010 822147 843959
34648H43959Q647l341j3262k0379k4194k4711k2695j9647j7309j6996j9162k3525
34636F47385k9581l6897m4931n2624n8400o0771n9138n4125m7092l9381l1755
34625A32690k4421j7357j0566l979K719J0036J8300K7221L5823M2837M7291M8839
34613C09433M7694M4306L9089L2357K4348J5279N379n107j5879k6578l6756m5839
34601C87726n3099n7696n8819n6020m9615m0803l1317k2654j5455r472m030J536
34589i718P655J4473K1785K8994L5330M0219M3610M5957M7868M9649N1107N1789
34577D28718N1413N0019M7767M4649M0551L5516K9822K3766J7482J0970M279k513
34565G82439r420j6599k4116l1645l8367m3237m5467m4878m1881l7139l1204k4343
$$ plain form
34648 843959 852606 849265 836003 815624 791430 766719 744024 724377 707068 690072 670910 647385
34636 647385 617804 580907 535976 483352 424952 364181 305043 250918 203826 164445 132690
34625 132690 108269 90912 80346 76367 79086 89122 107422 134643 170466 213303 260594 309433
34613 309433 357127 401433 440522 472879 497227 512506 517885 512778 496899 470321 433565 387726
34601 387726 334627 276931 218112 162092 112477 71674 40357 17703 2248 -7224 -11254 -9718
34589 -9718 -2063 12410 34195 63189 98519 138738 182348 228305 276173 325822 376929 428718
34577 428718 480131 530150 577917 622566 663117 698633 728455 752221 769703 780673 784952 782439
34565 782439 773019 756420 732304 700659 662292 619055 573588 528710 486829 449690 418486 394143
34553C94143j6691q507l49O969J2664J6240J7565J6820J4523J1607R261Q413R175
34540D91833J0761J2039J2290J1653J0962J1175J2808J5709J9311K3054K6649
34529F58244K9980L2888L5056L6126L5927L4633L2691L0505K8034K4644J9399
34518I98127J1577J029j1771k5873l9960n2429o1632o6326o6186o2030n5540m8597
34506E20389m2573l7937l4302l0788k6525k1127j4960r057m619k389k223l174
34494B90715m044l990k797p66J620L925N876P415Q825J0693J3631J7811K2603
34481C71517K6621K8143K5715J8695P573o132k0398l3436m4217n2506n8583o2930
34469B00062o6027o8109o8870o7370o2303n2714l8614k1256k950J3489K5435L1208
$$ plain form
34553 394143 377452 368945 368596 375565 388229 404469 422034 438854 453377 464984 474245 482658 491833
34540 491833 502594 514633 526923 538576 549538 560713 573521 589230 608541 631595 658244
34529 658244 688224 721112 756168 792294 828221 862854 895545 926050 954084 978728 998127
34518 998127 1009704 1010733 998962 973089 933129 880700 819068 752742 686556 624526 568986 520389
34506 520389 477816 439879 405577 374789 348264 327137 312177 303120 298501 296112 293889 290715
34494 290715 286671 282681 279884 279118 280738 284663 290539 297954 306779 317472 331103 348914 371517
34481 371517 398138 426281 451996 470691 478264 472132 451734 418298 374081 321575 262992 200062
34469 200062 134035 65926 -2944 -70314 -132617 -185331 -223945 -245201 -248151 -234662 -209227 -178019
34457a78019L0573K4760J5857N870l943j3102k1419k8527l3776l6375l5614l1016
34445c04731k2546j0796K957J6948K9297L8512M3879M5564M4261M0686L5294K8416
34433a2259K0497J2137L785m548j3280k2887l3389m4052n3519o0226o2861o0666
34421c31268n3586m2343k8315j3171J562J4802K5948L4787M1452M6396N0267N3552
34409a99917N6169N7303N5777N0716M2187L1322K0002J0178L215n06j451m40J896
34396A26451N262R512J4321J9095K3062K5500K5858K3731J8697J0283j740j6811
34384B83221l3183m8056n8339o1766n7787m7799l4453k0534q015K200R930J5182
34372e9399J7880J7904J5326J0579M498j762o878r709r702p252l658o30M93n96
$$ plain form
34457 -178019 -147446 -122686 -106829 -100959 -104902 -118004 -139423 -167950 -201726 -238101 -273715 -304731
34445 -304731 -327277 -338073 -335116 -318168 -288871 -250359 -206480 -160916 -116655 -75969 -40675 -12259
34433 -12259 8238 20375 24160 19612 6332 -16555 -49944 -93996 -147515 -207741 -270602 -331268
34421 -331268 -384854 -427197 -455512 -468683 -467121 -452319 -426371 -391584 -350132 -303736 -253469 -199917
34409 -199917 -143748 -86445 -30668 20048 62235 93557 113559 123737 126952 126446 124995 124555 126451
34396 126451 131713 141225 155546 174641 197703 223203 249061 272792 291489 301772 300032 283221
34384 283221 250038 201982 143643 81877 24090 -23709 -58162 -78696 -86711 -84511 -74581 -59399
34372 -59399 -41519 -23615 -8289 2290 6788 5026 -1852 -11561 -21263 -28515 -32173 -32803 -32310 -32906
34358c2906l020n232n898m642k130L84J721J181j324n301r807j3576j5237j3590
34344a09377p972J432J3508K6437L8104M6554N0446M9472M4517L7321K9731K3016
34332B43189J7689J3806J1245R594P857M504j940j2151k5580m0593n4969o6566
34320A06085p3950p6840p6086p3152o9331o5115n9987n2867m2984l0632j7238
34309e32097m701N436J2408J6181J7220J6308J4325J1986R660P336M696J257l436
34296d23421r583j6874k4388l0706l4276l3904k9085k0021p470P372K2905L7293
34284e62158M8906N6784O0853O1777O0579N8238N5464N2614M9732M6587M2805
34273C2181L8159L2921K7966K4404K2937K3406K4886K6250K6757K6317K5305K4148
$$ plain form
34358 -32906 -35926 -41158 -47056 -51698 -53828 -53444 -51723 -50542 -51866 -57167 -66974 -80550 -95787 -109377
34344 -109377 -117349 -115917 -102409 -75972 -37868 8686 59132 108604 153121 190442 220173 243189
34332 243189 260878 274684 285929 295523 303380 307884 305944 293793 268213 227620 172651 106085
34320 106085 32135 -44705 -120791 -193943 -263274 -328389 -388376 -441243 -484227 -514859 -532097
34309 -532097 -536798 -531362 -518954 -502773 -485553 -469245 -454920 -442934 -433274 -425938 -421242 -419985 -423421
34296 -423421 -433004 -449878 -474266 -504972 -539248 -573152 -602237 -622258 -629728 -622356 -599451 -562158
34284 -562158 -513252 -456468 -395615 -333838 -273259 -215021 -159557 -106943 -57211 -10624 32181
34273 32181 70340 103261 131227 155631 178568 201974 226860 253110 279867 306184 331489 355637
34261C55637K3025K1829K0406J8862J7751J7898J9912K3690K8273L2176L3948
34250F13407L2620K7867J9937R388l171j7215l2172m7229o1263p2988q1278q5500
34238C02403q5693q2505p6877o9703o1702n3514m5805l9127l3624k8824k3693
34227b98664j6946p536M936K0013L6507N2849O7380P8508Q4797Q5256P9793O9592
34215B56485N6908M4302L3668K5654J9750J4923J0349N722J121l323p603j1750
34203D46206j5762j9606k3298k6835l0113l2856l4668l5135l3873l0577k5059
34192A38424j7340p811K573J2298J9620K3162K2402J7773J0345J390p884j6251
34180A98701k2343k4738k2406j5194l969R602K3579L6316M6819N4731N9943O2237
$$ plain form
34261 355637 378662 400491 420897 439759 457510 475408 495320 519010 547283 579459 613407
34250 613407 646027 673894 693831 703219 700048 682833 650661 603432 542169 469181 387903 302403
34238 302403 216710 134205 57328 -12375 -74077 -127591 -173396 -212523 -246147 -274971 -298664
34227 -298664 -315610 -323146 -318210 -298197 -261690 -208841 -141461 -62953 21844 107100 186893 256485
34215 256485 313393 357695 391363 417017 436767 451690 462039 467761 468882 465559 457956 446206
34203 446206 430444 410838 387540 360705 330592 297736 263068 227933 194060 163483 138424
34192 138424 121084 113273 115846 128144 147764 170926 193328 211101 221446 222836 214952 198701
34180 198701 176358 151620 129214 114020 110051 119653 143232 179548 226367 281098 341041 403278
34168D03278O1389N7509N1189M3268L4564K5817J7757J0924N379O65l923q913
34156F98903j4459k0407k6532l2778l9220m5846n2303n7883o1619o2380n9139
34145B26337n1454m0057k6831j4007l120N507J2395J8141K2791K5680K5807K2507
34133B23696J6016P547j217q851j4629j8465k0489k0631j8591j4144p520N07Q887
34120A32116J6625K2872K6908K8238K6862K3471J9258J5456J2807J1364J0619
34109C46596R912Q864P500O008M377K265q63n425j1495j8695k6200l2974l8064
34096B51806m0828m0874l7970l2060k3477j2998j680R409J9288K7090L2081L3798
34084A83585L2122K7169J9120Q256m722j8346l0440l8782m2060m0485l5678k9885
$$ plain form
34168 403278 464667 522176 573365 616633 651197 677014 694771 705695 711074 711739 707816 698903
34156 698903 684444 664037 637505 604727 565507 519661 467358 409475 347856 285476 226337
34145 226337 174883 134826 107995 93988 90868 96375 108770 126911 149702 175382 201189 223696
34133 223696 239712 247259 246042 237191 222562 204097 183608 162977 144386 130242 122722 123229 132116
34120 132116 148741 171613 198521 226759 253621 277092 296350 311806 324613 335977 346596
34109 346596 356508 365372 372872 378880 383257 385522 384659 379234 367739 349044 322844 289870 251806
34096 251806 210978 170104 132134 100074 76597 63599 61919 71328 90616 117706 149787 183585
34084 183585 215707 242876 261996 270252 265530 247184 216744 177962 135902 95417 59739 29854
34072B9854k5011k2002k0879k1150k2199k3348k3776k2689j9745j5274j0034m643
34060b00896P04O078J1498J6783K1672K5961K9615L2856L6141L9942M4366M8871
34048A13591N2408N3877N2623M8684M2672L5370K7367J8913J0149J391o808j3901
34036D36336j9677k4311k8141l1369l3967l5764l6646l6721l6349l5941l5588
34025H1862l4758l2392k7485j9810j0141J81J0043J9000K7065L4243M0201M4335
34013A32344M5969M4565L9996L2823K4307J5992R058L912K11k853o164j0432j5937
34000C13791k2442k9273l5633m0939m5040m8119n0317n1376n0538m6844l9612
33989a46342k8782j4959Q09J7373L3699M8861O1915P1792P7396P7799P2480O1563
$$ plain form
34072 29854 4843 -17159 -38038 -59188 -81387 -104735 -128511 -151200 -170945 -186219 -196253 -200896
34060 -200896 -200192 -194114 -182616 -165833 -144161 -118200 -88585 -55729 -19588 20354 64720 113591
34048 113591 165999 219876 272499 321183 363855 399225 426592 445505 455654 457045 450237 436336
34036 436336 416659 392348 364207 332838 298871 263107 226461 189740 153391 117450 81862
34025 81862 47104 14712 -12773 -32583 -42724 -42543 -32500 -13500 13565 47808 88009 132344
34013 132344 178313 222878 262874 295697 320004 335996 345054 348966 349177 346324 340160 329728 313791
34000 313791 291349 262076 226443 185504 140464 92345 42028 -9348 -59886 -106730 -146342
33989 -146342 -175124 -190083 -189274 -171901 -138202 -89341 -27426 44366 121762 199561 272041 333604
33977C33604M5936K7095O780j3409l2113m8031n9767o5964o5751n9277m7922l3914
33965a2733j9504o157N616J5814K4368L1034L5707L8726M0759M2299M3248M2884
33953B82061M0214L4480K5549J4079J472j0510k0349k7296l1460l3511l4306l4705
33941B05718l5422l6774l8449l9590l9236l6781l2174k5808j8426j1010m692n84
33929a13228N98j034m317p357q298o138j021N991J3454K0093K5246K9090L2495
33916a4426L6497M1685M7831N3970N8730O0694N8722N2272M1703K8340J4107P56
33904D80881j0765k0346k8229l4476l8867m1248m1856m1316m0296l9121l7638
33893A06723l5397l2000k7365k1802j5936j0529o274l544k238j927k198l010m695
$$ plain form
33977 333604 379540 406635 413415 400006 367893 319862 260095 194131 128380 69103 21181 -12733
33965 -12733 -32237 -38394 -32778 -16964 7404 38438 74145 112871 153630 195929 239177 282061
33953 282061 322275 356755 382304 396383 397855 387345 366996 339700 308240 274729 240423 205718
33941 205718 170296 133522 95073 55483 16247 -20534 -52708 -78516 -96942 -107952 -112644 -113228
33929 -113228 -112630 -113664 -117981 -125338 -133636 -139774 -140795 -134804 -121350 -101257 -76011 -46921 -14426
33916 -14426 22071 63756 111587 165557 224287 284981 343703 395975 437678 466018 480125 480881
33904 480881 470116 449770 421541 387065 348198 306950 265094 223778 183482 144361 106723
33893 106723 71326 39326 11961 -9841 -25777 -36306 -42580 -46124 -48362 -50289 -52487 -55497 -60192
33880f0192p610j1643j6057j9728k1657k1390j9228j6162j3498j2308j2942j4953
33868b47368j7364j8913j8152j3690m806P857K2208L5422M4956M9242M7875M1488
33856g1245L1436J9362O634o071j8780l1781m5009n7705o8564p6222p9697p8536
33844d76178p2798o3052n0474l6697k3401j1780k248N507J2251J8871K5957L3467
33832f40575M0551M5821M7980M6442M1555L4319K5915J7374R524L112j145k707
33820c31834j486J962O546J1007J4284J5704J4930J1891O776jp999j6954k6841
33807c02015l7678m9178o0393o9602p4487p2687o2519m3675j7621J2536M2751
33796g34568O9125Q8838J00609J04539J01580R3044Q0254O4431M6697K8052R332
$$ plain form
33880 -60192 -67802 -79445 -95502 -115230 -136887 -158277 -177505 -193667 -207165 -219473 -232415 -247368
33868 -247368 -264732 -283645 -301797 -315487 -320293 -312436 -290228 -254806 -209850 -160608 -112733 -71245
33856 -71245 -39809 -20447 -13813 -19884 -38664 -70445 -115454 -173159 -241723 -317945 -397642 -476178
33844 -476178 -548976 -612028 -662502 -699199 -722600 -734380 -736628 -731121 -718870 -699999 -674042 -640575
33832 -640575 -600024 -554203 -506223 -459781 -418226 -383907 -357992 -340618 -331094 -327982 -329127 -331834
33820 -331834 -333320 -331358 -324812 -313805 -299521 -283817 -268887 -256996 -250220 -250221 -258220 -275174 -302015
33807 -302015 -339693 -388871 -449264 -518866 -593353 -666040 -728559 -772234 -789855 -777319 -734568
33796 -734568 -665443 -576605 -475996 -371457 -269877 -176833 -96579 -32148 14549 42601 51933
33785E1933q819k5800m0883n3052o1021o3432n9216m8107l1117j0655J0028K7825
33773c12316M0691M7922M9861M7406M1708L4138K6193J9141J3624R491O027K408
33761B6294j944p278j3609k0846k8740l6733m3845m8868n0782m9129m4085l6310
33749c55875k6746j6480o626J772P769J0573R769N555j257r664j8881k8436l7845
33736d66372m6286n2585n5538n4349m8954m0090k8991j6890m611P563J9732L2055
33724g55316M4453N6448O7123P5327Q0022Q0635P7223P0290O0501M8563L5446
33713e9285K2518J1304K786l191p810j2449j7708k2949k6700k7601k5251k0416
33701a86752j4588r179m913j714R28L390N504O613O003L473l33m119o567o970
$$ plain form
33785 51933 43114 17314 -23569 -76621 -137642 -201074 -260290 -308397 -339514 -350169 -340141 -312316
33773 -312316 -271625 -223703 -173842 -126436 -84728 -50590 -24397 -5256 8368 17859 23886 26294
33761 26294 24350 17072 3463 -17383 -46123 -82856 -126701 -175569 -226351 -275480 -319565 -355875
33749 -355875 -382621 -399101 -405727 -403955 -396186 -385613 -375844 -370289 -371546 -381210 -400091 -428527 -466372
33736 -466372 -512658 -565243 -620781 -675130 -724084 -764174 -793165 -810055 -814666 -807103 -787371 -755316
33724 -755316 -710863 -654415 -587292 -511965 -431943 -351308 -274085 -203795 -143294 -94731 -59285
33713 -59285 -36767 -25463 -22677 -25868 -33678 -46127 -63835 -86784 -113484 -141085 -166336 -186752
33701 -186752 -201340 -210519 -215432 -217146 -216218 -212828 -207324 -200711 -194708 -191235 -191568 -195687 -202254 -209224
33687b09224n423k506J182N175Q919J1600J2345J0793P613M426L054M559Q812
33674a38675J4915K2075L0018L8570M6893N3176N5200N1365M1521K7146J0730
33663B52934n336j9715l2378m4028n5103o5106p2682p6305p5167o9676o1262n1669
33651c75493m2214l3478k5455j7800j0032j735P193J6339K4806L1524L5520L6084
33639c54741L2809K5689J5268K731j0212k1614k9725l3429l2532k7832k0928j3760
33627d68276q020m647l667m392n739o521n704k652K650R616J7422K5398L3270
$$ plain form
33687 -209224 -214647 -217153 -215971 -210796 -201877 -190277 -177932 -167139 -159526 -155100 -152046 -147487 -138675
33674 -138675 -123760 -101685 -71667 -33097 13796 66972 122172 173537 215058 242204 252934
33663 252934 247598 227883 195505 151477 96374 31268 -41414 -117719 -192886 -262562 -323824 -375493
33651 -375493 -417707 -451185 -476640 -494440 -504472 -506207 -499014 -482675 -457869 -426345 -390825 -354741
33639 -354741 -321932 -296243 -280975 -278244 -288456 -310070 -339795 -373224 -405756 -433588 -454516 -468276
33627 -468276 -476296 -480943 -484610 -489002 -494741 -501262 -506966 -509618 -506968 -497352 -479930 -454532 -421262
$$ [...]
##END NTUPLES=NMR SPECTRUM
##END=
