##TITLE=31Pdec_E3e-N1
 CDCl3
  24 sc
 23.11.2023
##JCAMPDX= 6.0         $$ Bruker NMR JCAMP-DX V2.0
##DATA TYPE= NMR SPECTRUM
##DATA CLASS= NTUPLES
##ORIGIN= UXNMR, Bruker Analytische Messtechnik GmbH
##OWNER= root
$$ XWIN-NMR		Version 3.5
$$ Thu Nov 23 15:13:56 2023 Russian Standard Time (UT+4h)  she@DPX200
##.OBSERVE FREQUENCY= 81.013821
##.OBSERVE NUCLEUS= ^31P
##.ACQUISITION MODE= SIMULTANEOUS
##.ACQUISITION SCHEME= undefined
##.AVERAGES= 24
##.DIGITISER RES= 16
##SPECTROMETER/DATA SYSTEM= spect
##.PULSE SEQUENCE= zgpg30
##.SOLVENT NAME= CDCl3
##.SHIFT REFERENCE= (INTERNAL, CDCl3, 0, 248.564)
##AUDIT TRAIL= $$ (NUMBER, WHEN, WHO, WHERE, WHAT)
$$ ##TITLE= Audit trail, XWIN-NMR		Version 3.5
$$ ##JCAMPDX= 5.01
$$ ##ORIGIN= Bruker BioSpin GmbH
$$ ##OWNER= she
$$ F:/spectra/data/she/nmr/P31/1/pdata/1/auditp.txt
$$ ##AUDIT TRAIL=  $$ (NUMBER, WHEN, WHO, WHERE, WHAT)
(   1,<2023-11-23 15:13:07.81 +0400>,<she>,<DPX200>,
      <created by zg, POWCHK disabled, PULCHK disabled
       configuration hash MD5:
       00 E9 B6 7A A2 85 ED C7 34 08 36 98 17 FE 4E 26
       data hash MD5: 32K
       93 FF 85 F6 93 FF 72 97 E3 8E D9 D6 A3 91 49 DA>)
(   2,<2023-11-23 15:13:10.32 +0400>,<she>,<DPX200>,
      <Start of raw data processing
       efp BC_mod = 2 LB = 10 FT_mod = 6 PKNL = 1 PHC0 = -11330.47 PHC1 = -23.5066 SI = 64K 
       data hash MD5: 64K
       C6 EC 6A C7 5E 7A FF 28 A5 84 47 04 1C 26 B7 0F>)
(   3,<2023-11-23 15:13:24.53 +0400>,<she>,<DPX200>,
      <pk PHC0 = 4.99016 PHC1 = 0 
       data hash MD5: 64K
       7D 11 DA 80 C3 8C 6B 52 0C 28 7D 96 B8 32 B3 FD>)
(   4,<2023-11-23 15:13:34.67 +0400>,<she>,<DPX200>,
      <abs ABSG = 5 
       data hash MD5: 64K
       9B 4C FC 8C F1 E1 50 A4 F7 8B E9 80 79 1F F1 94>)
$$ ##END=
$$ 
$$ hash MD5
$$ 4C B1 D1 F2 92 33 1D 98 55 98 03 84 42 48 0D 20
##$RELAX= 
##$RELAX= 
##$RELAX= 
##$RELAX= 
##$RELAX= 
##$RELAX= 
##$RELAX= 
##$RELAX= 
##$RELAX= 
$$ Bruker specific parameters
$$ --------------------------
##$DU= <F:/spectra>
##$EXPNO= 1
##$NAME= <P31>
##$PROCNO= 1
##$TYPE= <nmr>
##$USER= <she>
##$AMP= (0..31)
100 100 100 100 100 100 100 100 100 100 100 100 100 100 100 100 100 100 
100 100 100 100 100 100 100 100 100 100 100 100 100 100 
##$AQSEQ= 0
##$AQ_mod= 1
##$AUNM= <au_zg>
##$AUTOPOS= <>
##$BF1= 81.014009
##$BF2= 200.13
##$BF3= 200.13
##$BF4= 200.13
##$BF5= 200.13
##$BF6= 200.13
##$BF7= 200.13
##$BF8= 200.13
##$BYTORDA= 1
##$CFDGTYP= 0
##$CFRGTYP= 5
##$CHEMSTR= <none>
##$CNST= (0..31)
1 1 145 1 1 1 1 1 1 1 1 1 1 1 1 1 1 1 1 1 1 1 1 1 1 1 1 1 1 1 1 1 
##$CPDPRG= <waltz16>
##$CPDPRG1= <>
##$CPDPRG2= <waltz16>
##$CPDPRG3= <>
##$CPDPRG4= <mlev>
##$CPDPRG5= <mlev>
##$CPDPRG6= <mlev>
##$CPDPRG7= <mlev>
##$CPDPRG8= <mlev>
##$CPDPRGB= <>
##$CPDPRGT= <>
##$D= (0..31)
0 1 0 0 0 0 0 0 0 0 0 0.03 2e-05 3e-06 0 0 0 0 0 0 0 0 0 0 0 0 0 0 0 0 
0 0 
##$DATE= 1700737987
##$DBL= (0..7)
120 120 120 11 120 120 24 19 
##$DBP= (0..7)
150 150 150 150 150 150 150 150 
##$DBP07= 0
##$DBPNAM0= <>
##$DBPNAM1= <>
$$ [...]
##$SUBNAM3= <"">
##$SUBNAM4= <"">
##$SUBNAM5= <"">
##$SUBNAM6= <"">
##$SUBNAM7= <"">
##$SUBNAM8= <"">
##$SUBNAM9= <"">
##$SW= 501.771253377433
##$SWIBOX= (0..15)
0 1 3 0 0 0 0 0 0 0 0 0 0 0 0 0 
##$SW_h= 40650.406504065
##$TD= 32768
##$TD0= 1
##$TE= 0
##$TE2= 300
##$TE3= 300
##$TEG= 300
##$TL= (0..7)
0 120 53 12 22 120 120 120 
##$TP= (0..7)
150 150 150 150 150 150 150 150 
##$TP07= 0
##$TPNAME0= <>
##$TPNAME1= <>
##$TPNAME2= <>
##$TPNAME3= <>
##$TPNAME4= <>
##$TPNAME5= <>
##$TPNAME6= <>
##$TPNAME7= <>
##$TPOAL= (0..7)
0.5 0.5 0.5 0.5 0.5 0.5 0.5 0.5 
##$TPOFFS= (0..7)
0 0 0 0 0 0 0 0 
##$TUNHIN= 0
##$TUNHOUT= 0
##$TUNXOUT= 0
##$USERA1= <user>
##$USERA2= <user>
##$USERA3= <user>
##$USERA4= <user>
##$USERA5= <user>
##$V9= 5
##$VALIST= <valist>
##$VCLIST= <CCCCCCCCCCCCCCC>
##$VD= 0
##$VDLIST= <DDDDDDDDDDDDDDD>
##$VPLIST= <PPPPPPPPPPPPPPP>
##$VTLIST= <TTTTTTTTTTTTTTT>
##$WBST= 1024
##$WBSW= 4
##$XGAIN= (0..3)
0 0 0 0 
##$XL= 0
##$YL= 0
##$YMAX_a= 16267
##$YMIN_a= -16694
##$ZGOPTNS= <>
##$ZL1= 120
##$ZL2= 120
##$ZL3= 120
##$ZL4= 120
##$ABSF1= 248.5645
##$ABSF2= -253.2056
##$ABSG= 5
##$ABSL= 3
##$ALPHA= 0
##$AQORDER= 0
##$ASSFAC= 0
##$ASSFACI= 0
##$ASSFACX= 0
##$ASSWID= 0
##$AUNMP= <proc_1d>
##$AZFE= 0.1
##$AZFW= 0.5
##$BCFW= 0
##$BC_mod= 2
##$BYTORDP= 0
##$COROFFS= 0
##$CY= -3
##$DATMOD= 1
##$DC= 0
##$DFILT= <>
##$DTYPP= 0
##$F1P= 0
##$F2P= 0
##$FCOR= 1
##$FTSIZE= 65536
##$FT_mod= 6
##$GAMMA= 0
##$GB= 0
##$INTBC= 1
##$INTSCL= 6.047779e-11
##$ISEN= 30
##$LB= 10
##$LEV0= 0
##$LPBIN= 0
##$MAXI= 10000
##$MC2= 0
##$MEAN= 0
##$ME_mod= 0
##$MI= 50
##$NCOEF= 0
##$NC_proc= -6
##$NLEV= 6
##$NOISF1= 182.463
##$NOISF2= 159.3651
##$NSP= 0
##$NTH_PI= 0
##$NZP= 0
##$OFFSET= 248.5645
##$PC= 4
##$PHC0= -11325.48
##$PHC1= -23.5066
##$PH_mod= 1
##$PKNL= yes
##$PPARMOD= 0
##$PSCAL= 0
##$PSIGN= 0
##$REVERSE= no
##$SF= 81.0140089999694
##$SI= 65536
##$SIGF1= 159.3651
##$SIGF2= -187.1042
##$SINO= 113.3802
##$SIOLD= 16384
##$SREGLST= <1H.CDCl3>
##$SSB= 0
##$STSI= 65536
##$STSR= 0
##$SW_p= 40650.406504065
##$SYMM= 0
##$S_DEV= 0
##$TDeff= 32768
##$TDoff= 0
##$TI= <>
##$TILT= no
##$TM1= 0
##$TM2= 0
##$TOPLEV= 0
##$USERP1= <user>
##$USERP2= <user>
##$USERP3= <user>
##$USERP4= <user>
##$USERP5= <user>
##$WDW= 1
##$XDIM= 65536
##$YMAX_p= 543132135
##$YMIN_p= -7824716
$$ End of Bruker specific parameters
$$ ---------------------------------
##NTUPLES= NMR SPECTRUM
##VAR_NAME=  FREQUENCY,     SPECTRUM/REAL,   SPECTRUM/IMAG
##SYMBOL=    X,             R,               I
##VAR_TYPE=  INDEPENDENT,   DEPENDENT,       DEPENDENT
##VAR_FORM=  AFFN,          ASDF,            ASDF
##VAR_DIM=   65536,         65536,           65536
##UNITS=     HZ,            ARBITRARY UNITS, ARBITRARY UNITS
##FACTOR=    0.620285442955139, 1,           1
##FIRST=     20137.2065510682, 0,            0
##LAST=      -20513.1999529968, 0,           0
##MIN=       -20513.1999529968, -7824716,    0
##MAX=       20137.2065510682, 543132135,    0
$$ Real data points
##PAGE= N=1
##DATA TABLE= (X++(R..R)), XYDATA
$$ [...]
40015G00210O77o302j4898k3905l1673l6562l7466l4155k7288j8023p550L203
40003D66268J3584K3130L1565L8767M4679M9118N1742N2224N0449M6634M1248
39992I09408L4879K8020K0957J3832O800J43n760j0501j3686j5066j4890j4141
39980I39995j4251j6272k0149k4733k8570l0687l0828k9168k6031k1947j7856
39969F79503j5025j4675j7415k3000l0408l8194m4820m8858m9127m4928l6289
39958C16764k3992r263O516K1845L4885M3512M5838M0964K9439J3123n390k3580
39946D90661l9630n2597o2095o7804o9337o6557n9960n0670m0018k8994j7950
39935f4951o736M876J6687K7893L7342M4062M7623M8093M5703M0567L2654K2094
$$ plain form
40015 700210 700887 694585 679687 655782 624109 587547 550081 515926 488638 470615 463065 466268
40003 466268 479852 502982 534547 573314 617993 667111 718853 771077 821526 868160 909408
39992 909408 944287 972307 993264 1007096 1013896 1014039 1008279 997778 984092 969026 954136 939995
39980 939995 925744 909472 889323 864590 836020 805333 774505 745337 719306 697359 679503
39969 679503 664478 649803 632388 609388 578980 540786 495966 447108 397981 353053 316764
39958 316764 292772 283509 290025 311870 346755 390267 436105 477069 506508 519631 514241 490661
39946 490661 451031 398434 336339 268535 199198 132641 72681 22011 -18007 -47001 -64951
39935 -64951 -71687 -66811 -50124 -22231 15111 59173 106796 154889 200592 241159 273813 295907
39923B95907R588l424j5075k3775k8850l0605k9811k7045k2405j5767p306K109
39911A03541J0924J7419K0476K0117J7484J4187J1560J0256J0388J1867J4629
39900B62848J8522K3123K7683L1262L2936L1968K7876K0625J0893J81r500j6289
39888D62128j9160j8127j3986p823o57O660J3325J8542K1684K2525K1313J8625
39876E25049J5146J1617Q755P062O532O662O893P117P767R379J1960J4611J5757
39863F54307J3755P623k572j5771l0279m4184n5694o3429o6755o5963o2210n7077
39851B11751n1998m7776m4518m1892l9486l6997l4158l0652k6125k0437j3939
39840a76227p614k853r73k694p867j5433k3578l0074l2871l0779k3883j3420j255
$$ plain form
39923 295907 305495 302071 286996 263221 234371 203766 173955 146910 124505 108738 101432 103541
39911 103541 114465 131884 152360 172477 189961 204148 215708 225964 236352 248219 262848
39900 262848 281370 304493 332176 363438 396374 428342 456218 476843 487736 487917 478417 462128
39888 462128 442968 424841 410855 403032 402375 409035 422360 440902 462586 485111 506424 525049
39876 525049 540195 551812 560567 567629 574161 580823 587716 594833 602600 611979 623939 638550 654307
39863 654307 668062 675685 673113 657342 627063 582879 527185 463756 397001 331038 268828 211751
39851 211751 159753 111977 67459 25567 -13919 -50916 -85074 -115726 -141851 -162288 -176227
39840 -176227 -183841 -186694 -187667 -190361 -198228 -213661 -237239 -267313 -300184 -330963 -354846 -368266 -369521
39827c69521J0745K1099K8941L4007L6410L6267L3524K8211K0878J2715N105j020
39815a02639n485q634j0887j2526j3754j4841j6093j7680j9441k0853k1155j9585
39803b83573j5677r512j883N883J2471J7293K0870K4562K9730L6876M5329N3585
39791f4046O0024O3454O3182N8890N0696L9425K6702J4640N344M02M37M674J0954
39778C34778J6620J9857K0490J9547J7969J5644J1384L821p600k2166l8209n3802
39766C38333o7327p7616q3854q5466q2107p3729o0685m3792k4287l629J6670L5078
39754b12411N0090O0483O5674O5927O2176N5575M7097L7425K7106J6661O435l660
39742B78578j4033k4860l5478m4367m9833n0824m7348m0271l0744j9746q026L609
$$ plain form
39827 -369521 -358776 -337677 -308736 -274729 -238319 -202052 -168528 -140317 -119439 -106724 -101619 -102639
39815 -102639 -108124 -116758 -127645 -140171 -153925 -168766 -184859 -202539 -221980 -242833 -263988 -283573
39803 -283573 -299250 -308762 -310645 -304762 -292291 -274998 -254128 -229566 -199836 -162960 -117631 -64046
39791 -64046 -4022 59432 122614 181504 232200 271625 298327 312967 318311 318713 319150 323824 334778
39778 334778 351398 371255 391745 411292 429261 444905 456289 460110 452510 430344 392135 338333
39766 338333 271006 193390 109536 24070 -58037 -131766 -192451 -236243 -260530 -264159 -247489 -212411
39754 -212411 -162321 -101838 -36164 29763 91939 147514 194611 232036 259142 275803 282238 278578
39742 278578 264545 239685 204207 159840 110007 59183 11835 -28436 -59180 -78926 -86952 -83343
39730h3343J4024K1866K6067K6413K3801J9962J6764J5390J5941J7648J9494K0698
39718A54725K0891K0161J8995J8070J7778J7928J7878J7025J5129J2355R128O036
39706C46099L775K977L965O519R848J2821J4388J3884J1074O000j159j0062k0195
39693C99934l0913m1548n1501o0230o7219p1940p3835p2409o7359n8598m6234
39682b41852l0577j2426O602K3970L6692M2286L9749L0043J5799L60j3354k3678
39670a26386l0374l4163l5949l6246l5109l2441k8331k3059j6945j0199k943M700
39658d07445J2493K0039K6790L2193L5895L7907L8590L8496L8108L7652L7005
39647e2277L5795L3551K9849K4358J6891P551l123j4098k4031l1549l5548l5381
$$ plain form
39730 -83343 -69319 -47453 -21386 5027 28828 48790 65554 80944 96885 114533 134027 154725
39718 154725 175616 195777 214772 232842 250620 268548 286426 303451 318580 330935 340063 346099
39706 346099 349874 352851 356816 363335 373183 386004 400392 414276 425350 431350 430191 420129 399934
39693 399934 369021 327473 275972 215742 148523 76583 2748 -69661 -137020 -195618 -241852
39682 -241852 -272429 -284855 -278253 -254283 -217591 -175305 -135556 -105513 -89714 -89354 -102708 -126386
39670 -126386 -156760 -190923 -226872 -263118 -298227 -330668 -358999 -382058 -399003 -409202 -412145 -407445
39658 -407445 -394952 -374913 -348123 -315930 -280035 -242128 -203538 -165042 -126934 -89282 -52277
39647 -52277 -16482 17069 46918 71276 88167 95718 92595 78497 54466 22917 -12631 -48012
39635d8012l0903k2492j1043K046J5004K6011L3620L7158L6805L3356K7793K0904
39623A20247J3178M945l415j1380j8333k3650k6709k6919k3846j7477q410K200
39611a9569J2919K2347K9367L3250L3789L1317K6649K0828J4886R637N583K861
39599B23864J267L71l07j096k077l159m295n698p814j0997j5154j9666k3695k6516
39585A05028k7578k6322k2116j4503l605R706K4042L7893M9891N8814O3540O3136
39573C17926N7148M5850L0310J2231o327k3287l6939m6299n1243n2300n0179m5372
39561A51519l8107k8644j7628o174M364J2834J8734K2352K4491K5821K6293K5085
39549B20940K1154J4010M146p052j7748k6075l0489l0041k4549j4638j606J2854
$$ plain form
39635 -48012 -78915 -101407 -112450 -110404 -95400 -69389 -35769 1389 38194 71550 99343 120247
39623 120247 133425 138370 134955 123575 105242 81592 54883 27964 4118 -13359 -21769 -19569
39611 -19569 -6650 15697 45064 78314 112103 143420 170069 190897 205783 215420 221003 223864
39599 223864 225131 225502 225195 224099 222022 218863 214568 208870 201056 190059 174905 155239 131544 105028
39585 105028 77450 51128 29012 14509 10904 20610 44652 82545 132436 191250 254790 317926
39573 317926 375074 420924 451234 463465 457138 433851 396912 350613 299370 247070 196891 151519
39561 151519 113412 84768 67140 60966 65330 78164 96898 119250 143741 169562 195855 220940
39549 220940 242094 256104 260250 253198 235450 209375 178886 148845 124296 109658 108052 120906
39537A20906K6942L9038M7964N3123N4492N2472M7656M0603L1680K1059Q975l910
39525E41000j6296k6534l3338l6322l6039l3461k9414k4383j8683j2712p042k334
39513B64442Q31K117J545m44l110n688p715r205j0507j2026j3916j5996j7912
39500A72416j9413k0546k1628k3033k4947k7271k9632l1464l2111l1019k7930
39489a16578k2948j6423q739k57Q629J7395K5346L1631L5278L5427L1704K4568
39477D5033J5253N291m064j2104j8584k3497k6898k8833k9314k8388k6259k3468
39465a55832k0952j9896k1288k5357l1144l6602l9298l7474l0841k0669r107J872
39453d46588J1239J8983K5600L1445L6396L9896M1256L9891L5356K7300J5591
$$ plain form
39537 120906 147848 186886 234850 287973 342465 394937 442593 483196 514876 535935 544910 541000
39525 541000 524704 498170 464832 428510 392471 359010 329596 305213 286530 273818 266776 264442
39513 264442 265273 267390 268935 268491 265381 259693 251978 242773 232266 220240 206324 190328 172416
39500 172416 153003 132457 110829 87796 62849 35578 5946 -25518 -57629 -88648 -116578
39489 -116578 -139526 -155949 -164688 -164945 -156316 -138921 -113575 -81944 -46666 -11239 20465 45033
39477 45033 60286 65577 61513 49409 30825 7328 -19570 -48403 -77717 -106105 -132364 -155832
39465 -155832 -176784 -196680 -217968 -243325 -274469 -311071 -350369 -387843 -418684 -439353 -448460 -446588
39453 -446588 -435349 -416366 -390766 -359321 -322925 -283029 -241773 -201882 -166526 -139226 -123635
39442a23635P52j5580l0720m1739m6545m4603l6840k4980j0729M652K0300L5431
39430c14236M9120O0472O8919P4277P6420P4954O9252N8969M4568K7465R650o931
39418B92899k0758l0751l6125l6436l1840k3266j2244m96J0497J9665K6330L0126
39406A87601L1023K9415K6131K2258J8819J6496J5482J5490J5917J6117J5614
39395D10363J4161J1580P675K313m342j1743j9023k5140k8980k9497k5997j8511
39383B82859q005L736J4628K2918K7662K8775K6780K2431J6521R890L494j665
39371D50024m784n506m087j329J569L269K550j339q378j7585k7159l5019l9578
39358C12648m0317l7814l3280k7926k2526j7369j2423p588k916J218M031M462
$$ plain form
39442 -123635 -122883 -138463 -169183 -210922 -257467 -302070 -338910 -363890 -374619 -369967 -349667 -314236
39430 -314236 -265116 -204644 -135725 -61448 14972 89926 159178 218147 262715 290180 299830 292899
39418 292899 272141 241390 205265 168829 136989 113723 101479 100983 111480 131145 157475 187601
39406 187601 218624 248039 274170 296428 315247 331743 347225 362715 378632 394749 410363
39395 410363 424524 436104 443779 446092 441750 430007 410984 385844 356864 327367 301370 282859
39383 282859 274854 278590 293218 316136 343798 372573 399353 421784 438305 448195 451689 450024
39371 450024 445240 439734 435647 434318 435887 439156 441706 440367 431989 414404 387245 352226 312648
39358 312648 272331 234517 201237 173311 150785 133416 120993 113405 110489 111707 115738 120200
39346A20200J685m287j2354k0827k8328l4397l9383m3872m8184n2228n5593n7639
39334b75207n7683n5186m9989m2358l2836k2027j0517J068J2022K1677K9656L6074
39322d45306M1521M6759N2242N7678O1976O3622O1277N4299M3081K9188J5119
39311H1456L618l292n022k472K479P674J1320J2462J1222Q642O154M931N497P751
39297A52420J1234J5298J9068K1461K1589J9347J5717J2386J0911J2043J5561
39286C27035K0578K6032L1010L4833L6952L6890L4439K9906K4176J8389J3511
39275F33751J0041Q048P247P028O475M409l30q549k0321l4746m9908o3190p1833
39262D28122p3646o7616n4234l5500j4531N165K0614L0158L3777L2876K9525K5582
$$ plain form
39346 120200 121885 117598 105244 84417 56089 21692 -17691 -61563 -109747 -161975 -217568 -275207
39334 -275207 -332890 -388076 -438065 -480423 -513259 -535286 -545803 -544735 -532713 -511036 -481380 -445306
39322 -445306 -403785 -357026 -304784 -247106 -185130 -121508 -60231 -5932 37149 66337 81456
39311 81456 85074 81782 76760 74288 76767 84441 95761 108223 119445 128087 134241 139172 144669 152420
39297 152420 163654 178952 198020 219481 241070 260417 276134 288520 299431 311474 327035
39286 327035 347613 373645 404655 439488 476440 513330 547769 577675 601851 620240 633751
39275 633751 643792 651840 659087 666115 672590 676999 676669 668120 647799 613053 563145 499955 428122
39262 428122 354476 286860 232626 197126 182595 187760 208374 238532 272309 305185 334710 360292
39250C60292K2066J9118J6401J3471R847M922j973j1372k3482l8025n4056o9889
39238B47320q3387r2701r7100r7325r5194r2662r0802q9282q6642q1198p2104
39227g31077n9961m6684l4694k5931k1273k0561k3026k7603l3038l7917m0916
39216a102681m1145l8375l2986k5689j7147p741K392J3096K3960L4262M3152M9893
39204a099009N4131N5999N5996N4644N2224M8730M4026L8063L1055K3682J7139
39193f23320J2936J2422J6282K4231L5032M6815N7583O5574O9410O8169O1543
39182a53323N0130L5532K0004N692o166j5619k3621l1124l8208m3803m6225m4172
39170b90903l7570k7759j6855o681K045R664J6857K3924L0693L6862M2341M7204
$$ plain form
39250 360292 382358 401476 417877 431348 441195 446117 444144 432772 409290 371265 317209 247320
39238 247320 163933 71232 -25868 -123193 -218387 -311049 -401851 -491133 -577775 -658973 -731077
39227 -731077 -791038 -837722 -872416 -898347 -919620 -940181 -963207 -990810 -1023848 -1061765 -1102681
39216 -1102681 -1143826 -1182201 -1215187 -1240876 -1258023 -1265764 -1263372 -1250276 -1226316 -1192054 -1148902 -1099009
39204 -1099009 -1044878 -988879 -932883 -878239 -826015 -777285 -733259 -695196 -664141 -640459 -623320
39193 -623320 -610384 -597962 -581680 -557449 -522417 -475602 -418019 -352445 -283035 -214866 -153323
39182 -153323 -103193 -67661 -47657 -41965 -48131 -63750 -87371 -118495 -156703 -200506 -246731 -290903
39170 -290903 -328473 -356232 -373087 -379768 -377723 -368059 -351202 -327278 -296585 -259723 -217382 -170178
39158a70178N1394N4538N5990N5132N1714M6038L8946L1556K4876J9487J5388
39147B74881J2106R089O204L983L432N442J0145J6609K3044K7450K8340K5141
39135D45866J8183Q367l163j5169k6416l5873m2945m7555m9886n0007m7709m2729
39123A10964l5168k5684j5328n267L396R601J2355J0959N294m149j6432l0387
39111B0154m4582n7238o6344p0157o7814n9615m6828l1210j4508J758J6305K8029
39099c92050L6104M0282M1108L9726L7309L4549L1543K8052K3820J8694J2667
39088d8196N915j138p849j3419j7109j8580j8201j6955j5953j5792j6301j6754
39076b00332j6312j4406j0994o614k242J053K476J635j474o503j2663j8675k3037
$$ plain form
39158 -170178 -118784 -64246 -8256 46876 98590 144628 183574 215130 240006 259493 274881
39147 274881 286987 296076 302280 306263 309695 315137 325282 341891 364935 392385 420725 445866
39135 445866 464049 472416 469253 454084 427668 391795 348850 301295 251409 201402 153693 110964
39123 110964 75796 50112 34784 29517 32913 42514 54869 65828 71122 66973 50541 20154
39111 20154 -24428 -81666 -148010 -218167 -285981 -345596 -392424 -423634 -438142 -436384 -420079 -392050
39099 -392050 -355946 -315664 -274556 -234830 -197521 -162972 -131429 -103377 -79557 -60863 -48196
39088 -48196 -42281 -43419 -51268 -64687 -81796 -100376 -118577 -135532 -151485 -167277 -183578 -200332
39076 -200332 -216644 -231050 -242044 -248658 -250900 -249847 -247371 -245736 -247210 -253713 -266376 -285051 -308088
39063c08088k4498k2469j7117r226M2R377J7648K4297K9389L3272L6096L7682
39051a93595L7796L6543L4413L2078L0110K8754K7830K6704K4501K0494J4431
39040A20059O648j990j0222j6552j9541j8282j2794m195N459J3571J7600J5723
39028I5484P422o274k2988l9548n2794o0407o1546n6926m8216l7148k4907j2074
39016c19922J063J4222K6983L8765M8900N6771O1984O4410O4060O0976N5183M6855
39004B20250L6430K4662J2514J021q818j6165k0531k1908k0731j7614j3058p365
38992A68687p57O413J3540J9808K4371K6637K6467K4103J9869J3885O166l085
38980C46104j3247k3443l2877m0952m7121n0660n0677m6347l7321k4203q846N917
$$ plain form
39063 -308088 -332586 -355055 -372172 -381398 -381356 -371979 -354331 -330034 -300645 -267373 -231277 -193595
39051 -193595 -155799 -119256 -84843 -52765 -22655 6099 33929 60633 85134 105628 120059
39040 120059 126707 124717 114495 97943 78402 60120 47326 43131 48590 62161 79761 95484
39028 95484 102906 96632 73644 34096 -18698 -79105 -140651 -197577 -245793 -282941 -307848 -319922
39016 -319922 -318859 -304637 -277654 -238889 -189989 -133218 -71234 -6824 57236 118212 173395 220250
39004 220250 256680 281342 293856 294877 286059 269894 249363 227455 206724 189110 176052 168687
38992 168687 167930 174343 187883 207691 232062 258699 285166 309269 329138 343023 349189 346104
38980 346104 332857 309414 276537 235585 188464 137804 87127 40780 3459 -20744 -29590 -23673
38968b3673J7276K3764K5928K5767K5358K5555K5768K4745K1799J7571J3890J2913
38956B36661J6132K3705L4256M5124N3050N5240N0412L9273K4178Q190n900j6227
38944E64094k2091k3862k2714k0231j7985j7073j7797j9615k1440k2194k1280
38933C37812j8781j5254j1382p673m371j587M83J388N46k422p339j3472j9853
38920B38095k5612l0163l3211l4737l5001l4454l3562l2590l1530l0137k8221
38909a11123k5843k3350k1087j9151j7315j5189j2222p679p58Q942K0938L3847
38897a89990M5885N5617O2374O6205O7538O6859O4648O1366N7492N3350M8911
38886D60255M3740L7241K9034J9179Q041m003j6693k9634m2036n2740o0625o5002
$$ plain form
38968 -23673 -6397 17367 43295 69062 94420 119975 145743 170488 192287 209858 223748 236661
38956 236661 252793 276498 310754 355878 408928 464168 514580 553853 578031 586221 580321 564094
38944 564094 542003 518141 495427 475196 457211 440138 422341 402726 381286 359092 337812
38933 337812 319031 303777 292395 284722 280351 278764 279247 280635 281181 278759 271420 257948 238095
38920 238095 212483 182320 149109 114372 79371 44917 11355 -21235 -52765 -82902 -111123
38909 -111123 -136966 -160316 -181403 -200554 -217869 -233058 -245280 -252959 -253717 -244775 -223837 -189990
38897 -189990 -144105 -88488 -26114 40091 107629 174488 239136 300502 357994 411344 460255
38886 460255 503995 541236 570270 589449 597490 593487 576794 547160 505124 452384 391759 326757
38874C26757o5759o3245n8127n1264m3477l5365k7170j8962j0875l312L167Q082
38862c9550J1339J3311J4664J5954J7337J8526J9061J8438J6169J1797N248k717
38850A19577j0364j5439j6048j1387k072J0011K2211L1821L6789L6190L0283K0267
38838B51839P830n225j7290k7128l4032l7940l9413l9268l8074l5767l1781k5544
38826g1793j7004o717M435J5697K6634L7001M6367N3902N8429N8755N4021M4004
38814C03731K9305J1370p756k5896m1136n2010n7478n7001n0802m0103k7020j3966
38802b8762k779N832J2246J7202K0994K3187K3036K0173J4935Q071L01p863j5855
38789I0718k2799k7623k9582k8690k5776k2137j9086j7597j8024j9923k2126k3132
$$ plain form
38874 326757 260998 197753 139626 88362 44885 9520 -17650 -36612 -47487 -50799 -47632 -39550
38862 -39550 -28211 -14900 -236 15718 33055 51581 70642 89080 105249 117046 122294 119577
38850 119577 109213 93774 77726 66339 64267 74278 96489 128310 165099 201289 231572 251839
38838 251839 259669 254444 237154 210026 175994 138054 98641 59373 21299 -14468 -46249 -71793
38826 -71793 -88797 -95514 -91079 -75382 -48748 -11747 34620 88522 146951 205706 259727 303731
38814 303731 333036 344406 336650 310754 269618 217608 160130 103129 52327 12224 -14796 -28762
38802 -28762 -31541 -25709 -13463 3739 24733 47920 70956 91129 106064 114135 114436 106573 90718
38789 90718 67919 40296 10714 -17976 -43752 -65889 -84975 -102572 -120596 -140519 -162645 -185777
38777a85777k1666j7080r357J123J3787K7827M1955N4422O3398O7617O6732O1178
38765A64159N1820L9795K6475J3287J336q812j6929k2800k6114k6679k4620k0451
38753A50467j4943q975l343J273M161M464J435m955j3609k2587l0007l4829l6981
38740h429l6911l5046l1624k6768k0608j3192m442N650J6648K7535L7181M5061
38728d4945N1661N8032O4866P1797P7477Q0299P9130P3624O4101N1356L6653K1641
38716F85692Q075k802j0763j6675k1998k7965l4949m2338m9043n4226n7781o0166
38704C15061o1743o2246o0821n6696m9884m1406l2953k6224k2390k1788k3869
38693a44959k7405l0858l2860l2564k9824k5120j9256j2999o806r33M318Q476
$$ plain form
38777 -185777 -207443 -224523 -233880 -232757 -218970 -191143 -149188 -94766 -31368 36249 102981 164159
38765 164159 215979 255774 282249 295536 296872 288060 271131 248331 222217 195538 170918 150467
38753 150467 135524 126549 123206 124479 128640 133104 134539 129584 115975 93388 63381 28552 -8429
38740 -8429 -45340 -80386 -112010 -138778 -159386 -172578 -177020 -171370 -154722 -127187 -90006 -44945
38728 -44945 6716 64748 129614 201411 278888 359187 438317 511941 576042 627398 664051 685692
38716 685692 693767 690965 680202 663527 641529 613564 578615 536277 487234 433008 375227 315061
38704 315061 253318 191072 130251 73555 23671 -17735 -50688 -76912 -99302 -121090 -144959
38693 -144959 -172364 -203222 -236082 -268646 -298470 -323590 -342846 -355845 -362651 -363584 -359266 -350790
38681c50790J1092J2045J1557R896P050K671l631j1864k1331l0561l7662m0938
38669d42466l9508l3654k4782j5082o974k385k108n519j0805j5643j7995j6782
38657f33703j2138n181K618J0088J6641K2123K6471K9532L1147L1284L0030K7527
38645d23561K3961J9679J5201J1025P443M484K062J08j466k786l958m889n194
38632c57891m307j753K628Q570J5450K2339K7969L0828K9515K3320J2678q55j5050
38619b06559k7641l6801m1454m1393l7288l0448k2362j4183o506M24O433J1317
38607d46461J4896J6987J7251J5217J0585L642m664j2960j9878k4435k6264k5639
38595d81723k3293k0132j6890j3817j0561o461j113N295J2136J8885K5423L1916
$$ plain form
38681 -350790 -339698 -327653 -316096 -306200 -299150 -296479 -300110 -311974 -333305 -363866 -401528 -442466
38669 -442466 -481974 -515628 -540410 -555492 -562466 -564851 -566959 -572478 -583283 -598926 -616921 -633703
38657 -633703 -645841 -651022 -648404 -638316 -621675 -599552 -573081 -543549 -512402 -481118 -451088 -423561
38645 -423561 -399600 -379921 -364720 -353695 -346252 -341768 -339706 -339598 -341064 -343850 -347808 -352697 -357891
38632 -357891 -362198 -363951 -361323 -352753 -337303 -314964 -286995 -256167 -226652 -203332 -190654 -191509 -206559
38619 -206559 -234200 -271001 -312455 -353848 -391136 -421584 -443946 -458129 -464635 -464211 -457778 -446461
38607 -446461 -431565 -414578 -397327 -382110 -371525 -367883 -372547 -385507 -405385 -429820 -456084 -481723
38595 -481723 -505016 -525148 -542038 -555855 -566416 -572877 -573990 -568695 -556559 -537674 -512251 -480335
38583d80335L8412M4540M9444N2106N1971M9418M5673M2070L9191L6626L3477
38572B593K9198K4118J9374J6279J5663J7585K1560K6880L2752L8207M2124M3553
38560C29886M2153L8442L3630K9086K5729K3698K2519K1575K0596J9815J9698
38549F26827K0494K1995K3565K4408K3766K0993J5610P457l057j4790k5958l4583
38537G06727l9201l9418l5938l0180k3725j7959j3887j1978j2146j3858j6364
38526D52073j8932k1014k2424k3289k3792k3923k3480k2319k0496j8185j5506
38515B18713j2520r407o624m882m816o532r261j1568j2145j0688q193o413o898
38502A08766j0224j5771k2069k7494l0880l1803l0372k6824k1408j4652p667j999
$$ plain form
38583 -480335 -441923 -397383 -347939 -295833 -243862 -194444 -148771 -106701 -67510 -30884 2593
38572 2593 31791 55909 75283 91562 107225 124810 146370 173250 206002 244209 286333 329886
38560 329886 372039 410481 444111 473197 498926 522624 545143 566718 587314 607129 626827
38549 626827 647321 669316 692881 717289 741055 762048 777658 785115 782058 767268 741310 706727
38537 706727 667526 628108 592170 561990 538265 520306 506419 494441 482295 468437 452073
38526 452073 433141 412127 389703 366414 342622 318699 295219 272900 252404 234219 218713
38515 218713 206193 196786 190162 185280 180464 173932 164671 153103 140958 130270 122077 115664 108766
38502 108766 98542 82771 60702 33208 2328 -29475 -59847 -86671 -108079 -122731 -130398 -132397
38490a32397J078J333j19j302l81L374R286J5806K1465K5523K7943K8932K8537
38477B9078K6654K3260J8659J3535Q799N218L049J891R49m06k113l369l128r63
38463A21113K314M829M591O22o523j5037k2713k7824k9676k8696k6102k3378k1795
38450f8275k2097k4370k8054l2210l5842l8145l8513l6521l1986k5082j6300o273
38438d03668M401J5120K5158L3572L9284M1328L9179L3079K4178J4370N827L87
38426a27785j026J348O262J1967J6697J9000J7901J3068N016m879j4656k2323
38414g9410k6369k6118k1827j4623o233J521P377J1087J3400J5571J8724K3426
38402h3474K9516L6139M2030M5964M7220M5661M1420L4547K5061J3370N19j2029
$$ plain form
38490 -132397 -131319 -129986 -130105 -131407 -131788 -128414 -119128 -103322 -81857 -56334 -28391 541 29078
38477 29078 55732 78992 97651 111186 119985 125203 128252 130143 131092 130686 128573 125204 122076 121113
38463 121113 123427 128256 132847 133469 126946 111909 89196 61372 31696 3000 -23102 -46480 -68275
38450 -68275 -90372 -114742 -142796 -175006 -210848 -248993 -287506 -324027 -356013 -381095 -397395 -403668
38438 -403668 -399267 -384147 -358989 -325417 -286133 -244805 -205626 -172547 -148369 -133999 -128172 -127785
38426 -127785 -128811 -127463 -121201 -109234 -92537 -73537 -55636 -42568 -37552 -42431 -57087 -79410
38414 -79410 -105779 -131897 -153724 -168347 -174580 -173059 -165682 -154595 -141195 -125624 -106900 -83474
38402 -83474 -53958 -17819 24211 70175 117395 163056 204476 239023 264084 277454 277973 265944
38390B65944k2894l1101l6031l7234l4418k7603j7299m525R265K2330L2829L9090
38378A58353L9963L5164K5502J2714j100j4090k4950l2711l6553l6026l1603k5003
38366F9660j8805j5450j6210k0673k7050l2998l6545l6625l3213k7099j9614j2319
38354b26941o760m119m892q722j4638k1564k8732l5687m1992m7004m9875m9783
38342e40709m6181l8964k8550j5903k435J0215K0606K7889L1908L2971L1616K8594
38330d88943K4937K1700J9471J8107J6957J5398J3229J0688Q254O332N072M286
38318c24512L513K130m32m372r261j4163j8147k0868k2724k4469k6514k8438k9006
38305e17263k6778k0935j1794o73J0755K1060K9279L4740L6790L4891K9071K0460
$$ plain form
38390 265944 243050 211949 175918 138684 104266 76663 59364 54839 64104 86434 119263 158353
38378 158353 198316 233480 258982 271696 270596 256506 231556 198845 162292 126266 94663 69660
38366 69660 50855 35405 19195 -1478 -28528 -61526 -98071 -134696 -167909 -195008 -214622 -226941
38354 -226941 -233701 -237820 -242712 -251434 -266072 -287636 -316368 -352055 -394047 -441051 -490926 -540709
38342 -540709 -586890 -625854 -654404 -670307 -672742 -662527 -641921 -614032 -582124 -549153 -517537 -488943
38330 -488943 -464006 -442306 -422835 -404728 -387771 -372373 -359144 -348456 -340202 -333870 -328798 -324512
38318 -324512 -320999 -318869 -319301 -323673 -332934 -347097 -365244 -386112 -408836 -433305 -459819 -488257 -517263
38305 -517263 -544041 -564976 -576770 -577443 -566688 -545628 -516349 -481609 -444819 -409928 -380857 -360397
38293c60397J1260M141J299L736J0964K1209L2069M1402M7965N1430N1922M9614
38281c3386M4658L7303K7905J6913M846p688k0099l1926m2806n2233n9404o3392
38269a79309o3608o0175n3863m5670l6357k6248j5353l635Q790K1580L4192M5935
38257c73721N5905O3000O6107O4541N8477M8975L7615K6012J5490O934O74l624
38245F6385o893j0303j4718k0311k6531l2374l6694l8500l7224l2947k6413j8736
38233b35259j0964l790K525Q025J2881J7182K0689K2748K2475J9243J3192N378
38221a05675k583r191j3556j5576j5866j5567j5944j7785k0855k3902k5241k3583
38209c05324j8608j1111k703M703R523J1059R721O826L973K367K420L780N688
$$ plain form
38293 -360397 -349137 -344996 -343697 -339961 -328997 -307788 -275719 -234317 -186352 -134922 -83000 -33386
38281 -33386 11272 48575 76480 93393 98239 90551 70452 38526 -4280 -56513 -115917 -179309
38269 -179309 -242917 -303092 -356955 -402625 -438982 -465230 -480583 -484218 -475428 -453848 -419656 -373721
38257 -373721 -317816 -254816 -188709 -124168 -65691 -16716 20899 46911 62401 69335 70009 66385
38245 66385 59492 49189 34471 14160 -12371 -44745 -81439 -119939 -157163 -190110 -216523 -235259
38233 -235259 -246223 -250013 -247488 -239463 -226582 -209400 -188711 -165963 -143488 -124245 -111053 -105675
38221 -105675 -108258 -117449 -131005 -146581 -162447 -178014 -193958 -211743 -232598 -256500 -281741 -305324
38209 -305324 -323932 -335043 -337746 -333043 -323520 -312461 -302740 -295914 -291941 -289574 -287154 -283374 -277686
38196b77686P385Q447R005R634J1037J3673J7638K2761K8696L4865M0419M4366
38184b9760M5855M4440M0161L3465K5028J5562N753l675j1879j7968k1181k1193
38172A04608j8316j3480p869k402K598P323J1956J6087J8463J7422J1864K145
38160A50399r766k1021k8984l1972k9531k2377j2225j501P190J1697J0908N066
38148B7883m390j5423k6176l5524m3061m8651n1888n1919m7837l9360k7255j3234
38136c76835O26J2543K1476K7209L0136L0846K9755K7038K2853J7623J2083P145
38124a37502L641K110K550M309O356P900Q993J0558J3832J9618K7821L7389M6567
38111E4142N3407N6409N5003M9509M0704K9391J6316K360j1388k3775l3797m0684
$$ plain form
38196 -277686 -270301 -261854 -252849 -243215 -232178 -218505 -200867 -178106 -149410 -114545 -74126 -29760
38184 -29760 16095 60535 100696 134161 159189 174751 180504 176829 164950 146982 125801 104608
38172 104608 86292 72812 64943 62541 65139 72462 84418 100505 118968 136390 148254 150399
38160 150399 140633 119612 90628 58656 29125 6748 -5477 -6978 212 11909 22817 27883
38148 27883 23493 8070 -18106 -53630 -96691 -145342 -197230 -249149 -296986 -336346 -363601 -376835
38136 -376835 -376209 -363666 -342190 -314981 -284845 -253999 -224244 -197206 -174353 -156730 -144647 -137502
38124 -137502 -133861 -131751 -129201 -124892 -118536 -110636 -101643 -91085 -77253 -57635 -29814 7575 54142
38111 54142 107549 163958 218961 268470 309174 338565 354881 357241 345853 322078 288281 247597
38099B47597m3893m3195l8911l2056k4127j6557j0203n228j399J448L162L328
38087C9966J589j998o783j1693j5597j7689j7678j5771j2591q968n753l645l063
38074g9674m033o104q480j0356j1342j1620j1755j2234j3063j3593j2770r718
38062b04742m312K746J0378J7720K4301K9801L3799L5878L5997L4693L2868L1281
38050H0408L0175K9236K7941K6001K3616K1373J9939J9839K1345K4411K8598L3094
38038C85976L6905L9091L8928L5951L0065K1700J1899K110o257j2372j6271j8739
38026E48986k0772k3034k5538k7739k8819k8022k4891j9352j1710k557P303J7020
38014C60875K5884L3441L9396M3495M5507M5352M3135L9047L3296K6208J8370
$$ plain form
38099 247597 203704 160509 121598 89542 65415 48858 38655 33427 32028 33476 36638 39966
38087 39966 41555 39557 32774 21081 5484 -12205 -29883 -45654 -58245 -67213 -72966 -76611 -79674
38074 -79674 -83707 -89811 -98291 -108647 -119989 -131609 -143364 -155598 -168661 -182254 -195024 -204742
38062 -204742 -209054 -206308 -195930 -178210 -153909 -124108 -90309 -54431 -18434 16259 49127 80408
38050 80408 110583 139819 167760 193761 217377 238750 258689 278528 299873 324284 352882 385976
38038 385976 422881 461972 500900 536851 566916 588616 600515 602625 596368 583996 567725 548986
38026 548986 528214 505180 479642 451903 423084 395062 370171 350819 339109 336552 343855 360875
38014 360875 386759 420200 459596 503091 548598 593950 637085 676132 709428 735636 754006
38003G54006J0531L354k698p212r610r248n823K83Q024J6046K3021K7769K9360
37990H37803K7298K1751J3488L483p492j8914l0190m0321m7945n1807n1318m6810
37978F09026l9272k9924j9898j0218j858M321P789Q558P270M952K582P73j87j59
37964E43755Q01K178K925J886j684p947j6670k7414l9498n1877o3200p2065p7400
37951A93790p8888p7225p3915p0508o7726o5178o1777n6465m8568l7703k3688
37940d67851o725J2249L1574M9301O3749P3724P8416P7312P0384N8493M3541K8059
37928A12226J4342L662l922r110j2694j5157j6666j7261j7056j6269j5192j4132
37916g229j3396j3334j4318j6575j9995k3995k7666l0177l1236l1190l0569k9386
$$ plain form
38003 754006 764537 767891 765193 757981 748371 739123 733300 733583 741607 757653 780674 808443 837803
37990 837803 865101 886852 900340 903823 896331 877417 847227 806906 758961 707154 655836 609026
37978 609026 569754 539830 519932 509714 507856 512177 519966 528524 535794 540746 543328 544101 543914 543755
37964 543755 544556 546734 549659 551545 549861 541914 525244 497830 458332 406455 343255 271190 193790
37951 193790 114902 37677 -36238 -106746 -174472 -239650 -301427 -357892 -406460 -444163 -467851
37940 -467851 -474576 -462327 -430753 -381452 -317703 -243979 -165563 -88251 -17867 40626 84167 112226
37928 112226 126568 130230 126308 117198 104504 89347 72681 55420 38364 22095 6903 -7229
37916 -7229 -20625 -33959 -48277 -64852 -84847 -108842 -136508 -166685 -197921 -229111 -259680 -289066
37904b89066k6885k2034j4489n193L736R834J1373Q135J595n680j1058j2812j0649
37891c63193n641M21N922J0157J3442J6564K0029K3645K6727K8620K9077K8192
37879a66038K6084K2764J8266J2899P299K301j312l056k912j403N79K037K171
37866h0321N74k618o687j0525j3047j3614j2217r405o055l093j259r14j998m167
37852a65346p039j0364j3994j7643k0700k2330k1904j9461j5845j2445j0641j1199
37840c48911j3941j7770k1062k2219k0138j4465n610N330J6732K6721L3713L7071
37828c44549L7525L6877L6996L8683M1292M3321M3531M1697L8515L4945L1563
37817H0396K8352K4930K0972J6546J2153Q358N294K438j126o137j2662j9904k6331
$$ plain form
37904 -289066 -315951 -337985 -352474 -357667 -353931 -344097 -332724 -324589 -322994 -328674 -339732 -352544 -363193
37891 -363193 -368834 -368413 -362491 -352334 -338892 -322328 -302299 -278654 -251927 -223307 -194230 -166038
37879 -166038 -139954 -117190 -98924 -86025 -78726 -76425 -77737 -80793 -83705 -85108 -84529 -82492 -80321
37866 -80321 -79747 -82365 -89052 -99577 -112624 -126238 -138455 -147860 -153915 -157008 -158267 -159181 -161179 -165346
37852 -165346 -172385 -182749 -196743 -214386 -235086 -257416 -279320 -298781 -314626 -327071 -337712 -348911
37840 -348911 -362852 -380622 -401684 -423903 -444041 -458506 -464116 -458786 -442054 -415333 -381620 -344549
37828 -344549 -307024 -270147 -233151 -194468 -153176 -109855 -66324 -24627 13888 48833 80396
37817 80396 108748 133678 154650 171196 183349 191707 197001 199439 198313 192176 179514 159610 133279
37804A33279l0168l0128k6044j9004j0839l364K154N120N546M021J684n0jK237
37790C4443O165J0771J5168J9102K2966K7342L2347L7198M0370M0291L6257K8967
37778C51387K0382J2903Q348P258Q915J1904J4775J6368J5855J2793P338M99n973
37765D82752j0169j0856q023k748L511R656J5209K0041K3982K6567K7115K4918
37753F01955J9528J1046L01j1199k1707k9870l5148l7783l8416l7761l6408l4667
37741C49871l2354k8883k3764j7231j0385m738j506j159l332p019j0831j3390
37729A95279j3686j1400o938j149N226J1938J9135K6892L4911M2691M9868N6203
37717D08970O1193O3855O3202N9044N2482M5486L9858L6253L3821L0583K4334
$$ plain form
37804 133279 103111 72983 46939 27935 17096 13732 15886 21006 26552 30573 32257 32207 32206 34443
37790 34443 40608 51379 66547 85649 108615 135957 168304 205502 245872 286163 322420 351387
37778 351387 371769 384672 393020 400278 409193 421097 435872 452240 468095 480888 488226 488725 482752
37765 482752 472583 461727 453704 450956 454467 464123 479332 499373 523355 549922 577037 601955
37753 601955 621483 632529 632830 621631 599924 570054 534906 497123 458707 420946 384538 349871
37741 349871 317517 288634 264870 247639 237254 232516 231010 229851 226519 219500 208669 195279
37729 195279 181593 170193 163255 162106 167332 179270 198405 225297 260208 302899 352767 408970
37717 408970 470163 534018 597220 656264 708746 754232 794090 830343 864164 894747 919081
37706I19081J3615j594j9799l8551n5316o8151p6028p8762p6776p0671o0803m7173
37694C39072k9782r269J2705L3678N1149O3489P0395P2660P1449O7610O1476N3046
37682H57678M2297K9382J4745p46j5750k8709l8403m4508m7671m8999m9323m8828
37670F21165m7184m4078l9641l4507k9458k5015k1360j8585j6954j6762j7933
37659C09688j9841k1578k2474k2333k1333j9698j7491j4684j1441q279n845m414
37647A20277l540k205P21O020J3944K4221L6057M8198N9046O6893P0239O8124
37635E07995O0356M7591L1289J3552l262j7151k7069l3160l6416l8007l8733l8758
37623D28227l7629l4500k8465j9007o327Q511K3785L7554M8236N5033N8034N7844
$$ plain form
37706 919081 932696 931102 911303 872752 817436 749285 673257 594495 517719 447048 386245 339072
37694 339072 309290 300021 312726 346404 397553 461042 531437 604097 675546 743156 804632 857678
37682 857678 899975 929357 944102 943356 927606 898897 860494 815986 768315 719316 669993 621165
37670 621165 573981 529903 490262 455755 426297 401282 379922 361337 344383 327621 309688
37659 309688 289847 268269 245795 223462 202129 182431 164940 150256 138815 130536 124691 120277
37647 120277 116737 114532 115253 121273 135217 159438 195495 243693 302739 369632 439871 507995
37635 507995 568351 615942 647231 660783 657521 640370 613301 580141 543725 505718 466985 428227
37623 428227 390598 356098 327633 308626 302299 310810 334595 372149 420385 475418 533452 591296
37611E91296N5186N0609M4456L6953K8294J8749Q733j234j0689j9249k6574l2387
37599G44143l6658l9789m2550m5825n0272n6037o2532o8485p2490p3780p2716
37588A23009p0584o8808o8126o8169o7711o5449o0862n4554m7916m2378l8739
37577e30287l6812l5350l2351k5786j4494J218J9558L7786N3033O3194O7600O7042
37565c65649O3104N7218N0105M1998L3151K4095J5462P746J277l673o956q714
37553i0836r292q878p215l768J691Q664J6074K2889K8722L3851L8781M3684M8157
37540A22524N1344N2242N0098M4858L7297K8689K0161J2229M814k403r563j6350
37528C95940k1986k5489k6202k4187k0220j5417j0734o686l428r81N69J200J193
$$ plain form
37611 591296 646482 697091 741547 778500 806794 825543 834276 833042 822353 803104 776530 744143
37599 744143 707485 667696 625146 579321 529049 473012 410480 341995 269505 195725 123009
37588 123009 52425 -16383 -84509 -152678 -220389 -285838 -346700 -401254 -449170 -491548 -530287
37577 -530287 -567099 -602449 -634800 -660586 -675080 -673862 -654304 -616518 -563485 -500291 -432691 -365649
37565 -365649 -302545 -245327 -195222 -153224 -120073 -95978 -80516 -72770 -71493 -75166 -82122 -90836
37553 -90836 -100128 -109006 -116221 -119989 -118298 -109634 -93560 -70671 -41949 -8098 30683 74367 122524
37540 122524 173868 226110 276208 321066 358363 387052 407213 419442 424256 421853 412290 395940
37528 395940 373954 348465 322263 298076 277856 262439 251705 245019 241591 240610 241179 242379 243572
37515B43572J187J854L437N574P563Q848R333R336R204R004Q542P720O835O406
37501C38415O726P422P467N537N77p673j8301k9165l7366m0178l6086k5397j0077
37488A61901O950K2706L4842M2026M4035M1559L5920K8817K2096J7341J5346J5855
37476D89394J7886K0449K3019K5489K7870L0074L1921L3175L3491L2383K9296
37465G94447K3837J6021O511l374j1931j7654j9903j9178j6847j4396j2697j1666
37453G13170j0477q111l984J696Q102J4279J9588K3766K6712K8340K8648K7917
37441H69646K6682K5525K4814K4670K5073K5942K7028K7795K7511K5507K1449
37430A151642J5366P604j287j0679k0072k9229l8135m6829n5268o3241p0348p6048
$$ plain form
37515 243572 244759 246613 250050 255624 263187 272035 281368 290704 299908 308912 317454 325174 332009 338415
37501 338415 345141 352563 360030 365567 366144 358471 340170 311005 273639 233461 197375 171978 161901
37488 161901 168851 191557 226399 268425 312460 354019 389939 418756 440852 458193 473539 489394
37476 489394 507280 527729 550748 576237 604107 634181 666102 699277 732768 765151 794447
37465 794447 818284 834305 840816 837442 825511 807857 787954 768776 751929 737533 724836 713170
37453 713170 702693 694582 690598 692294 700396 714675 734263 758029 784741 813081 841729 869646
37441 869646 896328 921853 946667 971337 996410 1022352 1049380 1077175 1104686 1130193 1151642
37430 1151642 1167008 1174612 1173325 1162646 1142574 1113345 1075210 1028381 973113 909872 839524 763476
37418G63476p9823q1355q0505p7121p0970o1991n0646l8015k5359j3498k530P862
37406A89525J7792K6880L4417L9790M2683M3058M1034L6935L1291K4830J8339
37395E46574J2600Q287N860N372O408Q241J0220J2062J3782J5434J6883J7850
37383F79573J8085J7587J6744J6386J7461K0495K5169L0511L5438L9179M1291
37372I57919M1526L9830L6377L1426K5122J7429Q396j555j1481k0106k6169k8883
37360A069831k8234k5008k0448j5721j1467p730m244p89K671O076R408J2605J5349
37347A002299J6931J6463J3364P825Q58o163j2172j6903k0892k5019k9820l5045
37335I11726l9735m2840m3843m2977m0933l8442l5969l3676l1397k8668k4798
$$ plain form
37418 763476 683653 602298 521793 444672 373702 311711 261065 223050 197691 184193 181663 189525
37406 189525 207317 234197 268614 308404 351087 394145 435179 472114 503405 528235 546574
37395 546574 559174 567461 573321 578693 585101 593342 603562 615624 629406 644840 661723 679573
37383 679573 697658 715245 731989 748375 765836 786331 811500 842011 877449 916628 957919
37372 957919 999445 1039275 1075652 1107078 1132200 1149629 1158025 1156470 1144989 1124883 1098714 1069831
37360 1069831 1041597 1016589 996141 980420 968953 961223 956979 956190 958861 964937 974345 986950 1002299
37347 1002299 1019230 1035693 1049057 1056882 1057740 1051577 1039405 1022502 1001610 976591 946771 911726
37335 911726 871991 829151 785308 742331 701398 662956 626987 593311 561914 533246 508448
37324E08448j9025j0774J3J2533K4972L4753L9361L7414K9377J7371M276p311
37312F71408j5595j9667j9436j5577r405k477L828Q692J2006J4250J6050J7722
37300F61799J9157K0184K1021K2387K5168K9877L6367M3816N0987N6560N9448
37289A046771N8996N5082M8148L9117K9273K0081J2995R156R064J2307J7564K2959
37277A381513K6601K7196K4448J9179J3032P838M885M395N494O587O040K778l306
37264A526680j1396k0061k7586l2256l2695k8394k0154j0012m59O619J0662J2488
37252A373436J3681J5707J9246K4079K9528L4911L9669M3221M4970M4615M2452
37241A725515L9353L6399L4404L3662L4002L5132L6910L9413M2774M6979N1794
$$ plain form
37324 508448 489423 478649 478662 491195 516167 550920 590281 627695 657072 674443 678719 671408
37312 671408 655813 636146 616710 601133 591728 589251 593079 601771 613777 628027 644077 661799
37300 661799 680956 701140 722161 744548 769716 799593 835960 879776 930763 987323 1046771
37289 1046771 1105767 1160849 1208997 1248114 1277387 1297468 1310463 1319619 1328683 1340990 1358554 1381513
37277 1381513 1408114 1435310 1459758 1478937 1491969 1499807 1504692 1509087 1514581 1521168 1527208 1529986 1526680
37264 1526680 1515284 1495223 1467637 1435381 1402686 1374292 1354138 1344126 1343667 1350286 1360948 1373436
37252 1373436 1387117 1402824 1422070 1446149 1475677 1510588 1550257 1593478 1638448 1683063 1725515
37241 1725515 1764868 1801267 1835671 1869333 1903335 1938467 1975377 2014790 2057564 2104543 2156337
37230B156337N6628O0410O1556N8353M9666L5689J8196J25j5427k6312l2086l4062
37218B389073l4663l6414m1037m8946n9173o9716p8277q3101q3413p9205p0752
37207A704376n8541m3617k7806j3266j713O060J0130J1155J0095Q039O074N186
37195A616172O192R556J5228K2605L0745L8648M5495N0806N4540N7052N9006O1205
37183B067250O4314O8573P3604P8525Q2232Q3671Q2084P7281O9797O0779N1575
37172B859685M3350L6897L2560L0096K8604K6667K2881J6506P860j826j1021j8638
37160C073621k4398k8724l2272l5458l8223m0195m1121m1288m1529m2832m5869
37149B661712n0697n6742o2993o8347p1964p3513p3224p1729o9776o7872o6051
$$ plain form
37230 2156337 2212965 2273375 2334931 2393284 2442950 2478639 2496835 2496960 2481533 2455221 2423135 2389073
37218 2389073 2354410 2317996 2276959 2228013 2168840 2099124 2020847 1937746 1854333 1775128 1704376
37207 1704376 1645835 1602218 1574412 1561146 1559433 1565493 1575623 1586778 1596873 1604912 1610986 1616172
37195 1616172 1622364 1631920 1647148 1669753 1700498 1739146 1784641 1835447 1889987 1947039 2006045 2067250
37183 2067250 2131564 2200137 2273741 2352266 2434498 2518169 2600253 2677534 2747331 2808110 2859685
37172 2859685 2903035 2939932 2972492 3002588 3031192 3057859 3080740 3097246 3105106 3103280 3092259 3073621
37160 3073621 3049223 3020499 2988227 2952769 2914546 2874351 2833230 2791942 2750413 2707581 2661712
37149 2661712 2611015 2554273 2491280 2422933 2350969 2277456 2204232 2132503 2062727 1994855 1928804
37138A928804o3954o1180n7603n3484m9264m5174m0986l6050k9765k2072j3579
37127A455693n172K507R320J5511K1424K7267L3041L8533M3296M6779M8577M8737
37115A785513M7754M6120M3878M0647L6184L0912K5959K2621K1758K3466K7191
37104B152003L2019L6821M0237M0781L7339K9806J9300P787k574r975j3176j1544
37092B358824n022N828J9745L4885M9194O0816O8361P0962O8459O1610N2033M1705
37080B887400L2271K4478J7902J1156K615q548k1661l4642m4877n0257m9916m4334
37068B721587l4923k3456j1694j361N929Q931P215J434o652j4571j9891k1056
37056B611492j7859j1332l239M488J0312J3627J4988J5818J7688K1542K7301L4027
$$ plain form
37138 1928804 1864850 1803670 1746067 1692583 1643319 1598145 1557159 1521109 1491344 1469272 1455693
37127 1455693 1450521 1453028 1462348 1477859 1499283 1526550 1559591 1598124 1641420 1688199 1736776 1785513
37115 1785513 1833267 1879387 1923265 1963912 2000096 2031008 2056967 2079588 2101346 2124812 2152003
37104 2152003 2184022 2220843 2261080 2301861 2339200 2369006 2388306 2396093 2393519 2383544 2370368 2358824
37092 2358824 2353802 2359630 2379375 2414260 2463454 2524270 2592631 2663593 2732052 2793662 2845695 2887400
37080 2887400 2919671 2944149 2962051 2973207 2975822 2967274 2945613 2910971 2866094 2815837 2765921 2721587
37068 2721587 2686664 2663208 2651514 2650153 2656082 2665013 2672228 2673662 2667010 2652439 2632548 2611492
37056 2611492 2593633 2582301 2579062 2583550 2593862 2607489 2622477 2638295 2655983 2677525 2704826 2738853
37044B738853M0601M6487N2071N8290O5820P4450Q3109R0393R5226R7192R6398
37033C538890R3190Q8078Q1966P6168P1884O9359O7538O4529N8632M9273L7267
37022D296774K4377J2395K282o096j3589k1015k8554l5632m1250m4377m4196m0185
37010D060934l2250k0878p212P084K0090L0089L6140L8500L8416L7388L6411L5754
36998D280466L5212L4473L3404L2073L0561K8738K6398K3769K1931K2603K7284
36987D596912L6271M8203O0409O9940P4712P4133O8989O0870N1638M2941L5821
36976E220839L0529K6679K3628K0794J7948J5475J4444J6181K1569L0594M2479
36965E481159N6130P0400Q4021R5562J03706J07897J08842J08395J08771J11496
$$ plain form
37044 2738853 2779454 2825941 2878012 2936302 3002122 3076572 3159681 3250074 3345300 3442492 3538890
37033 3538890 3632080 3720158 3802124 3878292 3950176 4019535 4087073 4151602 4210234 4259507 4296774
37022 4296774 4321151 4333546 4335828 4329732 4316143 4295128 4266574 4230942 4189692 4145315 4101119 4060934
37010 4060934 4028684 4007806 4000594 4007678 4027768 4057857 4093997 4132497 4170913 4208301 4244712 4280466
36998 4280466 4315678 4350151 4383555 4415628 4446189 4474927 4501325 4525094 4547025 4569628 4596912
36987 4596912 4633183 4681386 4741795 4811735 4886447 4960580 5029569 5090439 5142077 5185018 5220839
36976 5220839 5251368 5278047 5301675 5322469 5340417 5355892 5370336 5386517 5408086 5438680 5481159
36965 5481159 5537289 5607689 5691710 5787272 5890978 5998875 6107717 6216112 6324883 6436379
36955F436379J16779J23549J30088J34812J36836J36118J33162J28737J23674
36946G600134J18825J15026J13045J13425J16299J21256J27571J34660J42470
36937H702711J51458J62256J75160J89681K04388K17196K25803K27891K21086
36928A0477630K03321J73811J34176Q8846M4285P278j7071k6702k2637p759J4643
36917A1069821M1740P1349J01756J31410J58570J81242J97620K06789K09152K06395
36907A2575844K01120J96139J93616J94522J98761K05601K13881K21814K26946
36898A4428244K26496K17925J99632J71723J36579R8752O3949L7512K3037K1630
36888A5625479L2015N1373P6417J04161J32191J58651J82142K01694K16938K28380
$$ plain form
36955 6436379 6553158 6676707 6806795 6941607 7078443 7214561 7347723 7476460 7600134
36946 7600134 7718959 7833985 7947030 8060455 8176754 8298010 8425581 8560241 8702711
36937 8702711 8854169 9016425 9191585 9381266 9585654 9802850 10028653 10256544 10477630
36928 10477630 10680951 10854762 10988938 11077784 11122069 11129347 11112276 11085574 11062937 11055178 11069821
36917 11069821 11111561 11182910 11284666 11416076 11574646 11755888 11953508 12160297 12369449 12575844
36907 12575844 12776964 12973103 13166719 13361241 13560002 13765603 13979484 14201298 14428244
36898 14428244 14654740 14872665 15072297 15244020 15380599 15479351 15543300 15580812 15603849 15625479
36888 15625479 15657494 15708867 15785284 15889445 16021636 16180287 16362429 16564123 16781061 17009441
36878A7009441K37501K46413K57194K71198K88641L08536L29108L48510L65414
36869A9661956L79244L90247L99680M09839M23639M43780M71948N08261N51128
36860B3639722N97762O45315O91945P37076P80833Q23294Q64041R02144R36598
36851C0618730R66973R93839J018776J044269J073750J111276J160525J223778
36843C9211916J301666J393716J498869J615850J743666J882130K031948K194432
36835E2874193K371274K564526K776378L008917L264346L545460L855798M199630
36827G8460522M582402N011408N495766O045465O670409P379913Q182605R086654
36819A30915144J0100548J1233512J2494556J3890533J5424509J7094009J8886999
$$ plain form
36878 17009441 17246942 17493355 17750549 18021747 18310388 18618924 18948032 19296542 19661956
36869 19661956 20041200 20431447 20831127 21240966 21664605 22108385 22580333 23088594 23639722
36860 23639722 24237484 24882799 25574744 26311820 27092653 27915947 28779988 29682132 30618730
36851 30618730 31585703 32579542 33598318 34642587 35716337 36827613 37988138 39211916
36843 39211916 40513582 41907298 43406167 45022017 46765683 48647813 50679761 52874193
36835 52874193 55245467 57809993 60586371 63595288 66859634 70405094 74260892 78460522
36827 78460522 83042924 88054332 93550098 99595563 106265972 113645885 121828490 130915144
36819 130915144 141015692 152249204 164743760 178634293 194058802 211152811 230039810
36812B30039810K0774416K2699897K4567015K6224598K7453501K7962152K7400716
36805D07122105K5408193K1708041J6247466R326392J623512n942397j2474958
36798D63018354j7353045k0347021k1570977k1342217k0040492j8015523j5544296
36791C28804783j2822494r975444p076031m160669j241610J682357M616888P566173
36783C07393953J0528224J3487859J6407102J9214557K1792583K3960986K5462306
36776D38247570K5959706K5060907K2384431J7682001J0999182K798338o060277
36769E37071858j4522345k1646658k6855187l0008839l1314627l1159850k9967490
36762C51596862k8111113k5882298k3490485k1078015j8737647j6526077j4473740
$$ plain form
36812 230039810 250814226 273514123 298081138 324305736 351759237 379721389 407122105
36805 407122105 432530298 454238339 470485805 479812197 481435709 475493312 463018354
36798 463018354 445665309 425318288 403747311 382405094 362364602 344349079 328804783
36791 328804783 315982289 306006845 298930814 294770145 293528535 295210892 299827780 307393953
36783 307393953 317922177 331410036 347817138 367031695 388824278 412785264 438247570
36776 438247570 464207276 489268183 511652614 529334615 540333797 543132135 537071858
36769 537071858 522549513 500902855 474047668 444038829 412724202 381564352 351596862
36762 351596862 323485749 297603451 274112966 253034951 234297304 217771227 203297487
36755B03297487j2593337j0887223r352736p986073o785591n754035m898867m231018
36747A40808607l762474l501636l445959l574006l841237m183163m526405m804356
36739A09169371m970988n006829m915794m716735m434826m095488l720856l328297
36731G3979558k930411k535655k149008j772754j407542j053323p09685l75945
36723F1045235n1526K63352N66871Q54714J119083J348091J525820J632870J647235
36714F9951745J546198J310150R28457M06310k29846r31720j636033k277821k804924
36705F6262516l187508l419680l514576l496450l393127l230782l031419k812219
36697D0176755k585686k360238k141183j931756j733834j548363j375760j216155
$$ plain form
36755 203297487 190704150 179816927 170464191 162478118 155692527 149938492 145039625 140808607
36747 140808607 137046133 133544497 130098538 126524532 122683295 118500132 113973727 109169371
36739 109169371 104198383 99191554 94275760 89559025 85124199 81028711 77307855 73979558
36731 73979558 71049147 68513492 66364484 64591730 63184188 62130865 61421180 61045235
36723 61045235 60993709 61257061 61823932 62678646 63797729 65145820 66671640 68304510 69951745
36714 69951745 71497943 72808093 73736550 74142860 73913014 72981294 71345261 69067440 66262516
36705 66262516 63075008 59655328 56140752 52644302 49251175 46020393 42988974 40176755
36697 40176755 37591069 35230831 33089648 31157892 29424058 27875695 26499935 25283780
36689B5283780j069382r34962q12578p02817o07654n30412m75149m45438m42525
36680A9262863m63635n01551n45933n85900o12786o22133o14117n92393n62013
36671A4162402n27517m91799m55827m19080l80566l39789k97188k53929k11434
36662A0785273j70904j32919r7341o3695l1793k042K4637M6839O2403O8186O0507
36651A0549151L6439m630n9935j23437j87093k42784k84146l07781l13605l04204
36641H757975k83529k55568k23578j90023j56864j25862r8666p6551o0070m9089
36631G238175m3349m3044m8688o0279p6536r4891j12350j26801j37969j47390
36621F346878j57330j69349j83450j98145k11061k19662k21809k16133k02184
$$ plain form
36689 25283780 24214398 23279436 22466858 21764041 21156387 20625975 20150826 19705388 19262863
36680 19262863 18799228 18297677 17751744 17165844 16553058 15930925 15316808 14724415 14162402
36671 14162402 13634885 13143086 12687259 12268179 11887613 11547824 11250636 10996707 10785273
36662 10785273 10614369 10481450 10384109 10320414 10288621 10286579 10311216 10358055 10420458 10488644 10549151
36651 10549151 10585590 10580960 10521025 10397588 10210495 9967711 9683565 9375784 9062179 8757975
36641 8757975 8474446 8218878 7995300 7805277 7648413 7522551 7423885 7347334 7287264 7238175
36631 7238175 7194826 7151782 7103094 7042815 6966279 6871388 6759038 6632237 6494268 6346878
36621 6346878 6189548 6020199 5836749 5638604 5427543 5207881 4986072 4769939 4567755
36612D567755j80517j52815j21860r0998o3230m0436k3101j0497j054P247J6399
36601C906893K7827M1868N7468P2393Q3921Q9623Q7792P7615N9387L4815O972
36590D546574k0430m4167o2500p5377q3794q8672r0120q7562q0487o9058n4163
36579C790244l7159j9573k914J1581K3212L2026L8844M4915N1414N9035O8014
36568D059639P8267Q9299R9800J07390J08807J00569Q0105M7114M545m1757q4821
36557D648957j18829j40708j50504j50688j44883j36533j28006j20417j13924
36548C444465j08088j02108r5018q5989p4662o1435m7468l4348k3528j5940j1904
36537B783977j1297j3711j8628k5541l4000m3467n3090o1675o7895p0681o9594
$$ plain form
36612 4567755 4387238 4234423 4112563 4021565 3958335 3917899 3894798 3884301 3883247 3890494 3906893
36601 3906893 3934720 3976588 4034056 4106449 4190370 4279993 4367785 4445400 4504787 4539602 4546574
36590 4546574 4526144 4481977 4419477 4344100 4260306 4171634 4081514 3993952 3913465 3844407 3790244
36579 3790244 3753085 3733512 3730598 3742179 3765391 3797417 3836261 3881176 3932590 3991625 4059639
36568 4059639 4137906 4227205 4327005 4434395 4543202 4643771 4723876 4770990 4775535 4733778 4648957
36557 4648957 4530128 4389420 4238916 4088228 3943345 3806812 3678806 3558389 3444465
36548 3444465 3336377 3234269 3139251 3053262 2978600 2917165 2869697 2835349 2811821 2795881 2783977
36537 2783977 2772680 2758969 2740341 2714800 2680800 2637333 2584243 2522568 2454673 2383992 2314398
36526B314398o5022n8115n0483m3777l9334l7957l9863m4785n2180o1321p1247
36515A750314q0661q8060r2180r2543q9688q4911p9571p4442o9472o3988n7094
36504H77704m8129l6995k4391j1709o70P174J0886J0420O670J316l642o497o464
36491G75673m038q42R97k37n203j3280k2818l1614l7526l9016l5441k7073j4928
36478E44654n49J4283K7880L8872M6332M9746M9033M4451L6418K5315J1582l842
36466H84175j9082l1502l8717l9896l6441l1478k8475k9840l6116m5901n6361
36455D90366o4138o6426o1915n1216l6584k1014p178L298R929J3076J3618J2637
36443B34453J1071R393P575N409K951O21j046j824j903j594q32Q47L797P620J1083
$$ plain form
36526 2314398 2249376 2191261 2140778 2097001 2057667 2019710 1979847 1935062 1882882 1821561 1750314
36515 1750314 1669653 1581593 1489413 1396870 1307182 1222271 1142700 1068258 998786 934798 877704
36504 877704 829575 792580 768189 756480 755810 762984 773870 784290 790960 792276 788634 782137 775673
36491 775673 771635 770793 771790 771553 766350 753070 730252 698638 661112 622096 586655 559582 544654
36478 544654 544105 558388 586268 625140 671472 721218 770251 814702 851120 876435 888017 884175
36466 884175 865093 833591 794874 754978 718537 687059 658584 628744 592628 546727 490366
36455 490366 426228 359802 297887 246671 210087 189073 181895 185193 195122 208198 221816 234453
36443 234453 245524 254917 262492 267901 270852 271473 270427 268603 266700 265106 264274 265121 268918 276538 287621
36428B87621J2709J1483P204M64p524j5218k1141k4237k4092k0967j5693r421
36416A81188l292J890N841Q752J1079J3224J5372J7646K0343K3929K8615L3938
36404C58525L8700M1344M0475L5254K5649J2443k879j8289l1477m0316m3558m1397
36392C74474l5396k7773k0364j3910q024j782N484J3677K1942K8997L3566L4777
36380D05668L2451K7161J9925J1828L761l629r926j5101j9750k5183l3010m4360
36368C49835n9081p5648r1800j05373j14753j18826j16864j08690r4896p6790
36358f12886n6015l4132j2465P815K5611M0083N0912N8428O3373O6536O8504O9533
36346b64703O9636O8686O6588O3256N8460N1619M1979K9147J3683k718j7644k8787
$$ plain form
36428 287621 300330 311813 319017 319481 311957 296739 275598 251361 227269 206302 190609 181188
36416 181188 177896 179786 185627 194379 205458 218682 234054 251700 272043 295972 324587 358525
36404 358525 397225 438569 479044 514298 539947 552390 549511 531222 499745 459429 415871 374474
36392 374474 339078 311305 290941 277031 269007 267225 272709 286386 308328 337325 370891 405668
36380 405668 438119 465280 485205 497033 500794 497165 487239 472138 452388 427205 394195 349835
36368 349835 290754 215106 123306 17933 -96820 -215646 -332510 -441200 -536096 -612886
36358 -612886 -668901 -703033 -715498 -707683 -682072 -641989 -591077 -532649 -469276 -402740 -334236 -264703
36346 -264703 -195067 -126381 -59793 3463 61923 113542 155521 184668 198351 195633 177989 149202
36334A49202l4624l4792l0105k2423j4270q066n203n426o960p413m866J337J0472
36321a3137K0922L0932L9119M4539M6516M4508L8204K7671J3551k792j9269l3436
36309B37328m3220m7637m7072m2988l7270l1570k6976k3928k2355k1762k1403
36298a28853k0533j8642j5609j1773p959n324m973p374j2011j7511k2114k4221
36286b96897k2714j7207q233K769J3892K3544L1111L7040M2406M8258N5149O2861
36274b8021P0407P6432P9924Q0873Q0315P9655P9681P9971P9152P5785O9190N9649
36262H83013M8050L5388K2502R980j929j3484k5364l8258n2258o6481p9353q9465
36250F32341r6331j00465j02695j03423j02404r9171r3591q6197p7933o9514o0818
$$ plain form
36334 149202 114578 79786 49681 27258 12988 4922 -281 -5707 -12667 -20080 -24946 -23609 -13137
36321 -13137 7785 38717 77836 122375 168891 213399 251603 279274 292825 290033 270764 237328
36309 237328 194108 146471 99399 56411 19141 -12429 -39405 -63333 -85688 -107450 -128853
36298 -128853 -149386 -168028 -183637 -195410 -203369 -208693 -213666 -221040 -233051 -250562 -272676 -296897
36286 -296897 -319611 -336818 -345051 -342282 -328390 -304846 -273735 -236695 -194289 -146031 -90882 -28021
36274 -28021 42386 118818 198742 279615 359930 439585 519266 599237 678389 754174 823364 883013
36262 883013 931063 966451 988953 998933 997004 983520 958156 919898 867640 801159 721806 632341
36250 632341 536010 435545 332850 229427 127023 27852 -65739 -151936 -229869 -299383 -360201
36239c60201n0876l8576k3446o074J2043K8878M2356N0856N3719N1410M5261L6974
36227a57676K8172K0123J3661R227O916O554P801J0282J3766J8106K3048K8036
36215B8016L2289L5151L6437L6392L5283L2986K9043K3135J5522O971j571r233
36203C00421j5267j9155k0938k1528k2539k5521l1096l8510m5987n1523n3649
36192d5292n1890m6832l9849l2491k5742j9722j4082q710m140j427j600n187j1980
36179c08944k1121l1369m1287m9363n4190n4823n1177m4071l4929k5229j6021
36168g32524p693j43O760J2718J6968J8741J7770J4544J0146N860K786J609K578
36155f29880N553R975J4861J8954K1182K1199J9646J8007J7972K0691K6279L3847
$$ plain form
36239 -360201 -411077 -449653 -473099 -479173 -467130 -438252 -395896 -345040 -291321 -239911 -194650 -157676
36227 -157676 -129504 -109381 -95720 -86493 -79577 -73023 -65222 -54940 -41174 -23068 -20 28016
36215 28016 60305 95456 131893 168285 203568 236554 265597 288732 304254 311225 309654 300421
36203 300421 285154 265999 245061 223533 200994 175473 144377 105867 59880 8357 -45292
36192 -45292 -97182 -144014 -183863 -216354 -242096 -261818 -275900 -284610 -288750 -290177 -291777 -296964 -308944
36179 -308944 -330065 -361434 -402721 -452084 -506274 -561097 -612274 -656345 -691274 -716503 -732524
36168 -732524 -740217 -740360 -733600 -720882 -703914 -685173 -667403 -652859 -642713 -636853 -634067 -632458 -629880
36155 -629880 -624327 -614352 -599491 -580537 -559355 -538156 -518510 -500503 -482531 -461840 -435561 -401714
36143d01714M2003M9425N5193N8792N9919N8495N4747M9302M3005L6536L0244
36132A35947K4193J8340J2611O917J298l999q673j2638j6108j9232k1696k2670
36120I4290k1340j7635j2663q342o429p557j0988j5145j8416j9714j8682j5638
36108g8259j1401o946k953M86L793P379J1150J4420J6382J6605J5063J1829O879
36095D427K99p422j5345k2368k7654l0874l2226l2119l0796k8096k3488j6363
36083b62025o428N871J9189L1542M0960M6125M6793M3905L9375L5492L3959L5176
36071A09934L8113M0921M1747L9385L3588K5051J5211N838j438n720p253p463
36059C27914q410j1934j8904k8906m0402n1265n9435o3402o2390n6264m5340l0305
$$ plain form
36143 -401714 -359711 -310286 -255093 -196301 -136382 -77887 -23140 26162 69167 105703 135947
36132 135947 160140 178480 191091 198008 199306 195307 186634 173996 157888 138656 116960 94290
36120 94290 72950 55315 42652 34310 27881 20324 9336 -5809 -24225 -43939 -62621 -78259
36108 -78259 -89660 -96606 -99559 -99073 -95280 -87901 -76751 -62331 -45949 -29344 -14281 -2452 4427
36095 4427 4726 -2696 -18041 -40409 -68063 -98937 -131163 -163282 -194078 -222174 -245662 -262025
36083 -262025 -268453 -262582 -243393 -211851 -170891 -124766 -77973 -34068 5307 40799 74758 109934
36071 109934 148047 188968 230715 270100 303688 328739 343950 349788 348350 342630 335377 327914
36059 327914 319504 307570 288666 259760 219358 168093 108658 45256 -17134 -73398 -118738 -149043
36047a49043j2265P125K5629M0732N0296N3291N0123M2366L2079K1206J1274L381
36035A76194j932m805o002o426o542o245n239l581j831q20j246l357o764j0551
36021A10853j3687j5543j6102j5847j5406j5347j6045j7519j9297k0443j9897
36010g4280j6915j1314l506N594J4624K2025K6531K7698K5960K2207J7135J1020
35998F6779L914l940j1881j8914k4084k6854k7290k5854k3080j9247j4341q257
35986a33049j159O263J2798J7017J7684J4155O743l100j2992k0428k3765k2781
35974a42614j8414j2003m627K966J0106J6023K0095K2110K2303K1024J8506J4943
35962b9582J0751O666L402J192m66k500n588r516j3195j5365j5442j3817j1369
$$ plain form
36047 -149043 -161308 -154183 -128554 -87822 -37526 15765 65888 108254 140333 161539 172813 176194
36035 176194 174262 169457 163455 157029 150487 144242 139003 135422 133591 132771 131525 128168 121404 110853
36021 110853 97166 81623 65521 49674 34268 18921 2876 -14643 -33940 -54383 -74280
36010 -74280 -91195 -102509 -106015 -100421 -85797 -63772 -37241 -9543 16417 38624 55759 66779
35998 66779 70693 66753 54872 35958 11874 -14980 -42270 -68124 -91204 -110451 -124792 -133049
35986 -133049 -134208 -127945 -115147 -98130 -80446 -66291 -59548 -62648 -75640 -96068 -119833 -142614
35974 -142614 -161028 -173031 -177658 -174692 -164586 -148563 -128468 -106358 -84055 -63031 -44525 -29582
35962 -29582 -18831 -12165 -8763 -7571 -8037 -10537 -16125 -25641 -38836 -54201 -69643 -83460 -94829
35949i4829q621n246l11O991J6693K7995L9614N0250N8786O4383O6567O5268O0693
35936C48233N3066M2557K9577J5287J823q202j2896j2212q148l681j190j400l419
35923D39395n564o393n333k784K61K851M577N757P280J0213J5331K2771L1916
35910E20278M1624N0547N7363O0932O0456N5781M7633L7534K7298J8257J0710
35899I88413L875l471j2159k2058l2249m1708m9817n6297o0809o2840o2087n8965
35887E29828n4720n1029m9291m9995n2491n5397n7336n7518n5798n2424m7883
35876e4054m2850l8073l4084l0867k7813k3928j8292j0524j033R073J8357K5534
35864b28554K9932L1763L2042L2161L3262L5888L9967M5091N0711N6272O1038
$$ plain form
35949 -94829 -103450 -108696 -109007 -102016 -85323 -57328 -17714 32536 91322 155705 222272 287540 348233
35936 348233 401299 443856 473433 488720 490543 482341 469445 457233 449085 445404 444214 442814 439395
35923 439395 433831 427438 422105 419321 419582 422433 427010 432767 440047 450260 465591 488362 520278
35910 520278 561902 612449 669812 730744 791200 846981 894614 932148 959446 977703 988413
35899 988413 992288 988817 976658 954600 922351 880643 830826 774529 713720 650880 588793 529828
35887 529828 475108 424079 374788 324793 272302 216905 159569 102051 46253 -6171 -54054
35876 -54054 -96904 -134977 -169061 -199928 -227741 -251669 -269961 -280485 -281518 -272445 -254088 -228554
35864 -228554 -198622 -166859 -134817 -102656 -69394 -33506 6461 51552 102263 158535 219573
35853B19573O3912O3484N8534M8679L4683J8216J329j4015k6217l4264l7820l7234
35841C58860l3452k7797k1680j6270j2314j0181r933j1354j4016j7416k1080k4473
35829A38894k6742k6651k2871j4581k083J2926K7647L8978M4511M3250L5731K3637
35817B72646R111n799j9325k9926l6227l7259l2877k4012j2567r77Q400J3874
35805A05062J4797J1576N394k298j0202j7429k3600k8678l2648l5275l6085l4670
35793h4056l1035k5693j9485j3365q231m870l850n323q828j3268j7144j9090j8495
35780b72733j5880j2687j0594j0693j3064j6918k1141k4756k7100k7738k6352
35769d79656k2801j7216r890j117Q831J9498K9934L8653M3961M4611M0398L2306
$$ plain form
35853 219573 283485 346969 405503 454182 488865 507081 508410 494395 468178 433914 396094 358860
35841 358860 325408 297611 275931 259661 247347 237166 227233 215879 201863 184447 163367 138894
35829 138894 112152 85501 62630 48049 45966 58892 86539 125517 170028 213278 249009 272646
35817 272646 281757 275958 256633 226707 190480 153221 120344 96332 83765 82788 91188 105062
35805 105062 119859 131435 136829 134531 124329 106900 83300 54622 21974 -13301 -49386 -84056
35793 -84056 -115091 -140784 -160269 -173634 -181865 -186735 -190585 -195908 -204736 -218004 -235148 -254238 -272733
35780 -272733 -288613 -301300 -311894 -322587 -335651 -352569 -373710 -398466 -425566 -453304 -479656
35769 -479656 -502457 -519673 -529563 -530680 -521849 -502351 -472417 -433764 -389803 -345192 -304794 -272488
35757b72488K2030J1106K87j0401k1129l1738m1593m9796n5455n7933n6940n2567
35745f16617m5290l6023k6136j7274j0813p224n808n109l765j231K076N168O967
35732g61079O636L793j304p727j4104j9018k1421k0800j7263j1527m871J090M799
35719h62796N195K072l794j0769j6757j9801j8665j3197m266O706J8298K9370
35707h88404L9046M6597N1483N3477N2722M9646M4842L8989L2793K6933K2055
35696d29821J8768J7606J8865K2495K8043L4592M0684M4368M3721L7663K6594
35685i6422J2364k342j4801k2910k5584k2895j5999o830K361R591J3651J4300
35673a55516J1980P318P74p301j6387k5569l3560l8975m0802l8872l4027k7889
$$ plain form
35757 -272488 -250458 -239352 -239065 -249466 -270595 -302333 -343926 -393722 -449177 -507110 -564050 -616617
35745 -616617 -661907 -697930 -724066 -741340 -752153 -759377 -765185 -770294 -774059 -775290 -773214 -768046 -761079
35732 -761079 -754443 -750650 -751954 -759681 -773785 -792803 -814224 -835024 -852287 -863814 -868685 -867595 -862796
35719 -862796 -857601 -855529 -859323 -870092 -886849 -906650 -925315 -938512 -942778 -936072 -917774 -888404
35707 -888404 -849358 -802761 -751278 -697801 -645079 -595433 -550591 -511602 -478809 -451876 -429821
35696 -429821 -411053 -393447 -374582 -352087 -324044 -289452 -248768 -204400 -160679 -123016 -96422
35685 -96422 -84058 -86400 -101201 -124111 -149695 -172590 -188589 -195419 -193058 -183467 -169816 -155516
35673 -155516 -143536 -136218 -135444 -142745 -159132 -184701 -218261 -257236 -298038 -336910 -370937 -398826
35661c98826k2279j8534j6947j6546j5371j1334l238Q606K2424L5596M5390M9688
35649c41371M7545L9395K6810J1915l153j6501k6604l2537l4264l2697k9317k5487
35637d16266k1806j7954j3091o641J146R198J6183K1246K4437K6609K8854L1790
35625c16295L5125L7730L8174L5328K8734J8645N921q090k1707l3182m1235m5553
35613b66405m6916m6701m6039m5318m4269m2462l9722l6260l2480k8665k4635
35602f99872j9699j2990l995P091J9453L1973M3567N3388O0864O5660O7613O6691
35590c20256O3017N6897M8799L9258K8780J7805O816l586j2792k0509k6979l2798
35578a55548l8378m3527m7479m9393m8978m6795m4001m1648l9961l8138l4809
$$ plain form
35661 -398826 -421105 -439639 -456586 -473132 -488503 -499837 -503075 -494469 -472045 -436449 -391059 -341371
35649 -341371 -293826 -254431 -227621 -215706 -218859 -235360 -261964 -294501 -328765 -361462 -390779 -416266
35637 -416266 -438072 -456026 -469117 -475758 -474612 -465414 -449231 -427985 -403548 -376939 -348085 -316295
35625 -316295 -281170 -243440 -205266 -169938 -141204 -122559 -116638 -124728 -146435 -179617 -220852 -266405
35613 -266405 -313321 -360022 -406061 -451379 -495648 -538110 -577832 -614092 -646572 -675237 -699872
35602 -699872 -719571 -732561 -736556 -729465 -710012 -678039 -634472 -581084 -520220 -454560 -386947 -320256
35590 -320256 -257239 -200342 -151543 -112285 -83505 -65700 -58884 -62470 -75262 -95771 -122750 -155548
35578 -155548 -193926 -237453 -284932 -334325 -383303 -430098 -474099 -515747 -555708 -593846 -628655
35567f28655k8811j9771q175M966J8555L1545M2830N1127N5233N4532M9423M1263
35555c35938L1965K3369J6650J1854P878L077l758j2636k2346l1052l7051l9227
35543c87215l7168l1132k2050j1421r71P846J4317J8627K1656K4398K7295K9904
35531c45914L1274L0834K9012K7086K6349K7376K9768L2468L4239L4135L1794
35520a1579K7460K1702J5033P714q2p948j4964j9784k0942j7313q451N134K1875
35507b145L9313N4626O5447P0639P0561O6755O1183N5453N0448M6294M2551L8419
35495F59544L3043K5865J6859O469m553j5180k4010k9504l0600k7314k0783j2694
35483E77142m555K758R074J4754K0349K6230L2299L7994M2501M5080M5215M2600
$$ plain form
35567 -628655 -657466 -677237 -685412 -680446 -661891 -630346 -587516 -536389 -481156 -426624 -377201 -335938
35555 -335938 -303973 -280604 -263954 -252100 -244222 -241145 -244903 -257539 -279885 -310937 -347988 -387215
35543 -387215 -424383 -455515 -477565 -488986 -489957 -482111 -467794 -449167 -427511 -403113 -375818 -345914
35531 -345914 -314640 -283806 -254794 -227708 -201359 -173983 -144215 -111747 -77508 -43373 -11579
35520 -11579 15881 37583 52616 60330 60248 52300 37336 17552 -3390 -20703 -29154 -24020 -2145
35507 -2145 37168 91794 157241 227880 298441 365196 426379 481832 532280 578574 621125 659544
35495 659544 692587 718452 735311 741780 737227 722047 698037 668533 637933 610619 589836 577142
35483 577142 572587 575345 584419 599173 619522 645752 678051 716045 758546 803626 848841 891441
35471H91441L6978K8092J5858P71j5862l2030m5521n4540n8178n6602n0977m3164
35459F16266l5236k8963k5387k4674k6294k9369l2981l6272l8402l8586l6338
35448B63764l1725k5353j8022j0363k857L859Q810J0951R718N317j457r629j8258
35435A84755k6350l2877l7060l8720l8356l6840l5012l3378l1890k9856k6153
35424a81737j9810j0702J69J1028K0159K6629L0458L2161L2118L0272K6414K0697
35412A7856J3862P046J433k013k633j25N407J3408K2845L2271M0014M4573M5122
35399B39066M1834L5835K8733K1941J6227J1733Q280N676L795K580K097K517L924
35386D24238N951P622P669N167K13n833j0684j2013q444k43J0676K1331K8580
$$ plain form
35471 891441 928419 956511 972369 973140 957278 925248 879727 825187 767009 710407 659430 616266
35459 616266 581030 552067 526680 502006 475712 446343 413362 377090 338688 300102 263764
35448 263764 232039 206686 188664 178301 175444 179303 188113 199064 208782 214099 212642 203013 184755
35435 184755 158405 125528 88468 49748 11392 -25448 -60460 -93838 -125728 -155584 -181737
35424 -181737 -201547 -212249 -212080 -201052 -180893 -154264 -123806 -91645 -59527 -29255 -2841 17856
35412 17856 31718 38764 40197 38184 35551 35426 40833 54241 77086 109357 149371 193944 239066
35399 239066 280900 316735 345468 367409 383636 395369 403649 409325 413120 415700 417797 420314 424238
35386 424238 430189 437811 445480 450647 450860 445027 434343 422330 413886 413643 424319 445650 474230
35373D74230L0085K5077J4545O49j4413k9336m3709n7211o8793p6620p8907p5037
35361A00560o6215n5192m5179l8518l5879l6276l7691l7859l4955k8235j8464
35350c33903p743J415P318R808J0001R348Q764Q454Q351Q666R984J2884J7440
35337b29213K2947K8068L1222L1151K7479K0957J3155N742j33l956n657n435l788
35324f7461j550K21M60j651o335j2927j9830k4980k6622k3957j7375q188J811
35311b08384J0854J7686K1952K4316K6066K8333L1355L4334L6018L5408L2080
35300I0018K5957J6941M893r988k6696m3277n7280o6631p0489o9539o5608o0818
35288c32517n6803n4254n2900n1837n0035m6722m1506l4322k5358j5069m170O390
$$ plain form
35373 474230 504315 529392 543937 544586 530173 500837 457128 399917 331124 254504 175597 100560
35361 100560 34345 -20847 -66026 -104544 -140423 -176699 -214390 -252249 -287204 -315439 -333903
35350 -333903 -341646 -340231 -332913 -323105 -313104 -303756 -294992 -286538 -278187 -269521 -259537 -246653 -229213
35337 -229213 -206266 -178198 -146976 -115825 -88346 -67389 -54234 -48492 -48625 -52581 -58238 -63673 -67461
35324 -67461 -69011 -68790 -68330 -69981 -76316 -89243 -109073 -134053 -160675 -184632 -202007 -210195 -208384
35311 -208384 -197530 -179844 -157892 -133576 -107510 -79177 -47822 -13488 22530 57938 90018
35300 90018 115975 132916 137809 127821 101125 57848 568 -66063 -136552 -206091 -271699 -332517
35288 -332517 -389320 -443574 -496474 -548311 -598346 -645068 -686574 -720896 -746254 -761323 -765493 -759103
35276g59103J5580K2462K6387K7087K4630J9298J1563K131q029j7789k6070l2064
35264f93917l5357l5927l3982k9781k3531j5404n579N695J8017L0824M3546N5826
35252g19570O7551P8614Q8615R6944J03031J06490J06977J04073R7512Q7546P5123
35241B92906O1554M7988L5061K3027J2211L300k877n961o552o117o456r019j4439
35228D24626k2266l1032l8732m3599m4747m2368l7497l1597k6157k2331k0599
35217F3701k0646k1561k2340k2476k2231k2411k3715k6210k9273l2038l3796l4110
35205b47106l2687k9361k4287j8088j1696o006j578J440L300M584N963P796R828
35192c37898J1263J1197R033M675j405q141j3983j7256j6750j2185m397M922J3778
$$ plain form
35276 -759103 -743523 -721061 -694674 -667587 -642957 -623659 -612096 -609965 -617994 -635783 -661853 -693917
35264 -693917 -729274 -765201 -799183 -828964 -852495 -867899 -873478 -867783 -849766 -818942 -775396 -719570
35252 -719570 -652019 -573405 -484790 -387846 -284815 -178325 -71348 32725 130237 217783 292906
35241 292906 354460 402448 437509 460536 472747 476047 473170 467209 460657 454540 448084 439065 424626
35228 424626 402360 371328 332596 288997 244250 201882 164385 132788 106631 84300 63701
35217 63701 43055 21494 -846 -23322 -45553 -67964 -91679 -117889 -147162 -179200 -212996 -247106
35205 -247106 -279793 -309154 -333441 -351529 -363225 -369231 -370809 -369369 -366069 -361485 -355522 -347726 -337898
35192 -337898 -326635 -315438 -306405 -301730 -303135 -311276 -325259 -342515 -359265 -371450 -375847 -370925 -357147
35179c57147K0581K4613K6094K5808K4632K3131K1411J9180J5983J1400N140k884
35167a42058j2292k1965l0086l4717l4649l0010k2209j3325n268Q24M761P073
35155c33921Q509R587J0365J0632J0170Q870O502K579l349j1088j9415k6292k9475
35142c56326k7122j8269l182J6425L7635N7055P1857Q0492Q2825P9799P2980O4194
35130A58363N5298M7838M2739M0162L9596M0124M0636L9974L7011L0832K1013
35119E93586P928p147k2300l5400m4614m8851m8104m3488l6793k9805k3759j9217
35107B42036j6178j4291j3142j2565j2796j4208j6870k0231k3155k4289k2505
35096E1806j7345r285K89R378J5969J8733J7556J3628Q941N466M400N822Q818
$$ plain form
35179 -357147 -336566 -311953 -285859 -260051 -235419 -212288 -190877 -171697 -155714 -144314 -139174 -142058
35167 -142058 -154350 -176315 -206401 -241118 -275767 -305777 -327986 -341311 -346579 -345755 -340994 -333921
35155 -333921 -325412 -315825 -305460 -294828 -284658 -275788 -269286 -266707 -270056 -281144 -300559 -326851 -356326
35142 -356326 -383448 -401717 -404899 -388474 -350839 -293784 -221927 -141435 -58610 21189 94169 158363
35130 158363 213661 261499 304238 344400 383996 424120 464756 504730 541741 572573 593586
35119 593586 601514 594367 572067 536667 492053 443202 395098 351610 314817 285012 261253 242036
35107 242036 225858 211567 198425 185860 173064 158856 141986 121755 98600 74311 51806
35096 51806 34461 25176 25465 34843 50812 69545 87101 100729 109670 115136 119536 125358 134176
35083A34176J2021J4216J4840J4066J2568J1140J0385J0721J2537J6307K2322
35072B85299L0183L8516M5302M8620M7369M1575L2254K1035R698j79p506j1834
35060E80332j3349j2697j0638p922n377m013m769q020j3224j9000k3623k5785
35048D31915k5202k2761j9939j7951j7198j7334j7637j7346j5826j2774q285k802
35036B36860L096Q905J4391J9637K4933L0406L5670L9782M1661M0628L6687L0376
35024E63032K2316J2844J971j0295k3603l7041m9185n8387o3200o2904n7880m9690
35012A87978m0720l3467k9631k9446l1651l4141l4925l2876k8085k1702j5386
35001a44052j0631q332q696j1387j5621k0279k4163k6456k7017k6394k5585k5755
$$ plain form
35083 134176 146197 160413 175253 189319 201887 213027 223412 234133 246670 262977 285299
35072 285299 315482 353998 399300 447920 495289 536864 569118 590153 599851 599672 592166 580332
35060 580332 566983 554286 543648 535726 530349 526336 521567 513547 500323 481323 457700 431915
35048 431915 406713 383952 364013 346062 328864 311530 293893 276547 260721 247947 239662 236860
35036 236860 239956 248861 263252 282889 307822 338228 373898 413680 455341 495969 532656 563032
35024 563032 585348 598192 600163 589868 566265 529224 480039 421652 358452 295548 237668 187978
35012 187978 147258 113791 84160 54714 23063 -11078 -46003 -78879 -106964 -128666 -144052
35001 -144052 -154683 -163015 -171711 -183098 -198719 -218998 -243161 -269617 -296634 -323028 -348613 -374368
34989c74368k7924l2539l9062m5894n0796n1701m7471l8238k5229j0197N114J9272
34977g19033L1133L9724M4374M5033M2439L7853L2430K6734K0636J3655N457l685
34965c83250j2690j9964k4145k4795k2571j8754j4594j0920q164o535o074o565
34953e59021p447p907p173m836r48M100R802J5639K1041K5294K7684K7873K6301
34940d29598K4252K3391K4983K9299L5537M2239M7892N1348N1915M9250M3254
34929f238L4134K2553R680l083j4581k4343l2576l9698m5747n0187n2131n0884
34917b53101m6371l9271l0850k2554j5537j0436p419o486p693j1105j6590k3603
34905d91016l1102l7681m1985m3186m1315l7115l1473k4825j6981p467L825J6203
$$ plain form
34989 -374368 -402292 -434831 -473893 -519787 -570583 -622284 -669755 -707993 -733222 -743419 -738305 -719033
34977 -719033 -687900 -648176 -603802 -558769 -516330 -478477 -446047 -419313 -398677 -385022 -379565 -383250
34965 -383250 -395940 -415904 -440049 -464844 -487415 -506169 -520763 -531683 -539847 -546382 -552456 -559021
34953 -559021 -566468 -574375 -581548 -586384 -587332 -583232 -573430 -557791 -536750 -511456 -483772 -455899 -429598
34940 -429598 -405346 -381955 -356972 -327673 -292136 -249897 -202005 -150657 -98742 -49492 -6238
34929 -6238 27896 50449 60129 57046 42465 18122 -14454 -54152 -99899 -150086 -202217 -253101
34917 -253101 -299472 -338743 -369593 -392147 -407684 -418120 -425539 -432025 -439718 -450823 -467413 -491016
34905 -491016 -522118 -559799 -601784 -644970 -686285 -723400 -754873 -779698 -796679 -804146 -800321 -784118
34893g84118K8200L8011M4168M6055M4027L9130L2656K5813J9601J4716J1454
34882d40287R580Q363O893M551J405j859m414n784n923m918k742O61N200J0653
34868d18621J6893K3979L1890M0190M7832N3358N5349N2977M6407L6801K5836
34857A2891J4982M940m307j2999k1039k7829l2629l5043l5270l3894l1357k7641
34845b29195k2414j5652q087r98M592Q602J1897J5643K0620K6818L3476L9404
34833a15294M3456M4954M3848M0657L6218L1501K7380K4409K2689K1924K1654
34822B43396K1598K1852K2896K5265K9166L4200L9420M3614M5668M4961M1548
34811F13584L6106K9561K2751J6267J0514N833K433K97q84j648k657m640q348
$$ plain form
34893 -784118 -755918 -717907 -673739 -627684 -583657 -544527 -511871 -486058 -466457 -451741 -440287
34882 -440287 -430707 -422344 -415451 -410900 -409495 -411354 -415768 -421552 -427475 -432393 -435135 -434474 -429274 -418621
34868 -418621 -401728 -377749 -345859 -305669 -257837 -204479 -149130 -96153 -49746 -12945 12891
34857 12891 27873 32813 28506 15507 -5532 -33361 -65990 -101033 -136303 -170197 -201554 -229195
34845 -229195 -251609 -267261 -275348 -276346 -271754 -263152 -251255 -235612 -214992 -188174 -154698 -115294
34833 -115294 -71838 -26884 16964 57621 93839 125340 152720 177129 199818 221742 243396
34822 243396 264994 286846 309742 335007 364173 398373 437793 481407 527075 572036 613584
34811 613584 649690 679251 702002 718269 728783 734616 737049 737346 736462 734814 732157 727517 719169
34798G19169j4473k3385l4797m7436n9124o7274o9745o5621n5583m1702k6648
34787B13381j2752j321P360J3519J7296J8592J7260J3446P760J270m703r018j1201
34774B70889j1590j0947r795q024n111o95M890J0628J5335J8312J9728K0379K1157
34761C35156K2450K3888K4382K2517J7048P327o490k3445m1890n9710p4749q5246
34749A61238r0026q8453q0431o6624m8711k9245j1021L674J3666J9014K0748K0142
34737a76029J7894J3744O991k479j3509k4075l2331l7484l9783l9908l8382l5382
34725d00733l0931k5209j8717j2221o416j698J906M573O619Q444J0508J3127J6395
34712d34353K0336K5104L0903L7530M3978M8562M9826M7588M3403L9892L9410
$$ plain form
34798 719169 704696 681311 646514 599078 539954 472680 402935 337314 281731 240029 213381
34787 213381 200629 199308 206668 220187 237483 256075 273335 286781 294541 295811 291108 282090 270889
34774 270889 259299 248352 238557 230533 225422 224727 229617 240245 255580 273892 293620 313999 335156
34761 335156 357606 381494 405876 428393 445441 452768 446278 422833 380943 321233 246484 161238
34749 161238 71212 -17241 -97672 -164296 -213007 -242252 -253273 -249599 -235933 -216919 -196171 -176029
34737 -176029 -158135 -144391 -137400 -139879 -153388 -177463 -209794 -247278 -287061 -326969 -365351 -400733
34725 -400733 -431664 -456873 -475590 -487811 -494227 -495925 -494019 -489446 -482827 -474383 -463875 -450748 -434353
34712 -434353 -414017 -388913 -358010 -320480 -276502 -227940 -178114 -130526 -87123 -47231 -7821
34701g821M2863M9391N6825O2597O4539O1476N3451M1676K8211J5478N646Q9q76
34688D73545K228Q488J6972K6775L6778M5524N1302N2517M8127L8013K3076N114
34676H28459j3677l1277m6408n8719o8563p6464q2534q6251q6707q3241p5988
34665A18630o6074n5345m5832l9144l5968l5917l7768m0067m1623m1692l9795
34654c60595l5568k8867k0041j0230j282M683O031K314n336j4485k2284k6562
34642e12222k6590k3033j7346j0975m814R42O630J2685J9247K5936L1951L6382
34630d61207L8627L8665L7031L4493L1634K8742K6050K3931K2762K2537K2683
34619a34052K2281K0495J6910J1567M905k296q987j4036j6606j6442j3885r616
$$ plain form
34701 -7821 35042 84433 141258 203855 268394 329870 383321 424997 453208 468686 474332 474421 473545
34688 473545 475773 484261 501233 528008 564786 610310 661612 714129 762256 800269 823345 828459
34676 828459 814782 783505 737097 678378 609815 533351 450817 364566 277859 194618 118630
34665 118630 52556 -2789 -48621 -87765 -123733 -159650 -197418 -237485 -279108 -320800 -360595
34654 -360595 -396163 -425030 -445071 -455301 -456583 -451900 -445869 -443555 -448891 -463376 -485660 -512222
34642 -512222 -538812 -561845 -579191 -590166 -594980 -594038 -587408 -574723 -555476 -529540 -497589 -461207
34630 -461207 -422580 -383915 -346884 -312391 -280757 -252015 -225965 -202034 -179272 -156735 -134052
34619 -134052 -111771 -91276 -74366 -62799 -57894 -60190 -69177 -83213 -99819 -116261 -130146 -139762
34607a39762m342J289O665J1257J4847J7705K0457K3697K7590L1705L5144L6836
34595H3088L5930L2002K5019J5072K229j3172l0008m6199n9133o6576o7353o1599
34583a50700n0620l6485k1512p662L795J2202J7230J8753J6979J2598O599r6o789
34570a85708j2932j7906k1064k1984k0717j7854j4313j0996q456o675n139l069
34558c46813K99N544J2880K2019L2137M2183N1355N9262O5644O9901P1002O7923
34546A53336O0352M9138L6088K3195J1713J850o844j4674k1414k6568k9897l1618
34534B04657l2157l1716l0169k7331k3350j8893j4789j1369q049l633K802J1074
34522A7077J9869K7477L2572L4444L2815K7623J9141Q228l654j4746k3457k8758
$$ plain form
34607 -139762 -144104 -142815 -136150 -124893 -110046 -92341 -71884 -48187 -20597 11108 46252 83088
34595 83088 119018 151020 176039 191111 193340 180168 150160 103961 44828 -21748 -89101 -150700
34583 -150700 -201320 -237805 -259317 -266979 -263184 -250982 -233752 -214999 -198020 -185422 -178823 -178919 -185708
34570 -185708 -198640 -216546 -237610 -259594 -280311 -298165 -312478 -323474 -331930 -338605 -343744 -346813
34558 -346813 -346514 -340970 -328090 -306071 -273934 -231751 -180396 -121134 -55490 14411 85413 153336
34546 153336 213688 262826 298914 322109 333822 335672 328828 314154 292740 266172 236275 204657
34534 204657 172500 140784 110615 83284 59934 41041 26252 14883 6834 3201 6003 17077
34522 17077 36946 64423 96995 131439 164254 191877 211018 219246 215592 200846 177389 148631
34510A48631l0271k8137k2977j5921q574k538J308L194M173N391P574J1024J5787
34497H8664K1750K8516L5306M1098M4951M6308M5116M1721L6742L1023K5552K1190
34485E07937J8318J6765J6186J6503J8008K1019K5419L0456L4949L7656L7666
34474G80882L4646K8834K0796J1141M07j0803k1609l0842l7268m0015l8988l5078
34462F62103k9964k5487k2937k2669k4165k6411k8299k8928k7744k4532j9334
34451C81633j2523m885K420Q252J1936J3440J3108J1274Q102L685j716p622j3507
34438D13597j9112k4595l0358l6645m3240m9510n4711n8355o0323o0807o0120
34427h4179n8597n6515n4067n1326m8326m5159m1929l8594l4919l0734k6154k1537
$$ plain form
34510 148631 118360 90223 67246 51325 42751 40213 41521 44715 48888 54279 61853 72877 88664
34497 88664 110414 138930 174236 215334 260285 306593 351709 393430 430172 461195 486747 507937
34485 507937 526255 543020 559206 575709 593717 614736 640155 670611 705560 743216 780882
34474 780882 815528 844362 865158 876299 876706 865903 844294 813452 776184 736169 697181 662103
34462 662103 632139 606652 583715 561046 536881 510470 482171 453243 425499 400967 381633
34451 381633 369110 364225 366645 374897 386833 400273 413381 424655 432757 436442 434726 427104 413597
34438 413597 394485 369890 339532 302887 259647 210137 155426 97071 36748 -24059 -84179
34427 -84179 -142776 -199291 -253358 -304684 -353010 -398169 -440098 -478692 -513611 -544345 -570499 -592036
34415e92036j7142j2934q672m210L04M351P096P597N237Q5p068j5015k2473k8177
34401f83057l0905k9758k4717j7016q903k754j22j202m931r448j2699j3003r402
34388h47917j794R171K2317L6215M9381O0420O8150P1886P1723O8647O4249O0138
34376b67414N7331N5833N4580N1908M6399L7795K7236J6783Q509L751K696M393
34364I9800P179R422J0248R805Q994Q869J0042J2354J4904J6483J6220J4090J0903
34351B49313P842N789M949M832M636L672J622j428n132q986j2394j4807j5963
34338B23945j6175j6271j7125j9010k1260k2550k1662j8267j3277q506n844o357
34326C7641r750j4449j8254j9243j6495j0302j840P361J5801K2254K5958K6846
$$ plain form
34415 -592036 -609178 -622112 -630784 -634994 -634690 -630339 -623243 -615646 -610409 -610324 -617392 -632407 -654880 -683057
34401 -683057 -713962 -743720 -768437 -785453 -794356 -797110 -797232 -798434 -803365 -812813 -825512 -838515 -847917
34388 -847917 -849711 -840540 -818223 -782008 -732627 -672207 -604057 -532171 -460448 -391801 -327552 -267414
34376 -267414 -210083 -154250 -99670 -47762 -1363 36432 63668 80451 88960 92711 95407 99800
34364 99800 106979 116401 126649 136454 145448 154317 164359 176713 191617 208100 224320 238410 249313
34351 249313 257155 262944 267893 272725 277361 281033 282655 281227 276095 267109 254715 239908 223945
34338 223945 207770 191499 174374 155364 134104 111554 89892 71625 58348 49842 43998 37641
34326 37641 27891 13442 -4812 -24055 -40550 -50852 -52692 -45331 -29530 -7276 18682 45528
34314D5528K5592K3329K1132J9602J8747J8168J7339J5768J3097R172M142j584
34302B30032p502j3142j7987k1288k2087j9515j3107k912J0517K6099M2195N6800
34290B48103O8010P4596P6290P3660O7710N9545N0315M1335L4070K9824K9254
34279H52712L1963L6368L9992M0175L5016K4120Q708q930k6326m1621n3885o2928
34267H75364o8864p1816p2000o9966o6623o2918n9429n6276n3372n0861m9232
34256A94007m8959m9935n1266n1698n0356m7134m2520l7178l1690k6531k2090
34245b65350j8606j6115j4546j3890j4290j5907j8590k1614k3803k3950k1324
34234d67985j5923q431O7Q439J5809K1686K5907K8529K9722K9658K8359K5559
$$ plain form
34314 45528 71120 94449 115581 135183 153930 172098 189437 205205 218302 227474 231616 230032
34302 230032 222530 209388 191401 170113 148026 128511 115404 112492 123009 149108 191303 248103
34290 248103 316113 390709 466999 540659 608369 667914 718229 759564 793634 823458 852712
34279 852712 884675 921043 961035 1001210 1036226 1060346 1069054 1060124 1033798 992177 938292 875364
34267 875364 806500 734684 662684 592718 526095 463177 403748 347472 294100 243239 194007
34256 194007 145048 95113 43847 -7851 -58207 -105341 -147861 -185039 -216729 -243260 -265350
34245 -265350 -283956 -300071 -314617 -328507 -342797 -358704 -377294 -398908 -422711 -446661 -467985
34234 -467985 -483908 -492339 -492272 -483833 -468024 -446338 -420431 -391902 -362180 -332522 -304163 -278604
34222b78604K0801J3805M875m910j3826j9841k1090j6433n988Q719K5164M0747
34210b46581N3639O3123O9399P3140P5012P5328P3943P0383O4114N4756M2095
34199D68351K6128P173j3898l5656n6337p4322q8539r8624j04658j06745j04747
34188a81874r8457q8101p4599n9371m3754k8591j4257j023J0694K0429K7968L3522
34176d97414L7577M0548M2519M3308M2854M1625M0685M1196M3741M7894N2349
34165b3118N5469N5880N2874M6548L7715K7723J8233J0988P491Q554J3878K1952
34153C34187L0440L6913L9624L7961L2455K4454J5617P411Q06l773o250o731n526
34140E37588l258p54J348K901M153N309O199O235M556L12o968j6895k8109l8680
$$ plain form
34222 -278604 -257803 -243998 -239123 -244033 -257859 -277700 -298790 -315223 -321211 -312492 -287328 -246581
34210 -246581 -192942 -129819 -60420 12720 87732 163060 237003 307386 371500 426256 468351
34199 468351 494479 501652 487754 452098 395761 321439 232900 134276 29618 -77127 -181874
34188 -181874 -280331 -368432 -443031 -502402 -546156 -574747 -589004 -590027 -579333 -558904 -530936 -497414
34176 -497414 -459837 -419289 -376770 -333462 -290608 -248983 -208298 -167102 -123361 -75467 -23118
34165 -23118 32351 88231 141105 187653 225368 253091 271324 282312 289803 298357 312235 334187
34153 334187 364627 401540 441164 479125 511580 536034 551651 559062 559868 556095 549845 543114 537588
34140 537588 534330 533576 534924 537825 541978 547287 553486 559721 564277 564589 557621 540726 512617 473937
34126D73937m6863n1607n2585m9893m3802l4651k2982r732L585J5030K2775K5778
34114B28990K4166J9105J2268N199j113o348j0648j4350j7780k1216k4829k8633
34102A64811l2404l5646l7591l7277l3824k6879j6948n408N880J5106K1047K3432
34090D299K3046K1379J9949J9701K0891K3459K7397L2703L8996M5228M9820N1132
34078C78000M8040M0382K9179J6415M302n608j2974j8457k3055k7467l1810l5647
34066C61300l8190l8613l6472l2060k6499k1391j8110j7109j7652j8287j7662
34055G9255j5053j0229l103O314J7446K8850L8513M4677M6485M4062L8103K9384
34043C44704J8533O109p167k0194l1491l9458m2901m1531l6230k8793k1184j4654
$$ plain form
34126 473937 427074 375467 322882 272989 229187 194536 171554 161822 165407 180437 203212 228990
34114 228990 253156 272261 284529 289728 288615 282267 271619 257269 239489 218273 193444 164811
34102 164811 132407 96761 59170 21893 -11931 -38810 -55758 -61166 -55286 -40180 -19133 4299
34090 4299 27345 48724 68673 88374 109265 132724 160121 192824 231820 277048 326868 378000
34078 378000 426040 466422 495601 512016 516318 510710 497736 479279 456224 428757 396947 361300
34066 361300 323110 284497 248025 215965 189466 168075 149965 132856 115204 96917 79255
34055 79255 64202 53973 50870 57184 74630 103480 141993 186670 233155 277217 315320 344704
34043 344704 363237 369346 362179 341985 310494 271036 228135 186604 150374 121581 100397 85743
34031H5743r300m373Q62O333J0957J3092J1353N384l792j3995k2707k8049k9457
34018B2051k7641k4012j9937j6305j3475j1464j0146r291q554p507n785l218J48
34005a35136M214Q960J4375K0193K5648K9639L1248L0243K7153K2956J8774J5740
33993A14007J4815J6330J9564K2745K3733K0908J3777K996j0128k4262l8399n1671
33981A24415o2901p0494p3025p0141o3039n3979m5146l7564l0767k3341j3911
33970d19893j937J2002K6414L9286M8580N2786N1348M4741L4113K0832O188q629
33958i4169k2511l4430m3497m9038n0672m8305m2085l2358j9751n269R710K3656
33946d08719L5232M3575M8419N0003M8843M5503M0461L4179K7205K0200J3909
$$ plain form
34031 85743 76443 72070 72932 79265 90222 103314 114667 120051 116259 102264 79557 51508 22051
34018 22051 -5590 -29602 -49539 -65844 -79319 -90783 -100929 -110220 -118774 -126281 -132066 -135284 -135136
34005 -135136 -130922 -121962 -107587 -87394 -61746 -32107 -859 29384 56537 79493 98267 114007
33993 114007 128822 145152 164716 187461 211194 232102 245879 248875 238747 214485 176086 124415
33981 124415 61514 -8980 -82005 -152146 -215185 -269164 -314310 -351874 -382641 -405982 -419893
33970 -419893 -421830 -409828 -383414 -344128 -295548 -242762 -191414 -146673 -112560 -91728 -85540 -94169
33958 -94169 -116680 -151110 -194607 -243645 -294317 -342622 -384707 -417065 -436816 -442085 -432375 -408719
33946 -408719 -373487 -329912 -281493 -231490 -182647 -137144 -96683 -62504 -35299 -15099 -1190
33935a190R116O603O901R944J4865K0226K4588K7053K7447K6175K3874K1037J7691
33922B34330J3311P154j186j1377k2348l2694m1135m6909m9927n0717n0071m8567
33910a00136m6214m2462l6537k7938j6817m071Q931K0776L0442L7493M1993M4170
33898i0370M4134M1818L7242L0757K3056J4990P399J045l549o387q107r536j0935
33885G1557j1518r833m775L553J3768K3979L2720L9332M3607M5281M3894L9187
33873C30752L1527K1937J1838K670m418q907j1120j2051j2697j3260j2756r467
33861C14048k050R292K2368L3640L9650L8475L0402J7623L267r683j9161k4443
33849D53428k6137k5797k5195k5589k7248k9536l1338l1563k9464k4675j7195
$$ plain form
33935 -1190 7926 14529 21430 31374 46239 66465 91053 118106 145553 171728 195602 216639 234330
33922 234330 247641 254795 253609 242232 219884 187190 146055 99146 49219 -1498 -51569 -100136
33910 -100136 -146350 -188812 -225349 -253287 -270104 -274175 -265244 -244468 -214026 -176533 -134540 -90370
33898 -90370 -46236 -4418 32824 63581 86637 101627 109026 110071 106522 100135 92028 82492 71557
33885 71557 60039 50206 45431 48984 62752 86731 119451 158783 202390 247671 291565 330752
33873 330752 362279 384216 396054 398724 394306 385399 374279 362228 349531 336271 323515 314048
33861 314048 311998 321290 343658 377298 416948 455423 485825 503448 506715 497032 477871 453428
33849 453428 427291 401494 376299 350710 323462 293926 262588 231025 201561 176886 159691
33838A59691p405L811J5068K4731L1343L3948L2130K5919J5859L239r793k0610
33826C07931k6960k7849k3910j7031r438k741K539O736J0398J3703J6373J8033
33814B67784J8729J9109K0226K2962K7487L2960L7713L9874L8227L2799K4856
33803E82726J6324R043M235K325K951N208Q056J0700J2682J3656J3244J1231P840
33790G00221L718n04m592q669j2830j6879k0448k3428k6247k9741l4673m1249
33778D84679m8993n6907o3716o8088o8961o5981n9780n1783m3562l6132k9536
33767a08760k3000j5524o599L346J3005K0716K5137K5796K3304J9137J5113J2750
33755D421J2757J4868J8138K1533K4492K7009K9231L0865L0967K8170K1239R619
$$ plain form
33838 159691 152286 156097 171165 195896 227239 261187 293317 319236 335095 338334 328541 307931
33826 307931 280971 253122 229212 212181 202743 200002 202541 209277 219675 233378 249751 267784
33814 267784 286513 305622 325848 348810 376297 409257 446970 486844 525071 557870 582726
33803 582726 599050 608093 612328 614653 617604 622812 630868 641568 654250 667906 681150 692381 700221
33790 700221 703939 703435 698843 690174 677344 660465 640017 616589 590342 560601 525928 484679
33778 484679 435686 378779 315063 246975 178014 112033 52253 470 -43092 -79224 -108760
33767 -108760 -131760 -147284 -153883 -150537 -137532 -116816 -91679 -65883 -42579 -23442 -8329 4421
33755 4421 17178 32046 50184 71717 96209 123218 152449 183314 214281 242451 263690 273309
33743B73309o166k4448m2648n7815o7351o9748o4961n4252l9553k2911o201Q912
33731a73833K1119K9612L4071L4517L1321K5328J7845J0308L991m8q53K310R636
33718D5324K0457L3133M5225N4083N7804N6103N0466M3465L7572L4159L2995L2453
33706E43239L0280K4656J4962J966j2507k6255l7490m5447n0502n3631n5521n5969
33694B77781n4002m8571l9407k7448j4551k712O629J2855J5964J6232J3922R132
33682A65824J951p209j7386k7123l4854l9262l9509l5372k7385j6791n270N473
33670g6913J4112J9942K2973K3762K3074K1594J9873J8393J7614J7865J9241K1495
33658A63025K3952K5505K4816K0649J2347J36j4804l0532m4723n5046n9553n7190
$$ plain form
33743 273309 267143 242695 200047 142232 74881 5133 -59828 -114080 -153633 -176544 -182745 -173833
33731 -173833 -152714 -123102 -89031 -54514 -23193 2135 19980 30288 34279 34231 33378 35688 45324
33718 45324 65781 98914 144139 198222 256026 312129 362595 406060 443632 477791 510786 543239
33706 543239 573519 598175 613137 615103 602596 576341 538851 493404 442902 389271 333750 277781
33694 277781 223779 175208 135801 108353 93802 91090 97719 110574 126538 142770 156692 165824
33682 165824 167775 160566 143180 116057 81203 41941 2432 -32940 -60325 -77116 -82386 -76913
33670 -76913 -62801 -42859 -19886 3876 26950 48544 68417 86810 104424 122289 141530 163025
33658 163025 186977 212482 237298 257947 270294 270430 255626 225094 180371 125325 65772 8582
33646H582m8237l4391j8206k160J1989K3274L1248L5861L7649L7826L8057L9859
33634A61351M3981N0186N7445O4315O9314P1195O9258O3600N5077M4868L3927
33623G84517K2668J1075r52j3277k5504l7200m8180n8657o9011p9403q9387r7859
33611B98830j03348j04454j00297r0699p6222n8040l7794j7445Q77J5062K3402
33600b50128K5094K0635J1736P49r996j8593k3687k4646k1805j6458j0410n144
33588c22653j217J797M826Q636J3433J8821K4070K8451L1480L2977L2846L0840
33576i5693K6487J9437R922r43j1269j8876k1940j9685j2708k773P958J7714K5493
33563g6876L0875L3546L3012K8694K0415Q847m391j7118k7156l2944l4016l1233
$$ plain form
33646 8582 -39655 -74046 -92252 -94412 -82423 -59149 -27901 7960 45609 83435 121492 161351
33634 161351 205332 255518 312963 377278 446592 517787 587045 650645 705722 750590 784517
33623 784517 807185 818260 817308 804031 778527 741327 693147 634490 565479 486076 396689 298830
33611 298830 195482 91028 -9269 -99968 -176190 -234230 -272024 -289469 -288592 -273530 -250128
33600 -250128 -225034 -204399 -192663 -191914 -201910 -220503 -244190 -268836 -290641 -307099 -317509 -322653
33588 -322653 -323870 -322073 -317247 -308611 -295178 -276357 -252287 -223836 -192356 -159379 -126533 -95693
33576 -95693 -69206 -49769 -39847 -40790 -52059 -70935 -92875 -112560 -125268 -128041 -120083 -102369 -76876
33563 -76876 -46001 -12455 20557 49251 69666 78513 74122 57004 29848 -3096 -37112 -68345
33551f8345k6464k1620j7636j4108r893m093L142J0437J5531J6099J0710m84j5771
33538a22495l2593m8316o0686o7954o9055o3870n3356l9192k3215o833R169K4553
33526e53843L9221N2769O4208P2179P5532P3925O7984N8983M8347L7287K6653
33515F3245J7029Q964L088l1l25J481M080O245P371P536P134O610O333O563P306
33500A52629Q326R320J0249J1416J3354J6456K0635K5073K8447K9571K8100K4659
$$ plain form
33551 -68345 -94809 -116429 -134065 -148173 -158066 -162159 -159017 -148580 -133049 -116950 -106240 -106724 -122495
33538 -122495 -155088 -203404 -264090 -332044 -401099 -464969 -518325 -557517 -580732 -587565 -578396 -553843
33526 -553843 -514622 -461853 -397645 -325466 -249934 -176009 -108025 -49042 -695 36592 63245
33515 63245 80274 89238 92326 92295 91970 93451 97531 103776 111147 118683 125817 132427 138760 145323 152629
33500 152629 160955 170275 180524 191940 205294 221750 242385 267458 295905 325476 353576 378235
$$ [...]
##END NTUPLES=NMR SPECTRUM
##END=
