##TITLE=31Pdec_E3e-H-4
 CD3CN, 64 sc
 28.11.2024
##JCAMPDX= 6.0         $$ Bruker NMR JCAMP-DX V2.0
##DATA TYPE= NMR SPECTRUM
##DATA CLASS= NTUPLES
##ORIGIN= UXNMR, Bruker Analytische Messtechnik GmbH
##OWNER= root
$$ XWIN-NMR		Version 3.5
$$ Thu Nov 28 14:28:16 2024 Russian Standard Time (UT+4h)  she@DPX200
##.OBSERVE FREQUENCY= 81.013821
##.OBSERVE NUCLEUS= ^31P
##.ACQUISITION MODE= SIMULTANEOUS
##.ACQUISITION SCHEME= undefined
##.AVERAGES= 64
##.DIGITISER RES= 17
##SPECTROMETER/DATA SYSTEM= spect
##.PULSE SEQUENCE= zgpg30
##.SOLVENT NAME= CDCl3
##.SHIFT REFERENCE= (INTERNAL, CDCl3, 0, 198.062)
##AUDIT TRAIL= $$ (NUMBER, WHEN, WHO, WHERE, WHAT)
$$ ##TITLE= Audit trail, XWIN-NMR		Version 3.5
$$ ##JCAMPDX= 5.01
$$ ##ORIGIN= Bruker BioSpin GmbH
$$ ##OWNER= she
$$ F:/spectra/data/she/nmr/P31/2/pdata/1/auditp.txt
$$ ##AUDIT TRAIL=  $$ (NUMBER, WHEN, WHO, WHERE, WHAT)
(   1,<2024-11-28 14:27:13.92 +0400>,<she>,<DPX200>,
      <created by zg, POWCHK disabled, PULCHK disabled
       configuration hash MD5:
       00 E9 B6 7A A2 85 ED C7 34 08 36 98 17 FE 4E 26
       data hash MD5: 32K
       F6 90 3E E3 10 35 13 14 8C 6C F4 4E BE D4 EA 75>)
(   2,<2024-11-28 14:27:16.96 +0400>,<she>,<DPX200>,
      <Start of raw data processing
       efp BC_mod = 2 LB = 1.5 FT_mod = 6 PKNL = 1 PHC0 = 2178.137 PHC1 = 272.4883 SI = 64K 
       data hash MD5: 64K
       A7 3C F3 5E 92 D6 AC 9E D6 49 D9 2B 94 E7 14 E3>)
(   3,<2024-11-28 14:27:41.67 +0400>,<she>,<DPX200>,
      <pk PHC0 = -0.3608544 PHC1 = 0 
       data hash MD5: 64K
       0A 1D 6E AA 07 CF 98 DF 4E BA 5B 25 5F 4A 23 95>)
(   4,<2024-11-28 14:27:46.09 +0400>,<she>,<DPX200>,
      <abs ABSG = 5 
       data hash MD5: 64K
       22 5E 0B 5B FD C1 CD 7E C1 32 C2 0C 67 F1 33 69>)
$$ ##END=
$$ 
$$ hash MD5
$$ 96 24 5D 8C 16 EF ED 3F 8E E2 85 07 91 F2 6B F8
##$RELAX= 
##$RELAX= 
##$RELAX= 
##$RELAX= 
##$RELAX= 
##$RELAX= 
##$RELAX= 
##$RELAX= 
$$ Bruker specific parameters
$$ --------------------------
##$DU= <F:/spectra>
##$EXPNO= 2
##$NAME= <P31>
##$PROCNO= 1
##$TYPE= <nmr>
##$USER= <she>
##$AMP= (0..31)
100 100 100 100 100 100 100 100 100 100 100 100 100 100 100 100 100 100 
100 100 100 100 100 100 100 100 100 100 100 100 100 100 
##$AQSEQ= 0
##$AQ_mod= 1
##$AUNM= <au_zg>
##$AUTOPOS= <>
##$BF1= 81.014009
##$BF2= 200.13
##$BF3= 200.13
##$BF4= 200.13
##$BF5= 200.13
##$BF6= 200.13
##$BF7= 200.13
##$BF8= 200.13
##$BYTORDA= 1
##$CFDGTYP= 0
##$CFRGTYP= 5
##$CHEMSTR= <none>
##$CNST= (0..31)
1 1 145 1 1 1 1 1 1 1 1 1 1 1 1 1 1 1 1 1 1 1 1 1 1 1 1 1 1 1 1 1 
##$CPDPRG= <waltz16>
##$CPDPRG1= <>
##$CPDPRG2= <waltz16>
##$CPDPRG3= <>
##$CPDPRG4= <mlev>
##$CPDPRG5= <mlev>
##$CPDPRG6= <mlev>
##$CPDPRG7= <mlev>
##$CPDPRG8= <mlev>
##$CPDPRGB= <>
##$CPDPRGT= <>
##$D= (0..31)
0 1 0 0 0 0 0 0 0 0.06 0 0.03 2e-05 3e-06 0 0 0.0002 0 0 0 0 0 0 0 0 0 
0 0 0 0 0 0 
##$DATE= 1732789633
##$DBL= (0..7)
120 120 120 11 120 120 24 19 
##$DBP= (0..7)
150 150 150 150 150 150 150 150 
##$DBP07= 0
##$DBPNAM0= <>
##$DBPNAM1= <>
$$ [...]
##$SUBNAM3= <"">
##$SUBNAM4= <"">
##$SUBNAM5= <"">
##$SUBNAM6= <"">
##$SUBNAM7= <"">
##$SUBNAM8= <"">
##$SUBNAM9= <"">
##$SW= 400.765351723535
##$SWIBOX= (0..15)
0 1 3 0 0 0 0 0 0 0 0 0 0 0 0 0 
##$SW_h= 32467.5324675325
##$TD= 32768
##$TD0= 1
##$TE= 0
##$TE2= 300
##$TE3= 300
##$TEG= 300
##$TL= (0..7)
0 120 53 12 22 120 120 120 
##$TP= (0..7)
150 150 150 150 150 150 150 150 
##$TP07= 0
##$TPNAME0= <>
##$TPNAME1= <>
##$TPNAME2= <>
##$TPNAME3= <>
##$TPNAME4= <>
##$TPNAME5= <>
##$TPNAME6= <>
##$TPNAME7= <>
##$TPOAL= (0..7)
0.5 0.5 0.5 0.5 0.5 0.5 0.5 0.5 
##$TPOFFS= (0..7)
0 0 0 0 0 0 0 0 
##$TUNHIN= 0
##$TUNHOUT= 0
##$TUNXOUT= 0
##$USERA1= <user>
##$USERA2= <user>
##$USERA3= <user>
##$USERA4= <user>
##$USERA5= <user>
##$V9= 5
##$VALIST= <valist>
##$VCLIST= <CCCCCCCCCCCCCCC>
##$VD= 0
##$VDLIST= <DDDDDDDDDDDDDDD>
##$VPLIST= <PPPPPPPPPPPPPPP>
##$VTLIST= <TTTTTTTTTTTTTTT>
##$WBST= 1024
##$WBSW= 4
##$XGAIN= (0..3)
0 0 0 0 
##$XL= 0
##$YL= 0
##$YMAX_a= 8967
##$YMIN_a= -13150
##$ZGOPTNS= <>
##$ZL1= 120
##$ZL2= 120
##$ZL3= 120
##$ZL4= 120
##$ABSF1= 198.0616
##$ABSF2= -202.7028
##$ABSG= 5
##$ABSL= 3
##$ALPHA= 0
##$AQORDER= 0
##$ASSFAC= 0
##$ASSFACI= 0
##$ASSFACX= 0
##$ASSWID= 0
##$AUNMP= <proc_1d>
##$AZFE= 0.1
##$AZFW= 0.5
##$BCFW= 0
##$BC_mod= 2
##$BYTORDP= 0
##$COROFFS= 0
##$CY= -3
##$DATMOD= 1
##$DC= 0
##$DFILT= <>
##$DTYPP= 0
##$F1P= 0
##$F2P= 0
##$FCOR= 1
##$FTSIZE= 65536
##$FT_mod= 6
##$GAMMA= 0
##$GB= 0
##$INTBC= 1
##$INTSCL= 9.790993e-09
##$ISEN= 30
##$LB= 1.5
##$LEV0= 0
##$LPBIN= 0
##$MAXI= 10000
##$MC2= 0
##$MEAN= 0
##$ME_mod= 0
##$MI= 50
##$NCOEF= 0
##$NC_proc= -8
##$NLEV= 6
##$NOISF1= 182.463
##$NOISF2= 159.3651
##$NSP= 0
##$NTH_PI= 0
##$NZP= 0
##$OFFSET= 198.0616
##$PC= 4
##$PHC0= 2177.776
##$PHC1= 272.4883
##$PH_mod= 1
##$PKNL= yes
##$PPARMOD= 0
##$PSCAL= 0
##$PSIGN= 0
##$REVERSE= no
##$SF= 81.0140089999434
##$SI= 65536
##$SIGF1= 159.3651
##$SIGF2= -187.1042
##$SINO= 113.3802
##$SIOLD= 16384
##$SREGLST= <1H.CDCl3>
##$SSB= 0
##$STSI= 65536
##$STSR= 0
##$SW_p= 32467.5324675325
##$SYMM= 0
##$S_DEV= 0
##$TDeff= 32768
##$TDoff= 0
##$TI= <>
##$TILT= no
##$TM1= 0
##$TM2= 0
##$TOPLEV= 0
##$USERP1= <user>
##$USERP2= <user>
##$USERP3= <user>
##$USERP4= <user>
##$USERP5= <user>
##$WDW= 1
##$XDIM= 65536
##$YMAX_p= 329981207
##$YMIN_p= -313390134
$$ End of Bruker specific parameters
$$ ---------------------------------
##NTUPLES= NMR SPECTRUM
##VAR_NAME=  FREQUENCY,     SPECTRUM/REAL,   SPECTRUM/IMAG
##SYMBOL=    X,             R,               I
##VAR_TYPE=  INDEPENDENT,   DEPENDENT,       DEPENDENT
##VAR_FORM=  AFFN,          ASDF,            ASDF
##VAR_DIM=   65536,         65536,           65536
##UNITS=     HZ,            ARBITRARY UNITS, ARBITRARY UNITS
##FACTOR=    0.49542278885378, 1,            1
##FIRST=     16045.7642231865, 0,            0
##LAST=      -16421.768244346, 0,            0
##MIN=       -16421.768244346, -313390134,   0
##MAX=       16045.7642231865, 329981207,    0
$$ Real data points
##PAGE= N=1
##DATA TABLE= (X++(R..R)), XYDATA
$$ [...]
##PAGE= N=2
##DATA TABLE= (X++(I..I)), XYDATA
6655H243672J372821L960443L646748J211332o21732j439783k213753k269987
$$ 8243672 9616493 13576936 17223684 18435016 17813284 16373501 14159748 11889761
6647A1889761r93412o57928l027895m707842j351777M269164M696690j155617
$$ 11889761 10896349 10238421 7210526 2502684 1150907 5420071 10116761 8961144
6639H961144n815722m002150N55273J987853M27274o10508m12022l30656k78861
$$ 8961144 3145422 -856728 -301455 1686398 2113672 1503164 1091142 760486 481625
6630D81625J51653m7935p19151N20382L620051M215954J32044m185260m040456
$$ 481625 633278 585343 -133808 386574 4006625 8222579 8354623 4169363 128907
6621A28907j320133r191R73006M190250O469585K832904m282956p521069n609952
$$ 128907 -1191226 -1200417 -227411 3962839 10432424 13265328 8982372 1461303 -4148649
6612d148649m099395m852093k966133L663254R153677P884029K397525j110764
$$ -4148649 -8248044 -13100137 -16066270 -12403016 -3249339 4634690 7032215 5921451
6604E921451j122624n84209j320607k446330k689012j561438O50873K489107K281951
$$ 5921451 4798827 4214618 2894011 447681 -2241331 -3802769 -3151896 -662789 1619162
6595A619162M64361p25612l56133M68073J126550J958226J936902p19800m679989
$$ 1619162 2083523 1357911 1001778 1469851 2596401 4554627 6491529 5771729 1091740
6586A091740n699674k266585J937559K849547O57597j794269k557997j119939
$$ 1091740 -4607934 -6874519 -4936960 -2087413 -1429816 -3224085 -5782082 -6902021
6578f902021J940509M342028L648891P36831p78878M19308J776496J367043O31049
$$ -6902021 -4961512 -619484 3029407 3766238 2987360 3406668 5183164 6550207 7181256
6569G181256J109699J803629J643079J438019J487754M04694j789522k692138
$$ 7181256 8290955 10094584 11737663 13175682 14663436 15068130 13278608 10586470
6561A0586470j599754j031103k067951k122540K7660J222729o27856k228924k86659
$$ 10586470 8986716 7955613 5887662 3765122 3792782 5015511 4387655 2158731 1872072
6552A872072K528666J915011r19513j816590q30720j053663k083202q08996K031713
$$ 1872072 4400738 6315749 5396236 3579646 2748926 1695263 -387939 -1196935 834778
6543H34778K175888r68177k985081j334769J292048J888277J098495N74392N9746
$$ 834778 3010666 2042489 -942592 -2277361 -985313 902964 2001459 2575851 2635597
6534B635597r41412j491920j045642p27030j348411j948107j339829L54108K209338
$$ 2635597 1694185 202265 -843377 -1570407 -2918818 -4866925 -6206754 -5852646 -3643308
6525c643308L183121K419615M08982p64201j40798K65650j281272k665572r82026
$$ -3643308 -460187 1959428 2368410 1604209 1463411 1729061 447789 -2217783 -3199809
6516c199809K099941K275310o84937k785775k362070j809725k077039p01006K867700
$$ -3199809 -1099868 1175442 490505 -2295270 -4657340 -6467065 -8544104 -9245110 -6377410
6507f377410M920171L116768K97893j71214Q28900R62681N25960O09024K94110
$$ -6377410 -1457239 1659529 1957422 1786208 2615108 3577789 4103749 4712773 5006883
6498E006883j129823k011918j453463j572201l426800l953294q47017K679532
$$ 5006883 3877060 1865142 411679 -1160522 -4587322 -8540616 -9387633 -6708101
6490f708101K586914N91957Q27327K364764J183178j904136k029652J207879K768906
$$ -6708101 -4121187 -3529230 -2701903 -337139 846039 -1058097 -3087749 -1879870 889036
6481H89036O75112j104039k27205K516k554501l891520k10914N259115O806670
$$ 889036 1564148 460109 232904 235420 -2319081 -6210601 -6421515 -1162400 5644270
6472E644270M239459J370627o54413l024417m209473j329761L700736N071833
$$ 5644270 9883729 11254356 10599943 7575526 3366053 2036292 5737028 10808861
6464A0808861J222571k518748j196550L407685N647735K807338k556090n348445
$$ 10808861 12031432 9512684 8316134 11723819 17371554 20178892 17622802 12274357
6456A2274357k332321M343891P886789L641882m660481q427494m452289J735889
$$ 12274357 9942036 14285927 22172716 25814598 21154117 12726623 8274334 10010223
6448A0010223L642818J060701k219264l996750m025688j963870J523478L695240
$$ 10010223 13653041 14713742 12494478 8497728 4472040 2508170 4031648 7726888
6440G726888K878776R21545o7907j063112l214873m333239k267946M93544K84247
$$ 7726888 10605664 11527209 11459302 10396190 7181317 2848078 580132 1073676 1357923
6431A357923j375083n3186L888870N413615K612644j108169l296279n279589p161288
$$ 1357923 -17160 -70346 3818524 9232139 11844783 10736614 7440335 2160746 -5000542
6422e000542n592200M50042O055494O041299J195238l916139o486656o187189
$$ -5000542 -10592742 -10142700 -4087206 1954093 3149331 -766808 -7253464 -13440653
6414a3440653l261621J040532M207837N110276N000301M287780J289399l683792
$$ -13440653 -16702274 -15661742 -11453905 -6343629 -1343328 2944452 4233851 550059
6406E50059o425438m098984N48644L449249M658143N830200N405560J289559l694772
$$ 550059 -5875379 -9974363 -9425719 -5976470 -1318327 4511873 9917433 11206992 7512220
6397G512220m456109j044143J538827Q30385n25888k34980K01082r24985k095518
$$ 7512220 3056111 2011968 3550795 4381180 3855292 3620312 3821394 2896409 800891
6388H00891r28947K127550M170885K808507j835644o881307q388630m794329J167198
$$ 800891 -128056 1999494 6170379 8978886 7143242 261935 -8126695 -12921024 -11753826
6379a1753826N074646N029548K289344j066953l218331k512792J034212M412230
$$ -11753826 -6679180 -1649632 639712 -427241 -3645572 -6158364 -5124152 -711922
6371g11922M142144L05663l594380m646707k995868p69754P4866o54729j060892
$$ -711922 3430222 3735885 141505 -4505202 -7501070 -8270824 -8195958 -8850687 -9911579
6362i911579M88428K205056M75894m335230p060265m864790j429117p27771o66878
$$ -9911579 -9423151 -7218095 -6742201 -11077431 -18137696 -23002486 -24431603 -25159374 -25826252
6353b5826252K320045N937165N427362J872619L85212J427680R66491j221450
$$ -25826252 -23506207 -17569042 -12141680 -10269061 -9883849 -8456169 -7489678 -8711128
6345h711128p11446L414444O487787N715624L372039J161275k028761m953252
$$ -8711128 -9422574 -6008130 479657 6195281 9567320 10728595 8699834 3746582
6337C746582l510677J830101M682948K088259j149667j014476m62997k467785
$$ 3746582 235905 2066006 6748954 8837213 7687546 6673070 6210073 3742288
6329C742288l516054j18138L806309K961482l16644l61828J893259R39496l395799
$$ 3742288 226234 108096 3914405 6875887 6559243 6197415 8090674 9030170 5634371
6320E634371n612557l438486k77815J237122J986677K294620R67605o76410P48158
$$ 5634371 21814 -3416672 -3694487 -2457365 -470688 1823932 2791537 2115127 2863285
6311B863285M730979O215452K882157j163210j426256P11866O70642k626940n618845
$$ 2863285 7594264 13809716 16691873 15528663 14102407 14814273 15484915 12857975 7239130
6302G239130m851351q12976K971943L644120J505760r35474j803267r59480J094090
$$ 7239130 2387779 1574803 4546746 8190866 9696626 8761152 6957885 5998405 7092495
6293G092495L443342L906210P79902l624101m372959o58637K148338j12020m200804
$$ 7092495 10535837 14442047 15221949 11597848 7224889 6566252 8714590 8602570 4401766
6284D401766m426673j078556P21880j005589l166355l210999k176130j599273
$$ 4401766 -24907 -1103463 -381583 -1387172 -4553527 -7764526 -9940656 -11539929
6276a1539929j029181M40297K550056M239826M112027J315652k321135k746031
$$ -11539929 -12569110 -12128813 -9578757 -5338931 -1226904 88748 -2232387 -4978418
6268d978418J266674N499347N728888L472079K518253K275720l24767m191124
$$ -4978418 -3711744 1787603 7516491 10988570 13506823 15782543 15457776 11266652
6260A1266652n322839l774763l061770k885073O03151O375523P650562K016476
$$ 11266652 5943813 2169050 -892720 -3777793 -3174642 3200881 10851443 12867919
6252A2867919m090482m550253j478037J8200l67038n00244j364382m363067o237080
$$ 12867919 8777437 4227184 2749147 2767347 2400309 1900065 535683 -3827384 -10064464
6243a0064464k902718L204752N471101K407561o05132O04709L727186M190026
$$ -10064464 -12967182 -9762430 -4291329 -1883768 -2488900 -1884191 1842995 6033021
6235F033021J218446k155604l045512j229816J012915Q89236j927767m104801
$$ 6033021 7251467 5095863 2050351 820535 1833450 2722686 794919 -3309882
6227c309882j964695L681848P744919O625391K125484j528428k883842l421674
$$ -3309882 -5274577 -1592729 6152190 12777581 14903065 13374637 10490795 7069121
6219G069121l656547k320177Q022k9915l362704n258565j582353L434702J659053
$$ 7069121 3412574 1092397 1100419 1070504 -2292200 -7550765 -9133118 -5698416 -4039363
6210d039363o277486r684960k435220P649509R766524N094603K826163M792262
$$ -4039363 -10316849 -20001809 -22437029 -14787520 -5020996 73607 2899770 7692032
6202G692032M001400j829953n629483k848621R06023p88648n153164n585899j893605
$$ 7692032 11693432 9863479 4233996 1385375 2291398 1502750 -3650414 -9236313 -11129918
6193a1129918J204128K081004K489386K545379J466584J337685M187552O680297
$$ -11129918 -9925790 -7844786 -5355400 -2810021 -1343437 -5752 4181800 10862097
6185A0862097L760345k977578o521630m265539q66858m13321j409785j429232
$$ 10862097 14622442 11644864 5123234 857695 -9163 -422484 -1832269 -3261501
6177c261501j404306k259475j691728J842287N046782L738994r69831m052737
$$ -3261501 -4665807 -6925282 -8617010 -6774723 -1727941 2011053 1041222 -3011515
6169c011515k968316L69585K882131K532275j520361p199605q632385j607891
$$ -3011515 -5979831 -5610246 -2728115 -195840 -1716201 -8915806 -17548191 -19156082
6161a9156082R331902J3914253Q330550O5702k591536j350587k925512o843444
$$ -19156082 -9824180 4090073 12420623 12486325 9894789 8544202 5618690 -1224754
6153a224754o217867j74315L385900M03120k109105K646565R188863P329192j864199
$$ -1224754 -7442621 -7616936 -4231036 -3827916 -5937021 -3290456 5898407 13227599 11363400
6144A1363400p164324l618311J540412J469176n20928J455456N341996M951028
$$ 11363400 4199076 580765 2121177 3590353 3069425 4524881 9866877 14817905
6136A4817905M44228j993170K19449K812070J631763j911485m062738l992012
$$ 14817905 15262133 13268963 13488412 16300482 17932245 16020760 11958022 7966010
6128G966010l455604l112367j936857j36125j84954l317357o182365l762304L724786
$$ 7966010 4510406 1398039 -538818 -674943 -859897 -4177254 -10359619 -14121923 -10397137
6119a0397137R560715Q206658K089423k079319j900908m50828l4323N04542J879791
$$ -10397137 -836422 7370236 9459659 7380340 5479432 5028604 4994281 5498823 7378614
6110G378614K235786M10875k064374l584665m130446l429899p67558K369200K952110
$$ 7378614 9614400 10025275 7960901 4376236 245790 -3184109 -3951667 -1582467 1369643
6101A369643R71451j00154J419643L329749L813845L558962K206085k316540q414258
$$ 1369643 2341094 2240940 3660583 6990332 10804177 14363139 16569224 14252684 5838426
6092E838426r836509l852793L623072N118263O18080m106458n035433k193792
$$ 5838426 -3998083 -7850876 -4227804 890459 1508539 -2597919 -7633352 -9827144
6084i827144K496403N993089N485824K083282J47470M81171j371743o805117r682520
$$ -9827144 -7330741 -1337652 4148172 6231454 6378924 6860095 5488352 -1316765 -10999285
6075a0999285n201451K018525M878445M011555L929422L559825n27905m647461
$$ -10999285 -16200736 -14182211 -9303766 -5292211 -1362789 2197036 1669131 -2978330
6067b978330j821640N809237Q292045K506020l566384l280888K99209J589272
$$ -2978330 -4799970 1009267 9301312 11807332 8240948 4960060 5259269 6848541
6059F848541N61549n67134k658926o724984r678853p607064j284468M477492N685949
$$ 6848541 7410090 6842956 4184030 -2540954 -12219807 -19826871 -21111339 -16633847 -10947898
6050a0947898K261724j937976k021115K763735P275821O558159K224436p98801
$$ -10947898 -8686174 -10624150 -12645265 -9881530 -2605709 3952450 6176886 5378085
6042E378085j677732k576435k346838J491517N320602K321727o100402j0071446
$$ 5378085 3700353 1123918 -1222920 268597 5589199 7910926 1810524 -8260922
6034h260922n037429J899618L051724L73266j49932J735726K072533r5227k145726
$$ -8260922 -13298351 -11398733 -8347009 -7973743 -8123675 -6387949 -4315416 -4410643 -6556369
6025f556369k014516M73285L935650N165635J929858k630515k839362J081267
$$ -6556369 -8570885 -8097600 -4161950 1003685 2933543 303028 -2536334 -1455067
6017a455067L004700Q03177o46903J048919J124622l135034o143946k973763K110882
$$ -1455067 1549633 2352810 1705907 2754826 3879448 744414 -5399532 -8373295 -6262413
6008f262413K839528Q16988J002572K511197J631600l46467j32436N83059j021814
$$ -6262413 -3422885 -2605897 -1603325 907872 2539472 2193005 2060569 2643628 1621814
5999A621814j821710K048944O257876L823622k737788m559024m73592K120639
$$ 1621814 -199896 1849048 8106924 11930546 9192758 4633734 4160142 6280781
5991F280781M21713p6174L179124M672331N84440m495041n092769k629901j252872
$$ 6280781 6702494 6626320 9805444 14477775 15062215 10567174 5474405 2844504 1591632
5982A591632j193190o09620J57801J12686Q4328N41005n0195k049150k835349
$$ 1591632 398442 -211178 -53377 59309 143637 684642 634447 -1414703 -4250052
5973d250052o96653K181175K904302J636373K23239o56924j182503j192277p38085
$$ -4250052 -4946705 -2765530 138772 1775145 1998384 1341460 158957 -1033320 -1771405
5964a771405k68143L87245J569040K436091K140007J746436K400131K666554J093623
$$ -1771405 -2039548 -1652303 -83263 2352828 4492835 6239271 8639402 11305956 12399579
5955A2399579M6326K387834N284830K964917m184838r097969p596339k836427
$$ 12399579 12445905 14833739 20118569 23083486 18898648 9800679 2204340 -632087
5947f32087J053297L700790M771976J863256m268925p664785m618822P78955K413473
$$ -632087 421210 4122000 8893976 10757232 6488307 -1176478 -5795300 -5016345 -2602872
5938b602872J7657k215214j656034J393362N283917P010838L802873k450486n653187
$$ -2602872 -2585215 -4800429 -6456463 -5063101 220816 7231654 11034527 8584041 2930854
5929B930854l044903J277234K797487K092619J023404j214562l989459k666887
$$ 2930854 -114049 1163185 3960672 6053291 7076695 5862133 1872674 -794213
5921g94213M072350R087412N790070j412790l156912J153179L743840J116224
$$ -794213 3278137 12365549 18155619 16742829 13585917 14739096 18482936 19599160
5913A9599160k135085k253317j018337j58482J532268L240697J131929m485427
$$ 19599160 17464075 15210758 14192421 14033939 15566207 18806904 19938833 15453406
5905A5453406o949180k202172M763427O591669K904913j221021k952496l289522
$$ 15453406 8504226 6302054 11065481 17657150 20562063 19341042 16388546 13099024
5897A3099024k974550j394245R19062K137199J511596l37712k927448n454304
$$ 13099024 10124474 8730229 9649291 11786490 13298086 12960374 10032926 4578622
5889D578622n579892j490777M636387P674905M971575p58930m713974n005453
$$ 4578622 -1001270 -2492047 2144340 9819245 14790820 14031890 9317916 4312463
5881D312463l606172l246630m428882n249506l421625J422336O772189Q682176
$$ 4312463 706291 -2540339 -6969221 -12218727 -15640352 -14218016 -7445827 1236349
5873A236349N201812j137904n156001m205383q22165Q10486O0576l47336R23474
$$ 1236349 6438161 5300257 144256 -4061127 -4883292 -4072806 -4012230 -4359566 -3436092
5864c436092K025785J369330R4860l06358m84284j367204j716797L3654K717616
$$ -3436092 -1410307 -40977 53883 -252475 -736759 -2103963 -3820760 -3787106 -1069490
5855a069490L708697K729250K196471L788201O249699O768863L782185j235882
$$ -1069490 2639207 5368457 7564928 11353129 17602828 24371691 28153876 26917994
5847B6917994m489236l481858j73238J307885L33784J76956J828143J600082k408902
$$ 26917994 22428758 18946900 18773662 20081547 20415331 20592287 22420430 24020512 21611610
5838B1611610n760678m103497o48753j345528m885255m445322J152828N230874
$$ 21611610 15850932 11747435 11098682 9753154 4867899 422577 1575405 6806279
5830F806279L470763k27278o61042J491096K668081K022871N27092j764777m173241
$$ 6806279 10277042 10049764 9388722 10879818 13547899 15570770 16097862 14333085 10159844
5821A0159844m402562k273903j239312k978199l874564o08581L970160M922109
$$ 10159844 5757282 3483379 2244067 -734132 -4608696 -5217277 -1247117 3674992
5813C674992K513916P69151Q41911O79780l59564j509078l745037p564230q855226
$$ 3674992 6188908 6958059 7799970 8479750 8120186 6611108 2866071 -4698159 -13553385
5804a3553385l387622M736707O276523J6058m552778j064070M286626K868187
$$ -13553385 -16941007 -12204300 -5927777 -5911719 -10464497 -11528567 -7241941 -4373754
5796d373754k605148k556983M017548P735836L222163k942460k422981K876896
$$ -4373754 -6978902 -9535885 -5518337 2217499 5439662 2497202 74221 2951117
5788B951117M668448O51217l310611k701498j95038l02082k575817l349938j812736
$$ 2951117 7619565 8270782 4960171 2258673 2063635 1761553 -814264 -4164202 -5976938
5779e976938o82063j353465j602056Q82565M648703N747230K316026l122434o046005
$$ -5976938 -6659001 -8012466 -9614522 -8731957 -4083254 1663976 3980002 857568 -5188437
5770e188437m276517K33225L990977N897867P601733R858205J0347219O649929
$$ -5188437 -9464954 -9231729 -5240752 657115 8258848 18117053 28464272 35114201
5762C5114201J86163n007424o957006o982882o526020n432072l765125k499327
$$ 35114201 35300364 30292940 23335934 16353052 9827032 4394960 629835 -1869492
5754a869492j415551R46413L945656M498095K088042Q80847L637134O355688L370237
$$ -1869492 -3285043 -2338630 1607026 6105121 8193163 9074010 12711144 19066832 22437069
5745B2437069l952552q543046p016290k678666R03558L682673N065221K078333
$$ 22437069 18484517 9941471 2925181 246515 1150073 4832746 9897967 11976300
5737A1976300m763519q567604m093279M272295P727592M402974K26431n39169
$$ 11976300 7212781 -1354823 -5448102 -1175807 6551785 10954759 11181190 10642021
5729A0642021K19110Q5372N19457L006739M989263L174511j432024m897364n311173
$$ 10642021 10861131 10946503 11465960 14472699 19461962 22636473 21204449 16307085 10995912
5720A0995912l814056j901674k25995O16599L06410n76884j757448m158301p612928
$$ 10995912 7181856 5280182 5054187 5670786 5977196 5400312 3642864 -515437 -8128365
5711h128365q797029m443839L395308Q286318O548859J140454k672667l217363
$$ -8128365 -16925394 -21369233 -17973925 -9687607 -3138748 -1998294 -4670961 -7888324
5703g888324k251654r59392J018652L114779L321451J151066p72880K55786L193362
$$ -7888324 -10139978 -11099370 -10080718 -6965939 -3644488 -2493422 -3266302 -3010516 182846
5694A82846M239555J836858j024662o82810K204196L602196J841250r2862R13065
$$ 182846 4422401 6259259 5234597 4551787 6755983 10358179 12199429 12106567 13019632
5685A3019632L548255M238213K322660J95372j113507l184595o400658p942563
$$ 13019632 16567887 20806100 23128760 23324132 22210625 19026030 12625372 4682809
5677D682809n405473m94892K818377K735753P06983r72387j214451n38291n99152
$$ 4682809 -722664 -1217556 1600821 4336574 5043557 4071170 2856719 2318428 1719276
5668A719276k520709m705341l567606K015803Q122577R631264N984529J090205
$$ 1719276 -801433 -5506774 -9074380 -7058577 1064000 10695264 16679793 17769998
5660A7769998j994159l748448n313492n603471k936473J813592N447655N619378
$$ 17769998 15775839 12027391 6713899 1110428 -1826045 -12453 5435202 11054580
5652A1054580K821369o93164l185302m387140m657300l902576j850880Q40148
$$ 11054580 13875949 13182785 9997483 5610343 953043 -2949533 -4800413 -3960265
5644c960265K632422K653562J577019N34944k16067j011186j796390k174629k093896
$$ -3960265 -1327843 1325719 2902738 3437682 3221615 2210429 414039 -1760590 -3854486
5635c854486j893307j805475j610939n85375J834895M549731M659194O55442m476172
$$ -3854486 -5747793 -7553268 -9164207 -9749582 -7914687 -3364956 1294238 1949680 -2526492
5626b526492n795475k493323J228307K207423K074152L260451M690872M335682
$$ -2526492 -8321967 -10815290 -9586983 -7379560 -5305408 -2044957 2645915 6981597
5618F981597L091554K499506J086984k753618o138626m814104M691K785112J496604
$$ 6981597 10073151 12572657 13659641 10906023 4767397 -46707 -42016 2743096 4239700
5609D239700l87325K161J326201J347709j11367k265722l883546k649217J984083
$$ 4239700 3852375 3854536 5180737 6528446 6417079 4151357 267811 -2381406 -397323
5600c97323N620469L554084j543364k482196J473660L452398L26896k552466j195318
$$ -397323 5223146 8777230 7233866 4751670 6225330 9677728 10004624 7452158 6256840
5591F256840L83576j618172l351728p57948J946178q37785n684734n298054n66972
$$ 6256840 6640416 5022244 1670516 912568 2858746 2020961 -3663773 -8961827 -9528799
5582i528799J416222q13035k093352l74050J191121J741730L974243P193323O902740
$$ -9528799 -8112577 -8925612 -11018964 -11393014 -10201893 -8460163 -4485920 2707403 9610143
5573I610143K671154o72363r99856j120965j804993P5036M367327N784628K029688
$$ 9610143 12281297 11608934 10609078 9488113 7683120 7758156 12125483 17910111 19939799
5564A9939799k599730m346041m476409m250303k187615P85454N01719k717600
$$ 19939799 17340069 12994028 8517619 4267316 2079701 2865155 3366874 649274
5556F49274k663165K477550N854053K783880j572754j099246J908168K755938
$$ 649274 -2013891 463659 6317712 9101592 7528838 6429592 8337760 11093698
5548A1093698K712585L979946L110718k155534n855447k913623Q31878j695364
$$ 11093698 13806283 17786229 20896947 18741413 12885966 9972343 10804221 9108857
5540I108857n006831J79009Q684349O591044n830706j2785065o969250L12701
$$ 9108857 4102026 4281035 12965384 19556428 13725722 940657 -6028593 -5715892
5532e715892j454984o351327m168807K971568O326555M996907M329592M774929
$$ -5715892 -7170876 -13522203 -17691010 -14719442 -8392887 -3395980 933612 5708541
5524E708541J916245m698368j0196881j0584352n424740L242231J0444131J0230198
$$ 5708541 7624786 2926418 -7270463 -17854815 -23279555 -20037324 -9593193 637005
5516F37005K801949l769157l558657n46722j286560m320639l502233J645506O121426
$$ 637005 3438954 -330203 -3888860 -4435582 -5722142 -10042781 -13545014 -11899508 -5778082
5507e778082P677744P808545O219454J435309l896503n048837k311635m2144P28854
$$ -5778082 1899662 9708207 15927661 17362970 13466467 8417630 6105995 6063851 6792705
5498F792705K399199M123937K231915k238227l726522j364400q10119m288112
$$ 6792705 9191904 13315841 15547756 13309529 9583007 8218607 7408488 3120376
5490C120376n795766o29608N856871M730290m101012j1102506q266593K108950
$$ 3120376 -2675390 -3304998 2551873 7282163 3181151 -7921355 -16187948 -14078998
5482a4078998J0134579Q712068J012674l170440P55620O447065N477566j042566
$$ -14078998 -3944419 4767649 5780323 2609883 3365503 9812568 15290134 14247568
5474A4247568n022770l685641k151988l529734m117088q98407L140135M791124
$$ 14247568 9224798 5539157 3387169 -142565 -4259653 -5158060 -2017925 2773199
5466B773199N562753O641858M822730j203889n611861k915214K952007L749113
$$ 2773199 8335952 14977810 19800540 18596651 12984790 10069576 13021583 16770696
5458A6770696j200986m966981l721758r09041l50442j040148n22722Q23460J032993
$$ 16770696 15569710 10602729 6880971 5971930 5621488 4581340 4058618 4882078 5915071
5449E915071m58453k517872l318622j088390M368043J0287643J2406307Q463542
$$ 5915071 5456618 2938746 -379876 -1468266 2899777 13187420 25593727 34057269
5441C4057269J50458p828399j0601710o788693k03099L593883K955954N04619
$$ 34057269 34207727 26379328 15777618 8988925 8785826 12379709 15335663 15840282
5433A5840282j877892m645043o576379m313068J539940M830638K189086j616986
$$ 15840282 13962390 9317347 2740968 -1572100 -32160 4798478 6987564 5370578
5425E370578j194463J167468M94290j660325k68922L491468L487076j266220n053212
$$ 5370578 4176115 5343583 5837873 4177548 3908626 7400094 10887170 9620950 4567738
5416D567738m139906n51423K902885N074365M002064j263444o077714m517791
$$ 4567738 427832 -123591 2779294 7853659 11855723 10592279 4514565 -3226
5408c226J085427K522865j280142k262600L097513P180334L220020m211785p217886
$$ -3226 1082201 3605066 2324924 62324 3159837 10340171 13560191 9348406 2130520
5399B130520o306690o500538o958294l128653L569907O682549M788566L528412
$$ 2130520 -4176170 -10676708 -17635002 -20763655 -17193748 -10511199 -5722633 -2194221
5391b194221O752155J1134536J1110539N467057k286386p770291r195123q224852
$$ -2194221 4557934 15692470 26803009 32270066 29983680 22213389 13018266 4793414
5383D793414p359902o309940k758301K869853O460054N376656J479082k324876
$$ 4793414 -2566488 -8876428 -11634729 -8764876 -2304822 3071834 4550916 2226040
5375B226040m804019m427409K14238N678298N262816j019102m287015M93619O243294
$$ 2226040 -2577979 -7005388 -6791150 -1112852 4149964 3130862 -1156153 -662534 5580760
5366E580760M800517l56906j145795J086389n76970m594998l217492K559407L219184
$$ 5580760 10381277 10024371 8878576 9964965 9387995 4792997 1575505 4134912 7354096
5357G354096k854487n860420j026527L392875L31280m481523k807144K648133
$$ 7354096 4499609 -1360811 -2387338 1005537 1336817 -3144706 -5951850 -3303717
5349c303717L723338k95420l732312m216005l522185j916318J167347L198996
$$ -3303717 419621 124201 -3608111 -7824116 -11346301 -13262619 -12095272 -8896276
5341h896276J763821l88425O16635K944288K212033p46753j668699o26851j208220
$$ -8896276 -7132455 -7520880 -6904245 -3959957 -1747924 -2494677 -4163376 -4790227 -5998447
5332e998447k954002j743893K136418L277356j55453l227426j903942J402837
$$ -5998447 -8952449 -10696342 -8559924 -5282568 -5438021 -8665447 -10569389 -9166552
5324i166552K564865J527400M20204n16443j927750k729526j470724J030189K602650
$$ -9166552 -6601687 -5074287 -4654083 -5170526 -7098276 -9827802 -11298526 -10268337 -7665687
5315g665687K574921K402467L773293O298655O776215K006315o184942j0648864
$$ -7665687 -5090766 -2688299 1084994 7383649 14159864 16166179 9981237 -667627
5307f67627o758099P73241K983171j827776o120523l168185N205581J1968905
$$ -667627 -7425726 -6652485 -3669314 -5497090 -11617613 -14785798 -9580217 2388688
5299B388688J1933428M487680o184083j2084127p565929K890655P748500K351591
$$ 2388688 14322116 18809796 12625713 541586 -7024343 -4133688 3614812 5966403
5291E966403n035750n029830L08094K610588M23400p43639N37213n66816n404854
$$ 5966403 930653 -4099177 -3791083 -1180495 -757095 -1500734 -963521 -1530337 -6935191
5282f935191p952888l780597L151009O418792N309260L292482K035669R28913
$$ -6935191 -14888079 -18668676 -15517667 -9098875 -3789615 -497133 1538536 2467449
5274B467449k7961m89860j009834j253941O65881M287681N150944P05823m866409
$$ 2467449 2439488 1949628 939794 -314147 351734 4639415 9790359 10496182 5629773
5265E629773o048255l626358j776111N0067N334896J1321138R711215j295480
$$ 5629773 -418482 -4044840 -5820951 -5770884 -435988 10885150 20596365 19300885
5257A9300885j2585244j5202197j0063019l011389L567085Q781063Q695974J624363
$$ 19300885 6715641 -8486556 -18549575 -21560964 -17993879 -9212816 -516842 1107521
5249A107521n345220l617735M107941O507554k99152p267792n336133L214132
$$ 1107521 -4237699 -7855434 -3747493 2760061 2460909 -4806883 -10143016 -6928884
5241f928884R853035J0332512N865413j117457p285723q369324m231936j194204
$$ -6928884 2924151 13256663 19122076 18004619 10718896 2349572 -1882364 -3076568
5233c076568l933101p489747l551416O526969J1890938O355222l742074q393196
$$ -3076568 -7009669 -14499416 -18050832 -11523863 367075 6722297 2980223 -5412973
5225e412973n659737r81349J469506J977699J407253j008607n015092p601682
$$ -5412973 -11072710 -12054059 -10584553 -8606854 -7199601 -8208208 -13223300 -20824982
5217b0824982n959101j050223L317459M631138L664520K429407J679953J267087
$$ -20824982 -26784083 -27834306 -24516847 -19885709 -16221189 -13791782 -12111829 -10844742
5209a0844742J558469K676806L002866Q07448k431931k864676N23247L790477
$$ -10844742 -9286273 -6609467 -3606601 -2799153 -5231084 -8095760 -7572513 -3782036
5201c782036K838679j343865m100024k619053J526777M305611K536557l175186
$$ -3782036 -943357 -2287222 -6387246 -9006299 -7479522 -3173911 -637354 -3812540
5193c812540p610143n193998L137625R686365Q842818L531748q7897j186779l004909
$$ -3812540 -11422683 -16616681 -13479056 -3792691 5050127 8581875 8493978 7307199 4302290
5184D302290n619023n993972m305490l834106m147017q08983O361455J0813859
$$ 4302290 -1316733 -7310705 -11616195 -15450301 -19597318 -20406301 -14044846 -3230987
5176c230987Q003547J477240l126212n367074p227120p406086l680430J738026
$$ -3230987 4772560 6249800 3123588 -2243486 -9470606 -16876692 -20557122 -18819096
5168a8819096M391314L670904K337862J291413p22712k960299k713271K83741
$$ -18819096 -14427782 -10756878 -8419016 -7127603 -7850315 -10810614 -13523885 -13240144
5160a3240144L062152L416316J864747l14846k138103k135886L94712L134463
$$ -13240144 -10177992 -6761676 -4896929 -5211775 -7349878 -9485764 -9091052 -5956589
5152e956589K729312l60846j728436J282340N955497P485516M399752l70854l059423
$$ -5956589 -3227277 -3588123 -5316559 -4034219 1921278 9406794 13806546 13435692 10376269
5143A0376269k922865k391948l232300l551693p57957L030717K582004k247780
$$ 10376269 7453404 5061456 1829156 -1722537 -2480494 550223 3132227 884447
5135H84447m846555j560508K035337j84078m621670l761557J137346K416670k00016
$$ 884447 -3962108 -5522616 -3487279 -3671357 -8293027 -12054584 -10917238 -8500568 -8700584
5126h700584J260060Q538164J2391261O781012j531878l975036k782188m568266
$$ -8700584 -7440524 1097640 13488901 20269913 18738035 14762999 11980811 7412545
5118G412545p529722m739966L029024P388820M685066J93403o63199J489654L774210
$$ 7412545 -117177 -4857143 -1828119 5560701 10245767 10439170 9775971 11265625 15039835
5109A5039835N200563N185126K583806j721886m496734l940397j642225k92507
$$ 15039835 20240398 25425524 28009330 26287444 21790710 17850313 16208088 15915581
5101A5915581j199434l419040l627503J089717P862028Q766743J049311p085502
$$ 15915581 14716147 11297107 7669604 8759321 16621349 25388092 26437403 19351901
5093A9351901o778928j111020L17634l427984m642416j119050J082159L66729
$$ 19351901 12572973 11461953 11779587 8351603 3709187 2590137 3672296 4039025
5085D039025K911214Q999447Q343451l246186j3283414r185877K710658O659980
$$ 4039025 6950239 15949686 24293137 21046951 7763537 -1422340 1288318 7948298
5077G948298M01722m394535j738427J996333J427815j91293J68630p00134m545726
$$ 7948298 8350020 3955485 2217058 4213391 5641206 5449913 5618543 4918409 372683
5068C72683o240105j747300M582373O294581L952434K751171M304446N766042
$$ 372683 -5867422 -7614722 -3032349 3262232 7214666 9965837 14270283 20036325
5060B0036325N147735L250194J245715m69560j452953j388965q33502p00828j445966
$$ 20036325 25184060 28434254 29679969 29210409 27757456 26368491 25534989 24834161 23388195
5051B3388195k950439m329488m287752l033994k802937m488056n439001l592177
$$ 23388195 20437756 16108268 11820516 8786522 5983585 1495529 -3943472 -7535649
5043g535649j633076k587923l406509P32467O854782O887290O72075k519479J501653
$$ -7535649 -9168725 -11756648 -15163157 -14430690 -7575908 -688618 -16543 -2536022 -1034369
5034a034369M777864L23659n674875l091491O036091J0042615M080376m591846
$$ -1034369 3743495 4067154 -1607721 -4699212 1336879 11379494 15459870 10868024
5026A0868024p583043m303367R89326M827839N291412J874440k918252m620876
$$ 10868024 3284981 -1018386 -29060 4798779 10090191 11964631 9046379 4425503
5018D425503j320062M126265O755196L564165l956171r965612q818713j543784
$$ 4425503 3105441 7231706 13986902 17551067 13594896 3629284 -5189429 -6733213
5010f733213M193990K797908l019215o959384o525549k372208N128267J3037930
$$ -6733213 -2539223 258685 -2760530 -9719914 -16245463 -18617671 -13489404 -451474
5002d51474J3707366L476702q502740r079879J106393P721081K780167m473609
$$ -451474 13255892 16732594 8229854 -850025 256368 7977449 10757616 6284007
4994F284007j784697Q437537J3103702O083361n774837j3120401j3767330j0653108
$$ 6284007 4499310 12936847 26040549 32123910 26349073 13228672 -538658 -11191766
4986a1191766n658860P80958O284272P050202K668343k263036l281734j091538
$$ -11191766 -16850626 -16069668 -9785396 -2735194 -66851 -2329887 -5611621 -6703159
4978f703159J005512K734068N534966O823353K187010n456079o467087J848359
$$ -6703159 -5697647 -2963579 2571387 9394740 11581750 6125671 -341416 1506943
4970A506943R455681P317384j0486l164850k659261m547323o803267k799140M322012
$$ 1506943 10962624 18280008 18269522 15104672 12445411 7898088 1094821 -1704319 2617693
4961B617693M646688j258241k382391L372995M709340l282702r450183m766079
$$ 2617693 7264381 6006140 3623749 6996744 11706084 8423382 -1026801 -5792880
4953e792880K836296K206496l448477m670596k397912l245482m947928p93743
$$ -5792880 -2956584 -750088 -4198565 -8869161 -11267073 -14512555 -19460483 -20254226
4945b0254226N534339M121531l587525n477972J883734P852036N176116J022349
$$ -20254226 -14719887 -10598356 -14185881 -19663853 -17780119 -9928083 -4751967 -3729618
4937c729618M447773J1945464J3159672N750960k519450m286063J9288M459301
$$ -3729618 718155 12663619 25823291 31574251 29054801 24768738 24788026 29247327
4929B9247327L858896k195920r737131j4194560j3674299q707071q25725O907451
$$ 29247327 33106223 30910303 21173172 6978612 -6695687 -15402758 -16228483 -9321032
4921i321032J0073553O760854N53693k907634j926890M52406O30313k236433n833659
$$ -9321032 752521 7513375 8067068 5159434 3232544 3684950 4315263 2078830 -3754829
4912c754829o279720j865475L858134N340224K245514j72228R77504K499460J237464
$$ -3754829 -10034549 -11900024 -8041890 -2701666 -456152 -628380 349124 2848584 4086048
4903D086048j103636j800439q23603J577198N416997P180283K575150m557938
$$ 4086048 2982412 1181973 358370 1935568 7352565 14532848 17107998 12550060
4895A2550060m652498L103243Q585676O907932M935572O406435M699344j729968
$$ 12550060 7897562 11000805 19586481 26494413 31429985 37836420 42535764 40805796
4887D0805796k558021N005069P309948j291040m216257Q683126J8817315R515436
$$ 40805796 38247775 43252844 50562792 49271752 45055495 53738621 72555936 82071372
4879H2071372k297545L516209R953326n388806j8063150O663492L4252706r457710
$$ 82071372 79773827 83290036 93243362 87854556 69791406 76454898 110707604 101249894
4871A01249894j14293048j66494828r4833643K6168031P6151472M3766132J2409210
$$ 101249894 -13043154 -179537982 -274371625 -248203594 -172052122 -128285990 -115876780
4864a15876780K3611407L6026461J5876345r315063p233379Q195017J1002820
$$ -115876780 -92265373 -56238912 -40362567 -49677630 -56911009 -48715992 -37713172
4857c7713172N815791P562810J0537657M589614k098231K99802L939004M34233
$$ -37713172 -31897381 -24334571 -13796914 -9207300 -11305531 -11005729 -7066725 -6632492
4849f632492j733803M742976R103368K026470n594732k207491K772535l149760
$$ -6632492 -8366295 -3623319 5480049 7506519 1911787 -295704 2476831 -672929
4841f72929j1211747o524607M689968N142367n019074j0904687p873260m132202
$$ -672929 -11884676 -18409283 -13719315 -8576948 -13596022 -24500709 -32373969 -36506171
4833c6506171k808275K84806L875039K689268m72018J365891N871810N288279
$$ -36506171 -39314446 -39029640 -35154601 -32465333 -32937351 -31571460 -25699650 -20411371
4825b0411371P91215l2528L284879N667081P334966R984322P235644o138964j9673072
$$ -20411371 -19620156 -19652684 -16367805 -10700724 -3365758 6618564 13854208 7715244 -11957828
4816a1957828j8091311m155616N507456N317792M411030O451988M414325k426106
$$ -11957828 -30049139 -34204755 -28697299 -23379507 -18968477 -12516489 -8102164 -10528270
4808a0528270m358543J289699M716605J078199j787450Q98366K123133k539732
$$ -10528270 -14886813 -13597114 -8880509 -7802310 -9589760 -8691394 -6568261 -9107993
4800i107993n587689j261045L719743K364203o90031O51695J853879l266716r528956
$$ -9107993 -14695682 -15956727 -12236984 -9872781 -10562812 -9911117 -8057238 -11323954 -20852910
4791b0852910p694667Q71053P299312Q651464Q473698P204500J711224o606731
$$ -20852910 -28547577 -27676524 -20377212 -11725748 -3252050 3952450 5663674 -943057
4783i43057j1156757q101868k12853O713083Q154981L648154j780004j668568
$$ -943057 -12099814 -20201682 -20414535 -13701452 -5546471 -1898317 -3678321 -5346889
4775e346889L728910O784065K510267m997559q965611p990207m377133M29942
$$ -5346889 -1617979 5166086 7676353 2678794 -6286817 -14277024 -18654157 -18224215
4767a8224215M699412N457020K868068J164286J675537L06543m166469n782214
$$ -18224215 -13524803 -8067783 -5199715 -4035429 -2359892 -2053349 -6219818 -12002032
4759a2002032r34858M010993J740400m319693n044127J082896P132699P909430
$$ -12002032 -12936890 -8925897 -7185497 -11505190 -16549317 -15466421 -8333722 -424292
4751d24292M375585k38437k967714j576220K499627L894532M10935k905265j498262
$$ -424292 3951293 3712856 745142 -831078 1668549 5563081 5974016 3068751 1570489
4742A570489J128581m44433m020509l691225k44684M2756m477627q678133p744213
$$ 1570489 2699070 2254637 -1765872 -5457097 -5701781 -5659025 -10136652 -18814785 -26558998
4733b6558998j251311P903002J3936998J0908106M36102p210495n607972q61348
$$ -26558998 -27810309 -19907307 -5970309 4937797 5373899 -1836596 -7444568 -8305916
4725h305916j002359l015411p475M587443K345923m305066n122759N78749L299957
$$ -8305916 -9308275 -12323686 -12331161 -7743718 -5397795 -9702861 -14825620 -14246871 -10946914
4716a0946914J32282j730305L06145K03008k898670j044599P198817J1313172
$$ -10946914 -10814632 -12544937 -12238792 -12035784 -14934454 -15979053 -8780236 2532936
4708B532936N623309q99854K55693L670922J046213m350609m853972j943636j860503
$$ 2532936 8156245 7256391 7512084 11183006 12229219 7878610 3024638 1081002 -779501
4699g79501l978035l813042k458291l301998l867811k03185M681309N562805M072970
$$ -779501 -4757536 -8570578 -11028869 -14330867 -18198678 -18401863 -13720554 -8157749 -4084779
4690d084779M346339M105775n08520n534674m931006k032148m109327q322044
$$ -4084779 261560 4367335 3858815 -1675859 -6606865 -8639013 -12748340 -21070384
4682b1070384n382009L837518Q162872L744804n18200J687466M754759K252770
$$ -21070384 -26452393 -22614875 -14452003 -10707199 -11225399 -9537933 -4783174 -2530404
4674b530404k278043k180774J592371L118897M38564l324391m771704k798239
$$ -2530404 -4808447 -6989221 -5396850 -2277953 -1839389 -5163780 -9935484 -12733723
4666a2733723R83714K766932Q06828n83791L703052J0173390R509971K98602p734089
$$ -12733723 -11750009 -8983077 -8176249 -8760040 -5056988 5116402 14626373 14924975 7190886
4657G190886p408879l200413j804116j286967L028286P743501N581253k231294
$$ 7190886 -217993 -3418406 -5222522 -6509489 -3481203 4262298 9843551 7612257
4649G612257o520919l078463K244039K768382m92532k188037n94358J051484k64011
$$ 7612257 1091338 -1987125 256914 3025296 2532764 344727 -249631 801853 537842
4640E37842l352320m483249k188816O87128N08879k414962m327012k863368P40641
$$ 537842 -2814478 -7297727 -9486543 -8799415 -8290536 -10705498 -15032510 -17895878 -17155237
4631a7155237M066923N520373L983790k69612l843028k960716J107679L134051
$$ -17155237 -13088314 -7567941 -3584151 -3853763 -7696791 -10657507 -9549828 -6415777
4623f415777J712119J581803N783474R766614P105040j758301j0152459j2628995
$$ -6415777 -4703658 -3121855 2661619 12428233 19533273 17774972 7622513 -5006482
4615e006482q836912k003004L472351M549185K295261Q14174J980513L554064
$$ -5006482 -13843394 -15846398 -12374047 -7824862 -5529601 -4715427 -2734914 819150
4607H19150L723215L802171M310713K828337q77322k127433J631306N146729K353313
$$ 819150 4542365 8344536 12655249 15483586 14606264 12478831 14110137 19256866 21610179
4598B1610179m251171p461954n993992m355669l773544p99174M989293Q923124
$$ 21610179 17359008 9897054 3903062 -452607 -4226151 -5025325 -36032 8887092
4590H887092Q056738M247202m31732n530074q563038n889653P08069M171902J430372
$$ 8887092 16943830 21191032 20759300 15229226 6666188 776535 1484604 5656506 7086878
4581G086878k778635l756226k788818k088784J76708M960417P441371L014353
$$ 7086878 4308243 552017 -2236801 -4325585 -4148877 811540 8252911 11267264
4573A1267264n041701r581101q907644o552508l869950O68227N359996N268307
$$ 11267264 6225563 -3355538 -12263182 -18815690 -22685640 -22017413 -16657417 -11389110
4565a1389110P7437l588770q53753M353665M856122M90214j811605J827434O347008
$$ -11389110 -11311673 -14900443 -15754196 -11400531 -6544409 -6054195 -7865800 -6038366 308642
4556C08642M593200k469640o532056k972118L232116M996481K725518J798591
$$ 308642 4901842 2432202 -4099854 -7071972 -3839856 1156625 3882143 5680734
4548E680734K790836O88796n636781r739676o488808M22594M024868L230333J690981
$$ 5680734 8471570 9160366 3523585 -6216091 -12704899 -12282305 -8257437 -5027104 -3336123
4539c336123O47883j249498k495045O34175P283578J0994106P349581q17720p378728
$$ -3336123 -2688240 -3937738 -6432783 -5798608 1484970 12479076 19828657 19010937 11632209
4530A1632209r019562o098692p93595L341091K806825j738170m483489q56222
$$ 11632209 2612647 -3486045 -4279640 -938549 1868276 130106 -4353383 -5209605
4522e209605N774089P234421J027411n610358m500698K722865O414484J457367
$$ -5209605 564484 7798905 8826316 3215958 -1284740 1438125 7852609 9309976
4514I309976o163406p736975l365297n22027k530710m343699j165555M037563
$$ 9309976 3146570 -4590405 -7955702 -8477729 -11008439 -15352138 -16517693 -12480130
4506a2480130N126307J267350l204452m993186l846823j70997M879441P679681
$$ -12480130 -7353823 -6086473 -9290925 -14284111 -18130934 -18301931 -13422490 -5742809
4498e742809M924168j437047n452327l932718O05417L767558L501744P68310j396591
$$ -5742809 -818641 -2255688 -7708015 -11640733 -11035316 -7267758 -3766014 -2997704 -4394295
4489d394295j9304L965484N241312Q80135m151134l141598K061648L352199j108631
$$ -4394295 -4413599 -448115 4793197 5673332 1522198 -1619400 442248 3794447 2685816
4480B685816m241079j807512J078147o86926l551336k028293J768272K430962
$$ 2685816 -1555263 -3362775 -2284628 -2971554 -6522890 -8551183 -6782911 -4351949
4472d351949P45721J090353K364484q3052m810242n138305j47234L204348R14165
$$ -4351949 -3606228 -2515875 -151391 -234443 -5044685 -10182990 -10330224 -7125876 -6211711
4463f211711k262151r42263L031365M841216M088533L603153M052615L703998
$$ -6211711 -8473862 -9416125 -6384760 -1543544 2544989 6148142 10200757 13904755
4455A3904755J622567j685880n002854n949922k490376L126813N157728J838712
$$ 13904755 15527322 13841442 8838588 2888666 398290 3525103 8682831 10521543
4447A0521543j199284J319177N931047M600782l885266j1499312j0605799k590384
$$ 10521543 9322259 10641436 16572483 21173265 17287999 5788687 -4817112 -7407496
4439g407496M419886M464012p87629m695294l185820P82153J277344k572704n357811
$$ -7407496 -2987610 1476402 688773 -4006521 -7192341 -6410188 -5132844 -7705548 -13063359
4430a3063359l043193J489371K980659J019391p27180n96464l11802r61410j131342
$$ -13063359 -16106552 -14617181 -11636522 -10617131 -11344311 -11940775 -12252577 -13213987 -14345329
4421a4345329P34585M466473Q494444J0284023P535357J189183m023639m574933
$$ -14345329 -13610744 -9144271 -649827 9634196 17169553 18358736 14335097 9760164
4413I760164k329047j096019r91138N8196J089986n94421l676005l780997o16328
$$ 9760164 7431117 6335098 5343960 5402156 6492142 5897721 2221716 -1559281 -2175609
4404b175609J037124j348615m527979m924079l083691p16565K352981N740023
$$ -2175609 -1138485 -2487100 -7015079 -11939158 -15022849 -15739414 -13386433 -7646410
4396g646410O877605M677294J642157o7319j332724k518664j210161L133653N931385
$$ -7646410 -768805 3908489 5550646 5483327 4150603 1631939 421778 3555431 9486816
4387I486816L103412k738878n942371n465259m591994m753252m206140k121273
$$ 9486816 12590228 9851350 3908979 -1556280 -6148274 -10901526 -15107666 -17228939
4379a7228939J02183J435152J949549J435327J66708J35066K420464M364854K763885
$$ -17228939 -17126756 -15691604 -13742055 -12306728 -12140020 -12004954 -9584490 -5219636 -2455751
4370b455751j104692l351265l460231m118068n477552m472174o18644K147213
$$ -2455751 -3560443 -6911708 -10371939 -14490007 -19967559 -24439733 -25058377 -22911164
4362b2911164J189530j128403j526279k56960Q09915J603113K700036L112321
$$ -22911164 -21721634 -22850037 -24376316 -24633276 -23823361 -22220248 -19520212 -16407891
4354a6407891K013475Q70551J030559P13126k292429n733593m502665K152239
$$ -16407891 -14394416 -13523865 -12493306 -11780180 -14072609 -19806202 -24308867 -22156628
4346b2156628Q349685Q403228L521192q13000k262119k804741l205628j129629
$$ -22156628 -13806943 -5403715 -1882523 -2695523 -4957642 -7762383 -10968011 -12097640
4338a2097640L504166N749562K058083l546133m482817r04935J458701P54563
$$ -12097640 -8593474 -2843912 -785829 -4331962 -8814779 -9719714 -8261013 -7506450
4330g506450R14948L519392M460507J217179k457455k511660j70776J960656M264383
$$ -7506450 -6591502 -3072110 1388397 2605576 148121 -2363539 -2534315 -573659 3690724
4321C690724O571640N498266K66848l689053k539308q20958m064168r117149r221346
$$ 3690724 10262364 15760630 16027478 12338425 9799117 8978159 4913991 -4203158 -13424504
4312a3424504m958950j890947k59630L830104Q699231Q178970K268457k306032
$$ -13424504 -18383454 -20274401 -20534031 -16703927 -8004696 174274 2442731 136699
4304A36699k666646k247056k115733Q70760N591356N665430j49492n035598m756071
$$ 136699 -2529947 -4777003 -6892736 -6021976 -430620 5234810 5085318 49720 -4706351
4295d706351l077002l279091k641389N39326K529738J344478O54459J966594J018020
$$ -4706351 -7783353 -11062444 -13703833 -13164507 -10634769 -9290291 -8635832 -6669238 -5651218
4286e651218k892582k736849M368977R623748N279399k455667k856010K860840
$$ -5651218 -8543800 -11280649 -6911672 2712076 7991475 5535808 2679798 5540638
4278E540638M891440N84278l734531m507396m483994m944239l234368R79154L836438
$$ 5540638 10432078 11016356 7281825 2774429 -1709565 -6653804 -9888172 -8909018 -5072580
4269e072580K831460m96213l398632l743240n59301L487613K872328l277638p896800
$$ -5072580 -2241120 -2737333 -6135965 -9879205 -10438506 -6950893 -4078565 -7356203 -15253003
4260a5253003n133223J174065L842060K733057J962393J212027j841787m017514
$$ -15253003 -20386226 -19212161 -15370101 -12637044 -10674651 -9462624 -11304411 -15321925
4252a5321925p33845M768504N508156K231908J452862L551249K880327q41021
$$ -15321925 -16055770 -11287266 -5779110 -3547202 -2094340 1456909 4337236 3496215
4244C496215j758335P31618J30564n593239j0057955q744468m636719r98575L043063
$$ 3496215 1737880 2469498 2600062 -2993177 -13051132 -21795600 -26432319 -27430894 -24387831
4235b4387831O790617O244001J794545K7780L788748P237215M806815j059763
$$ -24387831 -17597214 -11353213 -9558668 -9530888 -5742140 1495075 6301890 5242127
4227E242127m882605n182641l220942j69547J501755q09397m775420m735142k82683
$$ 5242127 359522 -4823119 -8044061 -8213608 -6711853 -7521250 -12296670 -17031812 -17314495
4218a7314495K919515K618924K886713N081588M165575j778332o219822l923586
$$ -17314495 -14394980 -11776056 -8889343 -3807755 357820 -1420512 -7640334 -11563920
4210a1563920O45910P60076k205721k182275J814256N231406M817683J445504
$$ -11563920 -10918010 -10157934 -12363655 -14545930 -12731674 -7500268 -2682585 -1237081
4202a237081k019349k895784q36304R75675k78573k096677k39419L324253K656015
$$ -1237081 -3256430 -6152214 -6988518 -6012843 -6291416 -8388093 -8627512 -5303259 -2647244
4193b647244j919035l755742j131726K10593k015410k343427K262556O659543
$$ -2647244 -4566279 -8322021 -9453747 -9243154 -11258564 -13601991 -11339435 -4679892
4185d679892O233344L347052J047479j604091l988774k214573K836945M324582
$$ -4679892 1553452 4900504 5947983 4343892 355118 -1859455 977490 5302072
4177E302072M32536k448220j403312j677747n196402n627301o30745K475242m7063
$$ 5302072 5734608 3286388 1883076 205329 -4991073 -10618374 -11249119 -8773877 -8820940
4168h820940j116052L755844P624938M801026N23749m01293k209939o632574o147745
$$ -8820940 -9936992 -6181148 1443790 6244816 6768565 6367272 4157333 -2475241 -8622986
4159h622986J376274N224882m13287n906812m281454l283975p221383n683509
$$ -8622986 -7246712 -2021830 -2435117 -8341929 -12623383 -15907358 -23128741 -28812250
4151b8812250N007815R941398K398115q07481Q795649J1231983l868023j0372399
$$ -28812250 -23804435 -13863037 -11464922 -12272403 -3476754 7755229 3887206 -6485193
4143f485193P410000J5788949q367641j1722203O5842372J69038136J65657684
$$ -6485193 924807 16713756 8346115 -3376088 62466284 231504420 397162104
4136C97162104K6270820j18618324j42209341p0854968j5271659j4380073k1798794
$$ 397162104 423432924 304814600 162605259 91750291 76478632 62098559 40299765
4129D0299765r133500O17882n335358o024400O194172R444945m024279j1843786
$$ 40299765 31166265 31784147 26448789 20424389 26618561 36063506 32039227 20195441
4121B0195441k367102O029741J36795o689607k748258J594385k988816o520515
$$ 20195441 17828339 23858080 23994875 17305268 14557010 16151395 13162579 6642064
4113F642064j01069O854743M463722j054701j880890k505312o643123o587175
$$ 6642064 6540995 13395738 17859460 16804759 14923869 12418557 5775434 -811741
4105h11741J698166P795751L611272k833850k323721M00623j165377j263569N844262
$$ -811741 886425 8682176 12293448 9459598 7135877 7536500 6371123 5107554 10951816
4096A0951816J1149852L952317q933653j2310610m988900J203862O44617j304094
$$ 10951816 22101668 26053985 17120332 4809722 -179178 1024684 1669301 365207
4088C65207n98838N20995P24475J957237L905285L499564N41933j771766j995210
$$ 365207 -233631 287364 1011839 2969076 6874361 10373925 10915858 9144092 7148882
4079G148882j702773k048691k471567k058785J2944L761688O736241N795589J645323
$$ 7148882 5446109 3397418 925851 -1132934 -1119990 2641698 9377939 15173528 16818851
4070A6818851j900061l755106n852900p049762l294684M125219P512957L357396
$$ 16818851 14918790 11163684 5310784 -1738978 -5033662 -908443 6604514 9961910
4062I961910k328986l016642J5145K201495K462399J207828k482799p014643p137279
$$ 9961910 7632924 4616282 4631427 6832922 9295321 10503149 8020350 1005707 -6131572
4053f131572j457587L973073M084056J648923J279557K015422R31660q61766r32897
$$ -6131572 -7589159 -3616086 467970 2116893 3396450 5411872 6343532 5481766 4548869
4044D548869J74446J692634M832787Q226151O915826M42541m271226l243654j933478
$$ 4548869 4723315 6415949 11248736 19474887 26390713 26833254 22562028 19318374 17384896
4035A7384896n272545q201377m145680K894212L803281k003452p011982o879611
$$ 17384896 12112351 3910974 -234706 2659506 6462787 4459335 -2552647 -9432258
4027i432258l519133N01699L364873K361735k187568m117637N71663O022041M308231
$$ -9432258 -12951391 -12449692 -9084819 -6723084 -8910652 -13028289 -12456626 -6434585 -2126354
4018b126354k167590m360273l08544L519316L268722J510922M18653q35699j608500
$$ -2126354 -4293944 -8654217 -8962761 -5443445 -2174723 -663801 -245148 -1080847 -2689347
4009b689347J22747K801576K663803m8681j963101k589660l411189k736103J553231
$$ -2689347 -2566600 234976 2898779 2850098 886997 -1702663 -5113852 -7849955 -6296724
4000f296724N834352N032372J551461J549924L683606J210718n009605o303180
$$ -6296724 -462372 4570000 6121461 7671385 11354991 12565709 7556104 1252924
3992A252924n69303L672045J016020k739159r99822L463949M305042R30831l205534
$$ 1252924 683621 4355666 5371686 2632527 1632705 5096654 9401696 10332527 7126993
3983G126993o173095o890558l977012O80540K134430l29071j363182J617977L801931
$$ 7126993 953898 -5936660 -9913672 -9233132 -7098702 -7427773 -8790955 -7172978 -3371047
3974c371047J305310k007271j229677J592642J973469O63411O68032P83075j353707
$$ -3371047 -2065737 -4073008 -5302685 -3710043 -1736574 -1073163 -405131 377944 -975763
3965i75763l134434p22024L432224L559518k83057k436068n22064J787234J205829
$$ -975763 -4110197 -4832221 -1399997 2159521 1876464 -559604 -1081668 705566 1911395
3956A911395j072860k561342k611281j441141O09561K067804J318239q42635j868015
$$ 1911395 838535 -1722807 -4334088 -5775229 -5165668 -3097864 -1779625 -2622260 -4490275
3947d490275p61737J288903L118393M154201L433061P07711j868976j931682n56115
$$ -4490275 -5252012 -3963109 -844716 3309485 6742546 7450257 5581281 3649599 3093484
3938C093484q00394k540663k099142J904313N423376L991284j010137l868245
$$ 3093484 2293090 -247573 -2346715 -442402 4980974 8972258 7962121 4093876
3930D093876j924815J205431Q32155k408285l768664j368009J332138J271784
$$ 4093876 2169061 3374492 4206647 1798362 -1970302 -3338311 -2006173 -734389
3922g34389O92595L000030O033065M419502j623399n233057k475411J767039R31536
$$ -734389 -41794 2958236 8991301 13410803 11787404 6554347 4078936 5845975 6777511
3913F777511l663492m943753k29817N309035N699765J150125l388640m378819
$$ 6777511 3114019 -1829734 -2059551 3249484 8949249 10099374 6710734 2331915
3905B331915k561146o47800r9134o23777j526443k117146j254192J532379M103967
$$ 2331915 -229231 -877031 -976165 -1599942 -3126385 -5243531 -6497723 -4965344 -861377
3896h61377L281500m07802k199744M18916L362949J509451l673046o440353n006016
$$ -861377 2420123 2012321 -187423 231493 3594442 5103893 1430847 -5009506 -10015522
3887a0015522k255820N92851M630323P413672L863459m553902q427109k500285
$$ -10015522 -12271342 -11678491 -7048168 365504 4228963 -324939 -8752048 -11252333
3879a1252333O359750Q489317M257762J441558K775831L180946q62469n413262
$$ -11252333 -4892583 3596734 7854496 9296054 12071885 15252831 14390362 8977100
3871H977100m761863N59738M247711J824004m038971o688321l698368J59640q6878
$$ 8977100 4215237 4774975 9022686 10846690 6807719 119398 -3578970 -3419330 -3506208
3862c506208k081634J12069O001330Q476046M493382m83367j381678o65748k417342
$$ -3506208 -5587842 -5475773 525557 9001603 13494985 13011618 11629940 10964192 8546850
3853H546850m769405l693179j90773J996502K658522L546474L465058P97394j521039
$$ 8546850 3777445 84266 -106507 1889995 4548517 8094991 11560049 12357443 10836404
3844A0836404K09170L385099K144115l442608p307415o138634k453509Q49052
$$ 10836404 11045574 14430673 16574788 13132180 5824765 -313869 -2767378 -1918326
3836a918326L209458L556618O71628k778426k256820J307453J774275k671745
$$ -1918326 1291132 4847750 5519378 2740952 484132 1791585 3565860 894115
3828H94115n680335j658325N676932P657789J431022o922447r368860m205998
$$ 894115 -4786220 -6444545 -767613 6890176 8321198 1398751 -7970109 -12176107
3820a2176107K539311L704594r28216m527428k173249K769531M033831J383656
$$ -12176107 -9636796 -5932202 -6860418 -11387846 -13561095 -10791564 -6757733 -5374077
3812e374077l92248M67569J183797L79666o7912N13172M66128j87679M39919J629969
$$ -5374077 -5766325 -5298756 -4114959 -3735293 -3803205 -3290033 -2823905 -3011584 -2571665 -941696
3802i41696N25257k114090k110537R34006K436433O93198j00933K484186M354046
$$ -941696 -416439 -2530529 -4641066 -3707060 -1270627 -577429 -678362 1805824 6159870
3793F159870J744695k263500k689322j03031J439659P16206o42458j669260j786114
$$ 6159870 7904565 5641065 2951743 2848712 4288371 5004577 4362119 2692859 906745
3784I06745K15966L357727L729117L16500j910986P65941M072261K003664k981193
$$ 906745 1122711 4480438 8209555 8526055 6615069 7381010 11453271 13456935 10475742
3775A0475742l129868K159521M566166q88298q196156q556926k012308L490712
$$ 10475742 7345874 9505395 14071561 13183263 4987107 -3569819 -5582127 -2091415
3767b091415K901394k76175J57357M411125O581403L046199k034051k114982K551504
$$ -2091415 809979 533804 691161 5102286 11683689 14729888 12695837 10580855 13132359
3758A3132359N127025J621496m182804o659808n077845k042743R09817K831137
$$ 13132359 18259384 19880880 15698076 9038268 3960423 1917680 2827497 5658634
3750E658634J729344k560549o129253n498819k587425j504548k205433j372124
$$ 5658634 7387978 4827429 -1301824 -6800643 -9388068 -10892616 -13098049 -14470173
3742a4470173J741990M464051M858739L035943o70161m963329o138875j876978
$$ -14470173 -12728183 -8264132 -3405393 -369450 -1039611 -6002940 -12141815 -14018793
3734a4018793L960006M914184M87628l301699k448838L77113Q82526j218681l407764
$$ -14018793 -10058787 -5144603 -4656975 -7958674 -10407512 -10030399 -9147873 -10366554 -13774318
3725a3774318l913496k254151J132516M289612N020126L745374K787981K386687
$$ -13774318 -17687814 -19941965 -18809449 -14519837 -9499711 -5754337 -2966356 -579669
3717e79669N06148k703987m004488k213224n72773j575381k743140p27526K964491
$$ -579669 -73521 -2777508 -6781996 -8995220 -9567993 -11143374 -13886514 -14614040 -11649549
3708a1649549L993860J431962j506063k212102j015115R22844L031504M329582
$$ -11649549 -7655689 -6223727 -7729790 -9941892 -10957007 -10034163 -7002659 -2673077
3700b673077L547955J053072j153461j972684k133094k094922r82122J259290
$$ -2673077 874878 1927950 774489 -1198195 -3331289 -5426211 -6408333 -5149043
3692e149043K448722Q65410j745510k244675q00613p03511k849338l559075j47620
$$ -5149043 -2700321 -1834911 -3580421 -5825096 -6625709 -7329220 -10178558 -13737633 -13885253
3683a3885253L921880L169732j774614m494431j552964L319605N267866M475681
$$ -13885253 -9963373 -6793641 -8568255 -13062686 -14615650 -11296045 -6028179 -1552498
3675a552498L674219L007367J116208r42300r20791N42330P02336r03533j997423
$$ -1552498 2121721 5129088 6245296 5302996 4382205 4924535 5626871 4723338 2725915
3666B725915j237914M32037J850982K435013J269794j873838m809833m868116
$$ 2725915 1488001 1920038 3771020 6206033 7475827 5601989 792156 -4075960
3658d075960k496827n32592j21302J82807J569494L709108N897105O973215M946913
$$ -4075960 -6572787 -7105379 -7226681 -7043874 -5474380 -1765272 4131833 11105048 16051961
3649A6051961k75830m671276m205982o01685Q70339j125694l093317l039638k558015
$$ 16051961 15776131 11104855 6898873 6297188 7167527 6041833 2948516 -91122 -2649137
3640b649137k052680M49737M051512M222820P1238k895584q95538K091930R46718
$$ -2649137 -4701817 -4252080 -200568 4022252 4093490 1197906 302368 2394298 3341016
3631C341016k149849j500465K692696M740604K178422j491995k846710k534955
$$ 3341016 1191167 -309298 2383398 7124002 9302424 7810429 4963719 2428764
3623B428764k322272k046949j072769p3295K30159M83720J628433L283439L951222
$$ 2428764 106492 -1940457 -3013226 -3086521 -2856362 -2372642 -744209 2539230 6490452
3614F490452K618401J51244j000441O49772L332578L716941J098341k102926m388788
$$ 6490452 9108853 9260097 8259656 8909428 12242006 15958947 17057288 14954362 10565574
3605A0565574o796082r171524q303777k698751L419993M640310J479631o80413
$$ 10565574 3769492 -5402032 -13705809 -16404560 -12984567 -8344257 -6864626 -7545039
3597g545039Q73863L201678K449745j167836l794316j867858M226980R353855
$$ -7545039 -6671176 -3469498 -1019753 -2187589 -5981905 -7849763 -3622783 5731072
3589E731072P653370q12293q682260q825192k254342L749041M247964O28386l042528
$$ 5731072 13384442 12572149 3889889 -4935303 -7189645 -3440604 807360 1435746 -1606782
3580a606782m221659k437012J176828L972481L592985N98725j989120k031321
$$ -1606782 -5828441 -8265453 -7088625 -3116144 476841 1075566 -913554 -2944875
3572b944875j00155J711421J599830p51320l459937l641065o03862L067496M743400
$$ -2944875 -3045030 -1333609 266221 -485099 -3945036 -7586101 -8189963 -5122467 -379067
3563c79067M482865L187585M50480l261959m666347j487925L276187M635281K110397
$$ -379067 4103798 7291383 7741863 4479904 -186443 -1674368 1601819 6237100 8347497
3554H347497p29515k245603l976226o098822n998558k393313K224260M254358
$$ 8347497 7617982 5372379 1396153 -4702669 -10701227 -13094540 -10870280 -6615922
3546f615922K207355k471293n861847m174814J520629N076223L013684j68535
$$ -6615922 -4408567 -6879860 -12741707 -16916521 -15395892 -10319669 -7305985 -7474520
3538g474520J024325L948027K386581k085807k072803K599883L556886k245862
$$ -7474520 -6450195 -2502168 -115587 -2201394 -4274197 -1674314 1882572 -363290
3530c63290o934013m327402O84882J374823m6249J568653L915162J756163k435124
$$ -363290 -7297303 -11624705 -10939823 -9565000 -9611249 -8042596 -4127434 -2371271 -4806395
3521d806395j741917L271841M885065M40734l675926j699682M252000Q614510
$$ -4806395 -6548312 -3276471 1608594 2049328 -1626598 -3326280 925720 9540230
3513I540230R083261O622298K517466k111393n750203o960087n029573q95955
$$ 9540230 18623491 25245789 27763255 25651862 19901659 12941572 7911999 7016044
3505G016044J914576k34539n638304p386417k283236L569064K704092l020529
$$ 7016044 8930620 8696081 3057777 -4328640 -6611876 -3042812 -338720 -3359249
3497c359249n447038j950223K216571K676487M18611k681885o197364p816716
$$ -3359249 -8806287 -10756510 -8539939 -5863452 -5444841 -8126726 -14324090 -22140806
3489b2140806m126352L054577O835804M423900R49726J232474K868976J447931
$$ -22140806 -26267158 -23212581 -16376777 -11952877 -11003151 -9770677 -6901701 -5453770
3481e453770j719577j978706J146214L492474K411537j34673o92134J365336K912821
$$ -5453770 -7173347 -9152053 -8005839 -4513365 -2101828 -2236501 -2928635 -1563299 1349522
3472A349522N07675m556903o165339j119449M731548L048895m862349q821800
$$ 1349522 1857197 -2699706 -8865045 -9984494 -5252946 -2204051 -7066400 -15888200
3464a5888200l821260L574412N704033L739213K532375K001352R1486p25629K515919
$$ -15888200 -19709460 -16135048 -10431015 -6691802 -4159427 -2158075 -2066589 -2792218 -276299
3455b76299O019014L764496k501773n346000k841418k43902m32931j80282K629770
$$ -276299 5742715 9507211 7005438 1659438 -1181980 -1425882 -1858813 -2039095 590675
3446E90675M995641M551905L415200L289935J964187j822251m544386k949352
$$ 590675 5586316 10138221 13553421 16843356 18807543 16985292 12440906 9491554
3438I491554N26963J425827l47635j717042j818193k112402k505467j377945R04435
$$ 9491554 10018517 11444344 11096709 9379667 7561474 5449072 2943605 1565660 2470095
3429B470095J911450P34974r44328j482464p44466R86163L249374M360862K453331
$$ 2470095 4381545 5116519 4172191 2689727 1945261 2931424 6180798 10541660 12994991
3420A2994991j687817m692350m433621k347771j076777j202147j477799j191787
$$ 12994991 11307174 6614824 2181203 -166568 -1243345 -2445492 -3923291 -5115078
3412e115078q41420r64407j515131k102004j904918K1871L066229M421241K198967
$$ -5115078 -5956498 -6920905 -8436036 -10538040 -12442958 -12421087 -9354858 -4933617 -2734650
3403b734650j143864j296096J495514J950852k405652o438189m003007L267644
$$ -2734650 -3878514 -5174610 -3679096 -1728244 -4133896 -10572085 -14575092 -11307448
3395a1307448Q376183Q453053O458995M213531J73205m859901o385900l224294
$$ -11307448 -2931265 5521788 11980783 16194314 16367519 11507618 5121718 1897424
3387A897424q5935M3521K33150K412690K325438k509511n971360k406006K470237
$$ 1897424 1811489 1855010 2088160 4500850 6826288 4316777 -1654583 -4060589 -1590352
3378a590352m54352p852547p385052L133956J1354676Q019189j038510n236047
$$ -1590352 -2044704 -9897251 -17282303 -14148347 -2793671 5225518 4187008 -1049039
3370a049039l237833o93439l96938j045934j555454j239946J062508M083617M004507
$$ -1049039 -4286872 -4980311 -5377249 -6423183 -7978637 -9218583 -8156075 -4072458 -67951
3361f7951O43757p49388K350307M949455K659523n84110J024532N314397N520487
$$ -67951 575806 -173582 2176725 7126180 9785703 9201593 10226125 15540522 21061009
3352B1061009N08179m853370p192364o573904l349522J063431K755772N69805
$$ 21061009 21569188 16715818 9523454 2949550 -399972 663459 3419231 3989036
3344C989036j38119M663131R527083O928132l63092l430837j468763j525270m881664
$$ 3989036 3850917 8514048 18041131 24969263 24606171 21175334 19706571 18181301 13299637
3335A3299637n033055m47577K055593l20328j527209J432313K416730k090720
$$ 13299637 8266582 7819005 9874598 9554270 8027061 9459374 11876104 9785384
3327I785384n090353o01823N495281M967236M89402k08908K041843L53646n523953
$$ 9785384 4695031 4093208 9588489 14555725 15045127 14836219 16878062 17231708 11707755
3318A1707755q997442p526146m806028k788552L41091M216291N583122M012306
$$ 11707755 2710313 -4815833 -9621861 -12410413 -12069322 -7853031 -2269909 1742397
3310A742397K266098J008981j159979l008229k014074K30297J53800j040459M97817
$$ 1742397 4008495 5017476 3857497 849268 -1164806 -934509 -780709 -1821168 -1323351
3301a323351L116319J404783l709999m978770m76329L081201J385978j090496
$$ -1323351 1792968 3197751 -512248 -5491018 -5967347 -2886146 -1500168 -2590664
3293b590664L87858L314409L724789K982566L385241K600156j645688n839071
$$ -2590664 -2202806 1111603 4836392 7818958 11204199 13804355 12158667 6319596
3285F319596n467691j890349Q78413K595001M571562M739593J141240k560075
$$ 6319596 851905 -1038444 -160031 2434970 7006532 11746125 12887365 10327290
3277A0327290j551077K260628L255639J229239P37557K359865J776235k158294
$$ 10327290 8776213 11036841 14292480 15521719 16259276 18619141 20395376 18237082
3269A8237082n183266m752555l467804l759486m408327m086179l476871k240210
$$ 18237082 13053816 8301261 4833457 1073971 -3334356 -7420535 -10897406 -13137616
3261a3137616J179877M894011L906292k348255p664815p173861l193271M0035
$$ -13137616 -11957739 -7063728 -3157436 -5505691 -13170506 -20344367 -23537638 -23497603
3253b3497603K539123N525665P002199N371017L517835L931263L482076p78406
$$ -23497603 -20958480 -15432815 -8430616 -3059599 458236 4389499 7871575 7093169
3245G093169m152282m66160O317749N675706l931396j1998341j0794046m817133
$$ 7093169 2940887 2474727 8792476 14468182 10536786 -1461555 -12255601 -17072734
3237a7072734j357606N00921N004919R811860Q948288K732519k656948m199559
$$ -17072734 -18430340 -17929419 -12924500 -3112640 5835648 8568167 5911219 1711660
3229A711660m064715l407162p45217L089131M554394L194111K308807K409882
$$ 1711660 -2353055 -5760217 -6505434 -3416303 1138091 4332202 6641009 9050891
3221I050891k26872o031333q910678m655010J859709K807998k029382n655221
$$ 9050891 8824019 2792686 -6117992 -10773002 -8913293 -6105295 -8134677 -13789898
3213a3789898l250515L064353Q031042Q229583L776656j926770m522644l036769
$$ -13789898 -17040413 -13976060 -5945018 2284565 6061221 4134451 -388193 -3424962
3205c424962r62140j057299j160183J774447N739979O183816L131962Q74744Q71871
$$ -3424962 -4387102 -5444401 -6604584 -4830137 909842 7093658 10225620 11100364 11972235
3196A1972235J52055k420795l349855q5908M576521O227245M031416n7393m558798
$$ 11972235 12124290 9703495 6353640 6267732 10844253 17071498 21102914 21045521 16486723
3187A6486723q375694r521280o763392j793681K070122K974876J554789l19105
$$ 16486723 8111029 -1410251 -8173643 -9967324 -7897202 -4922326 -3367537 -3686642
3179c686642j231785j315156j611520j836088j59247L232800M527982J360029
$$ -3686642 -4918427 -6233583 -7845103 -9681191 -9840438 -6607638 -2079656 -719627
3171g19627k559194k309304M22679J73842k628163k130328K237188L832464K67355
$$ -719627 -3278821 -5588125 -5165446 -4991604 -7619767 -9750095 -7512907 -3680443 -3413088
3162c413088j710234K335278O193520L044179k924289l396093O92327K081675
$$ -3413088 -5123322 -2788044 3405476 6449655 3525366 129273 821600 2903275
3154B903275M4495J74472K791780J831516l945517p965203o230687k683047j507382
$$ 2903275 2947770 3122242 5914022 7745538 3800021 -4165182 -10395869 -13078916 -14586298
3145a4586298j240394M39546K482216M059193O296528P515012L315323m841559
$$ -14586298 -15826692 -15387146 -12904930 -8845737 -2549209 4965803 8281126 3439567
3137C439567p940850j640471N727387L960406m658857r040616m540549K776380
$$ 3439567 -4501283 -6141754 -414367 3546039 -1112818 -10153434 -14693983 -11917603
3129a1917603O001227M584477J187423k673994n822699o239731k949134K718918
$$ -11917603 -5916376 -1331899 -144476 -2818470 -8641169 -14880900 -17830034 -15111116
3121a5111116Q393310J1561624R703276K289274o934253j1992685r967222l243407
$$ -15111116 -6717806 4843818 14547094 16836368 9902115 -2090570 -12057792 -15301199
3113a5301199L311126O150798M698542J168733j151360p92010O99155J132583
$$ -15301199 -11990073 -5839275 -1140733 28000 -1123360 -1915370 -1216215 -83632
3105h3632L80007l19632m38195Q7358J867774M604616N514818J833139n099103
$$ -83632 296375 -23257 -461452 -374094 1493680 6098296 11613114 13446253 8347150
3096H347150j0347696j0290927n616433L24319M446616N344497L677253J623252
$$ 8347150 -2000546 -12291473 -17907906 -17583587 -13136971 -7792474 -4115221 -2491969
3088b491969P10119J6732k248166n364744n970885k161455L423108O037980M339585
$$ -2491969 -1781850 -1765118 -4013284 -9378028 -15348913 -17510368 -14087260 -8049280 -3709695
3079c709695K099170L256748O067240M746927k133743q008930o279861K51148
$$ -3709695 -1610525 1646223 7713463 12460390 10326647 2317717 -3962144 -3710996
3071c710996K770340j301660n246593l553802N61478J603536M31905J169372L218781
$$ -3710996 -940656 -2242316 -7488909 -11042711 -10481233 -8877697 -8445792 -7276420 -4057639
3062d057639K652783j94152p64891K179940M476069K869649r75931l839791m499601
$$ -4057639 -1404856 -1599008 -2363899 -183959 4292110 7161759 6185828 2346037 -2153564
3053b153564k821430J071745N104445N736032K103185k307243l640125j824233
$$ -2153564 -4974994 -3903249 1201196 6937228 9040413 6733170 3093045 1268812
3045A268812L25022Q33144M03877J091966L310123M119714L6460p474788j1810121
$$ 1268812 1593834 2426978 2830855 3922821 7232944 11352658 11389118 3914330 -7895791
3036g895791r005334l148394l04792M40907M325233J0603395J1970859N598091
$$ -7895791 -16901125 -20049519 -20354311 -19913404 -15588171 -4984776 6986083 12584174
3028A2584174j824341l232941j06341J694168O54189n48679r15095j798357l149089
$$ 12584174 10759833 7526892 7420551 9114719 9768908 9220229 8305134 6506777 3357688
3019C357688l474581k898183k582022j663099J509040N148482M963090M16197
$$ 3357688 -116893 -3015076 -5597098 -7260197 -5751157 -602675 4360415 4776612
3011D776612l298226j688919K947918M693969K077827m73340K96543J717908L09996
$$ 4776612 1478386 -210533 2737385 7431354 9509181 9035841 9332384 11050292 11360288
3002A1360288j347499J802667P449310O493938l660208j2755686j0419248o17085
$$ 11360288 10012789 11815456 19264766 25758704 22098496 9342810 -1076438 -1693523
2994a693523M303542J325852p37639L401196P353351L833498m295798r129300
$$ -1693523 2610019 3935871 3198232 6599428 13952779 17786277 13490479 4361179
2986D361179q293558m935439j354047J891145L461950K718645J570242J188503
$$ 4361179 -3932379 -8867818 -10221865 -8330720 -4868770 -2150125 -579883 608620
2978F08620k82940l235367l693660M09604L939150J506181l390983l096241K233092
$$ 608620 325680 -2909687 -6603347 -6193743 -2254593 -748412 -4139395 -7235636 -5002544
2969e002544M868557J414075k869360k881704l36384P65360J26981k27773L32388
$$ -5002544 -133987 1280088 -1589272 -4470976 -4807360 -4042000 -3915019 -4142792 -3810404
2960c810404J180221J773002J480153L07913J34399K510894N390300N345686K697966
$$ -3810404 -2630183 -857181 622972 930885 1065284 3576178 8966478 14312164 17010130
2951A7010130N71806o09251k874613n252178m440882j567575j750875n175594
$$ 17010130 17581936 16972685 14098072 8845894 4405012 2837437 1086562 -4089032
2943d089032n533842m31893L749517K057352p69895J332975N005357L271001j979540
$$ -4089032 -9622874 -10054767 -6305250 -4247898 -5017793 -3684818 1320539 4591540 2612000
2934B612000k709081J736189L450101q50171m385230j119784N204299P136264
$$ 2612000 -97081 1639108 5089209 4239038 -146192 -1265976 3938323 11074587
2926A1074587L428977j433855l777647k838065N43427L630083K947247p89184
$$ 11074587 14503564 13069709 9292062 6453997 6997424 10627507 13574754 12785570
2918A2785570j771116K968874P630329M708885l984606r232621o753908j482065
$$ 12785570 11014454 13983328 21613657 26322542 22337936 13105315 6351407 4869342
2910D869342J289462K581208M627113M847488R6676o457577q431442m964756j214344
$$ 4869342 6158804 8740012 13367125 18214613 18311289 11853712 3422270 -1542486 -2756830
2901b756830l07086J24303K163056L052340m86469o078953p419540j747124O678040
$$ -2756830 -3063916 -2939613 -776557 2275783 1789314 -4289639 -11709179 -13456303 -6778263
2892f778263J0958037Q479126L134190O62495J947949K211524k127709p769068
$$ -6778263 4179774 12658900 15793090 16455585 18403534 20615058 18487349 10718281
2884A0718281q705005m854429k023228k913321l421483j73248L387389K641408
$$ 10718281 2013276 -2841153 -4864381 -7777702 -11199185 -11372433 -7985044 -5343636
2876e343636n33035j179629M04136L2232k027433j035963L302515M800178L53819
$$ -5343636 -5876671 -7056300 -6652164 -6619932 -8647365 -9683328 -6380813 -1580635 -1226816
2867a226816m226756k189481M400501P758279M985412O87635m78083M58507l18167
$$ -1226816 -5453572 -7643053 -3242552 4515727 9501139 10188774 9710691 10169198 9851031
2858I851031l463473n437363l058018J971145M186741Q41880l826131l298026
$$ 9851031 6387558 950195 -2107823 -136678 4050063 4891943 1065812 -2232214
2850b232214K268109N226525K99443q007418j1045074o767853o49607L044444
$$ -2232214 35895 5262420 5561863 -2445555 -13490629 -20258482 -20908089 -17863645
2842a7863645N772339R346302J0876177O859556m8944k838727J066908O300709
$$ -17863645 -12091306 -2745004 8131173 14990729 14941785 12103058 13169966 19470675
2834A9470675O360005J473320k715713k896611j346936j233891j843590o01625
$$ 19470675 25830680 27304000 24588287 21691676 20344740 19110849 17267259 16665634
2826A6665634J939271K101147j698569n895057n385407L19326N808494N406513
$$ 16665634 18604905 20706052 19007483 13112426 7727019 8046345 13854839 19261352
2818A9261352l01772n098554m930902k852152l679949n915041m067638J268586
$$ 19261352 18959580 13861026 8930124 6077972 2398023 -3517018 -7584656 -6316070
2810f316070K495799k991755o645471n33839R804661J2196493M700613l088927
$$ -6316070 -3820271 -6812026 -13457497 -13991336 -4186675 8009818 12710431 9621504
2802I621504m753592l810328m426368m561636k143730k34377r24211n15866L536972
$$ 9621504 4867912 1057584 -3368784 -7930420 -10074150 -10308527 -11232738 -11748604 -8211632
2793h211632O508704L649955j135898j134852K061231J234346m306967p366703
$$ -8211632 -1702928 1947027 811129 -323723 1737508 2971854 -1335113 -8701816
2785h701816m143905L39121L39892k525626k416480K796657R430452J2233991
$$ -8701816 -12845721 -12506600 -12166708 -14692334 -17108814 -14312157 -4881705 7352286
2777G352286R235176L167881j574910l648934n094486o456874m885279L66783
$$ 7352286 16587462 19755343 18180433 14531499 9437013 2980139 -1905140 -1538357
2769a538357M225191K154053k502517l123337J30067J348423q16762j236786K207112
$$ -1538357 2686834 4840887 2338370 -784967 -654900 693523 -123239 -1360025 847087
2760H47087M458675J565757l009243m340924l303112l219200l126455K24875N653375
$$ 847087 5305762 6871519 3862276 -478648 -3781760 -7000960 -10127415 -9902540 -4249165
2751d249165P968272M949787J94814j563056L51683K611125J819738k055291n871553
$$ -4249165 3719107 8668894 8863708 7300652 7652335 10263460 12083198 10027907 4156354
2742D156354o886524n503580l613437j475643J599170M571204N773041N927447
$$ 4156354 -2730170 -8233750 -11847187 -13322830 -11723660 -7152456 -1379415 4548032
2734D548032O281965M454515k516704j0457265j0001312N76534J0299465Q302882
$$ 4548032 10829997 15284512 12767808 2310543 -7690769 -7114235 3185230 11488112
2726A1488112k353102r258924o376854N98618L433577M96120l638634l845093
$$ 11488112 9135010 -123914 -6500768 -5902150 -2468573 -1972453 -5611087 -9456180
2718i456180Q36254N758885M567854l160582r766229q123307o91042M038771K763273
$$ -9456180 -8619926 -2861041 1706813 -1453769 -11219998 -19343305 -20034347 -15995576 -13232303
2709a3232303J89077R98524M183944O434834O621860N064632K047374p77041n52907
$$ -13232303 -13043226 -12044702 -7860758 -1425924 5195936 10260568 12307942 11530901 10977994
2700A0977994K768398M802738J606246n042375r239835p376589j781245J908691
$$ 10977994 13746392 18549130 20155376 15113001 5873166 -1503423 -3284668 -1375977
2692a375977O88242k502500k186050K563615O412822M725354k83186l389880l902807
$$ -1375977 -687735 -3190235 -5376285 -2812670 3600152 8325506 8042320 4652440 749633
2683G49633m741623n703930l671569O44378K671132J772149K288101M617499K815373
$$ 749633 -3991990 -9695920 -13367489 -12723111 -10051979 -8279830 -5991729 -1374230 1441143
2674A441143m592067q906354l337200N204410N266410k083448n508157j307521
$$ 1441143 -3150924 -12057278 -15394478 -10190068 -4923658 -7007106 -12515263 -13822784
2666a3822784J851426k028536o732009m297641K849653O744106N483306L159231
$$ -13822784 -11971358 -13999894 -20731903 -25029544 -22179891 -15435785 -9952479 -6793248
2658f793248J709652j20250j182672K012071Q966469J3847450J1868875L917522
$$ -6793248 -5083596 -5203846 -6386518 -4374447 4592022 18439472 30308347 34225869
2650C4225869n732679j3100958j5081989r832870P73294J0284811J1710328L618616
$$ 34225869 28493190 15392232 310243 -9522627 -8749333 1535478 13245806 16864422
2642A6864422p708832j3147866r246972j706644J531191J65288P89603N762976
$$ 16864422 9155590 -3992276 -13239248 -14945892 -13414701 -13249413 -12459810 -6696834
2634f696834Q560251L886354l052946l874761J47646P95239l218731m433565L17760
$$ -6696834 1863417 5749771 2696825 -1177936 -1030290 -235051 -3453782 -7887347 -7569587
2625g569587M453261K811773r1405J532660M964874M322556N04729j437577j181196
$$ -7569587 -3116326 -304553 -395958 1136702 6101576 10424132 10928861 9491284 8310088
2616H310088k097500l911227l589754j885170k004255k942157j155617K008190
$$ 8310088 6212588 2301361 -1288393 -3173563 -5177818 -8119975 -9275592 -7267402
2608g267402K081400L68816K725759Q428644R147221J984465n002647m967676
$$ -7267402 -5186002 -4817186 -2091427 6337217 15484438 17468903 12466256 7498580
2600G498580k074860k854649m796307j965211K936030K010523m149327n962139
$$ 7498580 5423720 2569071 -2227236 -4192447 -1256417 754106 -3395221 -9357360
2592i357360R41170R367974J1116269O961732K386846p38477l095801k869160
$$ -9357360 -8416190 951784 12068053 19029785 21416631 20678154 17582353 14713193
2584A4713193J947603P981720R144161M762186j41210l203624p572687j4010490
$$ 14713193 16660796 24642516 33786677 38548863 38407653 35204029 27631342 13620852
2576A3620852j6111441q987655J079714L187797k785056n259259K538372J2605042
$$ 13620852 -2490589 -11478244 -10398530 -7210733 -9995789 -15255048 -12716676 -111634
2568a11634J3382618N135442k200565k752411N65213K974574K659109o31787n571822
$$ -111634 13270984 18406426 16205861 13453450 14018663 16993237 19652346 19020559 13448737
2559A3448737p919223m739242L86518J982786J479170M347656R093348P974627
$$ 13448737 5529514 790272 1176790 3159576 4638746 8986402 18079750 26054377
2551B6054377M4359n955306n040986l063896n320331p029238k323751M624535
$$ 26054377 26098736 20143430 15102444 12038548 6718217 -311021 -2634772 1989763
2543A989763N743733R38118l991757o505368o762925k871451M870729R488072
$$ 1989763 7733496 8671614 4679857 -1825511 -8588436 -11459887 -6589158 2898914
2535B898914O119750J091909K469394N924373J858693o578689o708693K607789
$$ 2898914 9018664 10110573 12579967 18504340 20363033 13784344 7075651 9683440
2527I683440P770604J324714p663688r267006o083863m055138j480651L936229
$$ 9683440 17454044 18778758 11115070 1848064 -4235799 -8290937 -9771588 -5835359
2519e835359O789724K790110j706759O87878N415471L338596l676570n845822
$$ -5835359 954365 3744475 2037716 2725594 8141065 11479661 7803091 1957269
2511A957269j268203K614322K266591J878050L355096K744735j118215l399105
$$ 1957269 689066 3303388 5569979 7448029 10803125 13547860 12429645 9030540
2503I030540j888067r77366l227553m044979M66781O181633O880406L169351J6887
$$ 9030540 7142473 6165107 2937554 -1107425 -640644 5540989 12421395 15590746 15607633
2494A5607633j380617l561690o471674o896706m225795k067324k888916m355106
$$ 15607633 14227016 10665326 4193652 -2703054 -6928849 -8996173 -11885089 -16240195
2486a6240195k713928K182967O933057Q667195P654325N961713M487115K037784
$$ -16240195 -18954123 -16771156 -9838099 -1170904 6483421 12445134 16932249 18970033
2478A8970033k388857o940563p878772m057133N61141O96092l737058o795536
$$ 18970033 16581176 9640613 1761841 -2295292 -1734151 -1038059 -4775117 -11570653
2470a1570653l556023L343540O509547K829410l018298m871126k090690J635433
$$ -11570653 -15126676 -11783136 -5273589 -2444179 -5462477 -10333603 -12424293 -10788860
2462a0788860L880104M698695L972536J403464j333236k025250j323098j205108
$$ -10788860 -6908756 -2210061 1762475 3165939 1832703 -192547 -1515645 -2720753
2454b720753o23113K691215O151191M085145k723933n727632n97382N393474L503246
$$ -2720753 -3343866 -652651 5498540 9583685 6859752 1132120 534738 5928212 9431458
2445I431458l717619o716998k918327J281625J392298L5077M68373J735160K340370
$$ 9431458 5713839 -1003159 -3921486 -2639861 -1247563 -1212486 -744113 991047 3331417
2436C331417L068654L506264O69863n688860j0378296q908005l516533J58122
$$ 3331417 6400071 9906335 10576198 4887338 -5490958 -14398963 -17915496 -17757374
2428a7757374J83546r18006p17858P83684K270278K246984Q6742k309958j498959
$$ -17757374 -17573828 -18491834 -19209692 -18426008 -16155730 -13908746 -13822004 -16131962 -17630921
2419a7630921K785183N717431L068476k503553m263884j15119M990365N853257
$$ -17630921 -14845738 -9128307 -6059831 -8563384 -12827268 -12942387 -7952022 -2098765
2411b098765K847800n77923l152913n602041o894441m408032J615173O573495
$$ -2098765 749035 171112 -2981801 -8583842 -15478283 -19886315 -18271142 -11697647
2403a1697647O174551J275924l361520m160480j202193L202407O242934N473855
$$ -11697647 -5523096 -4247172 -7608692 -11769172 -12971365 -9768958 -3526024 1947831
2395A947831O76572m551008n433459j451045K719160L005395Q95876Q22584M013993
$$ 1947831 2624403 -1926605 -7360064 -8811109 -6091949 -3086554 -2190678 -1368094 2645899
2386B645899P207467P024363L683917J16184j454919j539125k135763l640123
$$ 2645899 9853366 16877729 20561646 20677830 19222911 17683786 15548023 11907900
2378A1907900l924086j504284J640337K691608K321399K925084L302132J61721
$$ 11907900 7983814 6479530 8119867 10811475 13132874 16057958 19360090 19521811
2370A9521811m617271m639579N63440K610425l315758r582838o879765J236814
$$ 19521811 14904540 10264961 10828401 13438826 10123068 540230 -6339535 -5102721
2362e102721L713012j095862m125425o47825L753125M006057K660809K654183
$$ -5102721 -1389709 -2485571 -6610996 -7258821 -3505696 500361 3161170 5815353
2354E815353J640729j622954k708113R95213M466531K757726r02007j098159M57133
$$ 5815353 7456082 5833128 3125015 4120228 8586759 11344485 10442478 9344319 9801452
2345I801452j206347m715429m341973K38786L442078K486026K82740m00700p8653
$$ 9801452 8595105 3879676 -462297 -223511 3218567 5704593 5987333 5586633 5507980
2336E507980M91304J552974K117239P38856j415256k297866l158326o266983r155364
$$ 5507980 5999284 7552258 9669497 10408353 8993097 6695231 3536905 -2730078 -11885442
2327a1885442o998881j104808J380063j971144m853765j992130K713633K501420
$$ -11885442 -18884323 -19989131 -18609068 -20580212 -25433977 -27426107 -24712474 -22211054
2319b2211054j901485l717155K85860O796739J1610273J3435604J1913875O464588
$$ -22211054 -24112539 -27829694 -27543834 -20747095 -9136822 4298782 16212657 22677245
2311B2677245r96638n461576l920360L10869J287619j638562k763870J416859
$$ 22677245 21680607 16219031 12298671 12609540 13897159 12258597 9494727 10911586
2303A0911586N643564K274295o715817j0304304l422925M674146K729532o280423
$$ 10911586 16555150 18829445 12113628 1809324 -1613601 3060545 5790077 -490346
2295d90346r432237k596201M744075M869604K165178L159164M875498J165872
$$ -490346 -9922583 -12518784 -7774709 -2905105 -739927 2419237 7294735 8460607
2287H460607n199632o281024j884576Q23571k57625K40161L949096M739106l10163
$$ 8460607 3260975 -3020049 -4904625 -4081054 -4338679 -4098518 -149422 4589684 4279521
2278D279521m269769n74318O447201Q071667L650740p28496k896128n865070r534791
$$ 4279521 9752 -564566 5882635 13954302 17605042 16876546 13980418 8115348 -1419443
2269a419443r178170l449656K671407M950261M442891L076590L56843k745151
$$ -1419443 -10597613 -14047269 -11375862 -6425601 -1982710 1093880 1450723 -1294428
2261a294428k229489K525738N587232K584788k065131j775805J659671R82976
$$ -1294428 -3523917 -998179 4589053 7173841 5108710 3332905 4992576 5975552
2253E975552m801302r008927p649754l965481j078885K732103Q008094R742566
$$ 5975552 1174250 -7834677 -15484431 -19449912 -20528797 -17796694 -9788600 -46034
2245d6034M452995k696448l934568L55335K938635O80802k075007j744042j037031
$$ -46034 4406961 1710513 -2224055 -1868720 1069915 1750717 -324290 -2068332 -3105363
2236c105363l338497o135959m611114M11256K928889J65376l646185l394380K36413
$$ -3105363 -6443860 -12579819 -17190933 -16779677 -13850788 -13685412 -17331597 -20725977 -20489564
2227b0489564K850525K868152K387637K433983J532469k51099M1764L370510N914657
$$ -20489564 -17639039 -14770887 -12383250 -9949267 -8416798 -8667897 -8626133 -5255623 659034
2218F59034M307498P97248n87585m50973j757060l099008n04927M313176M463753
$$ 659034 4966532 5763780 5176195 4725222 2968162 -130846 -635773 3677403 8141156
2209H141156j566554o469811m728399p30377j191742m342176l442721J628814
$$ 8141156 6574602 104791 -4623608 -5353985 -6545727 -10887903 -14330624 -12701810
2201a2701810L861683K20793l544568j554498L736499N427580J842272j705738
$$ -12701810 -8840127 -8619334 -12163902 -13718400 -9981901 -4554321 -2712049 -4417787
2193d417787n97367K863979K918471j135862l132604J534611Q334546Q587850
$$ -4417787 -5015154 -2151175 767296 -368566 -3501170 -1966559 6367987 14955837
2185A4955837J287858n225858m607590j24205K049340J910536K928932M181062
$$ 14955837 16243695 11017837 6410247 6286042 8335382 10245918 13174850 17355912
2177A7355912J722989l794573p147537o015425l035995k13172L369852P276609
$$ 17355912 19078901 15284328 8136791 2121366 -914629 -1127801 2242051 9518660
2169I518660Q204969M715873l50567l941513n942865o832015n698593k554318
$$ 9518660 17723629 22439502 22088935 18147422 12204557 5372542 -326051 -2880369
2161b880369L63961J604189K320979L388179L297175J010883j294335p51752K143380
$$ -2880369 -2516408 -912219 1408760 4796939 8094114 9104997 7810662 7058910 9202290
2152I202290L938500K187683j977638m922838m179761j599440j726691n597880
$$ 9202290 13140790 15328473 13350835 8427997 4248236 2648796 922105 -4675775
2144d675775q095447m480704K310456N477989M383105M751468Q263476Q785022
$$ -4675775 -12771222 -17251926 -14941470 -9463481 -5080376 -328908 7934568 16719590
2136A6719590K188682n953288p550474k911833J071922J243076Q13216K280687
$$ 16719590 18908272 12954984 5404510 2492677 3564599 4807675 5620891 7901578
2128G901578L316033J348654j622939j686825J030878J946185j740030o347750
$$ 7901578 11217611 12566265 10943326 9256501 10287379 12233564 10493534 4145784
2120D145784n840823l72073L047536K81108l771971l002679j3405j102658l936488
$$ 4145784 -1695039 -2067112 980424 1261532 -2510439 -5513118 -5526523 -6629181 -10565669
2111a0565669j11784R303461J1886857K219798q046551o470561J970075L393248
$$ -10565669 -10677453 -1373992 10512865 12732663 4686112 -1784449 185626 3578874
2103C578874l564449o924709n83607P330682P460934J097507m880000p675459
$$ 3578874 14425 -6910284 -7493891 -163209 7297725 8395232 3515232 -4160227
2095d160227q277732o411670j025260O162165J1111329J0964669O153168K91959
$$ -4160227 -12437959 -18849629 -19874889 -13712724 -2601395 8363274 14516442 14808401
2087A4808401k111811o615K466947J093637k492407l465198j325289n4399j144060
$$ 14808401 12696590 12689975 15156922 16250559 13758152 10292954 8967665 8913266 7769206
2078G769206k022417k043634l941819p381086p197910j430633M407878N314920
$$ 7769206 5746789 3703155 -238664 -7619750 -14817660 -16248293 -11840415 -6525495
2070f525495M025198N032425N929982J669720n173591o248378L59599O725554
$$ -6525495 -2500297 2532128 8462110 10131830 4958239 -1290139 -930540 5795014
2062E795014N820344J18233l326358k098235O88750J712186J18330l208545n783465
$$ 5795014 11615358 11733591 8407233 6308998 6997748 8709934 8828264 5619719 -163746
2053a63746m340896J166603N438129L478397j964233l039848K179365O178884
$$ -163746 -4504642 -3338039 2100090 5578487 3614254 574406 2753771 8932655
2045H932655K478113m677046o130867p15891L908945K812425l89230q57652M54848
$$ 8932655 11410768 6733722 602855 -113036 3795909 6608334 6219104 5361452 5816300
2036E816300N63159L06494J888860L899135L423022R27752j047230k071504k859857
$$ 5816300 6379459 6685953 8574813 12473948 15896970 16824722 15777492 13705988 10846131
2027A0846131k394176k10572O98899k079348n568167n570096l301613k155282
$$ 10846131 8451955 8241383 8940282 6860934 1292767 -4277329 -7578942 -9734224
2019i734224n04671M794810R606569O455436k609917o985375l418158q48279n265293
$$ -9734224 -10238895 -5444085 4162484 10617920 8008003 1022628 -2395530 -3243809 -8509102
2010h509102r756567o286471J326789M651671L886902M362593N169717J801232
$$ -8509102 -18265669 -24552140 -23225351 -18573680 -14686778 -10324185 -5154468 -3353236
2002c353236l151580k780789J992527L597628J095528J521425O288726P282063
$$ -3353236 -6504816 -9285605 -7293078 -3695450 -2599922 -1078497 5210229 12492292
1994A2492292Q58116m406217r72635M744943J814981p941895j2173176n878122
$$ 12492292 13350408 8944191 7971556 12716499 14531480 6589585 -5583591 -11461713
1986a1461713K498350M262018J502843Q97317K599180J565394k630211l934348
$$ -11461713 -8963363 -4701345 -3198502 -2301185 297995 1863389 -766822 -4701170
1978d701170J194381P761662Q183040J678135n496952p838785n251902n92878
$$ -4701170 -3506789 4254873 12437913 14116048 8619096 780311 -4471591 -5064469
1970e064469L414610M162454K24112n421414o692960j811466L444893L108044
$$ -5064469 -1649859 2512595 2736707 -2684707 -9377667 -11189133 -7744240 -4636196
1962d636196j035119k763819l24961K787884M365022N210539M672924L08224o712427
$$ -4636196 -5671315 -8435134 -8760095 -5972211 -1607189 3603350 8276274 8584498 1872071
1953A872071j0864966q893689l188120K841819Q212129J1323869Q780852J069276
$$ 1872071 -8992895 -17886584 -21074704 -18232885 -10020756 1303113 10083965 11153241
1945A1153241m725782k658872M109749P523674N009019J236400N29183J845921
$$ 11153241 6427459 3768587 7878336 15402010 20411029 21647429 22176612 24022533
1937B4022533J488071k440272q577080j2966499j1519777m253076L352440N684959
$$ 24022533 25510604 23070332 14493252 1526753 -9993024 -14246100 -10893660 -5208701
1929e208701L206287Q14447Q30212J029010l93715j742048j067029M84959O04617
$$ -5208701 -2002414 -1187967 -357755 671255 277540 -1464508 -2531537 -2046578 -1441961
1920a441961o39223j021539Q84703M116625O296241N874707L816984K590832K661703
$$ -1441961 -2081184 -3102723 -2218020 1898605 8194846 14069553 17886537 20477369 23139072
1911B3139072J199806l810798r366364j0364646o280162j441699J361171L232573
$$ 23139072 24338878 20528080 11161716 797070 -5483092 -6924791 -5563620 -2331047
1903b331047M152873R52520o240791j0165901m785142M863271P621536R05084
$$ -2331047 1821826 2774346 -3466445 -13632346 -18417488 -13554217 -5932681 -5027597
1895e027597n858537m280422K316416N167585K560096K86758J479462K335987
$$ -5027597 -10886134 -15166556 -12850140 -7682555 -5122459 -4835701 -3356239 -1020252
1887a020252q47213n442429o257664k400379K875373P025471R255369Q082295
$$ -1020252 -1867465 -7309894 -13567558 -15967937 -13092564 -6067093 3188276 11270571
1879A1270571K421302m504231o795138l389350k54419k217018n863933m724740
$$ 11270571 13691873 9187642 2392504 -996846 -1251265 -3468283 -9332216 -14056956
1871a4056956P48555L758497J315860j824319r71581J714265J402706k025606
$$ -14056956 -13308401 -9549904 -8234044 -10058363 -11029944 -9315679 -7912973 -9938579
1863i938579m628193m271616k066475Q38847M242399O986514P227001M945827
$$ -9938579 -14566772 -18838388 -20904863 -20066016 -15823617 -8837103 -1610102 3335725
1855C335725K029637j50442j353504j164217N59123K113335J293857j373583k753253
$$ 3335725 5365362 5214920 3861416 2697199 3256322 5369657 6663514 5289931 2536678
1846B536678p82242L483945P292750Q057685M503541j855243o853896p444035
$$ 2536678 1754436 5238381 12531131 20588816 25092357 23237114 16383218 8939183
1838H939183m701289j213107K573772O185970N876203q70613q793998r568251
$$ 8939183 4237894 3024787 5598559 11784529 17660732 16790119 7996121 -1572130
1830a572130l405293J135584J52402r30117J394154J940970k718348n460434R05932
$$ -1572130 -4977423 -3841839 -3689437 -4619554 -3225400 -1284430 -4002778 -9463212 -8557280
1821h557280J0494859J1813167M454320k050199l380972l336917k976078Q41879
$$ -8557280 1937579 13750746 18205066 16154867 12773895 9436978 6460900 7302779
1813G302779N094296J610253p815072r818867N18425R608690M710148o248641
$$ 7302779 12397075 14007328 6192256 -3626611 -3108186 6500504 11210652 4962011
1805D962011o404950M544029J0265567J753296j1275323j5171200q560627K77801
$$ 4962011 -1442939 3101090 13366657 15119953 3844630 -11326570 -19887197 -19609396
1797a9609396M888618M607096J710633p15089j69763K963301N489203M969743
$$ -19609396 -14720778 -10113682 -8403049 -9118138 -9287901 -6324600 -835397 4134346
1789D134346K080360p12915j229044J174772M301186L917027j455803p550916
$$ 4134346 6214706 5501791 4272747 5447519 9748705 13665732 12209929 4659013
1781D659013r335610p690202o904958o637895k224231O264611J1380158P610475
$$ 4659013 -4676597 -12366799 -19271757 -25909652 -28133883 -21869272 -10489114 -2878639
1773b878639j186122o972578o682916k894134J557489N591643Q073692P685573
$$ -2878639 -4064761 -11037339 -17720255 -20614389 -19056900 -13465257 -5391565 2294008
1765B294008M616983N51666k709003l840639k528284k72806Q51746Q63763J372702
$$ 2294008 6910991 7462657 4753654 913015 -1615269 -1888075 -1036329 -172566 1200136
1756A200136K115306R40411j897610l002399j109043N68622l75426j660418p83759
$$ 1200136 3315442 4255853 2358243 -644156 -1753199 -1184577 -1560003 -3220421 -4004180
1747d004180M82622N6445K59192L365082N622949K211740l789895m723050j85037
$$ -4004180 -3521558 -3465113 -3205921 159161 5782110 7993850 4203955 -519095 -704132
1738g04132K195141j085169m437224l295129j345077k478275k415546M077542
$$ -704132 1491009 405840 -4031384 -7326513 -8671590 -11149865 -13565411 -9487869
1730i487869J2119800J1649885J974036o759068o966885j224336M701891Q905680
$$ -9487869 2631931 14281816 16255852 9496784 2529899 1305563 6007454 14913134
1722A4913134J0431494O340504l007375j0581139j0482351o048964m565794o419361
$$ 14913134 25344628 31685132 28677757 18096618 7614267 1565303 -3000491 -9419852
1714i419852n801916q60200L675113M376621L291748K747885J822312K69151M90188
$$ -9419852 -15221768 -16081968 -12406855 -8030234 -4738486 -1990601 -168289 100862 591050
1705E91050K562015K479308q77687k138212K216025O630409M212614j824007k552188
$$ 591050 3153065 5632373 4754686 2616474 4832499 11462908 15675522 13851515 11299327
1696A1299327K281931L243467m012759j1424547j0105060k606795K192763K072033
$$ 11299327 13581258 16824725 12811966 1387419 -8717641 -11324436 -9131673 -7059640
1688g059640K549140O568234R695378P134189J165625j455500J935273O556929
$$ -7059640 -4510500 2057734 11753112 18887301 20052926 18597426 20532699 27089628
1680B7089628N933296m22447o715745q063811n609169l219571j836297k36569
$$ 27089628 33022924 32600477 25884732 17820921 12211752 8992181 7155884 6919315
1672F919315P03784p17194k150166Q00214O620832P698380R11203o787924p625201
$$ 6919315 7623099 6905905 4755739 5555953 12176785 19875165 20786368 13998444 6373243
1663F373243l515349j812571l632096l229087J572947N120499K255410l862845
$$ 6373243 2857894 1045323 -2586773 -5815860 -4242913 877586 3132996 -729849
1655g29849n621453l71872O842048R216355N027915j371861m398981k623458P85452
$$ -729849 -6351302 -6723174 118874 9335229 14363144 12991283 8592302 5968844 6754296
1646F754296K551644K898294M039450O448084Q062847O641154J962157l635247
$$ 6754296 9305940 12204234 16243684 22691768 30754615 37395769 39357926 35722679
1638C5722679o404190m335851p8589J037641k791617p561736r048656q267531
$$ 35722679 29318489 24982638 24904049 25941690 23150073 15588337 6539681 -1727850
1630a727850q581377r498315p356397j488226M321845P002548P401865P315569
$$ -1727850 -10309227 -19807542 -27163939 -28652165 -24330320 -17327772 -9925907 -2610338
1622b610338O328451L445062j30535k022662j824753j442227j954900j387682
$$ -2610338 3718113 7163175 7032640 5009978 3185225 1742998 -211902 -1599584
1614a599584K713408Q240598Q640401R74164p749515p302496K083047Q418355
$$ -1599584 1113824 9354422 17994823 18968987 11219472 3916976 6000023 14418378
$$ [...]
##END NTUPLES=NMR SPECTRUM
##END=
