##TITLE=31Pdec_E3e-H-1
 CD3CN, 64 sc
 28.11.2024
##JCAMPDX= 6.0         $$ Bruker NMR JCAMP-DX V2.0
##DATA TYPE= NMR SPECTRUM
##DATA CLASS= NTUPLES
##ORIGIN= UXNMR, Bruker Analytische Messtechnik GmbH
##OWNER= root
$$ XWIN-NMR		Version 3.5
$$ Thu Nov 28 14:21:53 2024 Russian Standard Time (UT+4h)  she@DPX200
##.OBSERVE FREQUENCY= 81.013821
##.OBSERVE NUCLEUS= ^31P
##.ACQUISITION MODE= SIMULTANEOUS
##.ACQUISITION SCHEME= undefined
##.AVERAGES= 64
##.DIGITISER RES= 17
##SPECTROMETER/DATA SYSTEM= spect
##.PULSE SEQUENCE= zgpg30
##.SOLVENT NAME= CDCl3
##.SHIFT REFERENCE= (INTERNAL, CDCl3, 0, 198.062)
##AUDIT TRAIL= $$ (NUMBER, WHEN, WHO, WHERE, WHAT)
$$ ##TITLE= Audit trail, XWIN-NMR		Version 3.5
$$ ##JCAMPDX= 5.01
$$ ##ORIGIN= Bruker BioSpin GmbH
$$ ##OWNER= she
$$ F:/spectra/data/she/nmr/P31/2/pdata/1/auditp.txt
$$ ##AUDIT TRAIL=  $$ (NUMBER, WHEN, WHO, WHERE, WHAT)
(   1,<2024-11-28 14:17:24.04 +0400>,<she>,<DPX200>,
      <created by zg, POWCHK disabled, PULCHK disabled
       configuration hash MD5:
       00 E9 B6 7A A2 85 ED C7 34 08 36 98 17 FE 4E 26
       data hash MD5: 32K
       DF D7 6F D3 BE 12 6A BF B2 8F D5 EA 64 80 48 8A>)
(   2,<2024-11-28 14:20:44.98 +0400>,<she>,<DPX200>,
      <Start of raw data processing
       efp BC_mod = 2 LB = 1.5 FT_mod = 6 PKNL = 1 PHC0 = 2140.885 PHC1 = 272.4883 SI = 64K 
       data hash MD5: 64K
       EC F4 65 8F 13 2B 94 CF 09 DE EF D2 F3 DD 8B 40>)
(   3,<2024-11-28 14:20:57.21 +0400>,<she>,<DPX200>,
      <pk PHC0 = -80.03913 PHC1 = 0 
       data hash MD5: 64K
       99 98 3C C2 74 F6 0A 1D 59 8B DE C4 F9 04 13 19>)
(   4,<2024-11-28 14:21:14.46 +0400>,<she>,<DPX200>,
      <pk PHC0 = 117.2911 PHC1 = 0 
       data hash MD5: 64K
       94 A6 4B D8 BC 80 33 6E 33 DA C5 6B 4B 68 36 E8>)
$$ ##END=
$$ 
$$ hash MD5
$$ 8C D9 EA E5 D7 86 FE 8D 0B EC E8 73 93 B9 C4 7D
##$RELAX= 
##$RELAX= 
##$RELAX= 
##$RELAX= 
##$RELAX= 
##$RELAX= 
##$RELAX= 
##$RELAX= 
$$ Bruker specific parameters
$$ --------------------------
##$DU= <F:/spectra>
##$EXPNO= 2
##$NAME= <P31>
##$PROCNO= 1
##$TYPE= <nmr>
##$USER= <she>
##$AMP= (0..31)
100 100 100 100 100 100 100 100 100 100 100 100 100 100 100 100 100 100 
100 100 100 100 100 100 100 100 100 100 100 100 100 100 
##$AQSEQ= 0
##$AQ_mod= 1
##$AUNM= <au_zg>
##$AUTOPOS= <>
##$BF1= 81.014009
##$BF2= 200.13
##$BF3= 200.13
##$BF4= 200.13
##$BF5= 200.13
##$BF6= 200.13
##$BF7= 200.13
##$BF8= 200.13
##$BYTORDA= 1
##$CFDGTYP= 0
##$CFRGTYP= 5
##$CHEMSTR= <none>
##$CNST= (0..31)
1 1 145 1 1 1 1 1 1 1 1 1 1 1 1 1 1 1 1 1 1 1 1 1 1 1 1 1 1 1 1 1 
##$CPDPRG= <waltz16>
##$CPDPRG1= <>
##$CPDPRG2= <waltz16>
##$CPDPRG3= <>
##$CPDPRG4= <mlev>
##$CPDPRG5= <mlev>
##$CPDPRG6= <mlev>
##$CPDPRG7= <mlev>
##$CPDPRG8= <mlev>
##$CPDPRGB= <>
##$CPDPRGT= <>
##$D= (0..31)
0 1 0 0 0 0 0 0 0 0.06 0 0.03 2e-05 3e-06 0 0 0.0002 0 0 0 0 0 0 0 0 0 
0 0 0 0 0 0 
##$DATE= 1732789043
##$DBL= (0..7)
120 120 120 11 120 120 24 19 
##$DBP= (0..7)
150 150 150 150 150 150 150 150 
##$DBP07= 0
##$DBPNAM0= <>
$$ [...]
##$SUBNAM3= <"">
##$SUBNAM4= <"">
##$SUBNAM5= <"">
##$SUBNAM6= <"">
##$SUBNAM7= <"">
##$SUBNAM8= <"">
##$SUBNAM9= <"">
##$SW= 400.765351723535
##$SWIBOX= (0..15)
0 1 3 0 0 0 0 0 0 0 0 0 0 0 0 0 
##$SW_h= 32467.5324675325
##$TD= 32768
##$TD0= 1
##$TE= 0
##$TE2= 300
##$TE3= 300
##$TEG= 300
##$TL= (0..7)
0 120 53 12 22 120 120 120 
##$TP= (0..7)
150 150 150 150 150 150 150 150 
##$TP07= 0
##$TPNAME0= <>
##$TPNAME1= <>
##$TPNAME2= <>
##$TPNAME3= <>
##$TPNAME4= <>
##$TPNAME5= <>
##$TPNAME6= <>
##$TPNAME7= <>
##$TPOAL= (0..7)
0.5 0.5 0.5 0.5 0.5 0.5 0.5 0.5 
##$TPOFFS= (0..7)
0 0 0 0 0 0 0 0 
##$TUNHIN= 0
##$TUNHOUT= 0
##$TUNXOUT= 0
##$USERA1= <user>
##$USERA2= <user>
##$USERA3= <user>
##$USERA4= <user>
##$USERA5= <user>
##$V9= 5
##$VALIST= <valist>
##$VCLIST= <CCCCCCCCCCCCCCC>
##$VD= 0
##$VDLIST= <DDDDDDDDDDDDDDD>
##$VPLIST= <PPPPPPPPPPPPPPP>
##$VTLIST= <TTTTTTTTTTTTTTT>
##$WBST= 1024
##$WBSW= 4
##$XGAIN= (0..3)
0 0 0 0 
##$XL= 0
##$YL= 0
##$YMAX_a= 15765
##$YMIN_a= -17816
##$ZGOPTNS= <>
##$ZL1= 120
##$ZL2= 120
##$ZL3= 120
##$ZL4= 120
##$ABSF1= 0
##$ABSF2= 0
##$ABSG= 0
##$ABSL= 0
##$ALPHA= 0
##$AQORDER= 0
##$ASSFAC= 0
##$ASSFACI= 0
##$ASSFACX= 0
##$ASSWID= 0
##$AUNMP= <proc_1d>
##$AZFE= 0.1
##$AZFW= 0.5
##$BCFW= 0
##$BC_mod= 2
##$BYTORDP= 0
##$COROFFS= 0
##$CY= -3
##$DATMOD= 1
##$DC= 0
##$DFILT= <>
##$DTYPP= 0
##$F1P= 0
##$F2P= 0
##$FCOR= 1
##$FTSIZE= 65536
##$FT_mod= 6
##$GAMMA= 0
##$GB= 0
##$INTBC= 1
##$INTSCL= 9.790993e-09
##$ISEN= 30
##$LB= 1.5
##$LEV0= 0
##$LPBIN= 0
##$MAXI= 10000
##$MC2= 0
##$MEAN= 0
##$ME_mod= 0
##$MI= 50
##$NCOEF= 0
##$NC_proc= -8
##$NLEV= 6
##$NOISF1= 182.463
##$NOISF2= 159.3651
##$NSP= 0
##$NTH_PI= 0
##$NZP= 0
##$OFFSET= 198.0616
##$PC= 4
##$PHC0= 2178.137
##$PHC1= 272.4883
##$PH_mod= 1
##$PKNL= yes
##$PPARMOD= 0
##$PSCAL= 0
##$PSIGN= 0
##$REVERSE= no
##$SF= 81.0140089999434
##$SI= 65536
##$SIGF1= 159.3651
##$SIGF2= -187.1042
##$SINO= 113.3802
##$SIOLD= 16384
##$SREGLST= <1H.CDCl3>
##$SSB= 0
##$STSI= 65536
##$STSR= 0
##$SW_p= 32467.5324675325
##$SYMM= 0
##$S_DEV= 0
##$TDeff= 32768
##$TDoff= 0
##$TI= <>
##$TILT= no
##$TM1= 0
##$TM2= 0
##$TOPLEV= 0
##$USERP1= <user>
##$USERP2= <user>
##$USERP3= <user>
##$USERP4= <user>
##$USERP5= <user>
##$WDW= 1
##$XDIM= 65536
##$YMAX_p= 100658906
##$YMIN_p= -275177729
$$ End of Bruker specific parameters
$$ ---------------------------------
##NTUPLES= NMR SPECTRUM
##VAR_NAME=  FREQUENCY,     SPECTRUM/REAL,   SPECTRUM/IMAG
##SYMBOL=    X,             R,               I
##VAR_TYPE=  INDEPENDENT,   DEPENDENT,       DEPENDENT
##VAR_FORM=  AFFN,          ASDF,            ASDF
##VAR_DIM=   65536,         65536,           65536
##UNITS=     HZ,            ARBITRARY UNITS, ARBITRARY UNITS
##FACTOR=    0.49542278885378, 1,            1
##FIRST=     16045.7642231865, 0,            0
##LAST=      -16421.768244346, 0,            0
##MIN=       -16421.768244346, -275177729,   0
##MAX=       16045.7642231865, 100658906,    0
$$ Real data points
##PAGE= N=1
##DATA TABLE= (X++(R..R)), XYDATA
$$ [...]
##PAGE= N=2
##DATA TABLE= (X++(I..I)), XYDATA
$$ plain form
7456 -14151192 -15740653 -14603926 -11281564 -7887328 -6355530 -6883674 -8471852 -9913298
7448 -9913298 -9705974 -6638951 -1856914 1075077 80338 -2426805 -2600714 -578522 -245141
7439 -245141 -3465048 -7217534 -7615666 -4769466 -2076686 -1987224 -4140669 -6965440 -9408281
7430 -9408281 -11039461 -11650935 -11208385 -9843235 -7879466 -6113572 -5794802 -7824365 -11890158
7421 -11890158 -16445774 -19409165 -19111755 -15319502 -9651575 -4529732 -1468330 -675752
7413 -675752 -1917284 -4541049 -6646700 -6077291 -3268190 -1572277 -3202695 -6047306 -6425188
7404 -6425188 -4109097 -2218226 -2418212 -2937531 -1965192 -498014 -383283 -1392139 -1966663
7395 -1966663 -1638999 -1045860 -476811 -44582 -506708 -2120886 -3201441 -1799443 1197206
$$ packed form
7456a4151192j589461J136727L322362L394236J531798n28144j588178j441446
7448i913298K07324L067023M782037K931991r94739k507143j73909K022192L33381
7439b45141l219907l752486l98132K846200K692780Q9462k153445k824771k442841
7430i408281j631180o11474M42550J365150J963769J765894L18770k029563m065793
7421a1890158m555616k963391K97410L792253N667927N121843L061402P92578
7413f75752j241532k623765k105651N69409K809101J695913j630418k844611l77882
7404f425188K316091J890871j99986n19319R72339J467178J14731j008856n74524
7395a966663L27664N93139N69049M32229m62126j614178j080555J401998K996649
$$ plain form
7386 1197206 2530992 533917 -2998150 -5388896 -5860506 -4824931 -2089189 2398618
7378 2398618 6709428 7820322 4819160 196311 -2530255 -1911711 850744 3600692
7370 3600692 4974460 5008584 4679743 4683594 4356281 2316734 -1227787 -3553682 -2168264
7361 -2168264 1762317 4560293 5004431 5957289 9652753 13570996 13678701 10377793 7770896
7352 7770896 7347596 6204420 2295642 -2325989 -5215373 -6937260 -8273013 -7359309 -3117608
7343 -3117608 1115158 1614078 126515 1104388 4222760 4871076 2093817 555570 3131690
7334 3131690 6451326 6227007 2936093 -522599 -3132019 -4595807 -3294206 778970
7326 778970 3692353 2309775 -636687 -471750 1987749 1764929 -2035777 -4419384 -1928496
$$ packed form
7386A197206J333786j997075l532067k390746m71610J035575K735742M487807
7378B398618M310810J110894l001162m622849k726566O18544K762455K749948
7370C600692J373768L4124l28841L851l27313k039547l544521k325895J385418
7361b168264L930581K797976M44138R52858L695464L918243J07705l300908k606897
7352G770896m23300j143176l908778m621631k889384j721887j335753R13704M241701
7343c117608M232766M98920j487563R77873L118372O48316k777259j538247K576120
7334C131690L319636k24319l290914l458692k609420j463788J301601M073176
7326G78970K913383j382578k946462J64937K459499k22820l800706k383607K490888
$$ plain form
7317 -1928496 2501923 4140828 2630374 1074658 1129830 1640813 1305432 538263 408340
7308 408340 662177 -550325 -4468454 -9236080 -10948487 -8145565 -3751831 -846545 1743651
7299 1743651 6733688 12587120 14582550 11882196 9360281 10926955 14630216 16438022
7291 16438022 15592755 13421851 9614331 3413565 -2850506 -5130528 -2639543 1042039
7283 1042039 2029436 -421470 -4253595 -6536355 -5208364 -762661 3595783 4901193
7275 4901193 3635804 2736091 3482795 3868414 1382458 -3702500 -8214551 -8608911 -3715947
7266 -3715947 4140419 10698685 13101751 11773972 8945034 6310167 4867258 5640472
7258 5640472 8596523 11302035 10688774 6476083 1477690 -1614158 -2423024 -1878332 -688434
$$ packed form
7317a928496M430419J638905j510454j555716N5172N10983l35381p67169j29923
7308D08340K53837j212502l918129m767626j712407K802922M393734K905286K590196
7299A743651M990037N853432J995430k700354k521915J566674L703261J807806
7291A6438022q45267k170904l807520o200766o264071k280022K490985L681582
7283A042039R87397k450906l832125k282760J327991M445703M358444J305410
7275D901193j265389q99713P46704L85619k485956n084958m512051l94360M892964
7266c715947P856366O558266K403066j327779k828938k634867j442909P73214
7258E640472K956051K705512o13261m212691m998393l091848q08866N44692J189898
$$ plain form
7249 -688434 641608 1642967 2539900 4248038 7122889 10175249 11644843 9975478 4912216
7240 4912216 -1207828 -4116956 -1764743 2337641 2493658 -1912786 -5311282 -3448233
7232 -3448233 867069 2033341 -595930 -2778606 -2164391 -1027196 -1703116 -2889776 -2338346
7223 -2338346 -723037 -373580 -1492892 -2117358 -1446419 -988971 -2066862 -3984002 -5554585
7214 -5554585 -7169277 -10017423 -13705391 -15925996 -14816689 -10979763 -6789810 -4115022
7206 -4115022 -3089613 -2709454 -1931601 -247832 2006026 3514311 2817823 27263 -2628878
7197 -2628878 -2842721 -827029 926499 654136 -747232 -1163383 212932 2444919 4162132
7188 4162132 4397107 2774052 117278 -1448319 -412719 2083381 3533191 3488184 3905177
$$ packed form
7249f88434J330042J001359Q96933J708138K874851L052360J469594j669365n063262
7240D912216o120044k909128K352213M102384J56017m406444l398496J863049
7232c448233M315302J166272k629271k182676O14215J137195o75920j186660N51430
7223b338346J615309L49457j119312o24466O70939M57448j077891j917140j570583
7214e554585j614692k848146l687968k220605J109307L836926M189953K674788
7206d115022J025409L80159P77853J683769K253858J508285o96488k790560k656141
7197b628878k13843K015692J753528k72363j401368m16151J376315K231987J717213
7188D162132K34975j623055k656774j565597J035600K496100J449810m5007M16993
$$ plain form
7179 3905177 5478194 5803387 2945620 -857067 -1641087 878755 3250556 3800128 5127692
7170 5127692 9601143 14794141 15950527 11948492 6394492 3047360 2386085 3000130 4108473
7161 4108473 5349540 5573249 3785435 929626 -949279 -1459635 -2206675 -3810847 -4293329
7152 -4293329 -1956526 1430049 2763357 2538072 4564443 9741749 13190860 10232776
7144 10232776 3201973 -1142835 -158634 2419533 2865639 2146545 2663038 3737594 3149534
7135 3149534 1117047 -154752 180793 1275360 2877840 5455428 8246493 9497761
7127 9497761 8874699 7790439 7078682 6035180 4152793 2228186 1094902 445056 -454001
7118 -454001 -1740906 -3103400 -4150667 -4261385 -2787506 100412 3094939 4490889 3226170
$$ packed form
7179C905177J573017L25193k857767l802687p84020K519842K371801N49572J327564
7170E127692M473451N192998J156386m002035n554000l347132o61275O14045J108343
7161D108473J241067K23709j787814k855809j878905n10356p47040j604172m82482
7152d293329K336803L386575J333308k25285K026371N177306L449111k958084
7144A0232776p030803m344808R84201K578167M46106p19094N16493J074556n88060
7135C149534k032487j271799L35545J094567J602480K577588K791065J251268
7127I497761o23062j084260p11757j043502j882387j924607j133284o49846q99057
7118d54001j286905j362494j047267j10718J473879K887918K994527J395950j264719
$$ plain form
7109 3226170 -345876 -4313492 -6441918 -6207280 -5027122 -3969152 -2422340 -102959
7101 -102959 1167078 -161481 -2153023 -1256978 2680960 5910020 5737297 3465183 1442305
7092 1442305 -327432 -2886138 -5437926 -5972047 -4125030 -1709756 -463887 -328576 -25768
7083 -25768 1212158 2640717 2873117 1928180 1654274 3119351 4365656 2526168 -2154279
7074 -2154279 -6462364 -8359192 -8688271 -8500773 -7426017 -5750065 -5470773 -7530409 -10023444
7065 -10023444 -10900285 -10604548 -10257246 -9147006 -6217511 -2497453 209323 1747635 2531688
7056 2531688 1428488 -2667909 -8017011 -11316163 -11343321 -9338975 -6667599 -4338903 -3829745
7047 -3829745 -5658955 -7740607 -7787121 -6747916 -7090395 -8365364 -7856554 -5447493 -4163885
$$ packed form
7109C226170l572046l967616k128426K34638J180158J057970J546812K319381
7101a02959J270037j328559j991542Q96045L937938L229060j72723k272114k022878
7092A442305j769737k558706k551788n34121J847017K415274J245869J35311L02808
7083b5768J237926J428559K32400r44937k73906J465077J246305j839488m680447
7074b154279m308085j896828l29079J87498J074756J675952K79292k059636k493035
7065a0023444q76841K95737L47302J110240K929495L720058K706776J538312P84053
7056B531688j103200m096397n349102l299152k7158K004346K671376K328696N09158
7047c829745j829210k081652m6514J039205l42479j274969N08810K409061J283608
$$ plain form
7038 -4163885 -5325458 -6666741 -6348473 -5653082 -6290930 -7761297 -8758317 -8717230 -6880767
7029 -6880767 -2618608 2098478 3653951 1921553 1320025 4596231 8690576 9524655 7920793
7020 7920793 7306784 7986248 7699401 6267803 5562552 5692678 5107622 4102767 4593921
7011 4593921 6549768 8067905 8835750 9951856 10429451 8044405 4308311 4234132 9410857
7002 9410857 15064821 16202165 13408363 10181523 7744064 5586332 4397176 4632315
6994 4632315 3896840 -300615 -5951086 -8345621 -6314741 -3398616 -2668397 -3596469 -4648744
6985 -4648744 -5760458 -6839994 -6543089 -4579174 -3343292 -4984898 -7918721 -8455417 -5574265
6976 -5574265 -2148838 -1158693 -2219564 -2700816 -1355966 450539 1215550 1750080 3888378
$$ packed form
7038d163885j161573j341283L18268O95391o37848j470367r97020M1087J836463
7029f880767M262159M717086J555473j732398o01528L276206M094345Q34079j603862
7020G920793o14009O79464k86847j431598p05251J30126n85056j004855M91154
7011D593921J955847J518137P67845J116106M77595k385046l736094p4179N176725
7002I410857N653964J137344k793802l226840k437459k157732j189156K35139
6994D632315p35475m197455n650471k394535K030880K916125P30219r28072j052275
6985d648744j111714j079536K96905J963915J235882j641606k933823n36696K881152
6976e574265L425427R90145j060871m81252J344850J806505P65011N34530K138298
$$ plain form
6967 3888378 7040055 7816829 4072933 -1994794 -6296904 -7491582 -7350758 -7209936 -6556740
6958 -6556740 -5264708 -4577676 -4900120 -4878776 -3970728 -3765886 -5074107 -5814829 -4178236
6949 -4178236 -2213233 -3308560 -6978787 -9290570 -8370853 -6435337 -5774075 -5613204 -4356501
6940 -4356501 -2744057 -2935013 -5583541 -9187864 -11560696 -11102483 -7650000 -3069859 -238553
6931 -238553 -576814 -3087681 -6004270 -8256534 -9101008 -8041616 -5951581 -4609992 -4082577
6922 -4082577 -2350926 1084404 3238858 1419741 -2693834 -5430630 -6403418 -8231764
6914 -8231764 -11454689 -13253913 -11950873 -9628396 -8738746 -8542734 -6887893 -3834899 -1397434
6905 -1397434 -582675 -546644 -246943 588653 1876064 3175205 3302505 1185632 -2537101
$$ packed form
6967C888378L151677P76774l743896o067727m302110j194678J40824J40822O53196
6958f556740J292032O87032l22444K1344R08048K04842j308221p40722J636593
6949d178236J965003j095327l670227k311783R19717J935516O61262J60871J256703
6940d356501J612444j90956k648528l604323k372832M58213L452483M580141K831306
6931b38553l38261k510867k916589k252264q44474J059392K090035J341589N27415
6922d082577J731651L435330K154454j819117m113575k736796r72788j828346
6914h231764l222925j799224J303040K322477Q89650J96012J654841L052994K437465
6905a397434Q14759L6031K99701Q35596J287411J299141J27300k116873l722733
$$ plain form
6896 -2537101 -5554160 -5970267 -4073777 -1818166 -701700 -336345 749556 2908220 4516995
6887 4516995 4012657 2510448 3235168 7861498 14215131 18250252 17790896 13781096 8518261
6878 8518261 3713384 197326 -1621296 -1877077 -1635558 -2314016 -4123449 -5423947 -4510866
6869 -4510866 -2092821 -802288 -1541592 -1517350 2596842 10139865 16822146 19509304 18885138
6860 18885138 17017680 14162918 9259617 2603921 -3363252 -6022342 -5012347 -2822982
6852 -2822982 -2665548 -5044620 -6778157 -4553480 768212 4851710 4863673 2081373 -560201
6843 -560201 -1400967 78542 3921939 8639808 11239058 10158258 7144588 4881524 3992202
6834 3992202 3701152 3857106 4408384 4221022 2605739 1041097 1184720 2028840 1406188
$$ packed form
6896b537101l017059m16107J896490K255611J116466L65355J085901K158664J608775
6887D516995n04338j502209P24720M626330O353633M035121m59356m009800n262835
6878H518261m804877l516058j818622k55781K41519o78458j809433j300498R13081
6869d510866K418045J290533p39304K4242M114192P543023O682281K687158o24166
6860A8885138j867458k854762m903301o655696n967173k659090J009995K189365
6852b822982J57434k379072j733537K224677N321692M083498J1963k782300k641574
6843e60201q40766J479509L843397M717869K599250j080800l013670k263064q89322
6834C992202k91050J55954N51278j87362j615283j564642J43623Q44120o22652
$$ plain form
6825 1406188 -305805 -558207 1500582 4034903 5480685 6049586 5913189 4274687 1090724
6816 1090724 -2142987 -4115585 -4707798 -3900029 -1518219 1296353 2215048 352762 -2509818
6807 -2509818 -4024738 -3403524 -1186427 1434395 2625805 1208178 -1217442 -1334034 1584898
6798 1584898 4191606 3184687 -686878 -4148185 -5400675 -4922512 -3485895 -1265213
6790 -1265213 1547867 4471096 6612966 6320240 2338246 -3700538 -7623860 -7151282 -4621703
6781 -4621703 -3677504 -4740866 -5826039 -6323833 -7148395 -7871426 -6716886 -3531456 -317944
6772 -317944 1394809 1525893 -167318 -3961851 -7875359 -8304852 -4425653 75837 1180042
6763 1180042 -1179121 -4379476 -6883516 -8768214 -9771038 -9256288 -7893878 -7264622 -7364626
$$ packed form
6825A406188j711993k52402K058789K534321J445782N68901j36397j638502l183963
6816A090724l233711j972598n92213Q07769K381810K814572R18695j862286k862580
6807b509818j514920O21214K217097K620822J191410j417627k425620j16592K918932
6798A584898K606708j006919l871565l461307j252490M78163J436617K220682
6790a265213K813080K923229K141870k92726l981994o038784l923322M72578K529579
6781d621703R44199j063362j085173m97794q24562p23031J154540L185430L213512
6772c17944J712753J31084j693211l794533l913508m29493L879199M501490J104205
6763A180042k359163l200355k504040j884698j002824N14750J362410O29256j00004
$$ plain form
6754 -7364626 -6063039 -1878833 3552540 6650744 5384901 1218240 -2364119 -3002442
6746 -3002442 -1066496 1589420 3799774 5545656 6790352 7028823 6289127 5631066 5935176
6737 5935176 6679772 6541921 4850826 1849409 -2098802 -6628801 -10569860 -11863483 -9076490
6728 -9076490 -3072799 3205789 6953016 7576921 6613324 5839991 5783650 5860497 5282490
6719 5282490 3635335 1262977 -502796 -216968 1874332 3509467 2795818 489688 -1088164
6710 -1088164 -1049479 -672547 -1292103 -2750505 -4136687 -4931776 -5115609 -5080395 -5615432 -6991815
6700 -6991815 -8029085 -7352973 -5694681 -5291828 -6527507 -7072693 -5478256 -3791560 -4795710
6691 -4795710 -7897579 -9815025 -8687585 -5583693 -2424885 -498130 -841196 -3736771
$$ packed form
6754g364626J301587M184206N431373L098204j265843m166661l582359o38323
6746c002442J935946K655916K210354J745882J244696K38471p39696o58061L04110
6737E935176P44596j37851j691095l001417l948211m529999l941059j293623K786993
6728i076490O003691O278588L747227O23905r63597p73333n6341P6847n78007
6719E282490j647155k372358j765773K85828K091300J635135p13649k306130j577852
6710a088164L8685L76932o19556j458402j386182p95089j83833L5214n35037j376383
6700f991815j037270O76112J658292M02853j235679n45186J594437J686696j004150
6691d795710l101869j917446J127440L103892L158808J926755l43066k895575
$$ plain form
6683 -3736771 -7210196 -8055967 -5487511 -2338318 -1504488 -2442084 -2566443 -1132758 96200
6674 96200 -176546 -968437 -837432 -234979 -774625 -2531319 -3435142 -1939044 583439
6665 583439 1262461 -583518 -2464037 -1949458 257014 1640871 1568532 2015424 4415418
6656 4415418 7209707 7436902 4163897 -418356 -3146330 -2728215 -557565 1050900 1321181
6647 1321181 1463383 2604242 4050900 4447422 4042429 4391741 5896885 7222671 7512450
6638 7512450 7540869 7894940 7681746 6371155 5453337 6398662 7982940 7828300 6056351
6629 6056351 4942730 4941934 3853412 890312 -1164670 7570 2025094 543916 -4430498
6620 -4430498 -8015705 -6799548 -3100910 -1380464 -2336025 -2939143 -1653388 -988661 -3938660
$$ packed form
6683c736771l473425q45771K568456L149193Q33830r37596j24359J433685J228958
6674I6200k72746p91891J31005O02453n39646j756694r03823J496098K522483
6665E83439O79022j845979j880519N14579K206472J383857p2339M46892K399994
6656D415418K794289K27195l273005m582253k727974M18115K170650J608465K70281
6647A321181J42202J140859J446658L96522m04993L49312J505144J325786K89779
6638G512450K8419L54071k13194j310591r17818R45325J584278j54640j771949
6629F056351j113621p96j088522k963100k054982J172240K017524j481178m974414
6620d430498l585207J216157L698638J720446r55561o03118J285755O64727k949999
$$ plain form
6611 -3938660 -9457672 -12992946 -11168858 -4954762 1642423 5066660 4337232 843672
6603 843672 -3054966 -5489262 -5924521 -4942574 -3315691 -1524753 -60025 607572 842900
6594 842900 1865809 3977939 5313928 3815037 395692 -1658980 -1188784 -1257429 -5077345
6585 -5077345 -11027649 -14069854 -11952066 -7695151 -5359938 -5525028 -6207342 -6342955 -6297865
6576 -6297865 -6062052 -5333487 -5104817 -6826257 -9639740 -10627370 -8722393 -6433570 -6258852
6567 -6258852 -7041941 -5961492 -3139585 -1704517 -3150281 -5012849 -4295026 -1608208 -292618
6558 -292618 -2012855 -4654276 -4721595 -1030090 4147918 7101484 5737058 1122142 -3573021
6549 -3573021 -5592417 -4294430 -975219 2267006 3511273 1859101 -1799084 -5041650
$$ packed form
6611c938660n519012l535274J824088O214096O597185L424237p29428l493560
6603H43672l898638k434296m35259R81947J626883J790938J464728O67597K35328
6594H42900J022909K112130J335989j498891l419345k054672M70196o8645l819916
6585e077345n950304l042205K117788M256915K335213j65090o82314j35613M5090
6576f297865K35813P28565K28670j721440k813483r87630J904977K288823J74718
6567f258852p83089J080449K821907J435068j445764j862568P17823K686818J315590
6558b92618j720237k641421o7319L691505N178008K953566j364426m614916m695163
6549c573021k019396J297987L319211L242225J244267j652172l658185l242566
$$ plain form
6541 -5041650 -5737543 -4004939 -2196300 -2704575 -5655721 -8723122 -9358212 -7359512 -5029861
6532 -5029861 -4524816 -5438742 -5647949 -4123070 -1727039 703720 3440372 6353001 7878106
6523 7878106 6839551 4299756 2241066 1308749 1323507 2894159 6221946 8886291 7692738
6514 7692738 3212287 -136745 356162 2315188 1915958 -1137973 -4223206 -5783724 -6369053
6505 -6369053 -6537975 -5965531 -4394626 -1822128 1813152 5531873 6711328 3857479 -329154
6496 -329154 -1178662 2297873 6214008 6774275 4168002 745201 -2141386 -3831735 -3095366
6487 -3095366 311988 3838145 4251405 1420128 -1674766 -2524431 -1204370 904808 2831293
6478 2831293 4074891 4231640 3227348 1387719 -928539 -3295634 -4923412 -5109877 -4061689
$$ packed form
6541e041650o95893J732604J808639n08275k951146l067401o35090J998700K329651
6532e029861N05045r13926k09207J524879K396031K430759K736652K912629J525105
6523G878106j038555k539795k058690r32317J4758J570652L327787K664345j193553
6514G692738m480451l349032M92907J959026l99230l053931l085233j560518n85329
6505f369053j68922N72444J570905K572498L635280L718721J179455k853849m186633
6496c29154q49508L476535L916135N60267k606273l422801k886587j690349P36369
6487c095366L407354L526157M13260k831277l094894q49665J320061K109178J926485
6478B831293J243598J56749j004292j839629k316258k367095j627778j86465J048188
$$ plain form
6469 -4061689 -2720047 -1804001 -1514067 -1964071 -3221586 -4989724 -6786534 -8251029 -8830754
6460 -8830754 -7770591 -5299013 -3249922 -3242142 -4558675 -5229102 -4996531 -5478170 -7245912
6451 -7245912 -8750224 -8909085 -8833371 -9580910 -9740103 -7112844 -1938693 3356673 7091164
6442 7091164 9242312 9844750 8596238 6393766 5349821 6318642 7615224 7067297 4444638
6433 4444638 1203692 -1157167 -1704227 -159392 2353477 3364849 1280939 -2616090
6425 -2616090 -5455174 -5915770 -5156393 -4895329 -5665581 -6783134 -6840985 -4369549 564301
6416 564301 5333760 6898917 5298239 3317344 2239279 165894 -4129722 -7995805
6408 -7995805 -8028503 -4989105 -2728575 -2820809 -3227540 -2323060 -1171568 -910508 -579470
$$ packed form
6469d061689J341642R16046K89934m50004j257515j768138j796810j464495n79725
6460h830754J060163K471578K049091P780j316533o70427K32571m81639j767742
6451g245912j504312j58861P5714p47539j59193K627259N174151N295366L734491
6442G091164K151148O02438j248512k202472j043945R68821J296582n47927k622659
6433D444638l240946k360859n47060J544835K512869J011372k083910l897029
6425b616090k839084m60596P59377K61064p70252j117553n7851K471436M933850
6416E64301M769459J565157j600678j980895j078065k073385m295616l866083
6408g995805l2698L039398K260530r2234m06731R04480J151492K61060L31038
$$ plain form
6399 -579470 947072 2963357 4464397 5838513 7254554 7034119 3886634 -269336 -2071249
6390 -2071249 -966389 299292 -547713 -2718559 -3810382 -2649980 -393352 583820 -998673
6381 -998673 -3727760 -4843038 -3631215 -2350411 -3001774 -4658907 -5207330 -3994792 -1036960
6372 -1036960 4311047 11087835 14939602 12506851 6897935 4651512 7171555 9504114
6364 9504114 8395503 6775942 7962815 9732013 7835400 2559314 -2152473 -4443472
6356 -4443472 -5762527 -7308730 -8661774 -9688184 -10925046 -11888915 -11192672 -8564272 -5222113
6347 -5222113 -2426604 -935915 -1270183 -3140031 -5381012 -7650122 -10847569 -14456111
6339 -14456111 -15528172 -12660173 -8882769 -7438550 -6620283 -2902634 2213647 3593982
$$ packed form
6399e79470J526542K016285J501040J374116J416041k20435l147485m155970j801913
6390b071249J104860J265681q47005k170846j091823J160402K256628R77172j582493
6381i98673k729087j115278J211823J280804o51363j657133n48423J212538K957832
6372a036960N348007O776788L851767k432751n608916k246423K520043K332559
6364I504114j108611j619561J186873J769198j896613n276086m711787k290999
6356d443472j319055j546203j353044j026410j236862r63869O96243K628400L342159
6347e222113K795509J490689l34268j869848k240981k269110l197447l608542
6339a4456111j072061K867999L777404J444219Q18267L717649N116281J380335
$$ plain form
6331 3593982 551141 -1827287 -541985 1260247 241596 -1820793 -1839716 -686560 -921635
6322 -921635 -2121221 -2346165 -2231043 -3827313 -6795064 -9277751 -11381150 -14176283 -16068260
6313 -16068260 -14007056 -8369780 -3263007 -1532200 -2385043 -4348325 -7408606 -11055130
6305 -11055130 -12950650 -11434656 -7789919 -4574349 -2869276 -2267483 -2362476 -2929245 -3396619
6296 -3396619 -3394242 -3545767 -4814343 -7092648 -9042549 -9506206 -8762380 -7905756 -6823898
6287 -6823898 -3692013 2159672 7297669 6554727 -544508 -7821715 -8767344 -3300997 3601642
6278 3601642 8107699 9608599 8356194 5062633 2611309 4160547 8602279 11076658
6270 11076658 9043625 4955343 1926642 4224 -1604921 -1780242 410528 3000100
$$ packed form
6331C593982l042841k378428J285302J802232j018651k062389j8923J153156k35075
6322i21635j199586k24944J15122j596270k967751k482687k103399k795133j891977
6313a6068260K061204N637276N106773J730807q52843j963282l060281l646524
6305a1055130j895520J515994L644737L215570J705073O01793r4993n66769m67374
6296c396619K377j51525j268576k278305j949901m63657P43826Q56624J081858
6287f823898L131885N851685N137997p42942p099235p277207r45629N466347O902639
6278C601642M506057J500900j252405l293561k451324J549238M441732K474379
6270A1076658k033033m088282l028701j922418j609145j75321K190770K589572
$$ plain form
6262 3000100 3144356 603493 -2653860 -4904705 -5134516 -2911438 200922 927113 -1659655
6253 -1659655 -3890870 -1824333 3416510 7066839 6320977 2072136 -3587684 -8601981
6245 -8601981 -10626269 -8819681 -5876743 -5520649 -8086208 -11000235 -12885472 -14018860
6237 -14018860 -13355268 -9229159 -3525703 -1024994 -3054878 -5272475 -3636927 478289
6229 478289 3222712 3496285 2808879 2301756 2541796 4364780 7251712 8416456 6150389
6220 6150389 2790172 1779075 2992681 3757468 3464282 3946209 5605128 6401725 5169952
6211 5169952 3237083 2004252 1236038 628880 917313 2164404 2670048 1073218 -1560263
6202 -1560263 -3123107 -3246146 -3456432 -4886650 -6925290 -8300027 -8798615 -9352928 -10370276
$$ packed form
6262C000100J44256k540863l257353k250845k29811K223078L112360P26191k586768
6253a659655k231215K066537N240843L650329p45862m248841n659820n014297
6245h601981k024288J806588K942938L56094k565559k914027j885237j133388
6237a4018860O63592M126109N703456K500709k029884k217597J635548M115216
6229D78289K744423K73573o87406n07123K40040J822984K886932J164744k266067
6220F150389l360217j011097J213606P64787k93186M81927J658919P96597j231773
6211E169952j932869j232831p68214o07158K88433J247091N05644j596830k633481
6202a560263j562844j23039k10286j430218k038640j374737m98588n54313j017348
$$ plain form
6193 -10370276 -10499276 -7904361 -2965134 1236177 1884466 -687921 -3764003 -5163741
6185 -5163741 -4552670 -2709356 -842194 -165048 -837439 -1654398 -1901434 -2763661 -5246469
6176 -5246469 -7415385 -6073953 -1263108 3223927 4378762 2967366 1321819 369665
6168 369665 92237 938237 2980846 4924916 5602924 5547802 5707704 5621333 4423314 2778847
6158 2778847 2066687 2144906 1581633 -187343 -2431404 -4551892 -6347330 -7002904 -5534226
6149 -5534226 -2518462 50080 983389 734840 -168739 -1958626 -4310614 -5809547 -5878199
6140 -5878199 -6045102 -7845018 -10130072 -9966860 -6125303 -612673 3214094 3261340 -173062
6131 -173062 -4610783 -6817610 -5502754 -3010718 -2992472 -5800271 -7653365 -5444173 -949294
$$ packed form
6193a0370276j29000K594915M939227M201311O48289k572387l076082j399738
6185e163741O11071J843314J867162O77146o72391q16959k47036q62227k482808
6176e246469k168916J341432M810845M487035J154835j411396j645547r52154
6168C69665k77428Q46000K042609J944070O78008n5122J59902q6371j198019j644467
6158B778847p12160P8219n63273j768976k244061k120488j795438o55574J468678
6149e534226L015764K568542R33309k48549r03579j789887k351988j498933o8652
6140e878199j66903j799916k285054J63212L841557N512630L826767M7246l434402
6131a73062m437721k206827J314856K492036J8246k807799j853094K209192M494879
$$ plain form
6122 -949294 1470114 400226 -1536778 -1766356 -594936 369600 388977 -735511 -3245941
6113 -3245941 -6364708 -8072365 -7264283 -5069777 -3128277 -1998117 -2231587 -4948208 -9452324
6104 -9452324 -12122146 -10216880 -5610447 -2253444 -1068469 -159476 1002581 1109182 331724
6095 331724 390478 998730 -122872 -2868449 -3926658 -1615512 1775989 3964519 5613648
6086 5613648 7368300 7376924 4567029 1641251 1714374 4039666 5980716 7222190 8847041
6077 8847041 9933522 8602047 5579312 3632668 4021939 5976978 8646734 10887588
6069 10887588 10312669 5691062 -439176 -4413365 -5768653 -6083004 -5069486 -1803843
6061 -1803843 1310687 717967 -2165670 -1991572 2503681 6444396 6413509 5231251 6403313
$$ packed form
6122i49294K419408j069888j937004k29578J171420R64536J9377j124488k510430
6113c245941l118767j707657Q08082K194506J941500J130160k33470k716621m504116
6104i452324k669822J905266M606433L357003J184975R08993J162057J06601p77458
6095C31724N8754O08252j121602k745577j058209K311146L391501K188530J649129
6086E613648J754652Q624k809895k925778P3123K325292J941050J241474J624851
6077H847041J086481j331475l022735j946644L89271J955039K669756K240854
6069A0887588n74919m621607o130238l974189j355288l14351J013518L265643
6061a803843L114530n92720k883637J74098M495253L940715l0887j182258J172062
$$ plain form
6052 6403313 8121699 6671582 2809760 480922 734428 864010 -807520 -2567420 -2256083
6043 -2256083 -449936 204814 -1861665 -5089939 -6182710 -4051033 -1649868 -2418955 -5693088
6034 -5693088 -8076020 -8753995 -9854522 -11274148 -9608664 -4083174 613335 344963 -3071821
6025 -3071821 -5743109 -7580617 -10103629 -11209858 -7516135 -754809 3391985 2876730
6017 2876730 1105531 666040 -301373 -3990999 -8863741 -11737605 -11454420 -8811035 -4986653
6008 -4986653 -1621502 -635621 -2330969 -4845794 -6557984 -7821344 -9485858 -11104166
6000 -11104166 -11694111 -11200831 -10215201 -9101943 -8225325 -8289683 -9668432 -11726779 -13066494
5991 -13066494 -12162612 -8206775 -2248887 2921125 5296179 5778041 6482910 7472934 7090514
$$ packed form
6052F403313J718386j450117l861822k328838K53506J29582j671530j759900L11337
6043b256083J806147O54750k066479l228274j092771K131677K401165p69087l274133
6034e693088k382932o77975j100527j419626J665484N525490M696509k68372l416784
6025c071821k671288j837508k523012j106229L693723O761326M146794n15255
6017B876730j771199m39491r67413l689626m872742k873864K83185K643385L824382
6008d986653L365151R85881j695348k514825j712190j263360j664514j618308
6000a1104166n89945M93280R85630J113258Q76618o4358j378749k058347j339715
5991a3066494R03882L955837N957888N170012K375054M81862P04869R90024l82420
$$ plain form
5982 7090514 5282463 4157873 4695814 5121317 3588612 729706 -1532585 -2235381 -1494343
5973 -1494343 146468 1431924 822282 -1662446 -4131352 -5258371 -5768901 -6559833 -6865821
5964 -6865821 -5779713 -4390023 -4577622 -6214629 -7178011 -6102989 -4001100 -3024702 -4155689
5955 -4155689 -6036981 -6075225 -3394276 -634936 -1424686 -5681142 -9219461 -9053116 -7260545
5946 -7260545 -7926309 -11845638 -16459464 -19779383 -21606383 -21464346 -18540498 -14180540 -11501736
5937 -11501736 -11226760 -10341478 -6681394 -2794429 -2791131 -6605888 -10148469 -10770753 -9794595
5928 -9794595 -9223690 -8729830 -7327383 -5804024 -5286322 -4734221 -2330563 1180445 2980874
5919 2980874 2068161 401979 -243425 -337149 -703160 -830155 -440789 -715722 -2077215
$$ packed form
5982G090514j808051j124590N37941M25503j532705k858906k262291p02796P41038
5973a494343J640811J285456o09642k484728k468906j127019n10530p90932l05988
5964f865821J086108J389690j87599j637007r63382J075022K101889R76398j130987
5955d155689j881292l8244K680949K759340p89750m256456l538319J66345J792571
5946g260545o65764l919329m613826l319919j827000J42037K923848M359958K678804
5937a1501736K74976Q85282L660084L886965L298l814757l542581o22284R76158
5928i794595N70905M93860J402447J523359N17702N52101K403658L511008J800429
5919B980874r12713j666182o45404r3724l66011j26995L89366k74933j361493
$$ plain form
5910 -2077215 -2424527 104016 3681563 4520316 1549584 -2746460 -5692212 -6460011 -5239059
5901 -5239059 -3001266 -2203447 -5032236 -10145921 -13363892 -12503645 -9540125 -7078047 -4964718
5892 -4964718 -2011140 884775 1712017 638385 154724 1830471 4353788 5155594 3145051
5883 3145051 -533649 -3996941 -6340432 -7656335 -7702636 -5588796 -1384663 2877561 4966278
5874 4966278 4695961 3283325 1121249 -2239002 -6240780 -9176793 -9962528 -8792502 -6350399
5865 -6350399 -3772600 -2738398 -3621918 -4023407 -1387163 3195886 6136259 5946458 4034398
5856 4034398 1322361 -2517082 -6295264 -7548918 -6441414 -5856293 -6536989 -5866938 -2810979
5847 -2810979 10694 1037157 2229618 4290790 3949900 -374588 -4362864 -3721004 -824629
$$ packed form
5910b077215l47312K528543L577547Q38753k970732m296044k945752p67799J220952
5901e239059K237793P97819k828789n113685l217971Q60247K963520K462078K113329
5892d964718K953578K895915Q27242j073632m83661J675747K523317Q01806k010543
5883C145051l678700l463292k343491j315903m6301K113840M204133M262224K088717
5874D966278k70317j412636k162076l360251m001778k936013p85735J170026K442103
5865f350399K577799J034202q83520m01489K636244M583049K940373j89801j912060
5856D034398k712037l839443l778182j253654J107504N85121o80696O70051L055959
5847b810979K821673J026463J192461K061172l40890m324488l988276O41860K896375
$$ plain form
5838 -824629 -456187 -1903935 -1041387 1712244 1614589 -2901532 -8484539 -12418052 -14720506
5829 -14720506 -14673666 -10573623 -3792204 1557264 3921342 5104537 5449409 3157058 -746124
5820 -746124 -2152870 -362402 432996 -1422848 -1524963 2959933 6987294 4192003 -3343712
5811 -3343712 -7496127 -5000485 -844701 -728612 -4463394 -8042285 -9102790 -8355681 -7067856
5802 -7067856 -5069693 -1597169 2550565 4750441 3218094 -817126 -4982363 -9072085
5794 -9072085 -14199514 -18870003 -19034833 -13254392 -5312879 -108177 1166215 431859 -576468
5785 -576468 -1269814 -1488901 -1582943 -2217240 -3226966 -4056361 -5701673 -9779504 -14789000
5776 -14789000 -16332103 -12896191 -8614022 -7911100 -9928357 -10928545 -9842244 -8219068
$$ packed form
5838h24629L68442j447748Q62548K753631r7655m516121n583007l933513k302454
5829a4720506M6840M100043O781419N349468K364078J183195L44872k292351l903182
5820g46124j406746J790468P95398j855844j02115M484896M027361k795291p535715
5811c343712m152415K495642M155784J16089l734782l578891j060505P47109J287825
5802g067856J998163L472524M147734K199876j532347m035220m165237m089722
5794i072085n127429m670489j64830N780441P941513N204702J274392p34356j008327
5785e76468o93346k19087r4042o34297j009726q29395j645312m077831n009496
5776a4789000j543103L435912M282169P02922k017257j000188J086301J623176
$$ plain form
5768 -8219068 -6619749 -4675604 -3554736 -4831587 -7449187 -8881985 -8884652 -9232343 -10178967
5759 -10178967 -10079875 -8357749 -6122046 -3898482 -1255453 1428613 3303169 4980575
5751 4980575 7549430 9715774 8653176 4072022 -892555 -3166891 -2092839 1446826
5743 1446826 5646651 7558379 5248768 789575 -1576995 -914476 -585258 -3095004 -6895540
5734 -6895540 -9487485 -10698700 -11056536 -9643232 -6100826 -2839972 -2545272 -4548279 -5972482
5725 -5972482 -5630772 -4550948 -3236873 -888186 2334004 4191328 2491499 -2383667
5717 -2383667 -7505660 -9602308 -7375656 -2359073 2331859 4517123 4414586 3547534 2526261
5708 2526261 464269 -3363887 -7900225 -10973191 -11546285 -10572393 -9243119 -7326695 -4389095
$$ packed form
5768h219068J599319J944145J120868j276851k617600j432798k667l47691r46624
5759a0178967R9092J722126K235703K223564K643029K684066J874556J677406
5751D980575K568855K166344j062598m581154m964577k274336J074052L539665
5743A446826M199825J911728k309611m459193k366570O62519L29218k509746l800536
5734f895540k591945j211215l57836J413304L542406L260854K94700k003007j424203
5725e972482L41710J079824J314075K348687L222190J857324j699829m875166
5717b383667n121993k096648K226652N016583M690932K185264j02537q67052j021273
5708B526261k061992l828156m536338l072966n73094R73892J329274J916424K937600
$$ plain form
5699 -4389095 -1891622 -2022541 -4392944 -6218629 -6431932 -6956096 -8504118 -8183223 -4138957
5690 -4138957 -94872 -1247793 -6838270 -11028285 -10919761 -9474844 -9922083 -11479833 -12220589
5681 -12220589 -12515219 -13225147 -13067395 -10288276 -5448214 -794392 1862417 1684796 -915287
5672 -915287 -3556237 -3642334 -2018021 -2481744 -6325190 -10150309 -11017506 -10724382 -12045922
5663 -12045922 -13302657 -10497711 -3556339 3181024 6178732 5418383 2380892 -1692816
5655 -1692816 -5539280 -8360660 -10612106 -12409396 -11879284 -7541847 -1642488 1761610
5647 1761610 1687284 299816 -1396804 -4228975 -6983002 -6136083 -1177538 3366319 3622626
5638 3622626 1207124 -307924 -1064624 -3361107 -6091859 -5306888 -727960 2274321 -743238
$$ packed form
5699d389095K497473j30919k370403j825685k13303n24164j548022L20895M044266
5690d138957M044085j152921n590477m190015J08524J444917m47239j557750p40756
5681a2220589k94630p09928J57752K779119M840062M653822K656809j77621k600083
5672i15287k640950q6097J624313m63723l843446l825119q67197K93124j321540
5663a2045922j256735K804946O941372O737363K997708p60349l037491m073708
5655a692816l846464k821380k251446j797290N30112M337437N899359L404098
5647A761610p4326j387468j696620k832171k754027Q46919M958545M543857K56307
5638C622626k415502j515048p56700k296483k730752P84971M578928L002281l017559
$$ plain form
5629 -743238 -7241255 -10809548 -9074652 -5672082 -4462415 -4871158 -4513884 -3902562 -5360751
5620 -5360751 -8237005 -9084247 -7388759 -7354888 -11671688 -16614678 -16831324 -12847247 -9561641
5611 -9561641 -8448220 -6274677 -1945496 565731 -1714669 -5978171 -7991734 -7948352 -8358571
5602 -8358571 -8671153 -6379322 -2296693 -294343 -1622925 -3242837 -2558704 -557092 919653
5593 919653 2040706 3409249 4134563 3722988 4014350 6540937 8955402 6997349 198273
5584 198273 -6765175 -9286511 -7671784 -5650568 -5471893 -6222221 -6425161 -6234819 -6355792
5575 -6355792 -6206564 -4537423 -1480181 1190464 1928799 772662 -1146461 -2533922 -2314020
5566 -2314020 -311466 1860925 1723443 -1233555 -4403146 -4893179 -2944466 -1317422 -1796375
$$ packed form
5629g43238o498017l568293J734896L402570J209667m08743L57274O11322j458189
5620e360751k876254q47242J695488L3871m316800m942990k16646L984077L285606
5611i561641J113421K173543M329181K511227k280400m263502k013563M3382m10219
5602h358571l12582K291831M082629K002350j328582j619912O84133K001612J476745
5593I19653J121053J368543P25314m11575K91362K526587K414465j958053o799076
5584A98273o963448k521336J614727K021216J78675p50328k02940J90342j20973
5575f355792J49228J669141L057242K670645P38335j156137j919123j387461K19902
5566b314020K002554K172391j37482k956998l169591m90033J948713J627044m78953
$$ plain form
5557 -1796375 -3834721 -6378906 -9036032 -10947752 -10435593 -7053728 -2825039 -191128
5549 -191128 424358 -40123 -1300218 -3533888 -5856512 -6735816 -5775444 -3684815 -878804
5540 -878804 2099640 3137933 226744 -4685620 -6272184 -2256078 2741731 2472627 -2902700
5531 -2902700 -7071112 -5766052 -1625090 181791 -1483749 -3634977 -4039038 -3623178 -4231839
5522 -4231839 -6087625 -8108094 -9483136 -10163437 -10417336 -10517717 -10618101 -10640979 -10444256
5513 -10444256 -10088460 -9606526 -8641500 -6966405 -5393669 -5242156 -6432033 -7037543 -5699237
5504 -5699237 -3811880 -3912759 -6072908 -7575363 -6703533 -5191527 -5654271 -7881982 -9501852
5495 -9501852 -9531520 -9024619 -8312021 -6186784 -2731360 -637691 -1958156 -5079472 -6812770
$$ packed form
5557a796375k038346k544185k657126j911720N12159L381865M228689K633911
5549a91128O15486m64481j260095k233670k322624q79304R60372K090629K806011
5540h78804K978444J038293k911189m912364j586564M016106M997809k69104n375327
5531b902700m168412J305060M140962J806881j665540k151228m04061M15860o08661
5522d231839j855786k020469j375042o80301k53899j00381j00384k2878J96723
5513a0444256L55796M81934R65026J675095J572736J51513j189877o05510J338306
5504e699237J887357j00879k160149j502455Q71830J512006m62744k227711j619870
5495i501852k9668N06901P12598K125237L455424K093669j320465l121316j733298
$$ plain form
5486 -6812770 -6342663 -5103405 -3739168 -1704128 455411 1108930 285572 26202 1058292
5477 1058292 1181472 -1649946 -6119450 -8867671 -8066220 -4570185 -464357 2428939 3439605
5468 3439605 3537950 4275389 5514780 5293254 2850537 369597 151087 1237821 800339
5459 800339 -1938202 -5345255 -8442143 -11772928 -14992763 -16141448 -14373802 -11422918
5451 -11422918 -9014514 -6490483 -2657450 1343529 3176780 2759502 2305800 2705049 2039866
5442 2039866 -1151967 -4819860 -5522213 -2933819 -190965 388602 -79805 424094 1547333
5433 1547333 1578939 597050 408898 1646035 2967171 3270119 2797940 1805900 180386
5424 180386 -1089183 -311835 1943019 2366174 -1162224 -6958496 -12217651 -16156662 -18616227
$$ packed form
5486f812770M70107J239258J364237K035040K159539O53519q23358k59370J032090
5477A058292J23180k831418m469504k748221Q01451L496035M105828K893296J010666
5468C439605R8345P37439J239391k21526k442717k480940k18510J086734m37482
5459H00339k738541l407053l096888l330785l219835j148685J767646K950884
5451a1422918K408404K524031L833033M000979J833251m17278m53702L99249o65183
5442B039866l191833l667893p02353K588394K742854N79567m68407N03899J123239
5433A547333L1606r81889j88152J237137J321136L02948m72179r92040j625514
5424A80386j269569P77348K254854M23155l528398n796272n259155l939011k459565
$$ plain form
5415 -18616227 -17980628 -13572995 -8508773 -6663873 -7595867 -7865435 -6763189 -6760528 -8111427
5406 -8111427 -7332264 -2632682 2668729 4365254 2435216 -194460 -1754347 -2356093 -2472009
5397 -2472009 -2904400 -4861571 -8084806 -10175979 -9596432 -7983326 -7638838 -8174293 -7775452
5388 -7775452 -6439263 -5506215 -5025712 -4188340 -3642265 -4656238 -6273994 -5878089 -2555617
5379 -2555617 2349470 7659900 12571755 14594598 10798519 2328477 -5143960 -7201458
5371 -7201458 -4993723 -2517026 -1738171 -2040710 -2433936 -2068581 82356 3820227 6812841
5362 6812841 6981218 5072358 3163453 1565244 -715847 -3218008 -4204520 -3413821 -2250463
5353 -2250463 -1137134 893174 3501146 4436251 2702152 211539 -994498 -1232223 -1421190
$$ packed form
5415a8616227O35599M407633N064222J844900r31994k69568J102246K661j350899
5406h111427P79163M699582N301411J696525j930038k629676j559887o01746j15916
5397b472009m32391j957171l223235k091173N79547J613106L44488n35455L98841
5388g775452J336189R33048M80503Q37372N46075j013973j617756L95905L322472
5379b555617M905087N310430M911855K022843l796079q470042p472437k057498
5371g201458K207735K476697P78855l02539l93226L65355K150937L737871K992614
5362F812841J68377j908860j908905j598209k281091k502161r86512P90699J163358
5353b250463J113329K030308K607972R35105j734099k490613j206037k37725j88967
$$ plain form
5344 -1421190 -861225 1117118 2815207 1981673 -896042 -3504899 -5249547 -7295971 -9381607
5335 -9381607 -9425634 -6739885 -3141027 -329372 1374815 1166213 -2269265 -7455555 -9802976
5326 -9802976 -6952949 -2192536 -105589 -989006 -2377386 -3799864 -6073774 -7379501
5318 -7379501 -4848178 -36285 1862245 -637774 -2952905 -1215619 2377869 3535912
5310 3535912 2019652 709076 786700 1092969 853762 101074 -1580489 -4041322 -5285985
5301 -5285985 -3929092 -2051866 -2648475 -4818228 -4799908 -1855720 255754 -1376826 -4870694
5292 -4870694 -6396439 -4773779 -1647903 1216708 3114997 3904355 3762971 2972609 1285249
5283 1285249 -1746156 -5431559 -8114815 -9257167 -10088862 -11457526 -12357398 -11579217 -9599529
$$ packed form
5344a421190N59965J978343J698089q33534k877715k608857j744648k046424k085636
5335i381607m4027K685749L598858K811655J704187k08602l435478n186290k347421
5326i802976K850027M760413K086947q83417j388380j422478k273910j305727
5318g379501K531323M811893J898530k500019k315131J737286L593488J158043
5310C535912j516260j310576P7624L06269k39207p52688j681563k460833j244663
5301e285985J356893J877226n96609k169753J8320K944188K111474j632580l493868
5292d870694j525745J622660L125876K864611J898289P89358j41384p90362j687360
5283A285249l031405l685403k683256j142352q31695j368664q99872P78181J979688
$$ plain form
5274 -9599529 -7672974 -6080771 -4467777 -2980086 -1844460 -698562 419466 399502 -1112969
5265 -1112969 -2192086 -945669 1159202 542565 -3781820 -8803477 -11240972 -10671990 -8282364
5256 -8282364 -4765249 -1044022 793480 -283079 -1916924 -787900 2592991 3861235
5248 3861235 287442 -5776497 -10212527 -12095897 -13332998 -14511941 -13817000 -10248412
5240 -10248412 -5561991 -2033609 -44616 974913 883322 -197008 -561645 1175592 3464234
5231 3464234 3477690 1375679 452062 2452289 5265828 6646531 7832378 11004851 14662960
5222 14662960 14677664 9866155 3708564 -268319 -2511411 -5484116 -9432555 -11992415
5214 -11992415 -11296066 -7903740 -3924737 -1382502 -1103410 -2026243 -1876803 227724 2087745
$$ packed form
5274i599529J926555J592203J612994J487691J135626J145898J118028j9964j512471
5265a112969j079117J246417K104871o16637m324385n021657k437495N68982K389626
5256h282364L517115L721227J837502j076559j633845J129024L380891J268244
5248C861235l573793o063939m436030j883370j237101j178943O94941L568588
5240a0248412M686421L528382J988993J019529r1591j080330l64637J737237K288642
5231C464234J3456k102011r23617K000227K813539J380703J185847L172473L658109
5222A4662960J4704m811509o157591l976883k243092k972705l948439k559860
5214a1992415O96349L392326L979003K542235K79092r22833J49440K104527J860021
$$ plain form
5205 2087745 799892 -3272055 -6735567 -7684485 -7774218 -8700315 -8937687 -6275020 -1952214
5196 -1952214 815546 1813568 3891772 7611392 9361356 6601270 2068997 10517
5188 10517 171627 -1180488 -5169961 -8738720 -9407298 -8426861 -7924979 -7389501 -4976716
5179 -4976716 -938570 2330506 3401658 3543497 5115368 8864757 13004505 14883253
5171 14883253 13656160 11098668 9466463 9130538 9155008 9396470 10278978 10832990 9326629
5162 9326629 6336186 4743061 5504662 5781794 3022705 -1334017 -4632468 -7436310 -11894528
5153 -11894528 -16898316 -18726146 -16473766 -13203840 -11117867 -9163789 -6621761 -5418429
5145 -5418429 -6681752 -8133315 -7788872 -7658102 -10215884 -13086306 -11534619 -5713212 -1154156
$$ packed form
5205B087745j287853m071947l463512r48918q9733r26097k37372K662667M322806
5196a952214K767760R98022K078204L719620J749964k760086m532273k058480
5188A0517J61110j352115l989473l568759o68578R80437N01882N35478K412785
5179d976716M038146L269076J071152J41839J571871L749389M139748J878748
5171A4883253j227093k557492j632205l35925K4470K41462Q82508N54012j506361
5162I326629k990443j593125P61601K77132k759089m356722l298451k803842m458218
5153a1894528n003788j827830K252380L269926K085973J954078K542028J203332
5145e418429j263323j451563L44443J30770k557782k870422J551687N821407M559056
$$ plain form
5136 -1154156 -1378356 -3784689 -4332900 -2959567 -2006381 -1817822 -953115 459592 571380
5127 571380 -1084245 -2668631 -2651603 -1614456 -764522 37987 1743236 4175367 5616298
5118 5616298 4553968 1552033 -938833 -806239 1794404 4926357 7013447 7959092 8320553
5109 8320553 8257358 7537633 5876033 3050284 -558449 -3381968 -3684694 -1661046 491205
5100 491205 1220961 1349418 2404966 4289105 5618638 5519576 3995845 1282809 -2030762
5091 -2030762 -4880880 -6776411 -8294758 -9590064 -9408969 -6908923 -3555302 -1707081
5083 -1707081 -1998189 -3412777 -4953907 -5755197 -4850152 -2791609 -2081135 -3481547 -3404737
5074 -3404737 1576464 8590380 11047027 7351418 2632077 983976 643311 -1180302
$$ packed form
5136a154156k24200k406333n48211J373333R53186J88559Q64707J412707J11788
5127E71380j655625j584386J7028J037147Q49934Q02509J705249K432131J440931
5118E616298j062330l001935k490866J32594K600643L131953K087090R45645L61461
5109H320553o3195p19725j661600k825749l608733k823519l02726K023648K152251
5100D91205P29756J28457J055548J884139J329533r9062j523731k713036l313571
5091b030762k850118j895531j518347j295306J81095K500046L353621J848221
5083a707081k91108j414588j541130q01290R05045K058543P10474j400412P6810
5074c404737M981201P013916K456647l695609m719341j648101l40665j823613
$$ plain form
5066 -1180302 -3142144 -2664488 -600895 713632 1740705 4407307 8046784 10017099
5058 10017099 9347064 7022073 3862621 794837 -290916 869955 791780 -3655635 -9806781
5049 -9806781 -11744390 -8179582 -3985982 -3400312 -5378118 -6821865 -6971674 -6577727 -5212033
5040 -5212033 -1842394 2951820 6975379 8292518 6706349 4109074 3182347 4378019
5032 4378019 4452520 -16708 -7583760 -12722190 -12309281 -9121496 -7844575 -9612619 -11846249
5023 -11846249 -11849837 -9135453 -5524897 -4269721 -7688850 -14086596 -18161160 -16336486 -11052456
5014 -11052456 -7959699 -9234605 -11713316 -11908373 -10634979 -11020566 -13204283 -13580095 -9803631
5005 -9803631 -4377344 -1554762 -2037789 -3052186 -2961580 -2861648 -3410130 -3417479 -2936557 -4535249
$$ packed form
5066a180302j961842M77656K063593J314527J027073K666602L639477J970315
5058A0017099o70035k324991l159452l067784j085753J160871p8175m447415o151146
5049i806781j937609L564808M193600N85670j977806j443747j49809L93947J365694
5040e212033L369639M794214M023559J317139j586169k597275r26727J195672
5032D378019P4501m469228p567052n138430M12909L187785J276921j768044k233630
5023a1846249l588K714384L610556J255176l419129o397746m074564J824674N284030
5014a1052456L092757j274906k478711j95057J273394l85587k183717l75812L776464
5005i803631N426287K822582m83027j014397R0606R9932n48482p349M80922j598692
$$ plain form
4995 -4535249 -9077956 -12859150 -12006317 -7876921 -4866049 -4324488 -4141698 -3330037 -3157065
4986 -3157065 -3849686 -3740608 -2218020 -764855 -743569 -2501293 -6374745 -11775081 -15579854
4977 -15579854 -14678041 -10251618 -6454109 -4823106 -3373621 -1319184 -706910 -2360120
4969 -2360120 -3844163 -2986567 -543701 1783621 3238064 3113623 983822 -1385740 -1472667
4960 -1472667 -41923 -388298 -2955452 -4676285 -4597156 -5657200 -9181982 -12172166 -12490391
4951 -12490391 -12449268 -14321466 -16239002 -15872867 -14683195 -14951346 -15529580 -14052499 -10956827
4942 -10956827 -8260883 -6768836 -7149262 -10832993 -16739361 -20034806 -17669222 -12746723
4934 -12746723 -10142668 -10251383 -10418080 -10076087 -10719959 -12594327 -14731690 -16721989 -17837876
$$ packed form
4995d535249m542707l781194Q52833M129396L010872N41561J82790Q11661J72972
4986c157065o92621J09078J522588J453165K1286j757724l873452n400336l804773
4977a5579854R01813M426423L797509J631003J449485K054437O12274j653210
4969b360120j484043Q57596K442866K327322J454443j24441k129801k369562q6927
4960a472667J430744l46375k567154j720833P9129j060044l524782k990184l18225
4951a2490391M1123j872198j917536L66135J189672k68151n78234J477081L095672
4942a0956827K695944J492047l80426l683731n906368l295445K365584M922499
4934a2746723K604055j08715j66697L41993o43872j874368k137363j990299j115887
$$ plain form
4925 -17837876 -16459192 -12898272 -10442984 -11048282 -12505010 -12276336 -11204019 -10881068 -10545387
4916 -10545387 -9260948 -7981258 -7138825 -5910950 -5765113 -9641691 -15175208 -15021478 -7676966
4907 -7676966 -1354658 -2352405 -6415914 -7290860 -6551843 -7862990 -8625916 -5782570 -3536729
4898 -3536729 -6250092 -9592940 -8099314 -5339076 -6408743 -6868711 -944401 5370774
4890 5370774 2573321 -6222353 -11179766 -12682667 -17562659 -23484384 -23622751 -22369717
4882 -22369717 -28356813 -36180863 -34974155 -30392689 -34791047 -40628407 -32720497 -22502646
4874 -22502646 -30133710 -28354303 44743537 190514001 312130928 315790728 222127923
4867 222127923 131653082 99229346 94156177 75958912 51265387 41267649 39925593
$$ packed form
4925a7837876J378684L560920K455288o05298j456728K28674J072317L22951L35681
4916a0545387J284439J279690Q42433J227875J45837l876578n533517J53730P344512
4907g676966O322308r97747m063509q74946P39017j311147p62926K843346K245841
4898c536729k713363l342848J493626K760238j069667m59968N924310O315175
4890E370774k797453q795674m957413j502901m879992n921725j38367J253034
4882b2369717n987096p824050J206708M581466m398358n837360P907910J0217851
4874b2502646p631064J779407P3097840J45770464J21616927L659800r3662805
4867B22127923r0474841l2423736n073169j8197265k4693525r997738j342056
$$ plain form
4860 39925593 31712420 21477392 20678666 23275959 17690037 8584055 7176505 10791261
4852 10791261 9570058 5057722 6136118 12599620 16807174 17166171 17947155 19343268
4844 19343268 18079136 14826812 12439927 10207232 7249188 7291134 12533128 17263057
4836 17263057 15407669 10362108 9488073 12564714 13617640 11080560 8288765 6305388
4828 6305388 3764253 2035186 3584766 6540637 7035243 5515179 5028375 4995162 2570894
4819 2570894 -1186618 -2199505 551129 4733126 9041502 13002745 14071239 10242022
4811 10242022 4557990 2169417 3747681 5963357 6957681 6966298 5432823 2496589 1665975
4802 1665975 5662577 10877387 11404743 7624982 5220345 6333337 7546650 6611784 5230648
$$ packed form
4860C9925593q213173j0235028p98726K597293n585922r105982j407550L614756
4852A0791261j221203m512336J078396O463502M207554L58997P80984J396113
4844A9343268j264132l252324k386885k232695k958044M1946N241994M729929
4836A7263057j855388n045561q74035L076641J052926k537080k791795j983377
4828F305388k541135j729067J549580K955871M94606j520064m86804l3213k424268
4819B570894l757512j012887K750634M181997M308376L961243J068494l829217
4811A0242022n684032k388573J578264K215676R94324Q617j533475k936234q30614
4802A665975L996602N214810N27356l779761k404637J112992J213313r34866j381136
$$ plain form
4793 5230648 4255061 1691477 -2746120 -5731373 -5055693 -2630067 -901302 629801 3460869
4784 3460869 7006103 9042722 7836089 3378053 -2035108 -4841295 -3827612 -2131702
4776 -2131702 -3339366 -6365180 -6994469 -3895906 958 1871766 1659313 363421 -1333330
4767 -1333330 -2322768 -1424659 1023856 3498315 4811771 3942636 -56002 -5689624 -8476002
4758 -8476002 -5930094 -1432855 382495 287396 2194537 5853461 7160233 5267046 3868954
4749 3868954 4947456 6436575 6983456 7865359 8821470 7169236 3176083 1478766 4445208
4740 4445208 8383661 9339496 8740640 9798338 11599713 10717154 6512425 1261855 -3426144
4731 -3426144 -7137054 -8841396 -7565152 -4289058 -994176 1563662 3515442 4398679
$$ packed form
4793E230648r75587k563584m437597k985253O75680K425626J728765J531103K831068
4784C460869L545234K036619j206633m458036n413161k806187J013683J695910
4776b131702j207664l025814o29289L098563L896864J870808k12453j295892j696751
4767a333330r89438Q98109K448515K474459J313456q69135l998638n633622k786378
4758h476002K545908M497239J815350r5099J907141L658924J306772j893187j398092
4749C868954J078502J489119N46881Q81903R56111j652234l993153j697317K966442
4740D445208L938453R55835n98856J057698J801375q82559m204729n250570m687999
4731c426144l710910j704342J276244L276094L294882K557838J951780Q83237
$$ plain form
4723 4398679 3773730 2387923 1155385 -134612 -1805528 -3110961 -3374566 -3179881 -3204415
4714 -3204415 -3086718 -2561526 -2207204 -1791355 345368 4471223 7658315 7054612 3900774
4705 3900774 1963910 2504478 2996082 840232 -3429859 -6941471 -7245816 -4051781 849590
4696 849590 4966620 6701975 5814717 2847735 -1028855 -3868279 -4153949 -2605301 -1478194
4687 -1478194 -1567709 -1311405 513407 2865702 4341945 5544177 8026585 11741449 14869212
4678 14869212 15645952 13465946 8981317 4141643 1437320 2035459 4974729 8587313
4670 8587313 11828170 13798285 13452619 10947248 8118993 6308833 4678030 2075030
4662 2075030 -403674 -580812 1461343 3087940 2397020 299924 -1198513 -1561503 -1655947
$$ packed form
4723D398679o24949j385807j232538j289997j670916j305433k63605J94685k4534
4714c204415J17697N25192L54322M15849K136723M125855L187092o03703l153838
4705C900774j936864N40568M91604k155850m270091l511612l04345L194035M901371
4696H49590M117030J735355q87258k966982l876590k839424k85670J548648J127107
4687a478194q9515K56304J824812K352295J476243J202232K482408L714864L127763
4678A4869212P76740k180006m484629m839674k704323N98139K939270L612584
4670H587313L240857J970115l45666k505371k828255j810160j630803k603000
4662B075030k478704j77138K042155J626597o90920k097096j498437l62990r4444
$$ plain form
4653 -1655947 -1876267 -1566934 -418652 627383 725072 815389 2598892 5621278 6889184
4644 6889184 4361381 -335987 -3904142 -5019830 -4485310 -2825563 68318 3346217
4636 3346217 5561727 6757659 8226475 10065623 10921732 10291426 8979977 7055876 3709381
4627 3709381 -238764 -2035743 -249888 3545533 7120547 9612171 10475432 8895101
4619 8895101 5704953 3794908 4854230 7206416 8231776 7350454 5363673 2732565
4611 2732565 154679 -847956 265551 2007281 3160396 4612604 7245241 9597477
4603 9597477 9638473 7631982 5356164 3655248 2579153 2602782 3537673 3337286 356998
4594 356998 -3813488 -5872790 -4664393 -1660387 1716961 5118824 7942582 9083433
$$ packed form
4653a655947k20320L09333J148282J046035R7689R0317J783503L022386J267906
4644F889184k527803m697368l568155j115688N34520J659747K893881L277899
4636C346217K215510J195932J468816J839148Q56109o30306j311449j924101l346495
4627C709381l948145j796979J785855L795421L575014K491624Q63261j580331
4619H895101l190148j910045J059322K352186J025360q81322j986781k631108
4611B732565k577886j002635J113507J741730J153115J452208K632637K352236
4603I597477M0996k006491k275818j700916j076095K3629R34891k00387k980288
4594C56998m170486k059302J208397L004006L377348L401863K823758J140851
$$ plain form
4586 9083433 8258719 6289819 4170757 2803786 2945276 4154020 4614827 3464022 2450928
4577 2450928 3653901 6302231 7610938 6194504 3053324 -133224 -2056739 -1991315 -873013
4568 -873013 -1403349 -4987975 -9178509 -10327007 -8273385 -6106145 -5687422 -5970333 -5656135
4559 -5656135 -4753640 -3028955 384960 4651707 6665380 4497253 281671 -1748501
4551 -1748501 240657 3811595 4698645 1077801 -4346282 -6928673 -5115119 -1927749
4543 -1927749 -739561 -1166985 -837448 347130 467155 -642900 -1021755 -218153 -395862
4534 -395862 -2852771 -5731642 -6401349 -4483484 -1587997 521736 802508 -566392 -1886110
4525 -1886110 -1466079 176972 1159085 1387295 2682069 5154808 6065486 3810660 741670
$$ packed form
4586I083433q24714j968900k119062j366971J41490J208744M60807j150805j013094
4577B450928J202973K648330J308707j416434l141180l186548j923515O5424J118302
4568h73013n30336l584626m190534j148498K053622K167240M18723k82911L14198
4559e656135R02495J724685L413915M266747K013673k168127m215582k030172
4551a748501J989158L570938Q87050l620844n424083k582391J813554L187370
4543a927749J188188m27424L29537J184578J20025j110055l78855Q03602j77709
4534c95862k456909k878871o69707J917865K895487K109733K80772j368900j319718
4525a886110M20031J643051R82113K28210J294774K472739R10678k254826l068990
$$ plain form
4516 741670 -182952 232395 -879733 -3421780 -4168549 -1857085 455502 -435835 -3271687
4507 -3271687 -3957827 -1057149 2508413 3572255 2624691 2259322 2941133 2402535 -773847
4498 -773847 -4862870 -6970554 -5990678 -3012744 -113623 683251 -1121249 -3147388 -1973833
4489 -1973833 2481845 6304741 6795875 6029497 6805749 7427986 4343472 -1238193 -3805819
4480 -3805819 -904059 3865671 6099252 5318365 3157209 283960 -2684011 -3839847
4472 -3839847 -2134666 652730 2001017 1307242 -1005220 -5081760 -10171327 -13193376
4464 -13193376 -11528971 -6671019 -2793738 -1946985 -2648636 -2940713 -2533579 -1544377 695224
4455 695224 4298747 7581864 8616344 7589391 6439582 6184330 5688729 3552311 395477
$$ packed form
4516G41670r24622M15347j112128k542047p46769K311464K312587q91337k835852
4507c271687o86140K900678L565562J063842r47564l65369O81811n38598l176382
4498g73847m089023k107684R79876K977934K899121P96874j804500k026139J173555
4489a973833M455678L822896M91134p66378P76252O22237l084514n581665k567626
4480c805819K901760M769730K233581p80887k161156k873249k967971j155836
4472c839847J705181K787396J348287o93775k312462m076540n089567l022049
4464a3193376J664405M857952L877281Q46753p01651k92077M07134R89202K239601
4455F95224L603523L283117J034480j026953j149809k55252m95601k136418l156834
$$ plain form
4446 395477 -1688036 -1721014 -897200 -892179 -1978534 -3142632 -3348473 -2422856 -1436937 -2248510
4436 -2248510 -5487487 -8920220 -9562571 -7847340 -7382534 -9414924 -10192939 -6109783 822215
4427 822215 5667161 6994147 7082845 6919238 5147202 1915628 -324427 -790214 -1765145
4418 -1765145 -4800310 -8283665 -9985465 -9652927 -8127730 -6190663 -5055218 -5620165 -6569265
4409 -6569265 -5792071 -4259710 -5388538 -9548102 -12524954 -11060943 -6833246 -3131656
4401 -3131656 -731282 725481 409395 -1735037 -3358324 -3182285 -3813863 -7617871 -11654782
4392 -11654782 -10719219 -4617292 1318834 2922187 1147226 -1048374 -2849821 -5378938
4384 -5378938 -9026934 -12183826 -12264127 -8083400 -1788189 2147736 876391 -4031030 -8181171
$$ packed form
4446C95477k083513l2978Q23814N021j086355j164098k05841R25617R85919q11573
4436b248510l238977l432733o42351J715231M64806k032390p78015M083156O931998
4427H22215M844946J326986Q8698j63607j772036l231574k240055m65787r74931
4418a765145l035165l483355j701800L32538J525197J937067J135445n64947r49100
4409f569265P77194J532361j128828m159564k976852J464011M227697L701590
4401c131656K400374J456763l16086k144432j623287J76039o31578l804008m036911
4392a1654782R35563O101927N936126J603353j774961k195600j801447k529117
4384e378938l647996l156892q0301M180727O295211L935925j271345m907421m150141
$$ plain form
4375 -8181171 -8209673 -3951094 1849509 5342505 4506793 1202444 -789115 -142147 1220385
4366 1220385 1854024 2590026 3590434 2700469 -1123773 -5279130 -6830285 -6128217 -4660275
4357 -4660275 -1801544 2991786 6833287 6272685 2508423 -77440 -95699 -108545 -1384517
4348 -1384517 -1481913 1795083 6816643 10006484 9797032 7879049 7496371 10526490 15105581
4339 15105581 16465615 11514471 2311821 -6168670 -11019166 -12820018 -13263078 -13447011
4331 -13447011 -13867762 -13994385 -12211943 -7993984 -3579304 -1589193 -1581787 -1069324 496327
4322 496327 1005501 -1070647 -4669315 -7569891 -8468568 -7672212 -6785560 -7383297 -9265461
4313 -9265461 -10845849 -11715800 -13077721 -14855497 -14894843 -12585385 -10479994 -10109818 -9177394
$$ packed form
4375h181171k8502M258579N800603L492996q35712l304349j991559O46968J362532
4366A220385O33639P36002J000408q89965l824242m155357j551155P02068J467942
4357d660275K858731M793330L841501n60602l764262k585863j8259j2846j275972
4348a384517r7396L276996N021560L189841k09452j917983l82678L030119M579091
4339A5105581J360034m951144r202650q480491m850496j800852m43060j83933
4331a3447011m20751j26623J782442M217959M414680J990111P406N12463J565651
4322D96327N09174k076148l598668k900576q98677P96356Q86652n97737j882164
4313i265461j580388q69951j361921j777776l9346K309458K105391L70176R32424
$$ plain form
4304 -9177394 -5801001 -2415889 -1654635 -1288920 2048847 6564699 8098811 7381941 8549139
4295 8549139 11474304 11990889 9643839 8595759 9840392 9034000 4141479 -780799 -2340597
4286 -2340597 -3026074 -6152508 -10074194 -11351074 -10195390 -8844352 -7164270 -3690391
4278 -3690391 645857 3055403 2239099 -797158 -4098504 -5632440 -4480120 -2236932
4270 -2236932 -1298842 -1119859 1129313 5478591 8275850 7781104 6769475 7370060 7291715
4261 7291715 4423582 1678962 3024493 6942364 8204949 5094642 1002436 -808997
4253 -808997 -737778 -943174 -2481546 -4903411 -7097492 -8067912 -7660847 -6602421 -5625550
4244 -5625550 -4999695 -4715985 -4125760 -1918572 1748371 3601042 326529 -6654891 -12282303
$$ packed form
4304i177394L376393L385112P61254L65715L337767M515852J534112p16870J167198
4295H549139K925165N16585k347050j048080J244633q06392m892521m922278j559798
4286b340597o85477l126434l921686j276880J155684J351038J680082L473879
4278c690391M336248K409546q16304l036257l301346j533936J152320K243188
4270b236932R38090J78983K249172M349278K797259m94746j011629O00585p8345
4261G291715k868133k744620J345531L917871J262585l110307m092206j811433
4253h08997P1219k05396j538372k421865k194081r70420M07065J058426R76871
4244e625550O25855K83710N90225K207188L666943J852671l274513o981420n627412
$$ plain form
4235 -12282303 -13962829 -13512008 -12608781 -10090354 -5216387 -197921 2569421 3228903 2855123
4226 2855123 1668062 187910 -439462 -402348 -804405 -647351 2294950 6818904 8692490
4217 8692490 7063606 6029500 8008083 10207942 9992084 8880779 8267584 6034458 1139052
4208 1139052 -2871919 -2987309 -1379273 -952639 -342976 2291795 4551068 3874344 2885055
4199 2885055 5405123 9867193 11707530 10020466 7271351 4682617 2216919 819203
4191 819203 593291 -880523 -4789945 -8480235 -9830024 -10477380 -11296508 -9473717 -4335601
4182 -4335601 -784543 -1886886 -3676231 -2992538 -4021123 -9837310 -14103574 -10249592
4174 -10249592 -3109240 -1246398 -2760580 32135 5916352 6996840 2872637 199343
$$ packed form
4235a2282303j680526M50821R03227K518427M873967N018466K767342O59482l73780
4226B855123j187061j480152o27372L7114m02057J57054K942301M523954J873586
4217H692490j628884j034106J978583K199859k15858j111305o13195k233126m895406
4208A139052m010971j15390J608036M26634O09663K634771K259273o76724r89289
4199B885055K520068M462070J840337j687064k749115k588734k465698j397716
4191H19203k25912j473814l909422l690290j349789o47356q19128J822791N138116
4182d335601L551058j102343j789345O83693j028585n816187m266264L853982
4174a0249592P140352J862842j514182K792715N884217J080488m124203k673294
$$ plain form
4166 199343 -173223 -3145280 -7506688 -6892921 -2434848 -1785832 -5175311 -5102175 -499961
4157 -499961 1806312 615111 1877801 5713060 5923225 3474042 5336916 8921125 4662995
4148 4662995 -4456710 -5492512 -63980 -3580360 -15514787 -17515535 -9589782 -15153767
4140 -15153767 -31958716 -14211831 62040891 143279940 153387777 91517199 29774480
4133 29774480 16616250 29105116 28527557 16788996 14568734 19029881 14341860 3497427
4125 3497427 831953 4864842 3020538 -4475932 -6770531 -3148713 -2564504 -5655832
4117 -5655832 -4439020 1540104 4234869 2206502 2942641 8993783 13786991 13112730 10538542
4108 10538542 9316160 7795938 5083391 3634380 4198033 4649631 5114807 7985389 11923950
$$ packed form
4166A99343l72566k972057m361408O13767M458073O49016l389479P3136M602214
4157d99961K306273j191201J262690L835259K10165k449183J862874L584209m258130
4148D662995r119705j035802N428532l516380j1934427k000748P925753n563985
4140a5153767j6804949J7746885P6252722Q1239049J0107837o1870578o1742719
4133B9774480j3158230J2488866n77559j1738561k220262M461147m688021j0844433
4125C497427k665474M032889j844304p496470k294599L621818N84209l091328
4117e655832J216812N979124K694765k028367P36139O051142M793208o74261k574188
4108A0538542j222382j520222k712547j449011N63653M51598M65176K870582L938561
$$ plain form
4099 11923950 12318155 8917024 6629770 7117318 5924267 396713 -5367687 -6722709
4091 -6722709 -4869923 -3451056 -2434143 663971 5562429 8778024 7980883 4803366
4083 4803366 3130085 4903943 7465575 5966521 -587309 -7270173 -9106250 -7121427
4075 -7121427 -5634933 -5445510 -3988964 -1270509 -520312 -2433383 -3609124 -2213317 -837221
4066 -837221 -1586897 -2231711 -107345 3171696 4075009 2215928 164096 -333107 642013
4057 642013 2716550 5194483 6286643 4855476 2642767 2617486 5074518 7158238 6458949
4048 6458949 3559821 641527 -1141112 -2206043 -3285081 -4441336 -5220466 -5294728 -4691994
4039 -4691994 -3408036 -1145524 2158286 5693070 8158082 8734275 7282338 3996269
$$ packed form
4099A1923950L94205l401131k287254M87548j193051n527554n764400j355022
4091f722709J852786J418867J016913L098114M898458L215595p97141l177517
4083D803366j673281J773858K561632j499054o553830o682864j836077J984823
4075g121427J486494J89423J456546K718455P50197j913071j175741J395807J376096
4066h37221p49676o44814K124366L279041R03313j859081k051832m97203R75120
4057F42013K074537K477933J092160j431167k212709k5281K457032K083720o99289
4048F458949k899128k918294j782639j064931j079038j156255p79130p4262O02734
4039d691994J283958K262512L303810L534784K465012N76193j451937l286069
$$ plain form
4031 3996269 -184358 -3100324 -2892469 -547050 472894 -1814147 -5343072 -6616476
4023 -6616476 -5050180 -3191328 -3114716 -4442700 -6028637 -7673195 -9336147 -10197688 -9764940
4014 -9764940 -8871633 -8346613 -7690759 -6554808 -6505738 -9158451 -13003972 -14602022 -13122188
4005 -13122188 -11116359 -10184447 -8895784 -6545271 -5774185 -8500772 -11694814 -11161131 -8261213
3996 -8261213 -8451530 -13077557 -16934179 -15260809 -9541965 -4479853 -2227059 -1891430 -2236273
3987 -2236273 -2150776 -161545 3781848 7037928 7149656 5233783 4393425 5506980 6792925
3978 6792925 6955905 6324079 4982164 2265514 -1317702 -3719831 -3855120 -2959721 -2509453
3969 -2509453 -2124205 -799424 794170 997329 29697 384359 3387734 6515871 5830996
$$ packed form
4031C996269m180627k915966K07855K345419J019944k287041l528925j273404
4023f616476J566296J858852P6612j327984j585937j644558j662952q61541M32748
4014i764940Q93307N25020O55854J135951M9070k652713l845521j598050J479834
4005a3122188K005829R31912J288663K350513P71086k726587l194042N33683K899918
3996h261213j90317m626027l856622J673370N718844N062112K252794L35629l44843
3987b236273Q5497J989231L943393L256080J11728j915873q40358J113555J285945
3978F792925J62980o31826j341915k716650l583216k402129j35289Q95399M50268
3969b509453L85248J324781J593594K03159r67632L54662L003375L128137o84875
$$ plain form
3960 5830996 925953 -4324026 -6405599 -5698731 -4317436 -2604489 -89815 1735804
3952 1735804 962231 -971923 -629726 2005152 3084547 877538 -1510599 -1349945 -811405
3943 -811405 -3385842 -8254179 -11350074 -10368772 -5931091 598204 7388521 11501417 11230189
3934 11230189 8605442 7013334 7054051 7199828 7285510 8066104 8173009 5355559 791447
3925 791447 -1544488 -451810 960100 309508 -690969 595558 3895836 7078220 8873573
3916 8873573 8917603 6979632 3800406 1155417 -353888 -2109545 -4778242 -6404615 -4788930
3907 -4788930 -436765 4501895 9059645 13360769 16468937 16391119 12541444 7135751 3703289
3898 3703289 4212997 7222786 8858802 6514336 1742800 -1555901 -1833048 -1138217 -1361879
$$ packed form
3960E830996m905043n249979k081573P06868J381295J712947K514674J825619
3952A735804p73573j934154L42197K634878J079395k207009k388137J60654N38540
3943h11405k574437m868337l095895R81302M437681O529295O790317M112896k71228
3934A1230189k624747j592108M0717J45777Q5682P80594J06905k817450m564112
3925G91447k335935J092678J411910o50592j000477J286527L300278L182384J795353
3916H873573M4030j937971l179226k644989j509305j755657k668697j626373J615685
3907d788930M352165M938660M557750M301124L108168p7818l849675n405693l432462
3898C703289N09708L009789J636016k344466m771536l298701k77147O94831k23662
$$ plain form
3889 -1361879 -1526933 -205255 1487246 1677021 1267821 2972221 7071295 10638092 11390241
3880 11390241 10163334 8691413 6821695 3510561 -446516 -2483491 -1141010 2165876
3872 2165876 4447185 3548415 -677844 -6522572 -11115909 -11795302 -8055556 -2371389 1610582
3863 1610582 2077856 113965 -1983247 -2789065 -2298351 -1444008 -1540298 -3480120 -6875622
3854 -6875622 -10257864 -12250739 -12163676 -9803463 -5883874 -2576998 -2073207 -4073155 -6079874
3845 -6079874 -6606469 -6475694 -6552754 -6497731 -6748104 -9004950 -12838797 -14470753 -11670828
3836 -11670828 -7591166 -6430330 -7286364 -6368366 -3899184 -3960979 -7620151 -11060943 -11531301
3827 -11531301 -10817078 -11215315 -11883118 -11258012 -9967337 -9212449 -8837551 -8726978 -9421563
$$ packed form
3889a361879j65054J321678J692501J89775m09200J704400M099074L566797P52149
3880A1390241j226907j471921j869718l311134l957077k036975J342481L306886
3872B165876K281309q98770m226259n844728m593337o79393L739746N684167L981971
3863A610582M67274j963891k097212q05818M90714Q54343r6290j939822l395502
3854f875622l382242j992875Q7063K360213L919589L306876N03791j999948k006719
3845f079874n26595J30775p7060N5023k50373k256846l833847j631956K799925
3836a1670828M079662J160836q56034R17998K469182o1795l659172l440792m70358
3827a1531301P14223l98237o67803O25106J290675P54888L74898J10573o94585
$$ plain form
3818 -9421563 -9663650 -6391107 585292 6821455 8787071 8443850 9283604 10460445 8764107
3809 8764107 4616071 1675620 995968 -235161 -3551876 -6364312 -5761679 -2810042 -1272955
3800 -1272955 -3091445 -6448523 -8089033 -6867168 -4697254 -3979339 -4771031 -5503097 -5873084
3791 -5873084 -7005253 -8682632 -8992136 -7628296 -6926714 -8061263 -8753910 -6898397 -4168320
3782 -4168320 -3403865 -4257390 -4245616 -2646776 -491165 2031526 5100857 7115079 6054262
3773 6054262 2543513 -945901 -3198618 -4162786 -3149667 -328009 1222446 -1127728
3765 -1127728 -4753909 -4544628 -434751 2276339 801542 -1540965 -1272322 31127 -791589
3756 -791589 -3151419 -4133576 -3149595 -2064742 -1861561 -1797456 -1341134 -957451 -1090482 -1478089
$$ packed form
3818i421563k42087L272543O976399O236163J965616l43221Q39754J176841j696338
3809H764107m148036k940451o79652j231129l316715k812436O02633K951637J537087
3800a272955j818490l357078j640510J221865K169914P17915p91692p32066l69987
3791e873084j132169j677379l09504J363840P01582j134549o92647J855513K730077
3782d168320P64455q53525J1774J598840K155611K522691L069331K014222j060817
3773F054262l510749l489414k252717r64168J013119K821658J550455k350174
3765a127728l626181K09281M109877K711090j474797k342507K68643J303449q22716
3756g91589k359830r82157R83981J084853K03181O4105M56322L83683j33031l87607
$$ plain form
3746 -1478089 -1293028 276747 2748151 3763297 1484667 -2242501 -3243556 -146895
3738 -146895 3997787 5930720 5497656 3733157 633142 -3118578 -4881103 -3348037 -1285612
3729 -1285612 -2088199 -4892670 -5993759 -4202256 -1883066 -1148419 -1883887 -3508189 -5916582
3720 -5916582 -8148326 -8444825 -6487401 -3924010 -2137154 -1102118 -850055 -2051393 -4107840
3711 -4107840 -4471966 -1609865 2307934 3499766 1208108 -1293923 -730901 2321805 4476566
3702 4476566 3716714 1303075 -457629 -963721 -1049596 -1012259 -311728 1046533 2151790
3693 2151790 2330903 1672663 465624 -755015 -651940 1961998 6215237 9432461 9690760
3684 9690760 7085534 2544407 -2837217 -6996651 -7721784 -5454564 -3409384 -3535041 -4161364
$$ packed form
3746a478089J85061J569775K471404J015146k278630l727168j001055L096661
3738a46895M144682J932933m33064j764499l100015l751720j762525J533066K062425
3729a285612q02587k804471j101089J791503K319190P34647p35468j624302k408393
3720e916582k231744k96499J957424K563391J786856J035036K52063j201338k056447
3711d107840l64126K862101L917799J191832k291658k502031N63022L052706K154761
3702D476566p59852k413639j760704n06092q5875L7337P00531J358261J105257
3693B151790J79113o58240j207039j220639J03075K613938M253239L217224K58299
3684I690760k605226m541127n381624m159434p25133K267220K045180j25657o26323
$$ plain form
3675 -4161364 -3226127 -1837634 -2307075 -4264561 -5639728 -6542103 -8930976 -12578491 -14619187
3666 -14619187 -13781805 -12092599 -11076202 -8976724 -3915007 2081037 4876074 3372835
3658 3372835 496785 -918739 -1076693 -1468075 -2099248 -1907018 -932323 -430497 -992464
3649 -992464 -1946057 -2774297 -3758081 -4667543 -4159318 -1559021 1709678 3676881 3984179
3640 3984179 3181767 904011 -3140001 -6820264 -6813758 -2750058 1889528 3682075 2273579
3631 2273579 -920478 -4607699 -7159624 -6788166 -4072218 -2348844 -3492504 -4964290
3623 -4964290 -3341284 680952 3429039 3343837 2093326 1113183 -5985 -1405737 -1795413
3614 -1795413 -257318 2412705 4689075 5400582 3919593 915999 -1095835 118803
$$ packed form
3675d161364R35237J388493m69441j957486j375167r02375k388873l647515k040696
3666a4619187Q37382J689206J016397K099478N061717N996044K795037j503239
3658C372835k876050j415524j57954l91382o31173J92230R74695N01826n61967
3649i92464r53593q28240r83784r09462N08225K600297L268699J967203L07298
3640C984179q02412k277756m044012l680263O506M063700M639586J792547j408496
3631B273579l194057l687221k551925L71458K715948J723374j143660j471786
3623d964290J623006M022236K748087q5202j250511r80143j119168j399752l89676
3614a795413J538095K670023K276370P11507j480989l003594k011834J214638
$$ plain form
3606 118803 3446267 5200700 3542700 660458 -42854 2318806 5688682 7228002 5492632
3597 5492632 1521411 -1851206 -2537184 -1035079 960106 2941649 4980615 5619128 3112180
3588 3112180 -1031996 -2563696 335118 4595870 6256241 4938315 2906632 1573997
3580 1573997 920242 1057838 2164296 3325439 3221630 1952140 1074490 1934452 4619265
3571 4619265 8068646 10483545 10217678 7157129 2919358 -782940 -3405660 -4911517
3563 -4911517 -4951052 -3491382 -1309003 1025345 3749168 6591255 7905374 6426589 3207823
3554 3207823 557381 -417711 -105719 1025526 2634385 3657069 2799972 17199 -3511561
3545 -3511561 -6768041 -9278650 -10446295 -9895016 -8557359 -8063051 -8625454 -8652920 -7055512
$$ packed form
3606A18803L327464J754433j658000k882242p03312K361660L369876J539320j735370
3597E492632l971221l372617o85978J502105J995185J981543K038966O38513k506948
3588C112180m144176j531700K898814M260752J660371j317926k031683j332635
3580A573997o53755J37596J106458J161143j03809j269490q77650Q59962K684813
3571D619265L449381K414899k65867l060549m237771l702298k622720j505857
3563d911517l9535J459670K182379K334348K723823K842087J314119j478785l218766
3554C207823k650442r75092L11992J131245J608859J022684q57097k782773l528760
3545c511561l256480k510609j167645N51279J337657M94308n62403k7466J597408
$$ plain form
3536 -7055512 -5038682 -4787820 -6801286 -9241150 -9846361 -8034097 -5073578 -2554571 -1034443
3527 -1034443 -172112 374163 829786 1869231 4307098 7814652 10669881 11397057 10254938
3518 10254938 8659677 7528245 6542839 4644055 1092456 -3324497 -6152180 -5562115
3510 -5562115 -3108239 -2493362 -4576825 -5505362 -1821238 4034442 6125621 2362827 -3581118
3501 -3581118 -7804727 -10192913 -11566242 -10231673 -4601640 2391397 5162426 2031867
3493 2031867 -2696296 -4012739 -1558616 1403348 2686355 2998868 3642373 4240983 3415243
3484 3415243 910478 -1751583 -2801533 -2093660 -1216442 -1752576 -3731125 -5992878 -7645217
3475 -7645217 -8550951 -8712017 -8190282 -7681640 -7973264 -8459124 -7580179 -5537752 -4943926
$$ packed form
3536g055512K016830K50862k013466k439864o05211J812264K960519K519007J520128
3527a034443Q62331N46275M55623J039445K437867L507554K855229P27176j142119
3518A0254938j595261j131432r85406j898784l551599m416953k827683N90065
3510e562115K453876O14877k083463r28537L684124N855680K091179l762794n943945
3501c581118m223609k388186j373329J334569N630033O993037K771029l130559
3493B031867m728163j316443K454123K961964J283007L12513O43505N98610q25740
3484C415243k504765k662061j049950P07873Q77218n36134j978549k261753j652339
3475g645217r05734j61066N21735N08642k91624m85860Q78945K042427N93826
$$ plain form
3466 -4943926 -7166897 -9501515 -8484696 -5192026 -4031184 -6085601 -7148087 -3767669
3458 -3767669 1893635 5469228 5985251 5217689 3710052 1072078 -1086654 -566021 1331351
3449 1331351 955534 -2037909 -3872625 -2457253 -432290 -746973 -2429914 -3084974 -2896432
3440 -2896432 -3285852 -3512270 -1771793 1231165 2654151 1216458 -1694460 -4431687 -6509569
3431 -6509569 -7517226 -6592989 -3759642 -705728 510386 -636027 -2524055 -2708298 -503987
3422 -503987 1683923 813007 -2646740 -4674282 -2775871 702937 1991155 961848 417262
3413 417262 1368049 1893994 713051 -743071 -703907 298403 354564 -1109650 -2451697
3404 -2451697 -1525526 1860541 5224653 5742122 3550568 1676064 2007917 2777321 1445643
$$ packed form
3466d943926k222971k334618J016819L292670J160842k054417j062486L380418
3458c767669N661304L575593N16023p67562j507637k637974k158732N20633J897372
3449A331351l75817k993443j834716J415372K024963l14683j682941o55060J88542
3440b896432l89420k26418J740477L002958J422986j437693k910918k737227k077882
3431f509569j007657R24237K833347L053914J216114j146413j888028j84243K204311
3422e03987K187910q70916l459747k027542J898411L478808J288218j029307n44586
3413D17262R50787N25945j180943j456122L9164J002310N6161j464214j342047
3404b451697R26171L386067L364112N17469k191554j874504L31853P69404j331678
$$ plain form
3395 1445643 -1195274 -1876350 849863 5255599 9060390 11226498 11047128 7741156 2019563
3386 2019563 -3273102 -5269207 -3661062 -958622 -191656 -1806465 -2626652 942076 8004334
3377 8004334 13018473 11796674 5976896 -201390 -5480008 -11001261 -15772084 -16824028
3369 -16824028 -13944132 -10593979 -9326606 -9304397 -9177250 -9362123 -10128019 -10111219 -8426377
3360 -8426377 -6183441 -4378727 -2138605 1428208 5262876 7724209 8605906 8565510 7806172
3351 7806172 6456880 5154104 4308911 3718725 3314067 3072043 2110486 -317800 -2680604
3342 -2680604 -2211001 1237378 4508854 5127344 3928073 2989173 3074027 3819323 4214110
3333 4214110 2430155 -2025468 -5466614 -2942179 4711945 10547436 10126406 6472315
$$ packed form
3395A445643k640917o81076K726213M405736L804791K166108j79370l305972n721593
3386B019563n292665j996105J608145K702440P66966j614809q20187L568728P062258
3377H004334N014139j221799n819778o178286n278618n521253m770823j051944
3369a6824028K879896L350153J267373K2209J27147j84873p65896J6800J684842
3360h426377K242936J804714K240122L566813L834668K461333Q81697m0396p59338
3351G806172j349292j302776q45193n90186m04658k42024r61557k428286k362804
3342b680604M69603L448379L271476O18490j199271r38900Q4854P45296L94787
3333D214110j783955m455623l441146K524435P654124N835491m21030l654091
$$ plain form
3325 6472315 3920312 1567380 -3022313 -7497422 -7656050 -4490882 -2697953 -3187642 -2473567
3316 -2473567 608927 2736868 1574788 -843084 -1579981 -373036 1414645 2578610
3308 2578610 1827765 -1567282 -5793576 -7458440 -5583954 -2809631 -1939244 -3052076 -4512454
3299 -4512454 -5030922 -4139855 -2098593 191909 2037284 3373424 3585410 1372493 -2603879
3290 -2603879 -4848364 -3362120 -1009343 -1356739 -3014591 -2270509 125298 -58620 -3243509
3281 -3243509 -5199536 -3985156 -2284714 -1632425 147653 3537428 4555675 579736
3273 579736 -5097108 -7571863 -5764340 -1140870 4980493 10017930 10264685 6083212 3188205
3264 3188205 4922968 7062157 4692892 417534 89627 3294348 4474021 2069455
$$ packed form
3325F472315k552003k352932m589693m475109j58628L165168J792929m89689P14075
3316b473567L082494K127941j162080k417872p36897J206945J787681J163965
3308B578610p50845l395047m226294j664864J874486K774323Q70387j112832j460378
3299d512454n18468Q91067K041262K290502J845375J336140K11986k212917l976372
3290b603879k244485J486244K352777l47396j657852P44082K395807j83918l184889
3281c243509j956027J214380J700442O52289J780078L389775J018247l975939
3273E79736n676844k474755J807523M623470O121363N037437K46755m181473k895007
3264C188205J734763K139189k369265m275358l27907L204721J179673k404566
$$ plain form
3256 2069455 168678 1254720 3174048 4002704 4721471 5732409 5117969 2040908 -1519141
3247 -1519141 -3748706 -4805153 -4799310 -2990552 103490 2590100 3903355 4874663 4754597
3238 4754597 1538074 -3841949 -7046750 -5554733 -1574412 1495748 2646204 2024126
3230 2024126 -660811 -4429375 -6356823 -4896100 -1997621 -150120 745728 1966103
3222 1966103 3633558 5549575 7998735 9645300 7166866 -50398 -6752389 -6835876 -772296
3213 -772296 4995093 5686071 2413273 -1091909 -2977022 -3535457 -3201213 -1961668 -86717
3204 -86717 1674392 2783638 3585967 4977718 6978739 7986709 6577735 4001761 3233800
3195 3233800 5010577 6599565 5539572 2844648 1009372 430822 -254983 -1418191 -2077725
$$ packed form
3256B069455j900777J086042J919328Q28656P18767J010938o14440l077061l560049
3247a519141k229565j056447N843J808758L094042K486610J313255R71308j20066
3238D754597l216523n380023l204801J492017L980321L070160J150456o22078
3230B024126k684937l768564j927448J460723K898479J847501Q95848J220375
3222A966103J667455J916017K449160J646565k478434p217264o701991q3487O063580
3213g72296N767389O90978l272798l505182j885113n58435L34244J239545J874951
3204h6717J761109J109246Q02329J391751K001021J007970j408974k575974p67961
3195C233800J776777J588988j059993k694924j835276n78550o85805j163208o59534
$$ plain form
3186 -2077725 -1684058 -564419 823054 1631824 519058 -2539089 -5252350 -5690758 -5018504
3177 -5018504 -5485424 -6719428 -6689682 -5704818 -6250356 -8634823 -9922565 -8148345 -4932715
3168 -4932715 -2651187 -1334851 119586 1720157 3148509 5064903 7585180 8649410
3160 8649410 6242447 1896350 -227439 1608855 4004647 2002813 -4792600 -10764550
3152 -10764550 -9921598 -2786144 3807086 4480778 1215431 -222716 1796770 3423717
3144 3423717 1483343 -2496052 -5278003 -5851209 -4848673 -2791892 -965619 -1705043 -5360227
3135 -5360227 -8745515 -9022793 -7493503 -7015074 -7413142 -6642149 -5069755 -4694877 -4703469
3126 -4703469 -2128830 2529330 4579020 1686393 -2431547 -3217503 -1303165 -484026 -1771041
$$ packed form
3186b077725L93667J119639J387473Q08770j112766l058147k713261m38408O72254
3177e018504m66920j234004K9746R84864n45538k384467j287742J774220L215630
3168d932715K281528J316336J454437J600571J428352J916394K520277J064230
3160H649410k406963m346097k123789J836294K395792k001834o795413n971950
3152a0764550Q42952P135454O593230O73692l265347j438147K019486J626947
3144C423717j940374l979395k781951n73206J002536K056781J826273p39424l655184
3135e360227l385288k77278J529290M78429l98068P70993J572394L74878q592
3126d703469K574639M658160K049690k892627m117940p85956J914338Q19139j287015
$$ plain form
3117 -1771041 -2744883 -1943065 -868382 -1489387 -3804956 -6153247 -6560376 -3913342 753261
3108 753261 4185814 3591186 -300645 -3827233 -4185136 -1882034 407984 486171 -1732161
3099 -1732161 -4213905 -4489116 -2254606 -153733 -916329 -3858562 -5511101 -3861512 -607835
3090 -607835 1294289 1007440 -229020 -1550684 -3429746 -6183657 -8664344 -9214448 -7735700
3081 -7735700 -6097001 -6053775 -7161815 -7535116 -6526776 -5452399 -5239450 -4748648 -2637568
3072 -2637568 84252 972369 -754853 -3501729 -5463243 -6018133 -5031065 -2443668 943653
3063 943653 3485175 4021808 2579131 -35495 -2326646 -2405793 3508 2098283 720387
3054 720387 -3272355 -5706059 -4611053 -2372981 -1465345 -1124678 -182569 -237003 -2977988
$$ packed form
3117a771041r73842Q01818J074683o21005k315569k348291m07129K647034M666603
3108G53261L432553n94628l891831l526588l57903K303102K290018P8187k218332
3099a732161k481744k75211K234510K100873p62596k942233j652539J649589L253677
3090f07835J902124k86849j236460j321664j879062k753911k480687n50104J478748
3081g735700J638699M3226j108040l73301J008340J074377K12949M90802K111080
3072b637568K721820Q88117j727222k746876j961514n54890R87068K587397L387321
3063I43653K541522N36633j442677k614626k291151p9147K409301K094775j377896
3054G20387l992742k433704J095006K238072R07636L40667R42109n4434k740985
$$ plain form
3045 -2977988 -6422724 -7255167 -5746233 -4985333 -5879394 -6257132 -4747103 -2291376 332871
3036 332871 3234121 5146605 3792080 -323345 -3436308 -3343656 -2043209 -1934133 -2094305
3027 -2094305 -678511 1159398 592666 -2765724 -6491164 -8324707 -7563954 -4450599 -360486
3018 -360486 2106825 1507402 -270352 -174161 2018710 3871800 4060924 3612448 3300499
3009 3300499 2218261 -385985 -3763270 -6759560 -8438623 -7190961 -1660713 6158687
3001 6158687 11062563 10058505 6220230 4788431 6354734 6627335 2916523 -2009453
2993 -2009453 -3845589 -2540525 -2061520 -4986316 -9334987 -11306373 -9806576 -7073843
2985 -7073843 -5295147 -4029341 -1547246 2239016 5437882 6748125 7221078 8734386
$$ packed form
3045b977988l444736q32443J508934P60900q94061l77738J510029K455727K624247
3036C32871K901250J912484j354525m115425l112963R2652J300447J09076j60172
3027b094305J415794J837909n66732l358390l725440j833543P60753L113355M090113
3018c60486K467311n99423j777754R6191K192871J853090J89124m48476l11949
3009C300499j082238k604246l377285k996290j679063J247662N530248P819400
3001F158687M903876j004058l838275j431799J566303K72601l710812m925976
2993b009453j836136J305064M79005k924796m348671j971386J499797K732733
2985g073843J778696J265806K482095L786262L198866J310243M72953J513308
$$ plain form
2977 8734386 11210960 12210872 9408933 3042293 -4220177 -9444014 -11194197 -9561951
2969 -9561951 -5363156 77549 4784013 6951488 6555688 5596260 5992179 7439226 7941949
2960 7941949 6153870 2404176 -2244461 -6653779 -9185752 -8210087 -4158173 -192410
2952 -192410 492197 -2169041 -5505154 -7247727 -7129167 -5635123 -2874468 546895 2754095
2943 2754095 2110497 -680487 -3035732 -3335617 -2666348 -3285189 -5725315 -8144493 -8791490
2934 -8791490 -8519557 -9919294 -13794274 -17498448 -17723709 -14458204 -10948235 -9767705 -10358087
2925 -10358087 -10981858 -11539649 -12921052 -14377506 -13503336 -9126248 -2881710 2517409 5497204
2916 5497204 5797630 3905364 1341725 369096 1907104 4252221 5241104 5186118 5875898
$$ packed form
2977H734386K476574R99912k801939o366640p262470n223837j750183J632246
2969i561951M198795N440705M706464K167475l95800r59428L95919J447047N02723
2960G941949j788079l749694m648637m409318k531973R75665M051914L965763
2952a92410O84607k661238l336113j742573J18560J494044K760655L421363K207200
2943B754095o43598k790984k355245k99885O69269o18841k440126k419178o46997
2934h791490K71933j399737l874980l704174k25261L265505L509969J180530n90382
2925a0358087o23771n57791j381403j456454Q74170M377088O244538N399119K979795
2916E497204L00426j892266k563639r72629J538008K345117R88883n4986O89780
$$ plain form
2907 5875898 6863841 5302088 573536 -3315655 -2464587 1096017 1477614 -3084736 -7483153
2898 -7483153 -6288672 -422154 4822902 6266126 4476673 529525 -4939197 -9573300
2890 -9573300 -10332027 -8066521 -7614212 -11273302 -15198156 -14860669 -11262693 -8358899 -6793101
2881 -6793101 -4551476 -2160240 -2007725 -2904295 -910874 3482380 4556111 -105883 -5528850
2872 -5528850 -7032344 -7099463 -10046953 -13991400 -13986300 -10538546 -8556192 -8846862 -7145897
2863 -7145897 -2076829 1972430 1636962 -966133 -2984467 -5515417 -10337388 -15362849
2855 -15362849 -16919276 -14605403 -11035436 -8192828 -6246302 -4658301 -2690538 -45005
2847 -45005 1978358 1897627 1382952 4052104 9309715 11144525 6170957 -485617 -1556374
$$ packed form
2907E875898R87943j561753m728552l889191Q51068L560604L81597m562350m398417
2898g483153J194481N866518N245056J443224j789453l947148n468722m634103
2890i573300p58727K265506M52309l659090l924854L37487L597976K903794J565798
2881f793101K241625K391236J52515q96570J993421M393254J073731m661994n422967
2872e528850j503494o7119k947490l944447N100L447754J982354k90670J700965
2863g145897N069068M049259l35468k603095k018334k530950m821971n025461
2855a5362849j556427K313873L569967K842608J946526J588001J967763K645533
2847d5005K023363q0731n14675K669152N257611J834810m973568o656574j070757
$$ plain form
2838 -1556374 2620985 5669696 4991569 4386422 6661852 9015260 7701632 3321621 -949931
2829 -949931 -3561000 -4605024 -3824400 -1256234 1189896 1162190 -1187542 -3180535 -2774732
2820 -2774732 -852538 155324 -426425 -543289 1518445 3945709 3274020 -526261 -3514981
2811 -3514981 -3417873 -2837038 -4612098 -6849812 -5966915 -2433343 622127 2835649 5810887
2802 5810887 7872046 5242311 -1079916 -5187421 -4575814 -3399062 -5119705 -6979580
2794 -6979580 -5252917 -1645276 -59740 -164555 1097236 3627394 4441704 2775502 727748
2785 727748 -809027 -3161851 -6721757 -9851731 -11268176 -11134510 -9709127 -7021375 -3823874
2776 -3823874 -988513 1724032 4551048 6194653 5549069 4092944 3982408 4392195 2635275
$$ packed form
2838a556374M177359L048711o78127o05147K275430K353408j313628m380011m271552
2829i49931k611069j044024P80624K568166K446130k7706k349732j992993M05803
2820b774732J922194J007862n81749j16864K061734K427264o71689l800281k988720
2811c514981R7108N80835j775060k237714Q82897L533572L055470K213522K975238
2802E810887K061159k629735o322227m107505O11607J176752j720643j859875
2794f979580J726663L607641J585536j04815J261791K530158Q14310j666202k047754
2785G27748j536775k352824l559906l129974j416445J33666J425383K687752L197501
2776c823874K835361K712545K827016J643605o45584j456125j10536M09787j756920
$$ plain form
2767 2635275 -1305588 -4367061 -4779466 -4011585 -3760605 -3648918 -2825382 -1580330 -384934
2758 -384934 735524 1109964 -220195 -2128217 -1515194 2813525 8028658 10435404 9443553
2749 9443553 7094814 4842093 2303907 -1429977 -6490000 -11896142 -15729551 -16020405
2741 -16020405 -12300127 -6417137 -1654503 -788727 -4155749 -8936829 -11177609 -9702336
2733 -9702336 -7400465 -7355213 -8601114 -7641018 -3462843 1406740 4571263 5723347 4764879
2724 4764879 1064868 -4347653 -8562817 -10214236 -10885652 -11828175 -11788293 -9811788 -7643548
2715 -7643548 -6938563 -6227107 -3514394 -348480 -161956 -3294660 -6539122 -7356633 -5996943
2706 -5996943 -3577026 -637181 1988062 2969996 1815730 -884952 -4472323 -7988658
$$ packed form
2767B635275l940863l061473m12405P67881K50980J11687Q23536J245052J195396
2758c84934J120458L74440j330159j908022O13023M328719N215133K406746r91851
2749I443553k348739k252721k538186l733884n060023n406142l833409k90854
2741a6020405L720278N882990M762634Q65776l367022m781080k240780J475273
2733i702336K301871M5252j245901R60096M178175M869583L164523J152084r58468
2724D764879l700011n412521m215164j651419o71416r42523L9882J976505K168240
2715g643548P04985P11456K712713L165914J86524l132704l244462q17511J359690
2706e996943K419917K939845K625243R81934j154266k700682l587371l516335
$$ plain form
2698 -7988658 -9373298 -7092824 -2750822 14873 -391781 -2538688 -5271398 -9332695
2690 -9332695 -14516817 -17743607 -16175278 -10889192 -5497953 -2110218 -456332 -18251
2682 -18251 -744375 -1863637 -2015627 -840396 939956 2910837 4851544 5441313 3268227
2673 3268227 -438297 -2405197 -1749388 -1594848 -4501990 -8259898 -8729821 -5518728 -1909513
2664 -1909513 60390 1134422 1616022 412753 -1726690 -1748654 912964 2393807 57009
2655 57009 -2802620 -1611826 2254243 3346336 272194 -2740404 -2602205 -1119537 -760464
2646 -760464 -852424 -244145 -390467 -2905759 -6293338 -7911157 -7719180 -7655215 -8466621 -9365088
2636 -9365088 -9843943 -9809012 -8797619 -6992981 -6109330 -7225862 -8484322 -7115579 -3387314
$$ packed form
2698g988658j384640K280474M342002K765695m06654k146907k732710m061297
2690i332695n184122l226790J568329N286086N391239L387735J653886M38081
2682a8251p26124j119262j51990J175231J780352J970881J940707N89769k173086
2673C268227l706524j966900O55809J54540k907142l757908m69923L211093L609215
2664a909513J969903J074032M81600j203269k139443k1964K661618J480843k336798
2655E7009k859629J190794L866069J092093l074142l012598J38199J482668L59073
2646g60464r1960O08279j46322k515292l387579j617819J91977O3965q11406q98467
2636i365088m78855L4931J011393J804638Q83651j116532j258460J368743L728265
$$ plain form
2627 -3387314 -471748 -438718 -2178877 -3399288 -3095781 -1801438 -673408 -678914 -1847996
2618 -1847996 -3147556 -3522179 -2820573 -1447993 105487 977207 330661 -1279002 -2259922
2609 -2259922 -2481452 -3709025 -6400081 -8093518 -6766332 -3802173 -1394098 948699
2601 948699 4379008 7078443 6445851 3877945 3254234 4867563 4965721 1808835 -1751787
2592 -1751787 -2774505 -1694737 41772 2329135 4528245 4323896 768645 -3759431
2584 -3759431 -6593149 -7743773 -8193654 -7556845 -5506581 -3516743 -2997478 -3304529 -3459673
2575 -3459673 -4057459 -5448727 -5821728 -3433572 544540 3426901 3980443 2356105 -1060231
2566 -1060231 -4655962 -5519579 -3028738 -708792 -1605782 -3589571 -2677893 582760 2257558
$$ packed form
2627c387314K915566L3030j740159j220411L03507J294343J128030n506j169082
2618a847996j299560l74623P01606J372580J553480Q71720o46546j609663r80920
2609b259922k21530j227573k691056j693437J327186K964159K408075K342797
2601I48699L430309K699435o32592k567906o23711J613329R8158l156886l560622
2592a751787j022718J079768J736509K287363K199110k04349l555251m528076
2584c759431k833718j150624m49881O36809K050264J989838N19265l07051j55144
2575c459673n97786j391268l73001K388156L978112K882361N53542j624338l416336
2566a060231l595731q63617K490841K319946q96990j983789R11678L260653J674798
$$ plain form
2557 2257558 1689491 2346241 5656227 8442937 7875990 5307744 3441648 2756726 2636924
2548 2636924 3348588 4671246 4599946 1710574 -2330101 -4263900 -2425631 2305184 7289219
2539 7289219 9251124 6704679 2406881 1324884 4727587 8298999 7654448 3506784
2531 3506784 -611208 -3358875 -5451177 -6400385 -4994837 -2333366 -1034308 -1412965 -1265592
2522 -1265592 427121 2240498 2968196 2922336 2188799 244482 -2007462 -2449670 -1005653
2513 -1005653 -232126 -1508809 -3079708 -3228224 -2763766 -2480874 -874168 2812519 5464531
2504 5464531 3605515 -1071062 -3254750 -812410 3240911 5585915 6038963 5505030 3866826
2495 3866826 1585112 888702 3327318 7549039 10888678 11926143 10705794 8222077
$$ packed form
2557B257558n68067O56750L309986K786710n66947k568246j866096o84922j19802
2548B636924P11664J322658p1300k889372m040675j933799J838269M730815M984035
2539G289219J961905k546445m297798j081997L402703L571412o44551m147664
2531C506784m117992k747667k092302r49208J405548K661471J299058l78657J47373
2522a265592J692713J813377P27698m5860p33537j944317k251944m42208J444017
2513a005653P73527j276683j570899j48516M64458K82892J606706L686687K652012
2504E464531j859016m676577k183688K442340M053321K345004M53048n33933j638204
2495C866826k281714o96410K438616M221721L339639J037465j220349k483717
$$ plain form
2487 8222077 6576046 7430259 9035501 7292440 1617319 -2943937 -2199871 1063315 1158437
2478 1158437 -2086178 -3563853 -1014537 1955779 1938849 448350 482446 1672851 1410604
2469 1410604 -1398827 -5948350 -11099499 -15282677 -16443931 -14216625 -10965985 -8899664
2461 -8899664 -7455481 -5411128 -4099919 -5954870 -10458361 -13909387 -13302933 -8954752
2453 -8954752 -3590521 -241691 -481860 -3025234 -4274939 -1738770 3244039 7277034
2445 7277034 8739101 8391361 6941450 4126956 244567 -3244029 -5090800 -5151424 -3874037
2436 -3874037 -1925365 -117567 1321961 3018053 5030579 6066322 5492149 5004640 6270450
2427 6270450 7870621 7101960 4128239 1423499 -486156 -3143271 -5712497 -4575673
$$ packed form
2487H222077j646031Q54213J605242j743061n675121m561256P44066L263186R5122
2478A158437l244615j477675K549316K970316j6930j490499L4096J190405k62247
2469A410604k809431m549523n151149m183178j161254K227306L250640K066321
2461h899664J444183K044353J311209j854951m503491l451026O06454M348181
2453h954752N364231L348830k40169k543374j249705K536169M982809M032995
2445G277034J462067l47740j449911k814494l882389l488596j846771o0624J277387
2436c874037J948672J807798J439528J696092K012526J035743n74173m87509J265810
2427F270450J600171p68661k973721k704740j909655k657115k569226J136824
$$ plain form
2419 -4575673 754158 4904690 2898916 -3117519 -6646635 -5078601 -1981629 -1514844
2411 -1514844 -3551665 -5192500 -5131964 -4998029 -6678867 -9242610 -9344640 -5250649 228235
2402 228235 2428043 564832 -1198827 673142 4413243 5604927 3107247 -9317
2394 -9317 -1089134 -1250828 -3386581 -7940831 -11721751 -11164866 -6587883 -2365910 -2047407
2385 -2047407 -4204045 -4970170 -3982063 -4557942 -7375615 -7889973 -2656019 4853422 8485584
2376 8485584 7542074 6480580 7442845 7749184 5347771 2366874 1419952 1790937 1638527
2367 1638527 1323222 1812231 1787395 -401608 -2829137 -1491221 3745657 7476355 4728099
2358 4728099 -2818107 -8428564 -7780669 -3193081 -78650 -747397 -3061647 -4278805 -4046693
$$ packed form
2419d575673N329831M150532k005774o016435l529116J568034L096972M66785
2411a514844k036821j640835O0536J33935j680838k563743j02030M093991N478884
2402B28235K199808j863211j763659J871969L740101J191684k497680l116564
2394i317j079817j61694k135753m554250l780920N56885M576983M221973L18503
2385b047407k156638p66125R88107n75879k817673n14358N233954P509441L632162
2376H485584r43510j061494R62265L06339k401413k980897r46922L70985j52410
2367A638527l15305M89009k4836k189003k427529J337916N236878L730698k748256
2358D728099p546206n610457O47895M587588L114431o68747k314250j217158K32112
$$ plain form
2349 -4046693 -3331783 -2618771 -2539145 -4512493 -8619041 -11842851 -10922941 -6755781 -3528762
2340 -3528762 -3138716 -2945652 -177480 3657134 4814544 2646121 622342 1890475 5376931
2331 5376931 7130019 4966466 961655 -923154 745880 3582195 4583774 3576404
2323 3576404 2631634 2952303 3790180 4137576 3899308 3141874 1519714 -990271 -3606787
2314 -3606787 -5374075 -5823010 -5244311 -4986904 -6812840 -10704423 -14013194 -14504956 -13563382
2305 -13563382 -14052348 -15477536 -14373723 -9835515 -5289397 -3606412 -3764488 -4089491 -5324610
2296 -5324610 -7739105 -8388853 -5099119 -972666 -674917 -3535531 -4721200 -2657854 -759619
2287 -759619 -1611108 -3980509 -6600867 -10437040 -15139953 -17090071 -13802695 -7571255 -2141770
$$ packed form
2349d046693P14910P13012P9626j973348m106548l223810R19910M167160L227019
2340c528762L90046J93064K768172L834614J157410k168423k023779J268133L486456
2331E376931J753088k163553m004811j884809J669034K836315J001579j007370
2323C576404r44770L20669Q37877L47396k38268p57434j622160k509985k616516
2314c606787j767288m48935N78699K57407j825936l891583l308771m91762R41574
2305a3563382m88966j425188J103813M538208M546118J682985j58076l25003j235119
2296e324610k414495o49748L289734M126453K97749k860614j185669K063346J898235
2287g59619q51489k369401k620358l836173m702913j950118L287376O231440N429485
$$ [...]
##END NTUPLES=NMR SPECTRUM
##END=
