##TITLE=31Pdec_E3e-4
 CDCl3, 24 sc
 14.6.2023
##JCAMPDX= 6.0         $$ Bruker NMR JCAMP-DX V2.0
##DATA TYPE= NMR SPECTRUM
##DATA CLASS= NTUPLES
##ORIGIN= UXNMR, Bruker Analytische Messtechnik GmbH
##OWNER= root
$$ XWIN-NMR		Version 3.5
$$ Wed Jun 14 11:26:50 2023 Russian Standard Time (UT+4h)  she@DPX200
##.OBSERVE FREQUENCY= 81.013821
##.OBSERVE NUCLEUS= ^31P
##.ACQUISITION MODE= SIMULTANEOUS
##.ACQUISITION SCHEME= undefined
##.AVERAGES= 24
##.DIGITISER RES= 16
##SPECTROMETER/DATA SYSTEM= spect
##.PULSE SEQUENCE= zgpg30
##.SOLVENT NAME= CDCl3
##.SHIFT REFERENCE= (INTERNAL, CDCl3, 0, 248.564)
##AUDIT TRAIL= $$ (NUMBER, WHEN, WHO, WHERE, WHAT)
$$ ##TITLE= Audit trail, XWIN-NMR		Version 3.5
$$ ##JCAMPDX= 5.01
$$ ##ORIGIN= Bruker BioSpin GmbH
$$ ##OWNER= she
$$ F:/spectra/data/she/nmr/P31/1/pdata/1/auditp.txt
$$ ##AUDIT TRAIL=  $$ (NUMBER, WHEN, WHO, WHERE, WHAT)
(   1,<2023-06-14 11:25:40.73 +0400>,<she>,<DPX200>,
      <created by zg, POWCHK disabled, PULCHK disabled
       configuration hash MD5:
       00 E9 B6 7A A2 85 ED C7 34 08 36 98 17 FE 4E 26
       data hash MD5: 32K
       F7 C3 4A A9 B6 51 B8 3E DB 45 2A E5 C7 75 7B 8E>)
(   2,<2023-06-14 11:25:44.79 +0400>,<she>,<DPX200>,
      <Start of raw data processing
       efp BC_mod = 2 LB = 1 FT_mod = 6 PKNL = 1 PHC0 = -10717.43 PHC1 = 136.2848 SI = 64K 
       data hash MD5: 64K
       BB B5 B9 26 76 FB 1A E0 EB 7E 0B 14 2A 39 58 74>)
(   3,<2023-06-14 11:26:06.51 +0400>,<she>,<DPX200>,
      <pk PHC0 = 10.10159 PHC1 = 0 
       data hash MD5: 64K
       91 68 2D AC B4 A5 65 A5 78 99 F1 96 B5 75 CF 5B>)
(   4,<2023-06-14 11:26:12.71 +0400>,<she>,<DPX200>,
      <abs ABSG = 5 
       data hash MD5: 64K
       3A 8F 51 9C 3C F4 67 3A F4 1B F6 BB 1C 9C 48 BA>)
$$ ##END=
$$ 
$$ hash MD5
$$ A1 71 EE 65 61 DD 36 4C FD 55 4E 69 96 ED 5A 17
##$RELAX= 
##$RELAX= 
##$RELAX= 
##$RELAX= 
##$RELAX= 
##$RELAX= 
##$RELAX= 
##$RELAX= 
##$RELAX= 
$$ Bruker specific parameters
$$ --------------------------
##$DU= <F:/spectra>
##$EXPNO= 1
##$NAME= <P31>
##$PROCNO= 1
##$TYPE= <nmr>
##$USER= <she>
##$AMP= (0..31)
100 100 100 100 100 100 100 100 100 100 100 100 100 100 100 100 100 100 
100 100 100 100 100 100 100 100 100 100 100 100 100 100 
##$AQSEQ= 0
##$AQ_mod= 1
##$AUNM= <au_zg>
##$AUTOPOS= <>
##$BF1= 81.014009
##$BF2= 200.13
##$BF3= 200.13
##$BF4= 200.13
##$BF5= 200.13
##$BF6= 200.13
##$BF7= 200.13
##$BF8= 200.13
##$BYTORDA= 1
##$CFDGTYP= 0
##$CFRGTYP= 5
##$CHEMSTR= <none>
##$CNST= (0..31)
1 1 145 1 1 1 1 1 1 1 1 1 1 1 1 1 1 1 1 1 1 1 1 1 1 1 1 1 1 1 1 1 
##$CPDPRG= <waltz16>
##$CPDPRG1= <>
##$CPDPRG2= <waltz16>
##$CPDPRG3= <>
##$CPDPRG4= <mlev>
##$CPDPRG5= <mlev>
##$CPDPRG6= <mlev>
##$CPDPRG7= <mlev>
##$CPDPRG8= <mlev>
##$CPDPRGB= <>
##$CPDPRGT= <>
##$D= (0..31)
0 1 0 0 0 0 0 0 0 0 0 0.03 2e-05 3e-06 0 0 0 0 0 0 0 0 0 0 0 0 0 0 0 0 
0 0 
##$DATE= 1686727540
##$DBL= (0..7)
120 120 120 11 120 120 24 19 
##$DBP= (0..7)
150 150 150 150 150 150 150 150 
##$DBP07= 0
##$DBPNAM0= <>
##$DBPNAM1= <>
##$DBPNAM2= <>
$$ [...]
##$SUBNAM3= <"">
##$SUBNAM4= <"">
##$SUBNAM5= <"">
##$SUBNAM6= <"">
##$SUBNAM7= <"">
##$SUBNAM8= <"">
##$SUBNAM9= <"">
##$SW= 501.771253377433
##$SWIBOX= (0..15)
0 1 3 0 0 0 0 0 0 0 0 0 0 0 0 0 
##$SW_h= 40650.406504065
##$TD= 32768
##$TD0= 1
##$TE= 0
##$TE2= 300
##$TE3= 300
##$TEG= 300
##$TL= (0..7)
0 120 53 12 22 120 120 120 
##$TP= (0..7)
150 150 150 150 150 150 150 150 
##$TP07= 0
##$TPNAME0= <>
##$TPNAME1= <>
##$TPNAME2= <>
##$TPNAME3= <>
##$TPNAME4= <>
##$TPNAME5= <>
##$TPNAME6= <>
##$TPNAME7= <>
##$TPOAL= (0..7)
0.5 0.5 0.5 0.5 0.5 0.5 0.5 0.5 
##$TPOFFS= (0..7)
0 0 0 0 0 0 0 0 
##$TUNHIN= 0
##$TUNHOUT= 0
##$TUNXOUT= 0
##$USERA1= <user>
##$USERA2= <user>
##$USERA3= <user>
##$USERA4= <user>
##$USERA5= <user>
##$V9= 5
##$VALIST= <valist>
##$VCLIST= <CCCCCCCCCCCCCCC>
##$VD= 0
##$VDLIST= <DDDDDDDDDDDDDDD>
##$VPLIST= <PPPPPPPPPPPPPPP>
##$VTLIST= <TTTTTTTTTTTTTTT>
##$WBST= 1024
##$WBSW= 4
##$XGAIN= (0..3)
0 0 0 0 
##$XL= 0
##$YL= 0
##$YMAX_a= 42107
##$YMIN_a= -39488
##$ZGOPTNS= <>
##$ZL1= 120
##$ZL2= 120
##$ZL3= 120
##$ZL4= 120
##$ABSF1= 248.5645
##$ABSF2= -253.2056
##$ABSG= 5
##$ABSL= 3
##$ALPHA= 0
##$AQORDER= 0
##$ASSFAC= 0
##$ASSFACI= 0
##$ASSFACX= 0
##$ASSWID= 0
##$AUNMP= <proc_1d>
##$AZFE= 0.1
##$AZFW= 0.5
##$BCFW= 0
##$BC_mod= 2
##$BYTORDP= 0
##$COROFFS= 0
##$CY= -3
##$DATMOD= 1
##$DC= 0
##$DFILT= <>
##$DTYPP= 0
##$F1P= 0
##$F2P= 0
##$FCOR= 1
##$FTSIZE= 65536
##$FT_mod= 6
##$GAMMA= 0
##$GB= 0
##$INTBC= 1
##$INTSCL= 6.047779e-11
##$ISEN= 30
##$LB= 1
##$LEV0= 0
##$LPBIN= 0
##$MAXI= 10000
##$MC2= 0
##$MEAN= 0
##$ME_mod= 0
##$MI= 50
##$NCOEF= 0
##$NC_proc= -2
##$NLEV= 6
##$NOISF1= 182.463
##$NOISF2= 159.3651
##$NSP= 0
##$NTH_PI= 0
##$NZP= 0
##$OFFSET= 248.5645
##$PC= 4
##$PHC0= -10707.33
##$PHC1= 136.2848
##$PH_mod= 1
##$PKNL= yes
##$PPARMOD= 0
##$PSCAL= 0
##$PSIGN= 0
##$REVERSE= no
##$SF= 81.0140089999694
##$SI= 65536
##$SIGF1= 159.3651
##$SIGF2= -187.1042
##$SINO= 113.3802
##$SIOLD= 16384
##$SREGLST= <1H.CDCl3>
##$SSB= 0
##$STSI= 65536
##$STSR= 0
##$SW_p= 40650.406504065
##$SYMM= 0
##$S_DEV= 0
##$TDeff= 32768
##$TDoff= 0
##$TI= <>
##$TILT= no
##$TM1= 0
##$TM2= 0
##$TOPLEV= 0
##$USERP1= <user>
##$USERP2= <user>
##$USERP3= <user>
##$USERP4= <user>
##$USERP5= <user>
##$WDW= 1
##$XDIM= 65536
##$YMAX_p= 271669637
##$YMIN_p= -18657313
$$ End of Bruker specific parameters
$$ ---------------------------------
##NTUPLES= NMR SPECTRUM
##VAR_NAME=  FREQUENCY,     SPECTRUM/REAL,   SPECTRUM/IMAG
##SYMBOL=    X,             R,               I
##VAR_TYPE=  INDEPENDENT,   DEPENDENT,       DEPENDENT
##VAR_FORM=  AFFN,          ASDF,            ASDF
##VAR_DIM=   65536,         65536,           65536
##UNITS=     HZ,            ARBITRARY UNITS, ARBITRARY UNITS
##FACTOR=    0.620285442955139, 1,           1
##FIRST=     20137.2065510682, 0,            0
##LAST=      -20513.1999529968, 0,           0
##MIN=       -20513.1999529968, -18657313,   0
##MAX=       20137.2065510682, 271669637,    0
$$ Real data points
##PAGE= N=1
##DATA TABLE= (X++(R..R)), XYDATA
$$ [...]
42834 62760 49952 49479 83858 116702 84848 893 -42278 -3828 34871 -11739 -106254 -156688
42822 -156688 -163079 -195213 -247873 -233707 -133027 -42013 -30953 -46261 -11068 50376 57837 -4318
42810 -4318 -76487 -103015 -72475 -8042 41516 34032 -6514 -2851 65889 117975 82627 7921
42798 7921 -9718 38991 83533 83225 53584 7378 -52621 -95067 -86990 -50817 -29741 -13472
42786 -13472 28424 59548 15723 -72383 -96854 -32759 15257 -34135 -123683 -149222 -99900 -44901
42774 -44901 -27220 -33706 -44327 -55528 -63908 -66446 -73765 -96973 -123325 -121129 -69395 18742 96471
42761 96471 115255 71648 13740 -13643 -12332 -1927 18437 42938 32145 -28288 -72362 -30953
42749 -30953 53289 71231 3001 -59341 -53020 -16541 2898 21479 55173 65096 22244 -34723
42737 -34723 -58392 -57549 -60063 -64313 -67934 -85868 -97034 -40227 82120 165167 136822 68477
42725 68477 66166 105189 76628 -30483 -104100 -70218 15470 59584 40904 -398 -26239 -22385
42713 -22385 3496 20895 1996 -38689 -58956 -50245 -49465 -78053 -106540 -102207 -81102 -79854 -91894
42700 -91894 -69768 3357 74533 77488 17181 -31636 -15778 34950 54862 24973 -18787 -39582
42688 -39582 -30423 -8008 -7556 -62432 -152345 -199527 -162483 -98759 -73925 -53243 24495 106585
42676 106585 90285 13657 25594 139126 185073 83910 -5881 65041 187044 155638 -14623
42665 -14623 -125139 -88172 -4491 34854 50423 66394 56561 30558 42993 82614 70858 2168
42653 2168 -32590 1913 31215 14254 16380 73528 101867 31653 -66254 -85447 -35814 10893
42641 10893 57391 146416 235034 226362 117166 8827 -34035 -44229 -59216 -57728 -24238 -4099
42629 -4099 -40505 -97755 -100559 -34350 35832 46709 5682 -33305 -42076 -41452 -53734 -61975 -39035
42616 -39035 2187 23621 21476 28740 50032 38571 -35249 -126016 -159717 -120514 -60265 -32142
42604 -32142 -40352 -47826 -13477 68836 151680 169581 112710 44708 20393 11815 -37253 -101136
42592 -101136 -87586 19722 104559 57627 -73734 -147782 -118915 -79238 -98482 -115903 -48987
42581 -48987 61684 104595 58393 5424 -5323 -8184 -20089 4209 68209 79799 -19957 -142095
42569 -142095 -155487 -65684 4611 -10019 -57582 -78840 -84524 -101157 -114077 -98103 -56295 -3869
42557 -3869 47425 75901 63487 34538 36891 70697 81046 37878 -21460 -50372 -52024 -55517
42545 -55517 -69637 -86537 -99742 -91986 -34370 70660 164257 180267 115285 32497 -1381 25072
42533 25072 66002 67752 20962 -36725 -65395 -57418 -31361 -17110 -46215 -116813 -161516 -105834
42521 -105834 20448 96484 70485 27712 41763 51942 -13427 -79755 -33167 73927 91084
42510 91084 19279 10112 102965 152270 72893 -21859 -19678 14842 -14300 -50626 4123 95453
42498 95453 93248 5465 -36724 20385 100157 131435 120794 91829 54601 39279 73245 120900
42486 120900 118680 64323 2977 -58201 -141462 -216584 -214369 -127883 -29254 19214 11519 -34559
42474 -34559 -88704 -96696 -31586 47830 61911 28108 35929 105082 154110 124440 55311 10940
42462 10940 2702 9964 17411 8077 -25147 -43068 6906 104595 165085 152127 118185 105865
42450 105865 79713 -648 -99221 -149690 -142537 -116430 -93505 -70530 -53091 -53828 -64986 -65145
42438 -65145 -49371 -32043 -24961 -26660 -28419 -24609 -22485 -36913 -62473 -63083 -15311 47853 70473
42425 70473 45987 17575 6662 -14118 -63201 -104866 -86919 -3932 93034 138653 103859 21609
42413 21609 -38088 -35233 2768 24137 14698 -7012 -32650 -63418 -82861 -72320 -43621 -19808
42401 -19808 608 21505 16678 -28751 -70319 -62599 -44081 -84370 -157154 -158971 -67091 14843
42389 14843 5226 -41183 -18950 85702 190838 219110 159913 60574 -11340 -19231 8995 19252
42377 19252 4536 3281 26125 36679 14757 -13788 -23211 -12756 22393 84394 125458 78800
42365 78800 -36215 -108816 -74326 3973 31211 1898 -22164 -5504 41464 101699 161883
42354 161883 200571 196150 138171 32923 -73891 -98877 -5760 120739 161407 121580 115651
42343 115651 186935 248791 231018 172380 121564 59184 -16385 -33931 34808 95457 57535
42332 57535 -34884 -81758 -60242 100 88346 166265 141551 -1695 -124990 -107115 -21259
42321 -21259 -14455 -81135 -101670 -51292 -13332 -16317 -13178 -5411 -35964 -66786 -16386 77733
42309 77733 87208 -2913 -71127 -65379 -73476 -139001 -160388 -54198 101623 173770 133760 43666
42297 43666 -36167 -64480 -22076 45692 58246 13756 -500 53713 103583 81614 15130 -43191
42285 -43191 -82067 -85605 -22384 66026 71796 -18812 -79251 -32296 27164 -4677 -65710 -41463
42273 -41463 37891 60457 31049 50570 123177 136887 47969 -45213 -46247 21971 83562 114074
42261 114074 131879 137683 109985 44124 -27770 -58093 -33750 -4551 -30036 -90016 -97582 -22525
42249 -22525 59771 79602 63660 58865 38466 -33601 -104349 -98718 -49288 -56295 -134367 -195805
42237 -195805 -183821 -136066 -111323 -126073 -164375 -185198 -130319 3343 112944 92170 -24692
42226 -24692 -106473 -104959 -93686 -123173 -144974 -110403 -49759 -8821 17044 42615 54037 49982
42214 49982 59005 79277 62772 -4779 -71350 -101513 -122499 -144216 -109920 6210 114056
42203 114056 101822 -18877 -134317 -170954 -149775 -116512 -86943 -63964 -54915 -58380 -62255 -57400
42191 -57400 -37308 -195 27724 -2154 -96745 -184405 -183805 -97426 1762 64036 99591 127731
42179 127731 139171 122406 91338 66137 47445 27175 12059 18630 45278 61037 33512 -29585
42167 -29585 -80400 -87169 -77299 -96871 -136718 -142793 -105974 -88137 -129260 -176350 -154490 -77753
42155 -77753 -30476 -49341 -82848 -74551 -35166 -11268 -19565 -38513 -43359 -27781 -4733 -665
42143 -665 -33522 -80813 -85753 -18831 73944 110886 68007 9847 11040 63340 88185 39795
42131 39795 -37438 -71474 -54096 -36373 -47858 -63569 -54182 -26812 531 28379 54955 57022
42119 57022 22934 -18786 -36722 -40157 -47954 -37831 18720 81913 72247 -12206 -73243 -43141
42107 -43141 20006 22660 -24012 -31056 20028 43244 -20756 -115030 -148577 -112707 -66274 -46574
42095 -46574 -49486 -67205 -85744 -65518 11157 83973 75315 8066 -11203 56416 122109 96217
42083 96217 9303 -43180 -24877 27759 74257 95302 80587 46254 38209 68976 83691 42941
42071 42941 -26 24352 83160 86614 32599 6388 35602 48617 960 -53866 -61344 -48684
42059 -48684 -57556 -66632 -43233 -15898 -32114 -84610 -133901 -165624 -175798 -141656 -63708 303
42047 303 1970 -28507 -34050 -16064 -7743 266 33494 62016 38889 -5983 519 49997 55237
42034 55237 -6546 -47393 -5792 50959 22263 -83478 -166618 -163634 -99522 -33209 -2519 -14878
42022 -14878 -49210 -66333 -47132 -19480 -24950 -63547 -92642 -77487 -26914 14967 997 -79945
42010 -79945 -177420 -208636 -138605 -22360 55074 69498 62810 71951 91687 107248 122593 141335
41998 141335 149242 132271 91310 31560 -34373 -65125 -15040 93235 161056 121957 28371
41987 28371 -19877 -9470 -11887 -58935 -97950 -86690 -57000 -46115 -31456 10505 35332 -6545
41975 -6545 -71401 -66619 15270 80656 60036 -14124 -68661 -71551 -32021 29786 85174 108106
41963 108106 109164 124520 152772 144634 81441 19861 19184 59574 79841 71648 82391 132319
41951 132319 180449 181755 138426 78432 14814 -49258 -94050 -93174 -50862 -5293 16588 28831
41939 28831 51733 65168 33528 -28106 -62756 -58660 -69042 -111707 -114410 -26306 70364 54550
41927 54550 -56123 -129091 -112609 -91020 -122708 -143752 -89746 -8242 28707 37842 60714 58896
41915 58896 -21755 -129827 -159294 -98421 -31213 -6596 -284 1849 -21029 -59806 -73173 -62547
41903 -62547 -68835 -84317 -55874 3193 -488 -98241 -189288 -175306 -95067 -49948 -48854 -17437
41891 -17437 62337 113825 76988 -13330 -84752 -108009 -88567 -25604 68846 133747 104625 5617
41879 5617 -54149 -5539 94569 139790 107493 62797 46178 27250 -17614 -50561 -33073 9280
41867 9280 28438 23045 20630 21543 8299 -12399 -22494 -28073 -40483 -43722 -24571 -12454 -40224
41854 -40224 -85016 -100034 -87140 -81163 -76733 -35582 34941 73544 46061 -14899 -61560 -79761
41842 -79761 -79095 -72489 -70850 -68802 -43791 188 12551 -33128 -76590 -45345 28336 44394 -16945
41829 -16945 -69656 -54546 -12933 -2826 -18209 -27133 -26733 -24379 -16773 -16243 -46033 -86188 -80763
41816 -80763 -23343 23215 16857 -16687 -51861 -103817 -161628 -158068 -66772 31280 45113 -7483
41804 -7483 -40708 -21770 10189 16498 -5913 -40218 -57710 -36032 -2614 -19424 -86716 -114807
41792 -114807 -45998 48169 62438 7650 -17943 20410 62142 63822 54344 60509 52483 -586
41780 -586 -68928 -94058 -59104 -764 39116 57275 81058 118679 132344 85449 7913 -28869
41768 -28869 -6341 25597 41074 77600 146828 179287 122617 36360 11180 37957 40579 3430
41756 3430 -25994 -37844 -63639 -87284 -55969 9154 14887 -61394 -123801 -97759 -35723 -23624
41744 -23624 -48892 -35486 31231 90027 98368 77717 63266 57144 42312 10845 -33440 -80321
41732 -80321 -111901 -110634 -79793 -49687 -51623 -81346 -96110 -60671 5059 41447 17206 -37771
41720 -37771 -77170 -91487 -99138 -111100 -132720 -176921 -237002 -262360 -207859 -105979 -46134 -73173
41708 -73173 -141609 -181346 -175316 -154087 -140223 -123939 -86116 -28752 19973 30684 5418 -20710
41696 -20710 -18014 5358 19959 14954 6390 9267 13905 -8165 -74551 -161596 -210624 -185269 -119505
41683 -119505 -80932 -88559 -104077 -103432 -103597 -106859 -82834 -35819 -24124 -66785 -96464 -67208 -46331
41670 -46331 -116216 -233363 -281643 -235232 -167868 -119361 -63978 -12332 -27883 -111416 -170736
41659 -170736 -150832 -108309 -106296 -115750 -84824 -39771 -41760 -86187 -115988 -107853 -81375 -42218
41647 -42218 19830 81079 90683 39907 -15656 -21922 8958 19093 -18116 -59126 -38461 49666
41635 49666 137587 160460 123532 74327 35274 880 -19346 -7077 20137 21751 -2113 -6559
41623 -6559 28524 68703 77909 60830 38865 21012 10767 6396 -13056 -62550 -106846 -89374
41611 -89374 -16279 37737 22992 -33668 -84088 -110309 -103442 -54620 1947 -909 -68543 -117404
41599 -117404 -91277 -48509 -71915 -140010 -164715 -130299 -113937 -167569 -244928 -262740 -193511
41588 -193511 -83547 -3418 13720 -1506 4331 33245 29430 -33771 -97509 -88820 -22649 16221
41576 16221 -18677 -90733 -138183 -134740 -92919 -45548 -28918 -53616 -87287 -89163 -58603 -25687
41564 -25687 -4094 12443 14565 -15974 -56132 -44677 36846 117515 108216 8529 -89999 -109302
41552 -109302 -66769 -39621 -67664 -116951 -136924 -124765 -115500 -124206 -123319 -78701 6942 90503
41540 90503 122857 91337 33747 1338 2823 1557 -25116 -52481 -53029 -40399 -34873 -17421 33037
41527 33037 80021 65676 -4036 -68409 -99763 -119981 -130547 -97456 -22990 32081 26573 -10235
41515 -10235 -29871 -22659 -5676 3798 -11504 -50738 -69985 -28315 36181 40358 -24631 -79058
41503 -79058 -72526 -35980 1855 55919 109153 96195 15857 -36622 -13571 5423 -46781 -106395
41491 -106395 -98289 -79460 -138595 -225186 -217879 -118127 -38297 -24780 -28105 -32364 -74069 -128731
41479 -128731 -115601 -39601 -4523 -49794 -88014 -50160 10226 13563 -30804 -63583 -60298 -26333
41467 -26333 31215 80676 71830 7693 -42409 -38389 -21729 -33882 -43288 -6160 49875 63710
41455 63710 33415 17580 56762 129849 180544 166738 93704 7314 -56172 -103329 -143864 -145779
41443 -145779 -84330 -15033 -21632 -93164 -135043 -112032 -90076 -112071 -129428 -103081 -77919 -89689
41431 -89689 -82654 -6761 69784 45784 -54854 -110181 -67592 8366 52876 77435 110526 133017
41419 133017 109749 46873 -12668 -34436 -19953 1285 5317 3173 24210 65940 88898 76303
41407 76303 62584 74602 82440 51087 9108 10666 46284 50568 -855 -54433 -51672 -655
41395 -655 41522 31547 -28624 -104097 -156749 -169648 -150379 -116308 -85389 -75317 -88437 -97261
41383 -97261 -76319 -52513 -79870 -148014 -169412 -95613 2515 24677 -26705 -67648 -57855 -30202
41371 -30202 -6114 37831 104856 149954 146884 129627 133046 135340 98478 35106 -6706 -10527
41359 -10527 -6293 -19870 -35930 -20000 35124 95273 118524 98369 64437 40434 18963 -12511
41347 -12511 -42572 -54046 -52887 -51400 -39666 -9224 8801 -23110 -79001 -85972 -26555 24432
41335 24432 -4344 -86136 -135280 -114059 -57336 -5419 38694 77754 86111 34416 -64431 -155909
41323 -155909 -192527 -172035 -125066 -75790 -27488 16257 37163 21931 -17393 -58050 -87881
41312 -87881 -93664 -49337 46968 136607 152055 108963 92303 134671 169583 140220 89372 79541
41300 79541 81435 33455 -22968 16811 141877 206352 130798 16754 -6690 43647 75600
41289 75600 85187 130067 188825 181096 114610 80142 90182 55618 -42159 -89244 -17296 73473
41277 73473 62447 -13916 -38509 6469 51282 74003 98349 90954 -5513 -141671 -190909 -127352
41265 -127352 -62292 -75633 -115302 -102248 -39015 33163 97661 130584 89168 -5563 -50133
41254 -50133 5463 67819 25339 -90667 -158664 -142100 -114493 -122591 -121317 -64743 11682 37697
41242 37697 -2202 -57303 -71990 -40637 -6332 -9665 -42363 -64905 -66862 -78171 -110860 -128315
41230 -128315 -97122 -36065 14941 43465 53195 39254 10979 4628 30512 39839 -7134 -70421
41218 -70421 -84456 -56771 -44744 -48476 -6781 87484 141585 72726 -79286 -191007 -188048 -107748
41206 -107748 -37965 -21748 -34036 -39720 -45152 -70965 -96917 -83599 -49245 -62991 -135255 -174892
41194 -174892 -103431 35752 138471 169160 165464 148965 109112 60160 37688 39837 37474 39764
41182 39764 82980 154366 196443 193405 185583 189925 177964 147433 139121 154473 131556 46497
41170 46497 -26607 -12251 59587 101544 88398 68765 77031 91100 78715 44293 17845 17881
41158 17881 35628 50634 54492 48631 19010 -57188 -157359 -200593 -136592 -25637 26843 1281
41146 1281 -33768 -38373 -40239 -52496 -40827 23 18488 -4528 -11221 40285 102762 110964 69311
41133 69311 18149 -32080 -79601 -97742 -80094 -72319 -105537 -146326 -161621 -171406 -179477 -127996
41121 -127996 -3637 85894 50543 -27311 -6037 88502 98196 -15818 -116009 -111952 -88262
41110 -88262 -140711 -213976 -202685 -124359 -82112 -106202 -135316 -133377 -134148 -164881 -193012 -170824
41098 -170824 -99173 -29042 -9681 -39673 -72693 -78731 -82013 -109633 -125544 -73517 22115 73834
41086 73834 61666 63135 117797 148806 84167 -17373 -48183 -8690 12771 -13804 -35316 -28140
41074 -28140 -32600 -57939 -46602 27300 99590 107562 82417 93120 140900 172925 174270 177225
41062 177225 184305 151240 68255 2526 17508 83158 116042 94062 76477 105471 145789 150382
41050 150382 133688 128807 111594 39476 -50324 -64889 8512 68655 36736 -41339 -75280 -50641
41038 -50641 -7281 48707 130886 200825 196542 126544 60664 26961 -8508 -52180 -53455 6831
41026 6831 67937 71282 36890 13003 -3125 -39697 -79682 -77914 -37288 -12647 -35302 -78408
41014 -78408 -108437 -131244 -161832 -175092 -126185 -22147 60447 54755 -13931 -57889 -38024 -6244
41002 -6244 -22457 -71258 -95149 -77224 -46415 -26159 -28361 -75663 -166443 -229640 -187561 -69379
40990 -69379 8975 -6665 -50517 -48582 -12325 17407 45277 81998 90661 42224 -17447 -26155
40978 -26155 -1910 -13365 -73300 -127149 -138391 -125093 -111673 -95456 -67164 -27974 16624 55513
40966 55513 72400 66473 52917 27527 -29938 -93108 -87912 -2140 65370 36010 -24920 -8170
40954 -8170 62495 68771 -9798 -69723 -54664 -24424 -23742 -7034 50604 78843 25157 -46422
40942 -46422 -53884 -23370 -27909 -56737 -42792 12303 35440 -4492 -58980 -78805 -68220 -53647
40930 -53647 -48572 -58079 -79517 -91528 -71653 -28864 2428 -266 -29310 -55600 -44690 15004
40918 15004 85223 104001 57391 -1230 -22133 -17733 -26615 -52839 -71635 -67964 -42281 -5484
40906 -5484 11382 -20201 -72150 -76569 -25583 2886 -39899 -96160 -96840 -69662 -73480 -80667 -24544
40893 -24544 68775 100923 44201 -30021 -62575 -57785 -27855 19450 34261 -35016 -140328 -171797
40881 -171797 -118064 -84816 -121158 -141267 -78042 -5595 -20142 -85229 -99267 -56173 -29900
40870 -29900 -37822 -30329 -1397 -4546 -51935 -87644 -78449 -53558 -33834 2827 53730 59903 -7592
40857 -7592 -82458 -83837 -31136 -17128 -77256 -144914 -149261 -110104 -101509 -143187 -169994 -118583
40845 -118583 -15058 52149 38783 -8378 -20129 11520 44370 55932 59227 54581 14765 -64430
40833 -64430 -137787 -163213 -152436 -138544 -120198 -80077 -37899 -29386 -37387 -5781 66775 112271
40821 112271 101084 96854 150681 200823 157516 49417 -10016 9254 20140 -31596 -82179
40810 -82179 -59282 4569 30937 10846 -5143 4624 16128 10016 -10451 -36103 -51821 -42303
40798 -42303 -25503 -46191 -105926 -143503 -124010 -97258 -115521 -142561 -110244 -26115 45345 76921
40786 76921 86200 80944 66426 73190 103456 88700 -13259 -118039 -113982 -30703 7490 -23134
40774 -23134 -26960 33694 77506 46077 -15355 -52449 -64515 -44209 26334 88504 48509 -52225
40762 -52225 -53531 74126 153042 65276 -59357 -53562 28675 28761 -48741 -71714 -17689 11612
40750 11612 -18912 -46849 -58535 -99994 -141783 -96625 10032 43870 -30036 -89985 -53894
40739 -53894 9215 23869 26889 58400 55313 -39447 -148066 -148579 -42322 62240 94803 73193
40727 73193 40739 26368 43982 72154 58298 -6603 -49984 -9185 73036 107517 83902 63909
40715 63909 65590 35402 -53843 -146790 -176451 -143579 -94315 -55972 -33851 -48282 -122535 -223566
40703 -223566 -258201 -170217 -28179 34686 -17668 -73583 -23334 88026 125496 55814 -13985
40692 -13985 1572 53432 47116 -24046 -92274 -117290 -115455 -111373 -112500 -121449 -135297 -139492 -126145
40679 -126145 -103775 -71879 -13731 62604 110833 107791 95724 122876 170584 184319 151515 98485
40667 98485 32210 -55957 -138330 -162399 -119079 -52089 3923 49731 84519 92104 73966 51591
40655 51591 25064 -27163 -95735 -134785 -127751 -113183 -119314 -116161 -66840 9320 64509 87741
40643 87741 103851 125547 141960 140939 112066 45392 -38024 -73712 -19062 74793 103806 29607
40631 29607 -83203 -155546 -175544 -173602 -158897 -118562 -60022 -17439 -14815 -38150 -43552 6723
40619 6723 99148 158667 114810 -8180 -101557 -96068 -39023 -11597 -10183 26045 91583 101527
40607 101527 16485 -91557 -133717 -109887 -78320 -65240 -55583 -42282 -31101 -13900 14853
40596 14853 28227 187 -42118 -48417 -21010 -8528 -25771 -37967 -34319 -54914 -117052 -171139
40584 -171139 -172010 -149251 -154272 -169799 -134049 -42926 33496 43127 8635 -22252 -33908 -23678
40572 -23678 27952 119339 185341 152905 42410 -38947 -26416 22841 14156 -56047 -108731 -102585
40560 -102585 -80997 -87886 -99798 -79825 -51324 -61823 -97705 -94697 -30916 41983 68742 49588
40548 49588 19782 9876 38650 104516 163741 154929 72037 -17663 -53337 -44673 -27722 986
40536 986 55937 101499 88624 43223 45315 109168 154939 128654 82424 83442 99453 49769
40524 49769 -60068 -139426 -146064 -136105 -159865 -184417 -163903 -124580 -118112 -131391 -111095 -55674
40512 -55674 -15156 -8632 -8251 -4985 -21434 -47079 -31745 26208 49189 -16322 -116064 -161069
40500 -161069 -146443 -137533 -161783 -179505 -159300 -123682 -103560 -89167 -52769 -1542 17179 -29836
40488 -29836 -108307 -137106 -82373 -12129 -12387 -57759 -36027 80325 170886 131055 24063 -16806
40476 -16806 15913 13414 -67079 -143988 -145514 -98797 -54265 -10395 40450 63452 33269 -15512
40464 -15512 -38251 -42896 -63782 -107484 -158513 -205180 -229274 -204896 -139166 -81756 -63815 -58410
40452 -58410 -29853 9605 22311 -3116 -48168 -86015 -88748 -47082 -191 -4548 -52127 -67395
40440 -67395 -13234 52815 67192 54277 80184 151810 216581 235718 208736 147394 69863 3257
40428 3257 -42741 -85128 -126951 -140582 -115526 -79237 -43210 16248 88199 104947 41543 -30170
40416 -30170 -48935 -51732 -75976 -55517 72757 220950 243388 144469 58192 39411 19330
40405 19330 -30013 -38633 20326 68821 54279 23536 13712 -15213 -75503 -91046 -21812 46734
40393 46734 26036 -44334 -76284 -71665 -85640 -109095 -87559 -24190 21599 15974 -33076 -108828
40381 -108828 -174719 -171380 -91678 -20395 -33166 -96237 -133164 -142783 -169893 -200793 -179276 -101092
40369 -101092 -10619 70097 131153 131335 57270 -7710 23331 104699 122073 67215 26339 12307
40357 12307 -46564 -142362 -167790 -101310 -61204 -105654 -121043 -10870 123493 119454 -8126
40346 -8126 -96494 -60894 28379 76609 68454 39344 21449 24952 22638 -35133 -143736 -210689
40334 -210689 -158929 -38453 32728 20431 -5660 5422 22021 2517 -32661 -31280 23527
40323 23527 96190 131074 99858 30447 -22883 -49340 -91111 -163615 -213221 -194255 -139387 -98662
40311 -98662 -57920 9887 57703 22853 -53262 -66461 -5954 30577 -12630 -78768 -97794 -68977
40299 -68977 -20115 33327 62899 41365 6643 28566 89619 95423 34642 14834 83389 132345
40287 132345 70506 -18363 -8464 61487 55786 -33636 -78708 -20793 53092 60096 32523 40982
40275 40982 93410 149521 171556 134635 46411 -25774 -11020 63375 92385 36265 -29558 -39160
40263 -39160 -32764 -72484 -125800 -111133 -28024 34758 17027 -48412 -98685 -117243 -121757 -109694
40251 -109694 -57949 23288 71962 38284 -43224 -81591 -37860 28101 38707 -7610 -55633
40240 -55633 -75058 -77423 -71004 -49917 -23083 -10310 -11640 -16747 -34871 -75152 -110872 -110607 -91446
40227 -91446 -88290 -85650 -44328 15660 34317 10439 -1866 1568 -30445 -87188 -83395 -9522
40215 -9522 15383 -82365 -198056 -187624 -69329 20860 24378 -4394 -27428 -65764 -111296 -106437
40203 -106437 -38488 30184 54037 55521 59874 48676 11360 -18348 -15641 -3738 -2741 13621
40191 13621 67486 121089 118158 57852 -11542 -53594 -63697 -47664 -19692 -10964 -41846 -86112
40179 -86112 -93276 -48353 14699 57330 67227 45214 -4156 -56003 -70879 -42412 -16892 -34598
40167 -34598 -69020 -65617 -33157 -41410 -112494 -171027 -143743 -64464 -21495 -29934 -28977 2727 10324
40154 10324 -40084 -100832 -117160 -104136 -104356 -117468 -122200 -127561 -144903 -140411 -78822 2512 26212
40141 26212 -21470 -74741 -79434 -50370 -28721 -26958 -32744 -33491 -18893 16973 60478 81431 63701
40128 63701 26441 11101 46198 112945 145124 91432 -8706 -48197 18632 104920 93782
40117 93782 -15060 -114216 -125644 -68657 1335 56327 86765 86217 67565 54176 39346 -5969
40105 -5969 -70919 -93974 -37667 61760 142531 180573 178653 129402 33937 -58661 -79303 -19587
40093 -19587 44164 32758 -37754 -69664 -9599 68392 48523 -69660 -162035 -142573 -66684
40082 -66684 -30281 -32604 -11034 36949 57023 39312 24808 18191 -15391 -63148 -65401 -19193
40070 -19193 7637 -8868 -7732 47476 103895 113625 114461 154802 202174 192749 122863 31950 -58520
40057 -58520 -131224 -147535 -101622 -58188 -69012 -89254 -47019 36987 75411 37612 -27435 -76425
40045 -76425 -106810 -115174 -91952 -58740 -50540 -63107 -73614 -100040 -169818 -237622 -217479 -107895
40033 -107895 -6775 18081 -1431 -16697 -32321 -50678 -26494 55859 118637 82357 -15081
40022 -15081 -68962 -55704 -48280 -85897 -112691 -74992 -12321 -729 -43839 -74732 -52533 -8086
40010 -8086 11116 2427 -3480 8234 21843 18135 776 -4932 22774 72117 96385 62624 5548
39997 5548 3038 79102 160909 164263 95451 24685 -18355 -60835 -107862 -123234 -105250 -105952 -137336
39984 -137336 -128927 -36395 67232 83791 30355 915 13233 -6712 -83508 -135018 -93454
39973 -93454 -5474 41891 38485 34696 47706 49441 29835 9842 -8265 -48915 -108214 -136416
39961 -136416 -102376 -46555 -37736 -88608 -141864 -138390 -77479 -6597 29644 22747 -2183 -11125
39949 -11125 7875 31022 25533 -6340 -28751 -27902 -40671 -101808 -182046 -214497 -174558 -98934
39937 -98934 -30956 14290 31703 17120 -13747 -34863 -47062 -68248 -82414 -48437 26473 77502
39925 77502 72184 54856 66308 74402 34251 -29379 -58843 -49108 -38530 -41699 -48377 -63959 -91202
39912 -91202 -93541 -40114 28409 42913 3263 -30608 -33088 -28476 -19913 17194 62230 49846
39900 49846 -30321 -101678 -101320 -57624 -34371 -44809 -55734 -41295 -4521 27944 19520 -37010
39888 -37010 -91968 -92676 -62061 -66354 -105334 -110084 -63243 -33988 -57834 -69152 -9927 72537
39876 72537 105853 101005 101220 85555 18797 -50485 -48815 -7726 -25570 -109334 -164232 -147273
39864 -147273 -120672 -127173 -121315 -73753 -45301 -84665 -128676 -89364 9648 67678 46060 -5576
39852 -5576 -39416 -48415 -30318 6193 4521 -82944 -189806 -180632 -36469 93898 88467 17819
39840 17819 27615 113849 133205 24630 -99680 -117474 -53763 -15788 -37543 -59930 -31595
39829 -31595 35074 98422 131963 135510 127347 120191 98367 44018 -11246 -11550 28120 18275 -70958
39816 -70958 -142095 -105458 -18476 3512 -34006 -31685 22739 32854 -36225 -95153 -78105 -37460
39804 -37460 -32154 -26155 23798 66757 37503 -24510 -32179 14604 43631 33907 35811 75717 116597
39791 116597 118420 82978 38322 19234 49455 103394 111019 47807 -13629 -637 48060 45668
39779 45668 1407 3930 70104 115140 87437 32079 -9649 -63398 -134090 -149721 -69407 23530
39767 23530 24908 -41544 -70215 -38857 -30048 -89798 -157308 -160880 -111740 -65847 -47465 -51914
39755 -51914 -80128 -121262 -130107 -75616 -137 20347 -24216 -65261 -52693 -18339 -16730 -40797
39743 -40797 -37181 13573 73152 97738 82365 54226 48017 84703 147766 183939 155207 84904
39731 84904 22669 -23715 -77097 -121891 -110939 -53443 -28628 -78459 -144506 -154053 -117343 -88945
39719 -88945 -80479 -73574 -80760 -121509 -161413 -148520 -98200 -70184 -66993 -31627 46027 97207
39707 97207 74546 20401 1209 24526 56139 75918 79113 56960 14092 -18939 -21934 -13063
39695 -13063 -15789 -22298 -16582 -8697 -14320 -22098 -17711 -24171 -75535 -153374 -190848 -152368 -79195
39682 -79195 -37800 -44696 -66072 -77657 -90155 -109077 -104259 -49911 22444 50698 20664 -22547
39670 -22547 -49271 -84805 -149844 -206472 -205672 -157114 -104940 -58484 551 57776 70872 35262
39658 35262 -2783 -3519 32448 83237 118504 100613 19684 -75226 -124137 -127994 -124821 -110138
39646 -110138 -49546 33346 61429 13916 -39447 -36902 8307 60028 105854 123948 80415 -399
39634 -399 -37761 -12614 -6329 -64292 -102325 -30832 94314 141948 84089 9365 -14392 -591
39622 -591 15794 14313 -23138 -84220 -99991 -24204 76504 94366 29214 -23558 -22335 -12638
39610 -12638 -8843 39887 132959 177395 118816 23893 -26889 -46537 -76642 -95027 -70475 -45744
39598 -45744 -73943 -117162 -101493 -41231 -12886 -24970 -13997 31186 43341 -2671 -36872 -5223
39586 -5223 42875 35309 -11876 -28693 1381 33405 39548 32652 17594 -20586 -68863 -76442 -18668
39573 -18668 57710 77341 12755 -91517 -158863 -142388 -64882 306 6382 -13152 4305 52849
39561 52849 61168 3832 -50734 -41172 -8469 -31008 -102542 -147570 -138481 -118587 -111960 -93651
39549 -93651 -64698 -71981 -115375 -111679 -10846 108278 128298 45739 -33965 -35305 17279 63795
39537 63795 85253 101420 125782 137941 94927 -18360 -142639 -179275 -96114 30640 106470
39526 106470 115396 95194 61163 7923 -45965 -73423 -75676 -54144 17362 128761 184947 111760
39514 111760 -14750 -48358 25113 75221 26737 -43628 -44340 8821 62196 111858 148247 106813
39502 106813 -29522 -146982 -126501 -13124 40895 -19763 -101616 -107580 -44675 23815 59262
39491 59262 59456 41694 31038 31314 11441 -41130 -73093 -32086 32842 17643 -80669 -139362
39479 -139362 -77206 29538 57171 3529 -29405 7010 51036 36760 -14403 -41920 -37147
39468 -37147 -37199 -50180 -40614 5085 45110 40241 13685 16816 53913 83035 84024 77989 73704 44645
39454 44645 -18954 -78402 -98385 -96920 -109791 -133647 -140596 -124560 -94491 -43114 34953 109256
39442 109256 140223 129718 107030 78869 36985 1576 3620 27603 26680 -1256 -9247 14259
39430 14259 15116 -42565 -109640 -109978 -37771 38844 55133 4884 -66220 -99440 -68143 -3946
39418 -3946 30943 7885 -44992 -87475 -108292 -109451 -83209 -33336 5272 5210 -6338 24592 103529
39405 103529 170211 162854 77283 -42929 -149128 -205809 -191279 -113405 -22538 22367 13989
39394 13989 1676 20304 38820 10175 -48728 -75923 -58088 -46883 -68842 -82139 -56328 -33817
39382 -33817 -58766 -96574 -91090 -60536 -59606 -79233 -72782 -59417 -98668 -166429 -167168 -86925 -23019
39369 -23019 -27034 -30309 20846 67771 54167 33616 62738 79319 10613 -69321 -37416 63070
39357 63070 63370 -74403 -193892 -171653 -72319 -18035 -19117 -14959 5775 18121 35004 78037
39345 78037 108284 68970 -16688 -60921 -25254 35440 49959 10637 -36232 -52921 -46249 -45587
39333 -45587 -53813 -36982 20815 71902 54817 -17370 -69719 -69177 -54810 -50432 -21097 43555
39321 43555 74124 14996 -78720 -111422 -78306 -51380 -61054 -72926 -70763 -80796 -108681 -124144
39309 -124144 -117890 -108869 -88775 -31537 28829 10730 -91669 -172565 -149951 -72891 -36518 -46544
39297 -46544 -39659 724 29314 23805 10262 2740 -16810 -46738 -51333 -19754 6539 -8483
39285 -8483 -44176 -54420 -23036 33277 89844 117137 86340 6231 -63464 -73804 -52555 -67341
39273 -67341 -124094 -150758 -100071 -22051 4972 -17185 -20462 21131 58158 49497 21144 13764
39261 13764 21156 21931 31954 71314 105177 79178 6030 -41313 -26405 12816 29420 18196
39249 18196 -11232 -57806 -102952 -110726 -83123 -70845 -97491 -117489 -89051 -47915 -58063 -117135
39237 -117135 -162796 -157884 -123934 -99947 -105511 -134632 -154224 -123988 -49203 6320 -6506 -60013
39225 -60013 -96420 -102797 -91432 -44163 52913 144165 155680 103509 69149 69751 43483 -26367
39213 -26367 -74826 -76048 -98268 -178635 -236363 -195428 -119794 -121854 -183074 -181777 -85098 2926
39201 2926 3886 -28680 -14924 19966 -6440 -97288 -163796 -141856 -61124 11202 45165 43107
39189 43107 2699 -69165 -123965 -108005 -39855 -2070 -31127 -61909 -24055 46169 52654 -23142
39177 -23142 -102587 -124470 -105880 -77386 -33687 19970 41091 14520 -12861 -9199 -14157 -61110
39165 -61110 -94603 -41135 68283 125749 87984 20575 -1719 22456 51014 62149 66524 80253
39153 80253 96535 77733 -7304 -124296 -187274 -162860 -120168 -128396 -147161 -90533 28913
39142 28913 108629 104108 79329 93129 117969 107230 75864 66532 80067 84775 68769 49435
39130 49435 45708 57914 61963 25259 -46213 -86807 -39325 60741 118600 96880 44406 8339
39118 8339 -14850 -27406 -2137 60892 109617 108768 84185 68775 56707 41408 42060 56491 44574
39105 44574 -2364 -33278 -19371 -1266 -7587 1938 48875 64683 -7806 -102744 -121638 -89639
39093 -89639 -108919 -182097 -204422 -135950 -66101 -76530 -134579 -165006 -153752 -136457 -138219 -160745
39081 -160745 -187510 -181479 -121725 -51848 -37301 -66357 -60099 4159 55810 45270 15253 13560
39069 13560 12368 -23630 -55386 -29884 27859 57904 59013 64465 64242 35411 16581 54891 98000
39056 98000 47997 -73178 -125397 -48679 46115 40574 -30159 -57487 -28141 -16078 -46002 -64958
39044 -64958 -42384 -12905 -9417 -21885 -36958 -58778 -73103 -46714 13650 51196 34745 -137
39032 -137 -13893 -20871 -46571 -68342 -48034 3092 40991 51602 50191 34633 -8096 -56113
39020 -56113 -67175 -41779 -21595 -18449 2139 50684 82017 66254 44772 68956 114722 112667
39008 112667 50639 -9720 -25405 -29416 -68071 -118515 -114721 -44561 27728 48593 41067 50433
38996 50433 58150 5350 -107308 -203583 -225961 -190355 -129888 -48366 36045 68862 38982 21279
38984 21279 67532 109123 59540 -31909 -44314 20639 41084 -21567 -60212 -3513 71616 77355
38972 77355 48287 48552 46099 -12109 -75277 -57234 18775 57690 44301 47787 89453 108873
38960 108873 65570 -8047 -60238 -62968 -11438 58065 73032 15358 -26528 22280 93132 72208
38948 72208 -6178 -3186 94735 144322 73755 -10801 -11009 12726 -28957 -92656 -89896 -51153
38936 -51153 -72412 -146149 -168675 -97957 -958 52247 56546 33595 -2156 -33747 -51627 -70577
38924 -70577 -94817 -88491 -33008 15751 -4138 -57519 -54823 15170 78558 98786 114919 144293
38912 144293 141365 90804 56628 81594 105469 53793 -38140 -66337 -1809 77681 98269 71843
38900 71843 52206 53968 42875 -10121 -84410 -120667 -80054 2645 39698 -17053 -114201 -152257
38888 -152257 -100673 -30191 -22614 -72626 -99651 -48340 43912 88153 45724 -24600 -31988 39044
38876 39044 107232 89244 -5646 -96749 -129498 -116645 -89650 -56519 -23570 -15076 -35837 -42828
38864 -42828 3412 74375 104033 77150 41628 30274 19140 -18707 -61859 -73691 -56191 -38026
38852 -38026 -30994 -30901 -44199 -77872 -110945 -109441 -69897 -23594 1513 3287 -4200 -634 32771
38839 32771 89292 126102 107552 57111 32296 43459 35432 -32316 -121200 -160791 -140381 -114503
38827 -114503 -118940 -119940 -67046 28042 98977 108070 89115 93985 124651 143809 132467 102697
38815 102697 65181 23390 -4533 -613 15217 7897 -8678 14182 68714 79596 17116 -43755
38803 -43755 -29796 20533 19360 -40680 -91370 -94678 -69720 -33501 10565 34992 11733 -28996
38791 -28996 -29917 6099 25223 11994 -3827 -23943 -77909 -134985 -113998 -9792 77953 82335
38779 82335 53416 56333 67124 38591 1573 14912 56332 50306 -11747 -55712 -29979 34439
38767 34439 78596 84196 72901 68534 76779 89164 97044 100709 101586 92044 68906 49913 49086 38464
38753 38464 -28128 -143430 -233048 -230330 -143153 -38466 18604 11158 -18795 -12054 31822 44684
38741 44684 -6219 -45808 6124 96507 105264 32790 -1739 42951 72737 35653 14285 66913
38729 66913 109610 60981 -8961 1942 52428 38220 -22741 -31103 15519 33720 17880 43435
38717 43435 109225 120007 47183 -20304 -18489 11402 24987 52121 117214 166383 137244 48177
38705 48177 -29757 -51924 -23369 18830 29788 330 -21386 5702 43246 28992 -10499 9102
38693 9102 83717 107072 32132 -50946 -49213 4432 22478 -3891 -18884 -7670 -10992 -46509
38681 -46509 -74001 -45447 38038 121264 139680 80640 768 -35153 -22521 3833 36140 85057
38669 85057 119067 86685 6891 -37264 -16580 4163 -26756 -71975 -77968 -59986 -61580 -79047
38657 -79047 -79574 -57032 -21489 35110 117521 194750 224796 194138 115757 18693 -49813 -58150
38645 -58150 -40912 -59754 -98110 -70009 33964 98487 43987 -46890 -50651 15511 39225 -4978
38633 -4978 -38398 -27596 -30026 -73996 -101881 -74569 -44374 -67207 -108431 -102226 -61679 -58182
38621 -58182 -105358 -129082 -67663 42300 109628 98177 59515 55395 81734 95416 93192 113887
38609 113887 156109 148537 42929 -95553 -146270 -78429 10123 14977 -51825 -91740 -52154
38598 -52154 13542 26812 -11223 -30408 6852 59721 74264 51219 21939 -4588 -29090 -25755
38586 -25755 28976 104760 143099 126299 77885 11358 -67456 -122169 -114781 -67715 -33924 -13228
38574 -13228 30344 78317 74812 35077 35568 80409 88337 43355 37124 105525 145410 77686 -17870
38561 -17870 -33621 -1696 -11964 -46705 -32640 5201 -12602 -61561 -46627 23870 42868 -14813
38549 -14813 -55271 -27999 3308 -14524 -44403 -45712 -39246 -41118 -22437 20049 34154 -4172
38537 -4172 -50392 -69506 -80786 -93782 -80281 -45268 -42584 -78871 -85717 -33120 16049 18125
38525 18125 24458 76041 109186 54376 -39863 -76694 -52252 -33362 -36078 -23314 2857 856
38513 856 -28587 -41792 -29336 -23993 -35889 -43535 -44581 -55271 -63619 -39592 11266 53237 70109
38500 70109 64253 27036 -36359 -77098 -60554 -30661 -46912 -82008 -65817 -12806 -7600 -66384
38488 -66384 -116657 -125890 -140069 -166244 -133915 -29834 38472 -2919 -66881 -33561 60652 76788
38476 76788 -20302 -122968 -140319 -94394 -45478 -10934 12922 17896 9843 20738 63640 108279
38464 108279 121743 104063 70822 33191 7628 10695 28159 21443 -17545 -47894 -34914 3303
38452 3303 24490 12711 -20564 -63031 -104756 -130692 -133022 -122153 -110780 -98644 -85693 -84962
38440 -84962 -105160 -131927 -142962 -133911 -115624 -93066 -59992 -12035 41142 74511 62612 8439
38428 8439 -46085 -57232 -26776 6650 18783 15132 -371 -33112 -67612 -70514 -38673 -6225
38416 -6225 11769 40310 88703 121234 113731 93304 86193 74768 50138 54241 107909 143366
38404 143366 84751 -34663 -113103 -113546 -76091 -22071 55958 116324 88757 -8403 -69953 -52434
38392 -52434 -29396 -63208 -114339 -125240 -104752 -72068 -5752 80254 96279 3424 -92075 -74930
38380 -74930 6309 16774 -56940 -104722 -81451 -62654 -95252 -117746 -75229 -13392 932 -23793
38368 -23793 -45690 -64162 -90799 -95154 -44885 28199 55841 9939 -83105 -176796 -218740 -167760
38356 -167760 -47880 41107 23746 -53656 -80349 -28053 21121 2826 -37123 -17191 54807
38345 54807 87156 28543 -62341 -92795 -51902 -14218 -34532 -80329 -86900 -43509 13854 70444
38333 70444 134987 177432 136144 18219 -70063 -49132 22348 32468 -17229 -19968 62083 131772
38321 131772 104800 35355 19779 37791 -8256 -117146 -161777 -65340 82949 143796 103126
38310 103126 66402 106746 184804 219251 185186 124917 88697 82851 71340 26795 -23954 -27222
38298 -27222 17036 38834 -7115 -65335 -50793 23660 56287 -4003 -90403 -111904 -61577 146
38286 146 29161 28016 20359 29033 62411 99091 104611 80402 69385 93145 117242 109934 102050
38273 102050 141980 209181 223543 144016 21119 -57973 -54562 -4732 22116 -11065 -74059
38262 -74059 -103130 -75256 -35375 -40018 -91320 -140829 -141478 -83459 -1809 36280 -18594 -135987
38250 -135987 -220336 -213806 -154836 -106455 -68604 -10827 45810 51189 16782 10937 57447 101919
38238 101919 93835 47348 3210 -18790 -9782 35677 91700 111550 93658 91622 125402 131315
38226 131315 51157 -66273 -117742 -85534 -59502 -110673 -198393 -229157 -168910 -63851 24613
38215 24613 65215 46929 -28903 -126682 -178348 -144135 -66277 -30886 -70594 -131010 -143577 -104519
38203 -104519 -61763 -46380 -46922 -42402 -31245 -24369 -27808 -37014 -40583 -31168 -16153 -9723 -14141
38190 -14141 -24968 -51402 -98008 -122288 -63226 58256 122083 48874 -82579 -127909 -61769
38179 -61769 11058 19059 5214 26535 62224 68486 55263 49951 35024 -15534 -71064 -77844
38167 -77844 -40765 -16622 -33081 -60534 -61901 -31378 14947 52360 52405 7145 -49928 -74553
38155 -74553 -62367 -43228 -31549 -17444 -6812 -27230 -76543 -100757 -53894 36555 93338 76490
38143 76490 25325 7135 36535 59989 24515 -50110 -89287 -58167 -9879 -13325 -55660 -63767
38131 -63767 -19781 3358 -51831 -136505 -160683 -117085 -76998 -72767 -52647 30451 140911 201508
38119 201508 174770 78896 -38397 -114960 -106458 -41526 -6050 -32760 -52184 -6007 44837
38108 44837 9049 -77526 -92535 -15719 42454 22021 2521 54875 111482 70340 -47079
38097 -47079 -134780 -147412 -118859 -77544 -33268 -20267 -64420 -122262 -131897 -109595 -115516 -138633
38085 -138633 -107652 -16715 53080 55112 35701 44937 65731 66115 55509 50257 38518 15425
38073 15425 2943 2026 -23585 -80402 -113693 -85595 -37934 -27776 -39946 -21451 22211 27334
38061 27334 -32732 -101612 -104332 -32715 48210 72296 41533 13972 21148 23731 -23236 -86821
38049 -86821 -91674 -32700 11660 -5360 -31229 4920 92425 161600 171252 133657 79371 37014
38037 37014 30003 56971 82713 71623 23515 -32810 -65056 -52831 -4826 35481 35232 23775
38025 23775 50781 90706 59812 -48479 -127172 -105477 -55960 -74866 -124384 -99670 -10089
38014 -10089 30144 -14776 -52616 -21961 14869 -7406 -41496 -13099 47975 55544 6589 -20498
38002 -20498 7277 41398 47724 53995 73886 56699 -37396 -158492 -213964 -166449 -46331 98672
37990 98672 216979 248415 173802 60466 -3127 -14098 -34584 -71510 -60604 13135 68867
37979 68867 47559 -3180 -19276 -20970 -50493 -76165 -50320 -11733 -28267 -73601 -70171 -30663
37967 -30663 -37768 -92071 -108933 -76788 -79496 -124515 -95254 47610 150413 68811 -112093
37956 -112093 -194682 -141833 -87834 -105732 -117028 -55077 15089 4013 -64804 -100339 -75800
37945 -75800 -43634 -41827 -47632 -25284 25585 80663 118650 123463 86380 32487 24863 99157
37933 99157 193674 195028 77532 -49420 -75015 -26029 -10059 -50707 -64810 -3371 73118
37922 73118 89091 52151 17398 10209 24892 51232 61970 18044 -74022 -151076 -175089 -179143
37910 -179143 -193687 -183407 -113077 -23970 25842 56166 118440 182895 165425 65851 -11243
37899 -11243 2919 56803 73757 66704 95766 147656 133372 15849 -118270 -154355 -89140
37888 -89140 -23359 -20031 -33211 -5770 26838 -258 -56096 -48315 22084 43725 -36516 -120901
37876 -120901 -95696 10769 74712 37039 -48261 -97395 -75158 -12798 13832 -46486 -143450
37865 -143450 -164493 -85306 -16345 -44880 -104340 -85592 -12294 9877 -21691 -7751 69495
37854 69495 102863 38032 -26654 12040 107249 141751 100920 70637 91255 108104 74121 23571
37842 23571 10028 23611 17908 -6402 654 53468 92722 61847 -9133 -38218 2182 57155
37830 57155 68375 38134 1854 -26367 -60726 -119723 -206376 -291468 -319559 -266377 -185099 -146953
37818 -146953 -139184 -88763 4521 44228 -17629 -97159 -101619 -61100 -57645 -83735 -68128 -5290
37806 -5290 42398 56266 76774 105476 86593 9660 -50396 -33113 30267 81591 126496 204882
37794 204882 296691 317103 218220 62169 -33379 -15242 63124 121281 139646 142824 129804
37783 129804 75712 -7109 -67952 -80561 -55262 6486 101533 170390 141899 51078 16469
37772 16469 65312 86140 13131 -52098 4530 123928 158667 83367 3281 -10505 15989
37761 15989 40849 51348 38263 6732 -2242 27753 36077 -29499 -110622 -111892 -46846 -14002
37749 -14002 -47470 -87016 -83533 -44339 13051 67130 72620 21446 -4779 60916 147827 140586
37737 140586 63591 41549 94136 115808 64638 22231 38668 59981 51049 54767 75334 32764
37725 32764 -96630 -208680 -215443 -160856 -120529 -86688 -37319 -27070 -105642 -208221 -227805
37714 -227805 -160258 -94724 -86061 -106746 -108684 -78654 -42521 -44715 -103624 -171528 -174632 -106963
37702 -106963 -38972 -20026 -28401 -33630 -41371 -48979 -24381 33124 70822 59016 34604 35080 46070
37689 46070 47736 53866 68205 60140 22430 -1864 13212 35650 34634 24231 17066 -4578 -38250
37676 -38250 -45434 -21357 -15829 -48873 -75255 -71828 -83404 -131545 -154383 -100617 -17501 20337
37664 20337 11130 -7955 -34992 -73827 -85204 -43378 1386 -9147 -46921 -44307 -5501 3514
37652 3514 -37835 -73523 -47407 32797 107187 114937 46646 -38265 -67600 -37553 -6834 -12362
37640 -12362 -42058 -88328 -153822 -193005 -137268 -11148 62905 19430 -72192 -128386 -158205
37629 -158205 -192079 -199497 -157547 -120040 -131518 -142554 -97143 -35633 -17086 -4611 65673 152088
37617 152088 155202 67378 -26375 -72158 -77716 -44722 29758 94912 81806 -847 -78675 -113194
37605 -113194 -125165 -129925 -118797 -96953 -79189 -58799 -30861 -20401 -33859 -22049 40466 81943
37593 81943 25639 -77019 -102286 -27310 49040 55233 22725 2652 -5263 -15424 -18452 -11878
37581 -11878 -19889 -56345 -98166 -108126 -67317 6074 54586 27638 -45232 -69091 -5251 74772
37569 74772 100879 101582 121926 118094 36014 -59364 -54919 36734 94772 71590 36707 35977 30085
37556 30085 -641 -5726 33930 51060 -1998 -66388 -57370 19694 87339 93186 47239 -8644
37544 -8644 -35287 -21753 3152 4278 -9626 1470 43141 70975 50752 650 -37083 -37746
37532 -37746 -1350 51655 83551 65740 14481 -16500 10673 76176 114926 77196 -10791 -61599
37520 -61599 -31324 13448 -10396 -66376 -51086 22202 23691 -71920 -112103 -4208 111392
37509 111392 61699 -93724 -160947 -99734 -36198 -31308 -22640 9751 -860 -60757 -82475 -37857
37497 -37857 -4783 -18662 -9799 59887 120810 116292 90373 92946 93361 50140 -15968 -70707 -110259
37484 -110259 -117468 -61227 21729 39512 -16245 -43693 8025 58399 39194 5563 17153 13540
37472 13540 -79066 -195745 -210733 -121127 -39479 -30003 -53539 -61698 -55819 -53738 -67800 -112597
37460 -112597 -177946 -206369 -154770 -68093 -37262 -90207 -169102 -204375 -170825 -89439 -19836
37449 -19836 -32632 -137409 -246813 -258781 -169570 -66484 -19518 -23894 -42001 -51797 -44266 -12036
37437 -12036 39810 88482 109173 90690 41795 -6604 -15649 26373 84389 105222 69655 14256
37425 14256 -181 48832 109305 100127 9570 -76846 -78814 -24220 786 -17874 -14621 34533
37413 34533 66430 33992 -18862 -31097 -14270 -13595 -24318 -8677 29246 45015 23502 1241
37401 1241 16303 65744 116570 141446 141394 138567 143884 139895 112192 84045 86682 105404 100299
37388 100299 75692 72958 90620 78612 31133 13267 56343 93933 58703 -10799 -27331 17953
37376 17953 54785 38038 -13684 -71424 -122771 -145672 -116368 -57162 -28462 -54879 -95035 -100862
37364 -100862 -74439 -46871 -29513 -13111 1947 5072 2546 18165 56745 86196 74910 36749
37352 36749 14121 18707 20005 1133 -10311 7736 22655 -13255 -92338 -159470 -177111 -145277
37340 -145277 -73946 16292 76880 70518 29182 20361 52222 68873 46004 23032 18322 -13277
37328 -13277 -90591 -138198 -80348 34515 83048 31738 -23194 4808 80016 109951 75809
37317 75809 38973 35103 27090 -20366 -74952 -86358 -62891 -43485 -18700 49509 134862 154337
37305 154337 87809 13124 -10190 -13930 -32899 -27849 33045 91423 85684 57181 71359 92199
37293 92199 51999 -2878 24675 100251 94176 3701 -23097 74262 159549 102151 -40674 -133566
37281 -133566 -147910 -136414 -107719 -36226 53438 106644 112854 92690 51029 2757 -4578 41709
37269 41709 80774 73123 74656 136244 190700 143818 35486 -6718 42847 81595 46350 -4984
37257 -4984 -5570 26109 46388 57150 64252 35058 -39454 -91095 -52808 36459 71233 16666
37245 16666 -50151 -42369 38490 122366 153924 132802 92737 66688 64557 66428 44201 5522
37233 5522 2821 69911 157230 172050 93754 7271 -3129 44933 73603 53650 19350 -4827
37221 -4827 -28891 -46650 -21258 55255 131053 150987 116581 68800 37254 28943 44014 73714
37209 73714 93238 82187 51990 36079 49300 68303 59439 19329 -26031 -61525 -96364 -121043
37197 -121043 -85854 28038 136095 124229 6929 -66925 -3255 116339 158844 114238 65577
37186 65577 41763 4683 -41613 -37565 28022 91448 111742 119041 143118 165779 176281 208566
37174 208566 279751 346362 380130 452936 670043 1002403 1241228 1180223 846675 498551
37164 498551 357082 387914 406216 344519 296083 307038 292050 221166 232772 428387 664465
37153 664465 708513 544106 366614 308781 322291 320738 290779 244102 186273 158814 205860
37142 205860 281339 289293 225434 174115 159633 118896 38819 -3923 23311 51570 34081 22792
37130 22792 67101 128446 153066 151669 152931 145524 115078 81788 63605 52312 47504 60724
37118 60724 77271 74771 76767 114265 145103 105074 30469 17781 61077 58626 -216 4486
37106 4486 129173 265058 294919 234979 152928 59317 -37325 -70757 -8350 74811 99116
37095 99116 90677 110715 140767 121089 53652 -7427 -30807 -17824 21488 57174 51221 21476
37083 21476 42234 141122 247783 283284 249397 197179 161725 156336 173768 170219 111223 49887
37071 49887 80937 193596 258387 198593 90898 49181 84945 133446 151310 137545 110086
37060 110086 100353 128354 166824 177688 178477 205875 230788 201996 157993 179130 233829 207858
37048 207858 100321 44946 100740 167246 162293 141850 168905 192141 145223 64758 23423
37037 23423 25864 38408 49207 51095 39420 53405 130671 210585 198088 130276 133950 200490
37025 200490 179661 45244 -25804 70986 195170 185624 98001 79286 138264 187952 212959
37014 212959 252225 291387 293537 273962 252268 203907 136533 122510 175407 195593 125022 50995
37002 50995 63472 115907 128578 125914 160784 194994 167435 103706 57774 19689 -27180 -35215
36990 -35215 29577 109207 133579 110586 73796 22861 -22386 1044 102274 200067 235462
36979 235462 233533 219061 179460 143039 167744 219262 201229 137490 158299 263184 287103
36968 287103 170542 66990 90500 150985 148505 137919 173108 172446 83953 18229 68593 147687
36956 147687 144360 102453 110917 155168 201255 283119 386581 399620 299589 231440 276991
36945 276991 313456 231878 124300 111281 149583 156379 162124 197748 195807 145728 174292 323905
36933 323905 428065 363901 252545 246735 295717 291307 275350 322591 373365 355109 326525
36922 326525 350868 377608 381791 445524 572818 629021 610275 746274 1148866 1565703 1683640
36911 1683640 1500322 1218830 961250 764004 669854 645236 575022 478691 532563 751894
36901 751894 893711 822308 710968 717438 735238 655395 598068 673457 770661 788186 822197
36890 822197 941706 1047443 1126826 1342566 1678701 1825985 1631500 1336197 1159502 1002638
36880 1002638 784749 684828 780386 821594 652688 498537 552280 646295 612179 584294 661947
36869 661947 670954 552417 568491 819176 991753 900412 811133 906806 930747 725033 604654
36858 604654 787219 958210 834238 663168 731546 873074 895563 979312 1217046 1296310
36848 1296310 1084038 975013 1217144 1466241 1442118 1401397 1522281 1504324 1243052 1172505
36838 1172505 1450356 1577104 1326917 1216971 1515167 1685836 1410694 1214936 1452167
36829 1452167 1650771 1510065 1502595 1836252 1941417 1647282 1641809 2101692 2233746 1859678
36819 1859678 1909475 2602075 2875118 2438903 2450894 3243166 3564467 3097671 3271479 4419988
36809 4419988 4915935 4435228 4911422 6738625 7682802 7342634 8444756 11585658 13689936
36800 13689936 14279584 17276545 23356450 27978537 31362120 40903535 57352074 71451570
36792 71451570 85881658 124760831 198205835 266664643 271669637 206076658 125877067
36785 125877067 82759598 71759179 60481991 42147194 32669949 33746273 31060353
36778 31060353 22592697 20303264 25146857 25462085 20627441 22551639 31790759 35936613
36770 35936613 35129965 44186788 63672477 76872591 86891662 125836303 203389105
36763 203389105 270653141 268037586 198311798 121464174 81664099 69478284 57494234
36756 57494234 41376455 31890515 29244948 24934994 18209360 14819814 14786394 13238705
36748 13238705 9959290 8721153 9523825 9095940 7343737 6966696 8024352 8223324 7510144
36739 7510144 7832785 9253522 10187404 10706762 12323381 15271058 18676912 22281804 25448537
36730 25448537 25891246 22232504 16742688 12885165 11104696 9502491 7557648 6405593
36722 6405593 6149176 5655398 4791399 4510452 4836964 4835514 4477921 4644522 5358705 5802947
36712 5802947 6031831 6957287 8624727 10179370 11689251 14346757 18359476 21918426
36704 21918426 22895661 20826889 16934031 12911508 9920122 8121804 6874861 5616920
36696 5616920 4473289 3760203 3300916 2750889 2225984 2000450 1900108 1611184 1291310
36687 1291310 1252073 1318984 1131019 812551 731950 837352 828305 745573 804013 877243 730637
36676 730637 540368 611152 800059 781031 655872 734453 928371 950553 924550 1189839
36666 1189839 1633165 1795273 1564653 1245307 1012430 792675 615381 608272 680849 626744
36656 626744 495379 494501 601920 631553 594377 646046 772739 863029 982168 1238732 1482886
36645 1482886 1473076 1269599 1169241 1315178 1604462 1879897 2015453 1957894 1857003 1949283
36635 1949283 2147924 2037152 1487368 937403 782920 835713 735799 547780 523368 578551
36625 578551 483988 341655 394470 545483 530444 413783 458643 639186 738506 825150 1173149
36614 1173149 1760562 2261333 2495472 2515901 2319258 1867545 1357625 1082284 1026836 936769
36604 936769 752848 640041 618072 519291 322168 202892 228743 277682 275940 268089 260030
36593 260030 222203 216395 303076 388872 382238 392032 529352 658285 644507 697825 1084887
36582 1084887 1598913 1742830 1427484 1073520 976039 967005 811506 574780 429788 382134
36572 382134 359841 367294 402025 384453 290921 221923 249594 316079 343325 329714 297252 255335
36560 255335 245993 316655 425692 472022 431284 382090 401118 495453 612665 680078 707746
36549 707746 873165 1339189 1910351 2091308 1665303 1019907 673289 656107 633431 472095
36539 472095 335465 296677 231104 110641 79205 171862 230499 172136 106096 114637 134139
36528 134139 125651 158224 241491 261943 174981 98337 125506 185544 173140 100353 42433 28860
36516 28860 48720 83415 93874 49908 -6533 -2439 56170 94251 82475 56813 35656 9814
36504 9814 1610 37053 71197 38776 -31895 -51239 -2617 49919 75247 102934 145999 181443
36492 181443 200398 206928 185233 130475 81022 63591 53757 42845 70884 131305 138558 73301
36480 73301 51565 143111 235217 210465 147408 180500 257996 230762 116284 72677 141017
36469 141017 206826 209748 207765 220726 181918 81961 17177 47148 112834 134609 106148 66028
36457 66028 46568 64167 106345 131956 123279 108010 95974 55708 -1233 2540 84856 149888
36445 149888 136233 115287 151797 181895 142213 102595 136968 175983 138506 99588 156736
36434 156736 228816 180824 72437 77860 203668 285686 247330 179150 164529 184252 195837
36423 195837 179045 116839 40535 47823 160650 236591 158315 28511 14177 80637 72612
36412 72612 -7383 -17837 59004 90795 29899 -24235 -11712 14728 18331 22470 19825 -14772
36400 -14772 -28057 45408 137756 127503 45497 31472 99157 124954 70885 36579 70753 101235
36388 101235 80275 47097 22813 -14931 -38353 10388 97071 127151 96698 76454 63517
36377 63517 2666 -60628 -19539 99613 151177 94152 44668 84559 163500 213041 228690
36366 228690 224291 212162 217975 227373 182676 132070 250328 553980 781973 826928 1091514
36355 1091514 1983556 3118775 3535922 2837832 1687963 963116 795295 739629 554243
36346 554243 393494 378489 391080 321484 233856 209552 215681 210586 246620 372682 510777
36335 510777 537007 473986 491492 656686 802528 821378 1015699 1822877 3067372 3834769
36325 3834769 3421087 2200427 1174678 806427 736248 574707 416690 437910 486029 368110
36315 368110 202117 179209 223814 169822 72718 77344 138857 129414 85380 108474 141835 78130
36303 78130 -12701 8522 99449 110730 40442 5683 18972 -4846 -61709 -68443 -28966 -18957
36291 -18957 -35009 -18582 6715 -16974 -34442 51816 188880 225862 152713 114966 174495
36280 174495 218629 151511 39164 328 47901 98973 85158 13952 -46600 -34447 31206
36269 31206 60501 8008 -63335 -74009 -29130 27023 93497 173215 210170 159398 77751 52290
36257 52290 71986 61135 9397 -24155 -11826 28550 96366 190607 248629 204833 106809 73291
36245 73291 128628 177887 168966 178914 286032 442179 565520 720953 1083684 1665428 2155800
36234 2155800 2166817 1663662 1044593 713351 663388 610325 451412 375424 503282 664886
36224 664886 673466 645692 841084 1254967 1571549 1530819 1196119 825788 592645 482962
36214 482962 397213 280948 166031 112962 127616 152216 138815 97699 59982 32949 17350
36203 17350 29931 74406 115902 113313 65074 17744 45076 193116 397737 490898 377271
36192 377271 188098 146511 274543 366260 286611 149723 119229 167251 157045 69389 4266
36181 4266 7957 31704 43510 67400 110473 139341 136557 117806 95795 79174 94975 161046
36169 161046 248280 312715 345283 349674 301668 185315 52893 -2767 62380 202771 318585
36158 318585 325193 222759 109150 83001 127685 146520 113181 99439 131377 126233 34387
36147 34387 -54129 -35303 50981 89060 59496 37836 55077 66710 53904 59649 107456 154118
36135 154118 147017 84312 2319 -64528 -96723 -82904 -18217 81515 164362 170207 103868 50933
36123 50933 70818 103980 57995 -39462 -71637 -9620 52942 53431 29838 9293 -45714 -127997
36111 -127997 -145919 -65130 20025 35564 44167 125293 235743 284197 260584 202846 121706
36100 121706 46844 51830 132532 159524 65173 -24426 20999 115266 90568 -26479 -64319
36089 -64319 12201 70126 51770 51785 117881 154936 94042 8101 -22209 -35959 -95615 -158693
36077 -158693 -142500 -56121 18491 40482 35988 36145 47890 71835 101376 109114 69562 -3216
36065 -3216 -63626 -83753 -79198 -76696 -64741 -762 116917 210007 197192 102658 31939 32336
36053 32336 43175 9987 -25808 -5543 40357 40560 1471 -1643 58307 120097 116676 49574
36041 49574 -26516 -60728 -44713 -16443 -20857 -52269 -52402 16299 115284 169823 149802 93268
36029 93268 59842 68536 74808 21262 -72873 -107637 -32914 56875 37319 -63257 -98792 -20644
36017 -20644 56676 28894 -69406 -149994 -180573 -158266 -74013 31738 64630 -3791 -82983
36006 -82983 -86240 -33703 16373 55206 85650 80478 39951 14770 20633 13848 -4659 33681
35994 33681 129835 176487 123026 61047 64956 75096 36015 17866 79429 134837 94196 25631
35982 25631 33465 79950 79172 66267 109644 149839 101576 31182 47790 95932 52916 -38881
35970 -38881 -52956 -33792 -129714 -295516 -318356 -162904 -44058 -94428 -185175 -168456 -97209
35959 -97209 -86575 -119796 -120417 -96778 -96099 -105703 -100079 -110717 -163298 -209063 -190102 -118892 -41601
35946 -41601 19567 46889 16895 -46250 -67521 -11247 76818 140673 168493 160184 110209 43542
35934 43542 1534 -24033 -72543 -120721 -92163 17715 110696 110665 45104 -23952 -73012 -92146
35922 -92146 -65145 -13195 6254 -22896 -56258 -66249 -71115 -67990 -15042 86343 162879 162501
35910 162501 116294 72314 27108 -36175 -92635 -104915 -77822 -50904 -54484 -86174 -112332 -93478
35898 -93478 -30006 28491 42181 24418 791 -30559 -57366 -30772 52793 108187 80026 42345
35886 42345 81389 141758 114611 29887 13428 76908 104694 48636 -15885 -41219 -64006 -85116
35874 -85116 -44414 41416 61054 -14119 -71543 -43850 -21438 -92695 -189334 -194582 -116827 -51668
35862 -51668 -34954 -30018 -18367 -19936 -46174 -89338 -136627 -160766 -128904 -48178 31590 75837
35850 75837 85570 57500 -17852 -110138 -162307 -159840 -131925 -89827 -32212 2041 -25931 -70290
35838 -70290 -54219 -2373 -7348 -64122 -70052 -10010 2655 -79059 -137820 -68150 61873 114037
35826 114037 59520 -25375 -70850 -49589 34285 128598 160821 128828 105245 120900 121031 69720
35814 69720 8391 -29391 -65553 -94119 -55664 41916 81090 -5086 -118457 -129059 -50997
35803 -50997 220 -33115 -112419 -172895 -164777 -71826 55069 129023 130128 116351 104825 37146
35791 37146 -85606 -139796 -39791 119431 177240 108744 23263 5696 39986 61250 23074
35780 23074 -61779 -114008 -65239 35625 63303 -10070 -71484 -37670 32922 58914 61373 87666
35768 87666 106042 75810 45228 75091 124429 111969 43907 -9771 -23288 -17645 1395 30967
35756 30967 39687 19499 22279 77134 124067 100562 38982 4282 -7684 -29511 -34667 22146
35744 22146 118295 195488 239409 256443 217685 104227 -29194 -107502 -120382 -99984 -61117
35733 -61117 -20448 -20228 -67768 -98904 -58613 29782 114700 165365 135718 -17027 -215974 -280209
35721 -280209 -147346 22201 60287 3906 -17719 4765 5584 6221 67986 143354 135031 62272
35709 62272 20745 16210 -13895 -49653 -16126 58356 65050 -8394 -64666 -59583 -45857 -54468
35697 -54468 -59645 -62061 -84304 -87806 -19061 68322 69572 3290 -8273 62579 114776 99070
35685 99070 86140 119456 138521 98807 48183 33156 35775 47956 102894 186713 220216 176250
35673 176250 122197 104399 85233 36186 -4540 -14452 -32415 -72704 -85477 -54297 -40916 -75463
35661 -75463 -91989 -39641 24860 29764 2242 12016 56847 80007 61787 28102 -821 -17696
35649 -17696 -14260 -2869 -19607 -69393 -104125 -89968 -58060 -53950 -74344 -86910 -76633 -44498
35637 -44498 895 26224 -5181 -66927 -76576 -5825 67320 62002 4458 -19632 11920 42693
35625 42693 29667 -4644 -14189 14700 58284 85264 83082 60768 30859 -2349 -30909 -38388
35613 -38388 -26704 -26752 -51367 -60805 -20110 29493 17908 -43035 -68020 -28208 1540 -41868
35601 -41868 -111418 -117102 -47089 32329 70140 68964 41941 -12983 -83123 -126174 -113409 -68519
35589 -68519 -34281 -11236 30776 78036 69069 1659 -20092 73074 172027 107473 -92807 -205086
35577 -205086 -109301 52020 93894 33918 -2251 -3770 -41948 -90086 -56323 30993 43353
35566 43353 -38865 -95239 -63228 -17773 -17960 -17407 18041 33028 -8125 -46296 -34897 -24185
35554 -24185 -61692 -97188 -70772 -21603 -21859 -60560 -77514 -66303 -61122 -56509 -21466 26086
35542 26086 32026 -12024 -55190 -52885 -4361 65983 124053 130312 70276 -14366 -53969 -19630
35530 -19630 48530 83691 56037 -4553 -45393 -47475 -36617 -37933 -41546 -28238 -6270 494
35518 494 -16420 -49364 -81524 -81155 -29459 24760 -3482 -109187 -170383 -112034 -28208 -47578
35506 -47578 -134901 -147861 -62235 -4758 -52630 -125531 -115524 -26081 64265 102343 82531 26083
35494 26083 -26936 -44436 -37504 -40009 -64336 -111346 -186771 -255133 -233548 -110448 -5655 -5882
35482 -5882 -12947 97571 231203 183026 -33267 -182658 -155321 -94446 -121847 -160026 -127111
35471 -127111 -98230 -134160 -131622 -5872 129618 136800 76705 82436 122775 85580 9084 24074
35459 24074 113983 130648 33357 -63918 -82301 -56890 -22240 31833 76916 56762 1529 5888
35447 5888 72638 98373 38351 -32189 -51058 -47901 -49780 -19522 52526 88220 25745 -77291
35435 -77291 -110512 -44082 51216 91597 58707 10531 24339 107036 171085 134912 29313
35424 29313 -47711 -62972 -65906 -84398 -84805 -46793 -1772 24769 43146 53252 36518 14258
35412 14258 39477 99951 107862 33385 -27329 13303 92829 80070 -34953 -126582 -107366 -29847
35400 -29847 9955 -1727 -15572 -15527 -30747 -64260 -71070 -23789 41509 70650 55283 25099
35388 25099 -306 -18269 -16816 20154 82509 136881 158741 142218 93312 40109 25828 51948
35376 51948 55555 -2782 -59019 -29790 47704 62262 10348 6683 84377 119105 25560 -91936
35364 -91936 -93006 -10260 25121 1260 22472 113614 173728 142278 89152 96470 143078 159132
35352 159132 132625 109563 121826 150903 148659 84878 -9882 -59821 -31326 14424 945 -50386
35340 -50386 -48430 30839 105256 102615 54858 39249 65584 68094 1658 -86857 -100788 -7461
35328 -7461 106568 119937 14002 -109626 -153865 -119097 -54355 19756 93461 130930 116987
35317 116987 101268 128881 160680 133278 68632 44853 76543 103993 91151 56822 16037
35306 16037 -30099 -49201 -4350 69441 94278 59990 25692 8959 -30757 -82348 -64276 39347
35294 39347 120358 89094 -703 -39518 -12841 10440 -4365 -25521 -13789 44746 139047 216187
35282 216187 198119 74093 -53505 -80333 -33905 -26593 -91037 -143560 -116779 -47721 -5662
35271 -5662 -2387 -19355 -65782 -144238 -192826 -140054 -17645 52461 9678 -63656 -55215 26682
35259 26682 77000 46552 -3709 -10593 52 -30066 -92816 -125580 -100381 -51900 -21113 -9251
35247 -9251 7398 40374 71476 63624 -3193 -100012 -168314 -178120 -145945 -93501 -26849 33301
35235 33301 52426 41006 59634 126728 177552 167356 152989 193897 227406 150537 -552
35224 -552 -72446 -2024 108978 150966 131184 99439 52292 -18709 -62555 -35580 17534 25890
35212 25890 -1851 -6293 18379 25857 8370 8644 37094 45799 5919 -41423 -40343 8797 60960
35199 60960 83813 75659 42837 -8040 -53577 -55866 -911 70342 88750 27057 -62635 -95520
35187 -95520 -41955 39119 59474 -9199 -108882 -156744 -129188 -78717 -66318 -92319 -112238 -108836
35175 -108836 -111222 -135187 -145441 -105198 -34042 19398 43938 67448 102100 125423 116385 82612
35163 82612 50688 48402 88556 148175 173907 133329 53520 -10978 -33312 -17616 23921 62555
35151 62555 52677 -8459 -44355 13358 113234 133730 50405 -23208 11320 112167 168274 139778
35139 139778 72384 10930 -35486 -54868 -22751 51169 107193 96572 44315 23890 67191
35128 67191 124302 129599 85672 45486 25135 -6117 -39912 -9853 92344 150833 60948 -107804
35116 -107804 -180189 -94856 38373 101705 89581 45209 -17646 -76152 -70771 7825 66623
35105 66623 26309 -54150 -55728 22062 55190 -23479 -122221 -113404 -4137 76533 45042 -40961
35093 -40961 -73612 -38257 -16404 -57357 -110642 -113156 -87741 -97360 -134505 -129254 -61161 8171
35081 8171 25743 6219 -19984 -55585 -99107 -111698 -68033 -6514 15988 -1609 -14726 -4302
35069 -4302 -1135 -37000 -93046 -108249 -44514 55937 98767 42293 -49457 -89850 -75938 -60249
35057 -60249 -46721 3609 68858 63115 -35758 -136835 -156105 -118471 -96654 -110338 -134154 -151940
35045 -151940 -155217 -134903 -114411 -138885 -195164 -206447 -148230 -91977 -76909 -29574 99586
35034 99586 204706 153627 -6080 -106695 -98127 -83251 -118256 -129169 -66157 -3477 -11635
35023 -11635 -36489 3638 76362 88936 38477 11709 49154 94265 87952 48444 30282 44424
35011 44424 51713 20493 -34944 -74389 -74643 -43294 1642 47013 76212 68153 21917 -31668
34999 -31668 -60476 -60225 -38499 7487 70598 112986 103021 60984 31330 20295 1146 -27559
34987 -27559 -35578 -12660 17923 40779 60586 70226 53223 24264 18463 31441 23790 -1628
34975 -1628 9408 65915 93388 42809 -20246 -5708 61715 77346 16702 -26947 18126 101780
34963 101780 132570 103044 76569 77231 57632 -17338 -105004 -131592 -79899 -1835 44603 42808
34951 42808 7325 -39880 -72475 -67806 -32251 742 16738 42646 98152 148954 147900 108677
34939 108677 91857 119279 149634 146392 122878 104270 90678 81828 95475 129214 141156 105262
34927 105262 53942 26324 5677 -42765 -96434 -97306 -41844 8535 13731 2385 18891 63572
34915 63572 103714 113051 84240 28061 -26072 -50487 -48847 -45177 -43568 -28451 -5191 -2125 -24989
34902 -24989 -49003 -64316 -81731 -80499 -12449 106852 171828 108733 -21284 -104440 -120536
34891 -120536 -130052 -143677 -102710 3081 88779 80009 532 -78654 -120159 -116716 -65754 6089
34879 6089 39801 14218 -18389 -11264 6355 -6571 -13290 46242 134229 139501 31845 -88351
34867 -88351 -121411 -82424 -47780 -47074 -60101 -79014 -110278 -131532 -105763 -41716 6178 9276
34855 9276 -2060 7219 24630 19328 -4068 -19405 -32314 -71768 -123437 -122353 -42038 48614
34843 48614 64548 18396 -352 44943 88446 57578 -32049 -103967 -104444 -34193 64412 124269
34831 124269 99448 29593 16695 94852 168303 137337 42350 1143 30550 32936 -35041 -87655
34819 -87655 -47674 29539 38903 -25922 -84689 -98337 -103509 -123802 -120911 -60325 22811 62264
34807 62264 45452 23600 34717 45316 -5138 -108375 -172564 -126588 -12545 66203 75288
34796 75288 72367 95282 95660 26341 -58820 -63629 12125 68786 49868 16616 43332 99971
34784 99971 106009 68065 77447 162889 230202 193750 101135 55379 58410 26833 -50287 -78059
34772 -78059 -8837 69034 55444 -24519 -82649 -106067 -141852 -180977 -160868 -79702 -15463 -14825
34760 -14825 -38463 -38421 -22585 -13856 -3630 18798 34342 25624 8668 6098 13708 13539 -422
34747 -422 -21780 -39820 -47829 -61007 -109541 -182303 -202922 -114051 34289 142099 185443 208940
34735 208940 211846 147887 47558 22082 98916 157465 96006 -22324 -64904 656 109427
34724 109427 206745 265810 249283 148616 34688 -13398 -10596 -25366 -61398 -59619 -6234
34713 -6234 40115 34408 -3119 -28558 -20193 18844 64589 83405 71702 69177 99890 126935
34701 126935 107598 64506 51881 77299 109741 138768 166487 163315 97148 -3094 -69233
34690 -69233 -71359 -29927 27511 72548 67843 12490 -29396 -5842 43651 47225 6101 -28397
34678 -28397 -45827 -63553 -61117 -22621 -8474 -72714 -136645 -75830 75880 151445 93239 25002
34666 25002 46080 100442 112790 117618 165715 217992 229212 239567 282884 291523 201100 77564
34654 77564 27884 41518 32164 -10166 -24264 -2470 4617 -7333 5566 37394 32542 -11714
34642 -11714 -35281 -19022 -12286 -38708 -55223 -33203 -10360 -24861 -51592 -43434 -787 33338
34630 33338 27705 -7931 -36067 -28159 2149 11017 -17138 -44222 -33856 -4373 5591 -6862
34618 -6862 -28823 -72839 -143171 -192058 -177404 -141094 -153717 -195875 -179805 -87913 806 37037
34606 37037 62863 116184 160626 160830 153548 180590 208113 184607 144389 181929 331736 524094
34594 524094 655958 670182 574468 420527 269211 155584 82135 41795 28493 25930 17879
34583 17879 16504 44756 81079 65279 -21031 -122250 -179045 -186200 -157226 -88213 2099 51661
34571 51661 31735 47 15905 44767 22081 -23140 -2110 86974 142480 104052 27466 -13606
34559 -13606 -21428 -25903 -10551 51093 125601 146583 94439 7751 -66129 -94266 -54343 43722
34547 43722 137998 159662 104977 35435 5856 19840 55883 101564 145289 160609 125618 50565
34535 50565 -32232 -100798 -147817 -157880 -110602 -20579 51735 59007 24372 6730 17691 18109
34523 18109 -1920 292 39027 58702 23065 -10513 20436 62794 12868 -110989 -166735 -79207
34511 -79207 63465 139943 132089 81175 -1293 -99213 -139175 -71479 34412 68742 30665
34500 30665 7338 24004 20061 -22340 -35326 15810 66915 61854 45561 81182 134812 125091
34488 125091 53996 4437 15776 38289 23530 -5580 -5035 17668 22800 6151 7004 52157
34476 52157 120301 165942 161310 112006 46788 -3192 -27175 -41842 -65761 -86651 -72126 -18100
34464 -18100 37678 65285 80476 108293 134985 135637 130188 157418 196289 174566 73732 -28937
34452 -28937 -53613 -10801 29888 25274 -19387 -75815 -102948 -66449 12501 59477 36603 -4590
34440 -4590 -2713 20699 5202 -43587 -60039 -14777 55415 105166 116488 90220 51571 47159
34428 47159 86036 107854 65791 8767 10506 50468 53614 22143 23657 61704 73199 56416
34416 56416 77889 132358 125881 40910 -9951 40291 102876 81859 25502 29515 78598 94590
34404 94590 73341 61247 48653 -537 -50466 -33272 36167 83666 93421 108861 135295 136980
34392 136980 119207 121618 138932 138524 146451 217133 317602 344694 272098 182914 134071 87192
34380 87192 11912 -36898 -5482 65793 101455 95379 96089 119840 133722 111892 69412 43409
34368 43409 57096 93573 103685 61423 7878 5774 51543 77420 48681 10307 17561 63286
34356 63286 99074 93185 43418 -34153 -102329 -117141 -74860 -27155 -25984 -65840 -96941 -83704
34344 -83704 -37571 -758 -3283 -29635 -34112 -1656 22251 -11879 -86178 -136801 -137594 -120731
34332 -120731 -115688 -111138 -84570 -33118 32064 90980 115059 97634 80357 107623 158325 170644
34320 170644 131619 84880 47298 -11503 -85628 -101689 -18849 90053 111757 22695 -92697
34309 -92697 -134746 -72983 38853 106249 72731 -23054 -85583 -66968 -8100 28312 26806 10198
34297 10198 3832 24536 63750 70360 3017 -85405 -84056 21383 102654 53105 -67175 -123288
34285 -123288 -88886 -48002 -47690 -50397 -30142 -20898 -46050 -73149 -69660 -47606 -23783 15504
34273 15504 77850 131774 142621 114499 73713 38234 23333 44804 89447 110597 83700 43969
34261 43969 38402 60479 65711 35936 -7219 -41745 -61904 -63566 -50894 -52518 -88576 -122233
34249 -122233 -93136 -8067 55763 58408 50111 80235 113660 98899 70231 99049 169975 196863
34237 196863 156977 115289 103128 70938 -1078 -37465 25428 135892 196252 182050 131089
34226 131089 68758 13642 6377 51890 71484 -2823 -114567 -149039 -91323 -29241 -13343
34215 -13343 -10254 3884 572 -30917 -54890 -56907 -67420 -93044 -94906 -63943 -49753 -79611
34203 -79611 -109975 -97411 -64385 -53104 -58075 -46752 -15983 8775 12324 6824 23534 87729
34191 87729 178808 228125 194690 126969 99773 110417 104217 83425 100862 146198 138354 53739
34179 53739 -29172 -44116 -11255 32906 90148 146169 152081 109899 92531 127235 144524 99082
34167 99082 51631 61232 82576 50768 -10983 -54591 -101265 -175420 -214027 -152543 -49619 -13839
34155 -13839 -44134 -53974 -24529 -17909 -49610 -59135 -14563 47076 94056 133868 163897 160769
34143 160769 128335 94940 61404 9310 -45270 -66529 -58939 -53084 -45331 -15870 8027 -22838
34131 -22838 -99363 -163520 -185479 -169596 -109020 -10794 59176 46219 4746 30322 107446 131545
34119 131545 78665 35253 45636 52915 26101 25393 84189 133998 118460 89683 110506 139963
34107 139963 107399 41113 26258 69771 99191 80669 54871 52499 45652 6403 -33406 -15199
34095 -15199 66981 145888 152771 102540 77174 108180 118246 31425 -93370 -124159 -46314 8191
34083 8191 -45785 -117616 -72636 72727 171551 134457 22231 -48888 -39978 -11174 -34897 -104815
34071 -104815 -142463 -102027 -39526 -34493 -66367 -42907 49512 114264 90352 39118 33807 46857
34059 46857 20213 -22787 -25034 -4335 -18891 -56074 -51176 -885 33717 32076 33900 51297
34047 51297 48672 25194 34057 92037 142145 138877 107783 88973 82914 85798 113859 148890 123202
34034 123202 15725 -92666 -124499 -113667 -128354 -133614 -41112 117050 186785 98027 -30972
34023 -30972 -56068 8060 45366 20719 5297 42334 86603 91788 80120 93465 128683 153677
34011 153677 150198 116628 61965 15267 4206 7692 -24782 -83262 -82465 17266 121993 104197
33999 104197 -30892 -145038 -131131 -22751 66173 64403 -5956 -65244 -48263 36004 110185
33988 110185 110907 58257 19529 19097 24451 15764 20317 63462 120630 138243 87345 -6697 -74114
33975 -74114 -53757 36345 98917 67403 -3357 -13042 32149 24714 -73658 -155875 -113709 12042
33963 12042 95679 93998 71687 85258 124460 168781 223600 275531 274093 198350 101784 49358
33951 49358 37774 21643 -2224 7128 51752 69248 20474 -40560 -32635 37881 81284 43010
33939 43010 -31464 -63980 -35365 11008 25008 -11691 -74043 -102260 -54231 31253 62408 11242
33927 11242 -43588 -29783 12555 -671 -61549 -81551 -24201 53172 93941 104893 108481 98157
33915 98157 68561 39816 26090 19756 21208 39053 49019 9094 -63048 -88778 -39949 6967
33903 6967 -22860 -93603 -118917 -92416 -81395 -105054 -100556 -27797 57696 75323 23185 -30793
33891 -30793 -39836 -17114 9776 37142 62878 64254 31675 2618 20883 69881 89047 56690
33879 56690 11249 -15464 -32999 -44591 -25103 21615 43955 25531 24643 70509 83570 -14748
33867 -14748 -161390 -223713 -183506 -138886 -135457 -116674 -55209 -12309 -25365 -41386 -16379 9103
33855 9103 -8009 -37103 -42061 -49480 -79600 -81140 -17920 38505 -3093 -110463 -167221 -137509
33843 -137509 -100956 -121125 -158674 -138828 -52790 33640 46573 -30185 -137314 -190073 -161362
33832 -161362 -102678 -69035 -52261 -19349 11899 -13964 -104432 -187468 -179134 -69385 61134
33821 61134 106917 34364 -79131 -118075 -46155 66351 127785 106248 30379 -43042 -54748
33810 -54748 11563 92102 100378 36399 -18607 -30632 -57911 -132315 -182435 -141054 -56667 -15729
33798 -15729 -11733 16199 59165 57089 18907 18073 65735 83073 18857 -82299 -150230 -161915
33786 -161915 -124706 -51975 16059 22302 -40837 -110859 -126058 -86630 -29828 18487 45017 34927
33774 34927 -11776 -62812 -74320 -28256 52259 117865 129419 92897 50910 28971 8625 -28034
33762 -28034 -54995 -39962 -4376 3182 -12412 9290 93965 182575 196000 125204 34202 -14293
33750 -14293 -15595 -6159 -8009 -9106 230 922 -18289 -22704 22830 83371 89221 41171 9857
33737 9857 18004 5130 -58997 -112349 -104944 -82229 -93723 -95600 -32840 46765 61889 30279
33725 30279 25619 42523 18382 -38393 -60292 -44616 -46157 -55318 -9599 70823 92373 52398
33713 52398 57790 139690 184340 112184 3357 -36235 -27144 -41950 -69050 -54214 -11332 10296
33701 10296 20589 55978 91665 77332 29270 -604 -21462 -79224 -150384 -152488 -67676 21983
33689 21983 41143 3760 -31000 -38428 -39954 -62609 -104448 -132025 -114637 -65965 -32353 -31540
33677 -31540 -35385 -26625 -25081 -30141 4365 87170 135815 76442 -41662 -107556 -94530 -62963
33665 -62963 -43602 -14451 15668 6690 -16660 26319 134453 195734 147074 69609 55488 65454
33653 65454 14091 -66701 -64888 37503 140909 181269 201207 242401 261810 207396 108971
33642 108971 33959 -1625 -23108 -36472 -36349 -46653 -90145 -130852 -108486 -29871 29218 20248
33630 20248 -28754 -66739 -71501 -35932 42336 130148 163725 118354 40082 -17995 -52473 -74614
33618 -74614 -65866 -14794 37720 42660 8308 -23922 -41020 -46380 -20637 38621 64031 -12126
33606 -12126 -141068 -194120 -128647 -39632 -23426 -64872 -93952 -85391 -55164 -14395 21405 20481
33594 20481 -17943 -40062 -7239 42884 49118 9349 -33092 -53408 -49060 -12467 46265 77463
33582 77463 50950 13578 26156 64400 54550 -4137 -33913 -1914 31794 13111 -33322 -66297
33570 -66297 -95512 -137147 -157194 -119581 -53656 -14324 -2926 11831 17191 -28045 -105296 -136141
33558 -136141 -89378 -29164 -27315 -75348 -119364 -142373 -165285 -188981 -184496 -137674 -66299 9203
33546 9203 81271 136387 148991 108577 39120 -18664 -40155 -33750 -32817 -64381 -114739 -135844
33534 -135844 -101674 -46877 -27111 -50957 -79380 -86664 -88335 -106082 -135709 -155927 -144138 -84930
33522 -84930 5783 68395 52617 -14893 -61795 -72252 -98508 -155935 -179601 -126285 -50551 -16811
33510 -16811 4889 72425 143326 116002 -7325 -98964 -72224 10307 34575 -20446 -84226
33499 -84226 -97173 -58189 6780 69795 94540 50162 -44888 -115024 -97474 -23452 4044 -62380
33487 -62380 -140802 -122064 -23765 32912 1082 -33057 -4492 22190 -23671 -80236 -52470 17544
33475 17544 18052 -33352 -14008 84918 128611 62210 2678 34544 62454 -20162 -133809 -126170
33463 -126170 -10120 59222 16721 -39414 -11533 73679 132867 132499 92303 40232 -2676 -25428
33451 -25428 -33076 -30569 -6369 41708 81189 82747 66173 65690 68870 43119 6559 6998 33413
33438 33413 19151 -51863 -107186 -82444 -3410 61497 87430 95444 103354 114593 134538 160247
33426 160247 164602 121507 43344 -27549 -60927 -57237 -32442 -2563 18436 20209 950 -29499
33414 -29499 -48656 -29279 34601 105533 125817 77007 5018 -28378 -12533 5307 -24591 -101335
33402 -101335 -171122 -172813 -95936 -1164 30903 -15241 -71305 -70974 -35459 -36975 -86963 -114062
33390 -114062 -67743 10228 54036 65558 81029 82427 23000 -65957 -83298 -761 78844 54589
33378 54589 -41166 -102556 -93493 -61667 -41451 -21622 -2533 -11942 -49900 -71907 -44444 19996
33366 19996 90128 140785 147674 100039 28717 -15431 -22109 -29883 -68519 -124598 -168091 -180779
33354 -180779 -155627 -100295 -42999 -5503 23038 52416 49831 -15454 -96927 -105382 -24359 69556
33342 69556 111328 111223 100951 82101 54907 41425 48592 52214 39544 24812 10949 -12204
33330 -12204 -23342 12713 70733 81002 37392 9902 26587 34323 11136 13616 57552 60564
33318 60564 -15408 -69142 -14161 64002 35360 -58865 -67772 28705 96597 62701 2848 -13141
33306 -13141 -28811 -94106 -156892 -137844 -48774 29886 48198 13332 -48420 -110050 -143293 -134173
33294 -134173 -93797 -43111 1589 28207 33010 24012 4943 -31161 -72872 -79253 -30481 34037
33282 34037 66034 70758 75005 64632 14515 -42500 -46083 2751 49336 71622 88042 87469 34458
33269 34458 -46161 -71219 -10966 68107 96749 76218 34536 -22530 -79905 -93316 -49388 -2722
33257 -2722 -6596 -37422 -30378 30480 94582 107336 64286 6434 -24161 -22087 -10179 3176
33245 3176 34096 80628 108487 107241 116972 154988 164231 100170 25913 36433 117779 174012
33233 174012 171493 152189 117500 21167 -110854 -177434 -153780 -133840 -179231 -233849 -237597 -214631
33221 -214631 -185776 -103329 42928 150986 135573 57516 28977 54168 60913 34491 19254
33210 19254 27919 43731 79400 144779 185821 142541 45346 -22870 -34991 -19815 8649 43093
33198 43093 42555 -12614 -60183 -40715 -5119 -35076 -91673 -65822 37060 94606 56465 6649
33186 6649 11469 28437 11154 -5754 15209 43135 45501 47940 70150 74667 37633 3826 11551
33173 11551 22564 -14520 -85950 -152193 -206970 -240194 -207569 -110645 -48217 -98709 -193007 -198346
33161 -198346 -101578 -11831 6078 -1807 12795 25935 11927 5731 39498 72574 44831 -31209
33149 -31209 -85939 -86693 -69951 -79222 -106426 -107537 -58811 15246 66078 66811 31212 -11173 -48505
33136 -48505 -85218 -115128 -116604 -80650 -29699 1565 -2397 -30666 -61430 -77799 -75079 -62091
33124 -62091 -53647 -54492 -50512 -22016 31599 84768 108572 100169 84033 82186 90346 90584 81377 80435
33110 80435 94091 97448 58660 -18640 -88651 -106500 -76221 -48368 -64561 -108826 -125678 -88503
33098 -88503 -35034 -22985 -61019 -100863 -93325 -35075 37212 79002 63339 -1220 -66258 -75689
33086 -75689 -19518 53112 86700 76160 58219 55647 50246 14085 -47265 -93221 -87091 -30412
33074 -30412 40870 86575 83709 29803 -52484 -112133 -100990 -29450 30684 26244 -13592 -27064
33062 -27064 -10881 -8627 -20138 5539 71819 102775 50148 -29046 -55052 -33578 -18075 -8451
33050 -8451 33598 94377 117467 95231 72164 58491 20538 -36980 -62290 -44644 -26765 -10730
33038 -10730 52366 144792 161800 72178 -3557 35694 114082 103980 30536 13546 57751 59562
33026 59562 6177 1220 69052 94648 17800 -56471 -27858 40933 42787 5920 31124 113569
33014 113569 154452 118716 65785 35495 6175 -33381 -59618 -68327 -77883 -76339 -36832 15757
33002 15757 28105 6869 4012 13961 -21834 -94123 -111647 -45609 8309 -29147 -102192 -116426
32990 -116426 -84372 -85922 -130477 -154421 -135362 -117263 -119970 -104754 -50724 -1842 -5122 -43233
32978 -43233 -61834 -41974 -17979 -29510 -70998 -93041 -56810 16450 67183 70667 58859 56538
32966 56538 36506 -26202 -91135 -97104 -51321 -17011 -19497 -22793 -910 27699 47961 70877
32954 70877 89209 70870 26291 21619 79990 125052 82224 -9059 -55175 -45726 -46540 -73803
32942 -73803 -75494 -50209 -79273 -187817 -259673 -174580 17717 148552 136055 56390 9945
32931 9945 1275 -17415 -52065 -72083 -75619 -92479 -126204 -135658 -86844 -967 64385 75224
32919 75224 50143 27181 14144 -10209 -48171 -66567 -44748 -10160 3952 10433 35413 55332
32907 55332 25940 -32138 -44658 7470 57747 56621 35991 32447 15324 -47505 -108756 -104381
32895 -104381 -60963 -58044 -101212 -114971 -61224 10421 41198 27375 -7117 -43004 -56390 -34235
32883 -34235 -14116 -49746 -117727 -121870 -21836 102571 157677 151729 149647 156051 114765 11792
32871 11792 -85098 -101596 -35137 51192 88797 52488 -30645 -111005 -157359 -166161 -137174 -65957
32859 -65957 27523 89737 82761 35270 19458 72281 151661 178028 120005 34592 8517 54302
32847 54302 88799 37757 -64491 -122239 -107472 -82509 -92885 -104179 -71092 -13026 19425
32836 19425 15187 1897 2547 23299 56692 71288 31406 -44629 -83040 -45568 14779 26851
32824 26851 -8343 -45701 -74537 -109243 -130984 -107640 -59528 -39644 -50771 -43050 2762 47943
32812 47943 61243 58091 60341 64748 66830 71274 63497 17895 -44871 -56637 10507 94490 117866
32799 117866 81331 44203 37157 39687 31283 17385 1074 -30183 -73354 -93624 -61276 8507
32787 8507 68758 83786 46840 -29279 -114276 -160934 -138089 -72796 -31206 -42425 -69123 -71727
32775 -71727 -64152 -69108 -56020 14275 102296 122068 63704 9974 13273 30674 13131 -15466
32763 -15466 -18041 -16862 -44156 -75335 -79666 -88012 -132010 -157642 -91485 29001 85553 35991
32751 35991 -45472 -89809 -111080 -145275 -186454 -211673 -212964 -184616 -129071 -84406 -89017 -112315
32739 -112315 -85440 -10754 31393 3516 -35494 -24711 22500 66954 96215 93878 31803 -62974
32727 -62974 -107093 -75891 -45254 -64443 -70350 -2914 74324 66712 583 -23205 15134 51119
32715 51119 55162 47052 17702 -49446 -95473 -46426 45947 51204 -39635 -94075 -49737 -6925
32703 -6925 -49298 -106682 -90190 -49507 -76953 -140333 -142554 -92127 -80106 -116181 -119198 -65623
32691 -65623 -23845 -27755 -30857 -12905 -23350 -75098 -93415 -30320 51156 71902 45984 25931
32679 25931 4202 -46901 -88256 -63945 -9816 -11889 -63904 -66861 14270 88510 71785 1880
32667 1880 -34122 -25428 -23748 -42453 -40098 5199 59038 70892 19398 -73918 -147424 -135189
32655 -135189 -40840 39293 14954 -83658 -141980 -109248 -49911 -35557 -52275 -50445 -27861 -9192
32643 -9192 15222 65691 112545 108068 72112 75413 125292 135211 41764 -100553 -186592 -185294
32631 -185294 -146367 -108217 -62144 -7657 18787 -695 -21245 12115 82785 113429 63093
32620 63093 -18031 -49761 -17742 21783 28642 31867 73941 129859 124772 30899 -91823 -162361
32608 -162361 -152439 -81098 22426 117135 146876 92549 19190 20116 104696 180585 163196 72214
32596 72214 -2353 -11068 3380 -32858 -124776 -187697 -144889 -34573 27404 5573 1600 99738
32584 99738 214541 189085 22876 -108694 -77675 54929 153849 167130 116557 24419 -72046
32573 -72046 -103244 -47683 21200 40564 51543 105847 143980 76346 -57115 -127606 -97335
32562 -97335 -44717 -23212 -13550 -14037 -53211 -97437 -69243 13967 39933 -22631 -70217 -35947
32550 -35947 10783 4781 40 49805 85464 34963 -27791 12232 116752 143247 57179 -35534
32538 -35534 -57375 -40569 -34590 -37783 -36449 -25554 19165 108350 174437 129919 5863 -56218
32526 -56218 19098 147377 199016 141341 34047 -53974 -83176 -49664 4670 19651 -19840
32515 -19840 -76269 -121552 -159346 -174693 -123884 -8778 89599 96350 29780 -33832 -55399 -56203
32503 -56203 -64304 -73297 -54325 4182 67770 75643 9688 -67090 -76258 -21522 23360 21499 11783
32490 11783 30265 52766 44335 15303 -7614 -25139 -43444 -43275 -9707 33636 54512 53047
32478 53047 42830 16722 -34643 -90482 -118753 -113101 -86382 -46135 -1014 30309 45008 70056
32466 70056 118740 151183 114567 15415 -79426 -112462 -83863 -33773 1643 12858 7609 -12752
32454 -12752 -56378 -110248 -126225 -73123 6148 36415 10634 -6253 16031 29232 -1565 -32033
32442 -32033 -16358 9614 -10258 -56174 -72969 -68484 -86195 -105326 -62698 32735 102243 121904
32430 121904 149385 203563 214865 142942 57610 35938 47178 18421 -36258 -41814 9078 45161
32418 45161 35259 35121 91814 165710 186606 147800 103978 94009 99234 76518 13921 -52342 -75364
32405 -75364 -50382 -19261 -14487 -16701 10586 60292 89299 79154 50610 17199 -32481 -94200
32393 -94200 -131736 -123512 -90748 -54059 3300 93952 175315 182789 105241 -2615 -73774 -72399
32381 -72399 -4318 82806 125206 103438 65331 58844 63828 32420 -24911 -52021 -38138 -33607
32369 -33607 -67403 -106768 -114526 -95175 -66819 -36599 -22079 -45887 -86950 -88947 -43920 -14681
32357 -14681 -41844 -82975 -85344 -65747 -65219 -71361 -49877 -20718 -34580 -89097 -129830 -129253 -113038
32344 -113038 -109571 -117795 -126551 -130836 -127495 -117691 -107279 -91185 -59337 -31449 -46737 -95428 -110657
32331 -110657 -66815 -30470 -58529 -101626 -82997 -26407 -15944 -59411 -86961 -69020 -40362
32320 -40362 -14687 27886 67591 58706 27557 57218 152188 216837 201811 174828 198719 230770
32308 230770 206949 149708 119286 115804 103596 91435 116871 173582 213713 212697 191680 183792
32296 183792 200157 214709 176573 67892 -50567 -98088 -77714 -58378 -53582 -8995 67153
32285 67153 72254 -30080 -120032 -84193 15409 46026 12096 24390 94312 106797 14938 -69897
32273 -69897 -37069 70093 128776 100296 45637 10830 -30355 -113676 -210167 -240549 -158778
32262 -158778 -10884 97787 98197 15284 -70714 -104636 -89269 -59504 -46796 -58288 -69185
32251 -69185 -43162 20659 71558 63209 20269 17913 85582 157947 147660 57362 -15822 -1523
32239 -1523 53910 61505 28356 45177 126833 162434 82276 -14783 1234 94046 126906 82541
32227 82541 66208 98740 76638 -24298 -73148 7776 104514 88504 9530 -11562 20413
32216 20413 24706 9272 33172 59897 8857 -72098 -46249 92792 188353 138544 19974
32205 19974 -51418 -71636 -97905 -131880 -127353 -70258 3633 48730 42253 1770 -19298 16335
32193 16335 79335 107729 86249 52618 33750 23481 19059 30111 50863 65621 76882 90105
32181 90105 88562 68084 69133 115789 152727 116159 41574 14598 32905 15931 -52256 -96318
32169 -96318 -78782 -49496 -37683 1666 87946 154691 147125 103415 80097 64974 26348 -10743
32157 -10743 -4693 29289 45825 35539 15354 -12136 -41938 -43108 -761 44690 43620 422
32145 422 -43846 -66030 -64981 -39109 3790 35193 35087 15797 -1803 -11015 -3881 31846 80072
32132 80072 97207 69615 36731 35005 53194 63187 57746 37760 2356 -27634 -18652 21773
32120 21773 42389 17013 -29851 -76794 -123992 -144686 -97208 -16083 -5366 -91915 -168488 -143658
32108 -143658 -64680 -17767 6749 53572 87449 59280 25503 65247 119203 61266 -83097
32097 -83097 -149319 -84413 -27723 -83817 -156531 -103557 49698 162014 175519 152997 150108
32086 150108 151124 128202 87085 43406 5025 -15073 -7317 9584 3748 -29097 -65202 -88517
32074 -88517 -100169 -95934 -62275 145 66241 103530 92771 38808 -29837 -81033 -105574 -111342
32062 -111342 -91011 -27289 55342 85039 27938 -49493 -55283 4191 33577 -14362 -72406 -58383
32050 -58383 7115 29182 -37733 -139857 -193707 -169396 -99098 -31757 4507 9263 -2182 -12522
32038 -12522 -7840 21445 72006 118118 125862 86712 26584 -26203 -67275 -99655 -110871 -89054
32026 -89054 -48464 -13665 12337 38404 54195 42129 16391 13755 41298 66340 64263 43978
32014 43978 20507 -2021 -13201 -3387 1269 -41143 -113143 -135491 -74266 675 11959 -16105
32002 -16105 -6253 47892 80427 61779 34353 33625 38495 19078 -15189 -35032 -22662 25929
31990 25929 91848 120724 65615 -42907 -112644 -93357 -25184 29648 53926 51190 10653 -57963
31978 -57963 -97474 -68876 -19094 -23609 -73714 -84453 -20375 49823 51753 6082 -15241 961
31966 961 2567 -35527 -78712 -107187 -156798 -239329 -275304 -183054 -14391 84682 59264 8589
31954 8589 30136 81190 61384 -25442 -77817 -41069 34992 79427 71911 24779 -43869 -101059
31942 -101059 -111552 -80542 -50984 -48460 -60973 -76521 -100962 -129574 -138672 -118137 -82015 -40669
31930 -40669 5418 40883 41878 14653 -7368 -10968 -11912 -13829 -1370 18682 16915 -4128 -3253
31917 -3253 30281 49095 20788 -13300 5330 63085 83842 19194 -98965 -190717 -196134 -120051
31905 -120051 -23333 35493 52215 59751 67934 51951 4296 -39063 -44415 -26482 -26132 -56444
31893 -56444 -88597 -84721 -37938 13532 16529 -36513 -82614 -47247 71042 193992 238038 178032
31881 178032 51534 -68532 -114954 -78515 -21577 -12043 -49847 -87352 -104471 -116670 -119231
31870 -119231 -82508 -10275 49455 66688 59492 50379 37169 22468 28316 58618 81349 71298
31858 71298 45783 39078 57528 70543 37744 -48543 -136304 -150692 -80792 -1974 19545 8975
31846 8975 26103 66632 81828 62674 34085 -5211 -60132 -85447 -41356 22265 32465 19719
31834 19719 67182 150552 157810 72836 4841 12832 36147 35126 59388 117237 115252 13524
31822 13524 -77075 -50649 36871 65185 22284 -19033 -30086 -35133 -40875 -40033 -45190 -57578 -50567
31809 -50567 -33027 -62738 -143950 -189160 -145234 -76843 -54618 -44032 13727 90376 127786 133254
31797 133254 129907 85581 -15511 -99422 -96594 -46021 -15784 8814 61469 95582 59403 3397
31785 3397 -765 15044 -11833 -40941 5022 92834 127165 102582 81329 63285 8650 -49036
31773 -49036 -46981 -17870 -37244 -76705 -47058 37232 77224 55486 43743 59353 55753 46278
31761 46278 90912 157744 141812 35428 -52528 -59081 -24180 16382 62222 69964 -15726 -140777
31749 -140777 -187815 -152446 -132406 -137601 -75443 51600 109555 47240 -16773 7993 49585
31738 49585 21224 -29658 -14779 56823 119424 145741 136972 96000 54486 45338 27696 -57009
31726 -57009 -144683 -102957 47228 122851 44415 -51641 -39938 16826 14893 -20462 -29568 -46391
31714 -46391 -102670 -121133 -36433 75830 113971 99955 97486 81028 14512 -34064 5840 72115
31702 72115 70079 29218 25171 27153 -26802 -76777 -30248 49977 23722 -89205 -126270 -36107
31690 -36107 51787 36319 -22602 -24049 38787 110705 151927 144489 92117 39501 32574 50063
31678 50063 32563 -23653 -66427 -74132 -72012 -66865 -37382 9123 36416 37976 38735 43005 35821
31665 35821 24958 25281 17543 -16854 -39387 -449 71592 95023 40729 -46050 -117493 -157650
31653 -157650 -160128 -131277 -103150 -91518 -62886 5531 67584 72018 48317 59371 103707 137143
31641 137143 152181 156047 114065 10262 -75302 -58070 11515 14954 -50277 -79974 -48163 -45277
31629 -45277 -112302 -167903 -144247 -84727 -55038 -50126 -42065 -40582 -53999 -56585 -41118 -46057 -90093
31616 -90093 -130248 -118865 -60070 10910 64080 84508 90438 131690 212792 242213 143125 -5105
31604 -5105 -45458 39379 110913 91074 58437 85030 115120 85112 46416 71171 127623 149017
31592 149017 149098 167716 169339 104647 21733 5234 39900 42754 7279 6289 58088 95704 81170
31579 81170 54969 45911 17424 -52527 -104049 -66246 37378 107248 84718 13435 -25062 -13827
31567 -13827 -12252 -62028 -113859 -86886 11324 81047 60332 910 -19573 -7023 -18219 -58420
31555 -58420 -79751 -65096 -47293 -44436 -34184 -2519 31127 52010 70674 87876 78119 33712
31543 33712 -4182 11083 71471 121648 120476 79057 41175 36181 49297 36453 -24484 -99238
31531 -99238 -129711 -102120 -58749 -32685 -3226 54311 102135 76495 -11769 -71504 -48673 2244
31519 2244 4441 -28947 -30051 5307 13574 -22682 -38366 9762 72710 87771 70982 75155 96631
31506 96631 86776 35623 -12878 -20320 15751 79391 141010 156073 105054 31186 -401 22524
31494 22524 57706 69689 56076 26017 -6577 -19788 -14290 -31412 -93516 -144565 -112016 -21307
31482 -21307 21100 -28913 -90599 -65720 40023 132617 133711 46891 -53195 -83064 -25424
31471 -25424 50046 62053 8936 -44998 -62509 -67191 -87470 -117204 -138918 -141641 -110476 -43482
31459 -43482 17711 23528 -12871 -33096 -25822 -39542 -90374 -125109 -104625 -63331 -49769 -60506
31447 -60506 -69743 -75602 -77871 -55614 -10101 9667 -30554 -93158 -115104 -85247 -40211 -10014
31435 -10014 -2006 -13245 -25408 -9352 37138 77508 82567 61151 29799 -8503 -35773 -19422
31423 -19422 26255 29506 -44049 -130185 -147091 -95410 -26485 42643 114227 146624 91309 -15384
31411 -15384 -75387 -53345 -14964 -26399 -70437 -85876 -47900 18504 79616 122685 152863 171855
31399 171855 162823 109685 37558 6988 44263 102001 120661 105014 97349 95246 54232 -26160
31387 -26160 -75043 -33022 70041 143510 127456 46091 -16461 9449 113578 212096 229637
31376 229637 170230 97001 58568 57433 72518 77039 42326 -35636 -109485 -115991 -49235 28530
31364 28530 56909 31567 -17660 -67743 -100557 -88398 -16210 86131 157944 159515 101279 24924
31352 24924 -30739 -43479 -4814 76924 168655 223686 215006 154571 73338 -7031 -70342 -90919
31340 -90919 -53362 15286 64629 77107 76350 76519 61347 25931 -2837 -12545 -32776 -82121 -122592
31327 -122592 -111390 -73216 -71259 -118924 -168591 -183683 -176651 -172453 -172753 -161571 -116906 -20824
31315 -20824 107217 195063 183038 106182 61258 82697 105377 69822 6773 -19642 -3461
31304 -3461 16036 19148 4651 -41203 -110972 -138685 -73783 21003 37545 -5044 35210 199028
31292 199028 315573 215600 -20080 -154262 -102958 -11407 -13677 -62333 -54967 -3526 18661
31281 18661 8428 3315 -14237 -68733 -94262 -9451 133056 196381 150974 89043 46721 -37160
31269 -37160 -147698 -143009 26091 179636 128933 -53812 -135400 -42148 73841 78409 12286
31258 12286 -29796 -44920 -74576 -102215 -85277 -43789 -40346 -87649 -131620 -122566 -65243 -1196
31246 -1196 29482 11913 -30743 -45581 6305 104012 176554 169825 101332 39241 26474 39300
31234 39300 32188 6980 5042 32689 41530 9431 -1083 81463 220670 291559 225825 88092
31222 88092 -11949 -38069 -26955 -9614 14725 41343 50205 41587 41570 58175 67187 60888 74802
31209 74802 132028 188694 181006 114658 59624 57692 83145 99462 102083 90239 52063 4408
31197 4408 -6024 24469 36587 2687 -16775 31721 100452 114214 87294 79305 78591 34772
31185 34772 -22754 -19130 23118 3844 -79984 -109493 -28867 68390 89453 63719 53515 53844
31173 53844 53978 93697 172477 198797 124376 41018 43661 81816 59380 3438 4682 51401
31161 51401 61544 40462 68544 150986 206349 194348 143396 70126 -14578 -45381 24306 110740
31149 110740 98592 31248 45474 124695 102485 -58576 -182940 -147131 -51802 -31295 -53892
31138 -53892 -36785 -18361 -64817 -112545 -64701 29043 47220 -330 26 65233 97277 60428
31126 60428 30182 46536 51023 8459 -23315 -367 21330 -28459 -122356 -167303 -114508 -1112
31114 -1112 90112 93975 19149 -46900 -26660 48843 77659 27442 -24166 -8464 43040 65524
31102 65524 59561 68430 98628 121551 129447 136044 136054 109924 58711 -1850 -64497 -110865 -96685
31089 -96685 -10585 73856 72061 6622 -20775 22388 61307 43249 15769 29888 49239 25564
31077 25564 -6287 3659 14954 -35800 -100886 -76213 21904 62386 -2311 -68811 -53406 -10289
31065 -10289 -15522 -39732 -19894 28024 56645 74288 95758 76787 -4973 -70716 -51950 -19293
31053 -19293 -73680 -160997 -143237 -25862 47455 25963 8191 36956 11520 -119452 -229229
31042 -229229 -190117 -70143 -31865 -107539 -189544 -196447 -143295 -76450 -32099 -43646 -111097
31031 -111097 -170809 -158322 -92873 -50024 -67139 -121941 -180200 -213484 -193904 -127229 -74086
31020 -74086 -85441 -130972 -139940 -98129 -55949 -54220 -89915 -143438 -191721 -202185 -159731 -98173
31008 -98173 -68838 -80966 -99588 -90349 -42986 26862 72114 41555 -51881 -122573 -111991 -61117
30996 -61117 -37257 -32446 -873 38603 22166 -47401 -89769 -55811 16069 60184 46741 -15325
30984 -15325 -84059 -95427 -25524 61832 87825 67271 72314 100256 75299 -8055 -53612 -16781
30972 -16781 15680 -32643 -98404 -82864 -15483 -3302 -58475 -94639 -83780 -96267 -161504 -198710
30960 -198710 -141306 -43727 8801 30110 79769 121166 49396 -128025 -246145 -175072 14426
30949 14426 146985 152336 96620 39148 -34221 -123046 -159914 -100912 -3843 42595 22962 -25584
30937 -25584 -92291 -179059 -235110 -190521 -63279 35626 29532 -38907 -76406 -53528 -14789 2819
30925 2819 17743 61613 116638 126404 74003 18747 23453 63460 58248 -7285 -55490 -31781
30913 -31781 15837 16622 -20046 -41740 -47604 -72609 -105073 -96860 -45458 2645 23956 29288 13797
30900 13797 -31212 -61078 -14581 80648 120064 63198 -12577 -30828 -15086 -24190 -53732 -60887
30888 -60887 -42274 -27649 -24213 -19013 -17157 -32095 -50666 -46711 -22508 -6541 -14999 -37512 -56046
30875 -56046 -62103 -59128 -54552 -43654 -7345 56302 108049 105213 57965 13547 -9742 -31494
30863 -31494 -58167 -74745 -87115 -114267 -132540 -93223 -9668 44419 46774 59074 111172 135287
30851 135287 74705 -14988 -47439 -28184 -13739 832 56976 125150 122749 35438 -64486 -121531
30839 -121531 -138897 -115914 -35174 62887 78878 -19953 -132222 -139068 -52207 11241 -18193
30828 -18193 -92467 -131478 -124929 -117288 -121033 -96016 -23201 46963 57300 28128 28899 78118 130387
30815 130387 162819 203056 249654 239811 146138 46577 35376 103606 166377 174715 142372 93698
30803 93698 47998 31992 47444 47096 -1388 -53389 -48337 -2618 25647 33037 52515 66040
30791 66040 28207 -36931 -59971 -42700 -49208 -77222 -51001 33382 70620 4134 -78931 -75350
30779 -75350 -5209 46621 57476 58980 57839 43696 39505 72839 120911 142010 139156 141966 148331
30766 148331 132030 88630 33298 -25414 -74320 -85358 -53366 -18423 -17845 -42832 -67542 -82455
30754 -82455 -72973 -16431 63289 95374 62571 40794 79896 110073 46460 -69439 -128560 -113783
30742 -113783 -96812 -101303 -80788 -29912 -9831 -45367 -87340 -96531 -84129 -55103 1609 48163
30730 48163 17555 -69031 -98511 -27902 38382 -2328 -101530 -138344 -89694 -34875 -25195 -34290
$$ [...]
##END NTUPLES=NMR SPECTRUM
##END=
