##TITLE=31Pdec_E3e-4-4
 CDCl3, 24 sc
 16.6.2023
##JCAMPDX= 6.0         $$ Bruker NMR JCAMP-DX V2.0
##DATA TYPE= NMR SPECTRUM
##DATA CLASS= NTUPLES
##ORIGIN= UXNMR, Bruker Analytische Messtechnik GmbH
##OWNER= root
$$ XWIN-NMR		Version 3.5
$$ Fri Jun 16 14:10:07 2023 Russian Standard Time (UT+4h)  she@DPX200
##.OBSERVE FREQUENCY= 81.013821
##.OBSERVE NUCLEUS= ^31P
##.ACQUISITION MODE= SIMULTANEOUS
##.ACQUISITION SCHEME= undefined
##.AVERAGES= 24
##.DIGITISER RES= 16
##SPECTROMETER/DATA SYSTEM= spect
##.PULSE SEQUENCE= zgpg30
##.SOLVENT NAME= CDCl3
##.SHIFT REFERENCE= (INTERNAL, CDCl3, 0, 248.564)
##AUDIT TRAIL= $$ (NUMBER, WHEN, WHO, WHERE, WHAT)
$$ ##TITLE= Audit trail, XWIN-NMR		Version 3.5
$$ ##JCAMPDX= 5.01
$$ ##ORIGIN= Bruker BioSpin GmbH
$$ ##OWNER= she
$$ F:/spectra/data/she/nmr/P31/1/pdata/1/auditp.txt
$$ ##AUDIT TRAIL=  $$ (NUMBER, WHEN, WHO, WHERE, WHAT)
(   1,<2023-06-16 14:09:09.43 +0400>,<she>,<DPX200>,
      <created by zg, POWCHK disabled, PULCHK disabled
       configuration hash MD5:
       00 E9 B6 7A A2 85 ED C7 34 08 36 98 17 FE 4E 26
       data hash MD5: 32K
       67 42 92 F0 B9 4A DE 5F E0 39 E4 9F 9F 9C 4D 94>)
(   2,<2023-06-16 14:09:13.50 +0400>,<she>,<DPX200>,
      <Start of raw data processing
       efp BC_mod = 2 LB = 1 FT_mod = 6 PKNL = 1 PHC0 = -10704.97 PHC1 = 136.2848 SI = 64K 
       data hash MD5: 64K
       EF 88 3D 1D FC 9A 68 04 61 E0 AB 99 BA 93 C5 6A>)
(   3,<2023-06-16 14:09:36.85 +0400>,<she>,<DPX200>,
      <pk PHC0 = -0.5389378 PHC1 = 0 
       data hash MD5: 64K
       43 E0 F9 38 78 79 55 2E 0E 38 25 43 18 EF E5 8D>)
(   4,<2023-06-16 14:09:40.25 +0400>,<she>,<DPX200>,
      <abs ABSG = 5 
       data hash MD5: 64K
       99 BF E6 65 0D 93 35 D3 F6 64 AC 82 90 1B 8B 23>)
$$ ##END=
$$ 
$$ hash MD5
$$ 7B EB 30 6A 87 B8 AD 67 49 37 47 4B 21 80 2C B1
##$RELAX= 
##$RELAX= 
##$RELAX= 
##$RELAX= 
##$RELAX= 
##$RELAX= 
##$RELAX= 
##$RELAX= 
##$RELAX= 
$$ Bruker specific parameters
$$ --------------------------
##$DU= <F:/spectra>
##$EXPNO= 1
##$NAME= <P31>
##$PROCNO= 1
##$TYPE= <nmr>
##$USER= <she>
##$AMP= (0..31)
100 100 100 100 100 100 100 100 100 100 100 100 100 100 100 100 100 100 
100 100 100 100 100 100 100 100 100 100 100 100 100 100 
##$AQSEQ= 0
##$AQ_mod= 1
##$AUNM= <au_zg>
##$AUTOPOS= <>
##$BF1= 81.014009
##$BF2= 200.13
##$BF3= 200.13
##$BF4= 200.13
##$BF5= 200.13
##$BF6= 200.13
##$BF7= 200.13
##$BF8= 200.13
##$BYTORDA= 1
##$CFDGTYP= 0
##$CFRGTYP= 5
##$CHEMSTR= <none>
##$CNST= (0..31)
1 1 145 1 1 1 1 1 1 1 1 1 1 1 1 1 1 1 1 1 1 1 1 1 1 1 1 1 1 1 1 1 
##$CPDPRG= <waltz16>
##$CPDPRG1= <>
##$CPDPRG2= <waltz16>
##$CPDPRG3= <>
##$CPDPRG4= <mlev>
##$CPDPRG5= <mlev>
##$CPDPRG6= <mlev>
##$CPDPRG7= <mlev>
##$CPDPRG8= <mlev>
##$CPDPRGB= <>
##$CPDPRGT= <>
##$D= (0..31)
0 1 0 0 0 0 0 0 0 0 0 0.03 2e-05 3e-06 0 0 0 0 0 0 0 0 0 0 0 0 0 0 0 0 
0 0 
##$DATE= 1686910148
##$DBL= (0..7)
120 120 120 11 120 120 24 19 
##$DBP= (0..7)
150 150 150 150 150 150 150 150 
##$DBP07= 0
##$DBPNAM0= <>
##$DBPNAM1= <>
$$ [...]
##$SUBNAM3= <"">
##$SUBNAM4= <"">
##$SUBNAM5= <"">
##$SUBNAM6= <"">
##$SUBNAM7= <"">
##$SUBNAM8= <"">
##$SUBNAM9= <"">
##$SW= 501.771253377433
##$SWIBOX= (0..15)
0 1 3 0 0 0 0 0 0 0 0 0 0 0 0 0 
##$SW_h= 40650.406504065
##$TD= 32768
##$TD0= 1
##$TE= 0
##$TE2= 300
##$TE3= 300
##$TEG= 300
##$TL= (0..7)
0 120 53 12 22 120 120 120 
##$TP= (0..7)
150 150 150 150 150 150 150 150 
##$TP07= 0
##$TPNAME0= <>
##$TPNAME1= <>
##$TPNAME2= <>
##$TPNAME3= <>
##$TPNAME4= <>
##$TPNAME5= <>
##$TPNAME6= <>
##$TPNAME7= <>
##$TPOAL= (0..7)
0.5 0.5 0.5 0.5 0.5 0.5 0.5 0.5 
##$TPOFFS= (0..7)
0 0 0 0 0 0 0 0 
##$TUNHIN= 0
##$TUNHOUT= 0
##$TUNXOUT= 0
##$USERA1= <user>
##$USERA2= <user>
##$USERA3= <user>
##$USERA4= <user>
##$USERA5= <user>
##$V9= 5
##$VALIST= <valist>
##$VCLIST= <CCCCCCCCCCCCCCC>
##$VD= 0
##$VDLIST= <DDDDDDDDDDDDDDD>
##$VPLIST= <PPPPPPPPPPPPPPP>
##$VTLIST= <TTTTTTTTTTTTTTT>
##$WBST= 1024
##$WBSW= 4
##$XGAIN= (0..3)
0 0 0 0 
##$XL= 0
##$YL= 0
##$YMAX_a= 8608
##$YMIN_a= -8747
##$ZGOPTNS= <>
##$ZL1= 120
##$ZL2= 120
##$ZL3= 120
##$ZL4= 120
##$ABSF1= 248.5645
##$ABSF2= -253.2056
##$ABSG= 5
##$ABSL= 3
##$ALPHA= 0
##$AQORDER= 0
##$ASSFAC= 0
##$ASSFACI= 0
##$ASSFACX= 0
##$ASSWID= 0
##$AUNMP= <proc_1d>
##$AZFE= 0.1
##$AZFW= 0.5
##$BCFW= 0
##$BC_mod= 2
##$BYTORDP= 0
##$COROFFS= 0
##$CY= -3
##$DATMOD= 1
##$DC= 0
##$DFILT= <>
##$DTYPP= 0
##$F1P= 0
##$F2P= 0
##$FCOR= 1
##$FTSIZE= 65536
##$FT_mod= 6
##$GAMMA= 0
##$GB= 0
##$INTBC= 1
##$INTSCL= 6.047779e-11
##$ISEN= 30
##$LB= 1
##$LEV0= 0
##$LPBIN= 0
##$MAXI= 10000
##$MC2= 0
##$MEAN= 0
##$ME_mod= 0
##$MI= 50
##$NCOEF= 0
##$NC_proc= -5
##$NLEV= 6
##$NOISF1= 182.463
##$NOISF2= 159.3651
##$NSP= 0
##$NTH_PI= 0
##$NZP= 0
##$OFFSET= 248.5645
##$PC= 4
##$PHC0= -10705.51
##$PHC1= 136.2848
##$PH_mod= 1
##$PKNL= yes
##$PPARMOD= 0
##$PSCAL= 0
##$PSIGN= 0
##$REVERSE= no
##$SF= 81.0140089999694
##$SI= 65536
##$SIGF1= 159.3651
##$SIGF2= -187.1042
##$SINO= 113.3802
##$SIOLD= 16384
##$SREGLST= <1H.CDCl3>
##$SSB= 0
##$STSI= 65536
##$STSR= 0
##$SW_p= 40650.406504065
##$SYMM= 0
##$S_DEV= 0
##$TDeff= 32768
##$TDoff= 0
##$TI= <>
##$TILT= no
##$TM1= 0
##$TM2= 0
##$TOPLEV= 0
##$USERP1= <user>
##$USERP2= <user>
##$USERP3= <user>
##$USERP4= <user>
##$USERP5= <user>
##$WDW= 1
##$XDIM= 65536
##$YMAX_p= 510962463
##$YMIN_p= -183911405
$$ End of Bruker specific parameters
$$ ---------------------------------
##NTUPLES= NMR SPECTRUM
##VAR_NAME=  FREQUENCY,     SPECTRUM/REAL,   SPECTRUM/IMAG
##SYMBOL=    X,             R,               I
##VAR_TYPE=  INDEPENDENT,   DEPENDENT,       DEPENDENT
##VAR_FORM=  AFFN,          ASDF,            ASDF
##VAR_DIM=   65536,         65536,           65536
##UNITS=     HZ,            ARBITRARY UNITS, ARBITRARY UNITS
##FACTOR=    0.620285442955139, 1,           1
##FIRST=     20137.2065510682, 0,            0
##LAST=      -20513.1999529968, 0,           0
##MIN=       -20513.1999529968, -183911405,  0
##MAX=       20137.2065510682, 510962463,    0
$$ Real data points
##PAGE= N=1
##DATA TABLE= (X++(R..R)), XYDATA
$$ [...]
39712d86620k28787J92824L69047J94079r6593j95399o6592Q1513J15831Q9732
39702c0965M4997o0711j55634l2025L04937M71634J45816m42169p44346n83517
39692a081983k94535j39360M7833M23561O89923M92244O9336j853L08451M00418
39682I14035r270m22560l71810j71585l29826o10614l80198L02515O86636M32969
39672D0292J5026j25048j53788l09170l94059k06215P641k3410r2481J02259L85834
39661g53119M07407K63080K80918L49990P0216m36948n00296J00687O38838L57226
39651G77999m47449p82525l04182K54846J70931k62706k66784J93583L74571l4090
39641c25806l66937l457O33341O73459N5485m70785m62772k41865j77189j25552
$$ plain form
39712 -486620 -715407 -522583 -153536 40543 -56050 -251449 -318041 -236528 -120697 -30965
39702 -30965 14032 -46679 -202313 -234338 70599 542233 688049 245880 -498466 -1081983
39692 -1081983 -1376518 -1515878 -1468045 -1044484 -354561 137683 207019 205166 513617 914035
39682 914035 904765 482205 110395 -61190 -391016 -1001630 -1381828 -1079313 -392677 40292
39672 40292 55318 -69730 -223518 -532688 -926747 -1132962 -1125321 -1148731 -1241212 -1138953 -753119
39661 -753119 -345712 -82632 198286 548276 618492 181544 -318752 -218065 420773 777999
39651 777999 330550 -451975 -756157 -501311 -330380 -593086 -859870 -666287 -291716 -325806
39641 -325806 -692743 -696200 -62859 610600 666085 195300 -267472 -509337 -686526 -812078
39631h12078J62919N06525M90666L7803m29615l86747K13109P42064N11264k94613
39621G41297o85473j81517M26584K17790m20413l86023L47516O30708n8406p79930
39611a47867n35332L46722Q02319M19869k97826o50485l31459L46445O01182j3036
39601E40532q57697q79347j10461L36078j1962l04246R5347M79524N9227n75748
39591a228753l73235M43179P51784K86954j48342p4896J34657J33770O6151M8497
39581C9766k3388n8333J43696L44530R7815m33389n89459k16358J39970J47845
39571d07305J03315K54259L66358K11226n5126k23381k75555j71274J16004K74939
39561A93460n0509n48521m83558J76428N99805L39663j7707J05997L32886O4701
$$ plain form
39631 -812078 -649159 -142634 348032 385835 -43780 -430527 -217418 524646 1035910 741297
39621 741297 55824 -125693 300891 518681 98268 -287755 59761 690469 632063 -147867
39611 -147867 -683199 -336477 465842 885711 587885 -62600 -394059 -47614 553568 540532
39601 540532 -317165 -1196512 -1306973 -970895 -982857 -1287103 -1191756 -712232 -653005 -1228753
39591 -1228753 -1601988 -1158809 -407025 -120071 -268413 -343309 -208652 -74882 -8731 39766
39581 39766 16378 -41955 101741 446271 544086 110697 -478762 -695120 -555150 -407305
39571 -407305 -303990 -49731 316627 527853 472727 249346 -26209 -197483 -81479 193460
39561 193460 142951 -405570 -889128 -712700 -112895 226768 209061 315058 647944 712645
39551G12645m32594m56907N093L61560L82098L23867K41419n8869m07033l71680
39541B99599m3788K4977j94214q9629M35057N54569j58830q07860m27381M25302
39531A7802M40087l84558p12816R791O89372L28230m82384o14379r0738K38787
39521e60806J11890o5907j58567l12852k99662J61375O10833M11218m6795J57935
39511H662Q16141P34815k51523q12478k01132N31509K46718n16810n82338m1446
39501f7882J27069k37987m26172k18919j23797l01629k88817J11519M91789N31560
39491d03266L70258J95717K6311m8702P3996K02913P2740j67085j56398N9093
39481B25577J08073q5105k54189k87895k80240j75690J25884L93906L12300K3101
$$ plain form
39551 712645 280051 -176856 -171763 189797 571895 895762 1137181 1078312 671279 299599
39541 299599 255811 280788 86574 -3055 432002 986571 827741 19881 -407500 17802
39531 17802 457889 73331 -639485 -629694 59678 387908 -94476 -708855 -799593 -560806
39521 -560806 -448916 -514823 -673390 -986242 -1285904 -1124529 -513696 -102478 -149273 8662
39511 8662 824803 1559618 1308095 495617 294485 825994 1072712 555902 -26436 -67882
39501 -67882 59187 -178800 -604972 -823891 -947688 -1249317 -1538134 -1426615 -934826 -403266
39491 -403266 -33008 162709 189020 140318 214314 417227 489967 322882 166484 225577
39481 225577 333650 248545 -5644 -293539 -573779 -749469 -623585 -229679 82621 105722
39471A05722p6682K7633O3282O2940K52418M45861K28040k67592m35769j19335
39461B86518J84302J36962l5154q8067j17645j76288o5101K56865M79127L50235
39451A211754m4149m74788o98623m58124J84945N99270K54546l95654l85840L58045
39441A51382Q48717M61328k47377m96347l42262k77623l36073k07243R4351K39801
39431a11346J21296k6531K8914K87667N41987N19939J52995k68516m20586l76467
39421D49352l86351l27980J02350O56602O46718k5450n87821m63872l2181Q9401
39411A20768k4735N7837K60067J02880m66207r02793p61382k07727K45140L22027
39401a254125K17460K59111L97669K50901k06541l64576J65270P47469N01960
$$ plain form
39471 105722 29040 56673 119955 182895 435313 881174 1109214 841622 405853 286518
39461 286518 470820 607782 572628 484561 366916 190628 125527 382392 861519 1211754
39451 1211754 1167605 692817 -5806 -463930 -278985 320285 574831 179177 -206663 151382
39441 151382 1000099 1461427 1214050 717703 375441 97818 -238255 -445498 -351147 -111346
39431 -111346 9950 -16581 12333 300000 841987 1361926 1514921 1246405 825819 449352
39421 449352 63001 -264979 -162629 493973 1140691 1115241 527420 63548 31367 120768
39411 120768 96033 153870 413937 516817 50610 -852183 -1613565 -1821292 -1576152 -1254125
39401 -1254125 -1036665 -777554 -379885 -128984 -335525 -700101 -534831 212638 714598
39392G14598k90434m93491J19348M72339q0821p12240m92387J40039K27317j12894
39382e08626o8515L32586K80933l27676o11566j01388N33209N24024M9287k08536
39372a06268n3222J36874N3397j76301k11433P4907L98721L50516o9276l92174
39362E741l04522m5580O8757J58830L96661M65022M717o31265p49562l18306R3526
39351h55981K81363N24620P54544N01731j50227m59972j96450k6024l04714m18487
39341c49597L3547L27889j83260p37684k22703R09639J117671M3235r82873q82331
39331i26467j10000L73055L70323J71819j14801l41356j45905L80797N01043o9501
39321H9007n11358q0014O70533P14214J06279k80447k15590k07638l16125n6995
$$ plain form
39392 714598 424164 -69327 50021 522360 441539 -270701 -763088 -623049 -395732 -508626
39382 -508626 -577141 -244555 36378 -291298 -902864 -1004252 -471043 52981 102268 -106268
39372 -106268 -159490 -22616 30781 -145520 -356953 -282046 116675 467191 397915 5741
39362 5741 -298781 -344361 -275604 -116774 279887 744909 749626 118361 -631201 -949507 -855981
39351 -855981 -574618 -49998 704546 1206277 1056050 596078 399628 373604 68890 -349597
39341 -349597 -316050 11839 -171421 -909105 -1131808 -222169 895502 938737 -44136 -926467
39331 -926467 -1036467 -663412 -293089 -121270 -236071 -577427 -723332 -342535 158508 89007
39321 89007 -422351 -502365 168168 882382 988661 708214 492624 284986 -31139 -88134
39311h8134M31282L20824m73054q97777l45197L57940K68271k06317q0916N60354
39301a52724P39687J43150m89530n30598j79509J24193K92663L55616K16450m3542
39291D75856o1998K57616M31630J4099o79479q80801l59585K70121L39430p9785
39281b72896l97559l21287j00273k091M2843J35400J40639J2194M2237L89288
39271c31505O37996L25047l00755n98539m58542k79449j48093J94970N74438M36853
39261E2421j29226l17841J13324L80160j1830l78858m619O03944N13087j58812
39251F61750n43692m32806l80552n71530n42842p0822M57048O73409O26129M59553
39241C35645K03353p0509k66612l97182m07504j19764L12985L26781j85746m53001
$$ plain form
39311 -88134 343148 663972 190918 -706859 -1052056 -694116 -425845 -632162 -713078 -152724
39301 -152724 586963 730113 240583 -290015 -469524 -345331 -52668 302948 519398 475856
39291 475856 413858 671474 1103104 1117203 437724 -443077 -802662 -532541 -193111 -272896
39281 -272896 -670455 -991742 -1092015 -1094106 -1051263 -915863 -775224 -763030 -720793 -331505
39271 -331505 306491 631538 330783 -267756 -726298 -1005747 -1153840 -958870 -384432 52421
39261 52421 -76805 -394646 -281322 98838 87008 -291850 -296469 307475 820562 661750
39251 661750 118058 -314748 -695300 -1266830 -1809672 -1880494 -1423446 -750037 -123908 335645
39241 335645 538998 468489 201877 -195305 -602809 -722573 -409588 -82807 -268553 -721554
39231g21554M2858N71263K16304n65071o11939M4169K96414j15100k49580K63978
39221h28258N50728Q6350l45464j2482N60079N63202J57386q7066j95598l82631
39211F6246l61410O4520L61060R2192k19119L0740L96790J69064k69590q1094
39201B49399M20989J68868p60274j046158j43344Q84394R82355M28030l8747l85559
39191G59953q24149j002191n51362J05737L35603K58129L37628M20686Q4111l54487
39181d30342j89711M05112N10268n0249m02539q1306K59590Q4190j01453K03773
39171B07333M52743L4519m52709j05748O26163N34809l37035p06285j24510L87471
39161E16751J17854k88631j55950Q9437r3176l12936j15874L7768l05139n17929
$$ plain form
39231 -721554 -678696 -107433 108871 -456200 -1068139 -1023970 -727556 -842656 -1092236 -828258
39221 -828258 -277530 -191180 -536644 -549126 10953 574155 731541 644475 448877 66246
39211 66246 -295164 -230644 130416 222608 3489 34229 431019 600083 330493 249399
39201 249399 670388 839256 78982 -967176 -1110520 -226126 756229 1184259 1145512 759953
39191 759953 -64196 -1066387 -1617749 -1512012 -1176409 -918280 -580652 -159966 -75855 -430342
39181 -430342 -620053 -214941 295327 245078 -157461 -238767 20823 105013 3560 207333
39171 207333 660076 694595 241886 136138 762301 1297110 960075 253790 129280 516751
39161 516751 634605 345974 190024 279461 186285 -126651 -242525 -204757 -509896 -1027825
39151a027825Q7618Q39653O08720l06044n62549J34993O87684M13775n4604O422
39141H27843L59190M21484J28595k58814n98827p77062o72835m47440m06624m64221
39131a888711k49094K02354M49319M04089M34213N93897M51819r0812m70886k62996
39121d26808K39238N35344N21393L17592k7164l70995m32209j77902O7323P3174
39111C18986n7737j82608k69813k13006P1857L28321K18067p1963k1491L66249
39101D86862M96917J07421l44227m17539k61462j98788k31209k23565j79286j15103
39091h79979L016Q2193l335j17868m1297J07893O5969o1360O661J55775J06984
39080e75348N5530L59377P28690N53398l8487l38019k26574k28109m00888k51451
$$ plain form
39151 -1027825 -940207 -100554 508166 202122 -360427 -225434 462250 876025 821421 827843
39141 827843 1187033 1608517 1737112 1478298 879471 102409 -570426 -1017866 -1424490 -1888711
39131 -1888711 -2137805 -1935451 -1486132 -1082043 -647830 -53933 397886 307074 -163812 -426808
39121 -426808 -187570 347774 869167 1186759 1159595 788600 356391 178489 245812 318986
39111 318986 261249 78641 -191172 -404178 -332321 -4000 214067 142104 120613 486862
39101 486862 983779 1091200 746973 329434 67972 -130816 -362025 -585590 -764876 -879979
39091 -879979 -876963 -794770 -798105 -915973 -957270 -849377 -783408 -844768 -838107 -682332 -575348
39080 -575348 -519818 -160441 568249 1121647 1083160 745141 518567 290458 -110430 -361881
39070c61881J54368J43051k94223l54805J49737M27815J52526N692K66832J87687
39060D76799n05523p90829K4519J012221J015467L32087q9216k12750m94527o92925
39050G5323l49742J41381J29045j43018p7672J04027j35893m66829j94121M28623
39040d88876N67219J97009m265R9558P8512o1041M4824K12483j9836l66732j52588
39029A06267M07377M23925j79195n29491k47370O7113k7248j99338j27127l007
39019c08094Q241N3998J40544Q4874l160J06201J53079k26881o07655k72402M31307
39008d39948M33081k33281k96028O36108J209555L84066q59714r79071j27163
38999b72395L28579j6864k78527K4141K58680o3963l90320o4396N38052N50420
$$ plain form
39070 -361881 -207513 -64462 -358685 -713490 -563753 -135938 16588 22280 289112 476799
39060 476799 -28724 -819553 -795034 217187 1232654 1564741 1475525 1262775 768248 75323
39050 75323 -274419 -133038 -3993 -147011 -224683 -120656 -256549 -723378 -917499 -488876
39040 -488876 78343 275352 271087 370645 449157 388116 432940 645423 625587 258855 106267
39029 106267 513644 937569 758374 228883 -18487 48626 21378 -177960 -305087 -308094
39019 -308094 -299853 -245855 -105311 -20437 -23597 82604 235683 8802 -598853 -871255 -439948
39008 -439948 -6867 -240148 -536176 99932 1309487 1693553 833839 -145232 -272395
38999 -272395 56184 39320 -239207 -215066 43614 -20349 -410669 -475065 62987 613407
38989F13407l7701l41591O8718M73748O3488p84621r63026k28548M38782K65037
38979d32307k72611l04163J44928M04384K79728J43515J21259l4416l08037l70257
38969f27977j95236r9500j25144J1448L15623M67269M17751M00609L14375j65480
38959G13738p38201n82669L58251J000294N47423l69215o19012j16308K92560
38950D86861J57412j28287j25448P6987J91474J50146L3059r4827j37418o168
38940F03791J74383J16066k25367m64148k27067K85518M53016L8063m30034l46892
38930b2671Q5622J34308l27392n67708j43508L34347J54540k88429r2400O01702
38920a31589O88057j61437q61342m92959L40802M73438j29236n22654k93881M2847
$$ plain form
38989 613407 575706 234115 302833 776581 840069 55448 -907578 -1136126 -697344 -432307
38979 -432307 -704918 -1009081 -864153 -459769 -180041 -36526 84733 50317 -257720 -627977
38969 -627977 -823213 -922713 -1047857 -1036409 -720786 -253517 164234 564843 879218 713738
38959 713738 -24463 -607132 -248881 751413 1298836 929621 310609 194301 486861
38950 486861 644273 515986 390538 467525 658999 809145 842204 747377 609959 603791
38940 603791 778174 894240 668873 204725 -22342 263176 716192 754255 324221 -22671
38930 -22671 62951 197259 -130133 -697841 -841349 -507002 -352462 -640891 -733291 -131589
38920 -131589 556468 395031 -466311 -959270 -618468 -145030 -274266 -796920 -1090801 -1047954
38910a047954J13794K06635M83391M95613l4451n62830m55659M0961K05607n7096
38900f11989k13971o6631L6933q172J54866N39710N53553k7501m95858k23750
38890c62810L25409L30745p6443j07695L17732M53914r573m62149l67776J0027
38880E1381J96742J95124K12180J89298m324k39083k95783j48701P9959K28663
38870D65456J31669j70536l15037q1008J56037o7870m87367m43683M7709L17080
38860d47550J28924n7330J1698O4879J2755R2561J61529j96237o78937m74409
38850a382117K69039M21256k27373m17782M77227J208050O07980m62387n31412
38841c7519J32203J94871m05658n25855Q0737L95449p2047n71224m62189r2818
$$ plain form
38910 -1047954 -934160 -727525 -244134 251479 217028 -345802 -801461 -760500 -554893 -611989
38900 -611989 -825960 -892591 -855658 -863830 -708964 -169254 384299 356798 -139060 -362810
38890 -362810 -37401 293344 216901 109206 426938 880852 871279 409130 41354 51381
38880 51381 248123 443247 655427 844725 840401 601318 305535 156834 236793 465456
38870 465456 597125 426589 111552 30544 186581 118711 -368656 -812339 -764630 -447550
38860 -447550 -318626 -375956 -364258 -299379 -286624 -194063 -32534 -228771 -907708 -1382117
38850 -1382117 -1113078 -691822 -919195 -1336977 -859750 348300 956280 493893 -37519
38841 -37519 94684 289555 -116103 -641958 -561221 -165772 -237819 -809043 -1271232 -1364050
38831a364050L0883L372Q0071J98404K35242K15168J26883k5438l5127J74846
38821c59746K17455j98442o15410m04989K21648N08783K76197j1350j27020k37229
38811g30103k94435q7209J70327Q9880j15536Q2392N20601M98620k7683l05985
38801a99131l298K95154R4302k54923k11529J08301J81596j44158m70334l36654
38791i40674K32904O56367L98370k88948n60875r0562M72850M57563M6596k23637
38781A59954k63503j82550J55480O51099O25856k38527j122585j074723l37886
38772a627385J78715K70350L43330M08758K00912m2799P7381L07396J97196j2334
38762C01520Q4551J41803k46571m90379Q8361Q03944N19006l91407n80951J8205
$$ plain form
38831 -1364050 -1333167 -1329795 -1249724 -1051320 -816078 -600910 -474027 -499465 -534592 -359746
38821 -359746 -142291 -340733 -956143 -1361132 -1139484 -630701 -354504 -365854 -492874 -730103
38811 -730103 -1024538 -1111747 -941420 -851540 -967076 -884684 -364083 134537 106854 -199131
38801 -199131 -202429 92725 187027 -67896 -279425 -171124 10472 -133686 -604020 -940674
38791 -940674 -707770 -51403 346967 58019 -502856 -593418 -120568 336995 383591 159954
38781 159954 -103549 -286099 -130619 520480 1146336 907809 -214776 -1289499 -1627385
38772 -1627385 -1448670 -1178320 -834990 -426232 -225320 -268119 -190738 116658 313854 301520
38762 301520 386071 527874 281303 -209076 -120715 683229 1202235 810828 229877 248082
38752B48082J96313l41325n52528j8164L82319J38713j09905O6250J85573P965
38742B03293M0878L86324L63841k08134n72940l47273p7574p1232Q5633M26951
38732B29767L18629k70336n13609k01223j02699l92666k20682N50088P85588P2185
38722B55042l59406K56941P67985O8973q82884n91780N19148Q44514R5071n38813
38712D34791l66558N3209N1517l22749o27911n12975K6639N04510L95561m7242
38702d11208n7070L70973L98321j38759k93371L28918P12183Q4149p46423p35702
38692d87989k18350l2580j2884L76578P40528M30264j32712j37317J50221q4778
38682E90981o38655n77966J48133O16116L68563q9359k05614L3747L66469M64125
$$ plain form
38752 248082 444395 103070 -449458 -467622 -85303 53410 -56495 9755 195328 203293
38742 203293 244171 630495 994336 786202 213262 -134011 -211585 -282817 -197184 229767
38732 229767 548396 278060 -235549 -436772 -539471 -932137 -1152819 -602731 182857 255042
38722 255042 -104364 152577 920562 989535 106651 -485129 34019 878533 973604 434791
38712 434791 68233 121442 172959 -149790 -777701 -1290676 -1264037 -759527 -363966 -411208
38702 -411208 -468278 -97305 301016 162257 -131114 197804 909987 994136 247713 -487989
38692 -487989 -706339 -738919 -751803 -375225 365303 795567 662855 525538 675759 590981
38682 590981 -47674 -625640 -477507 138609 507172 417813 212199 245946 612415 1076540
38672A076540Q0458n06113o01650j16570J60405j47302l02605J91838N20444q8253
38662B67192q39942n38072M40063P71207K75673r9142l6772r5413l47559k21039
38652d23804K66025L98119N745k92910j76071M9892K00164L34344K20706l28906
38642B53304p32808l14791M49621N13814n8362k70667J9506o2736o40131o65199
38632a508449K57105J006752O18901l03357o30190k56659J81920M23466O02536
38623C92025O58470M43327J28242k6175p9301k31937m71009o41555o40413m09530
38613h77856j4824K38218J32939l6550J64369N53536N25335K6975l20331k14058
38603A77753j01107l42070n69953k83699L78655Q62237Q75105N28583N8092l26818
$$ plain form
38672 1076540 1156998 650885 49235 -67335 93070 -54232 -356837 -164999 355445 267192
38662 267192 -572750 -1110822 -670759 100448 376121 276979 240207 144794 -202765 -423804
38652 -423804 -157779 240340 246085 -46825 -222896 -173004 27160 361504 582210 253304
38642 253304 -479504 -794295 -344674 169140 110778 -159889 -140383 -203119 -843250 -1508449
38632 -1508449 -1251344 -244592 374309 70952 -559238 -815897 -633977 -210511 392025
38623 392025 1050495 1493822 1622064 1595889 1516588 1284651 813642 172087 -468326 -877856
38613 -877856 -892680 -654462 -521523 -558073 -393704 159832 685167 712142 391811 177753
38603 177753 76646 -265424 -835377 -1119076 -740421 121816 996921 1525504 1583596 1256778
38593A256778m94332m69094l45248j28588J36990K06828m3462k41454O0742O16945
38583E56105O76181J9866p11608q73144n06719r915L83858N40553L13295j48540
38573B39932l34804J011M12422L29583j36001l59856r0624K51019K31709k498
38563E41893l4381J51225J65765j34786l88670k89475p1396j10479k99452k59904
38553g29660k0746L6701j26037j15738K08789M89562M51752K54969J10386J1696
38543E71674j3006J31600K57349L9860l49714l57795M1427K17433j00538l90443
38533D7847k34936O8125J62468J71629J74101r1641n29080m98088J18837M94719
38523a16019J46775k10310J27026O40152N15640J1718j49933q7214l14187n57261
$$ plain form
38593 1256778 762446 293352 -51896 -180484 -43494 163334 119872 -121582 -60840 556105
38583 556105 1232286 1252152 540544 -332600 -839319 -849234 -465376 75177 388472 239932
38573 239932 -94872 -93861 318561 648144 512143 152287 61663 312682 544391 541893
38563 541893 507512 658737 824502 689716 301046 11571 -59825 -170304 -469756 -729660
38553 -729660 -750406 -713705 -839742 -955480 -746691 -257129 194623 449592 559978 571674
38543 571674 558668 690268 947617 987477 637763 279968 321395 538828 438290 47847
38533 47847 -187089 -118964 43504 215133 389234 297593 -231487 -729575 -610738 -116019
38523 -116019 30756 -179554 -52528 587624 1103264 1114982 965049 877835 563648 6387
38513F387k39554K63388J18413m64861m94289J32251M48476P960m75271l23361
38503a020461K06877N33407N11180K81187o6161m04723n31325l66391O326M20169
38493d29915N86645K89784j61119j50100K89423L79545j52262n37495k49038J02162
38483c2370o2344k00990K31962N52179K4770n85950j72763O99450O33169k26380
38473H60733m69782J57172M72668J9134l16162q9651K271l64547m96377o7332
38463b91873K49013O6245p9420J19334J91996k0779M2315M73243N06700j25220
38453A131554o15363m27295r3997j06524j21729J32003K49090M1984j5855K08721
38443C82589J61044k27668k24843K76294L42652k84671m90806K80223Q49122K49214
$$ plain form
38513 6387 -233167 30221 148634 -316227 -810516 -678265 -229789 -221829 -697100 -1020461
38503 -1020461 -813584 -280177 231003 512190 446029 41306 -490019 -856410 -850084 -429915
38493 -429915 156730 446514 285395 135295 424718 804263 652001 114506 -134532 -32370
38483 -32370 -94714 -295704 -63742 488437 513207 -72743 -245506 453944 1087113 860733
38473 860733 390951 548123 1020791 1039925 723763 634112 636383 271836 -224541 -291873
38463 -291873 -42860 23385 -56035 63299 255295 234516 276831 750074 1256774 1131554
38453 1131554 516191 88896 -5101 -111625 -233354 -101351 147739 189723 173868 382589
38443 382589 543633 315965 91122 367416 710068 425397 -65409 214814 1063936 1313150
38433A313150n21505j65528O66145M86092n23217r07542l41344J15799m5484k06805
38423a30239L859J83259J38959J78634K62558p506m00828j76230N70069P65174
38413A387709l2372q58358p15760O7544M74401K10977j72327k34166j04208p5820
38403e2380j76175k18727q2713J46006K84138K66069J90271J56762J85480K94773
38393I93504M40063L57385j77861q16187q07502l488P46601O33754n2934m42347
38383H70988l37360k72346m71239n22479j93765J33708J38008J03888L96649P94902
38373F40954Q09480M21206L6321j67477l78886o36877o47350k85161R7340J32312
38363B1862o2940j42715o1118O124P0346K24199K61677p3611n00524m47655M6620
$$ plain form
38433 1313150 791645 626117 1292262 1778354 1255137 347595 6251 122050 76566 -130239
38423 -130239 -126380 56879 195838 374472 637030 629524 228696 52466 622535 1387709
38413 1387709 1355337 496979 -218781 -151237 323164 534141 361814 127648 23440 -52380
38403 -52380 -228555 -447282 -529995 -383989 -99851 166218 356489 513251 698731 993504
38393 993504 1433567 1790952 1613091 796904 -10598 -14086 732515 1366269 1313335 870988
38383 870988 533628 261282 -209957 -732436 -926201 -792493 -654485 -550597 -153948 640954
38373 640954 1450434 1871640 1907961 1740484 1361598 724721 77371 -207790 -110450 21862
38363 21862 -41078 -183793 -244911 -238787 -168441 55758 317435 243824 -256700 -704355 -657735
38352f57735L12192R1214q2286J48810L36854O4228k60798j01319K59127K11864
38342C22151j48613k64294o0387J14326K14133L80637L58196j31920o29272m41221
38332b86264J93513L60527j33595n37079l86593n9370N6045Q0469J27872O4115
38322e20360n517K26420N45674L26599l91153p50785l26041K58885L33148O3581
38312b39549q7529r8438j13236l8546J19423N3374k79930m05481m9442L76494
38302g62860L92075P7219k46696m51800m05236Q1948P34227Q40504K36283l34471
38292A61193l00308o7941j78035l11955P5015O25333N09763k26926o29133j61383
38282e04377O33395R35725N66643n5733m60864m54675j87641k5613j68071l63064
$$ plain form
38352 -657735 -345543 -254329 -336615 -187805 149049 213277 -47521 -148840 110287 322151
38342 322151 173538 -90756 -151143 -36817 177316 557953 916149 784229 154957 -286264
38332 -286264 -92751 267776 134181 -402898 -789491 -848861 -792816 -712347 -584475 -520360
38322 -520360 -525877 -299457 246217 572816 181663 -569122 -895163 -636278 -303130 -239549
38312 -239549 -327078 -425516 -538752 -577298 -457875 -404501 -684431 -1089912 -1139354 -762860
38302 -762860 -370785 -293566 -540262 -992062 -1397298 -1315350 -581123 259381 495664 161193
38292 161193 -139115 -207056 -385091 -697046 -622031 3302 513065 286139 -342994 -504377
38282 -504377 129018 1064743 1631386 1575653 1114789 660114 472473 446860 278789 -84275
38272h4275k10705K37446M54140J32606l30019l01323K25747N70260K67769k85071
38262F76575m01860p6066J23064J6679R048K05183R8390m77921q07698l12907
38252i47513M61482O00615J07472l10915l54768k36581j6652L21130M15627K9159
38242F9056k66521J42450P08688L92056n86005q82729n3359P71986N76559k43737
38232F28444p39358o57247l04207R2293L52755K48209j17036k74420l9458K38861
38222e71164K42509K7327k73652n51062n02042O5137O89123O89201J62664j42963
38212a64922O2734L82064N49689O33959M64667j86597q44836p68033k00782j13535
38202a85592n96030o92275m3222N45356N18911L28621L26708J24739l86954n40224
$$ plain form
38272 -84275 -294980 -57534 396606 529212 199193 -102130 123617 693877 961646 676575
38262 676575 274715 198649 321713 338392 347440 552623 651013 173092 -634606 -947513
38252 -947513 -486031 114584 222056 -88859 -443627 -680208 -696860 -375730 39897 69056
38242 69056 -197465 -55015 653673 1045729 459724 -423005 -476364 295622 872181 628444
38232 628444 -110914 -768161 -1072368 -980075 -627320 -379111 -496147 -770567 -810025 -571164
38222 -571164 -328655 -301328 -574980 -1126042 -1628084 -1562947 -873824 -184623 -21959 -164922
38212 -164922 -102188 279876 829565 1463524 1928191 1741594 896758 128725 -72057 -185592
38202 -185592 -781622 -1473897 -1517119 -971763 -452852 -124231 202477 327216 -59738 -599962
38192e99962n3455L72661K70738J71426M71016N78649j0369p10503p37686k45319
38182d92804J41289K21664Q1162k01973k65276K58742Q17735L89226p42411j008698
38172h01344K2394P58686O0593r17127o57276L17237N58729J14692P2238M47389
38162b3789L31802k73051m60721q1533J15170n1650L4270M89934O46861K20814
38152I48107k73377m34776m11375l05646L3220M80974N98862K65153j71649l92303
38142C37190l26377R678M42199N69761K02393l00939m86251l32534l7661L03886
38132C81345M84015J78404m30458o13935j46929K35409m4816n14208m85936j08460
38122a065569J15056J97601L18046K32533j82737l89756K0525N43799N21648J28317
$$ plain form
38192 -599962 -653417 -280756 -10018 161408 632424 1211073 1200704 490201 -247485 -492804
38182 -492804 -351515 -129851 -48689 -250662 -515938 -257196 560539 949765 207354 -801344
38172 -801344 -778950 -20264 40329 -876798 -1534074 -1216837 -658108 -543416 -471178 -23789
38162 -23789 308013 34962 -425759 -507292 -392122 -443772 -409502 80432 727293 948107
38152 948107 674730 239954 -171421 -477067 -443847 37127 635989 901142 729493 337190
38142 337190 10813 20491 462690 1032451 1234844 933905 447654 115120 77459 381345
38132 381345 865360 1043764 613306 -629 -147558 87851 43035 -471173 -957109 -1065569
38122 -1065569 -950513 -752912 -434866 -202333 -385070 -774826 -754301 -210502 311146 439463
38112D39463j16375k01537k68375q6246L37993L53287l00538q01600m64293J44506
38102i63715K33177O2275J55817J57613l10373n37701J52419R67884P97621O2724
38092G77741j31136J8493m02324j035416p48459K15590N09717k8581k42706J93613
38082h73468L69373J6823n6811L02490K50059k74554k08122O47404J039552L74833
38072A587579k47557K5152L81544r0843p86557o96531n1854K99436K79750K75667
38062I75786K01671j23655l20791r0034J04047j56863l89987n5442L75208J75665
38052F95605l48093l84580k6491l0387l78948k42658N48008J043139N26444m62077
38042I39962r04169n67144l4108J86355J28228P3395J47450K46969J98295m1630
$$ plain form
38112 439463 323088 121551 -146824 -233070 104923 458210 157672 -643928 -1108221 -963715
38102 -963715 -730538 -668263 -512446 -354833 -665206 -1202907 -1050488 -82604 715017 777741
38092 777741 646605 665098 262774 -772642 -1521101 -1305511 -795794 -824375 -1067081 -873468
38082 -873468 -504095 -487272 -544083 -241593 8466 -266088 -474210 173194 1212746 1587579
38072 1587579 1340022 1365174 1746718 1655875 869318 172787 120933 420369 700119 975786
38062 975786 1177457 1053802 733011 642977 747024 590161 200174 144732 519940 695605
38052 695605 347512 -37068 -63559 -93946 -472894 -715552 -167544 875595 1402039 939962
38042 939962 35793 -531351 -565459 -379104 -250876 -177481 -30031 216938 415233 373603
38032C73603k71225j84386K48626N88975L41104l76559q24310n08061J67966M35949
38022h318J75886o0280L7956J65091L8710j54471j97623k19765l08769k08175
38012g39758K08758N49652M10391k7763k96806k72626j50506m2566N3636Q5157
38002b22431J6605r9526k53253m15351l35121J44709N62461K80901m36675n89819
37992a347500P2132O16841L92414k5696L8056K24752l7819l99364k49615J24225
37982e91574N9226k96671l18826l1794P2935K0457J95661M55105L29198n7147
37972a63430j36331J43908L03216J73939M8334O6989R0045P7475O5872o1625l11958
37961B96434l54561r853L70091M30342K90529R8354l03180p95875p82981j47933
$$ plain form
38032 373603 102378 -82008 166618 755593 1096697 720138 -104172 -612233 -444267 -8318
38022 -8318 167568 107288 145244 310335 349045 194574 -3049 -222814 -531583 -739758
38012 -739758 -531000 18652 429043 401280 104474 -168152 -318658 -361224 -307588 -222431
38002 -222431 -205826 -305352 -558605 -973956 -1309077 -1164368 -601907 -321006 -757681 -1347500
37992 -1347500 -1275368 -658527 -266113 -291809 -253753 -29001 -66820 -466184 -715799 -591574
37982 -591574 -532348 -829019 -1147845 -1179639 -1106704 -1086247 -890586 -435481 -106283 -163430
37972 -163430 -299761 -155853 147363 321302 369636 436625 526670 604145 670017 608392 296434
37961 296434 -58127 -67980 302111 732453 1022982 1121336 818156 22281 -760700 -908633
37951i08633L37238K08883P3180M13514N80183n0102q04271p43111j72470O2759
37941a002830L7455K41872L66291l5418l56399J11974O60938J88656p70293p46595
37931a304349K60744Q18077L61262k03215k06966K5506K00432M10027M25093l6848
37921G49763m18409n5524M12244r6619j063651r71637J29978O19925L1656k71558
37911i33832L70262P47896J664q19213n34895L01104N02450O4990k40963j91239
37901g31776l0518J92184L96168K44034k03126k99362J47978M06648k4706n41949
37891d44425l74633K43120N15090K27663j35590j24887K28482N04586L08927k03603
37881G44730l86248l0177J78463k53952o43230j94370M88692K70673n08093m70377
$$ plain form
37951 -908633 -571395 -362512 -289332 124182 704365 654263 -150008 -893119 -1065589 -1002830
37941 -1002830 -965375 -723503 -357212 -392630 -749029 -637055 23883 212539 -557754 -1304349
37931 -1304349 -1043605 -225528 135734 -67481 -274447 -248941 -48509 361518 786611 749763
37921 749763 331354 275830 688074 591455 -472196 -1443833 -1313855 -693930 -662274 -933832
37911 -933832 -563570 184326 185990 -633223 -1168118 -867014 -364564 -299574 -540537 -731776
37901 -731776 -762294 -570110 -173942 70092 -133034 -432396 -284418 122230 97524 -444425
37891 -444425 -819058 -575938 -60848 166815 31225 -93662 134820 639406 948333 744730
37881 744730 358482 328305 506768 252816 -390414 -584784 -96092 174581 -333512 -803889
37871h03889M39084P61213m0579o65435j19187P54352P52552Q1310l22793k92959
37861E43669l01430m72491n31951l44101J4656L82528M82247J77724j93684k41582
37851d84415j37555j78468n6676N38171R59710M26574m75648m86779K91348N69138
37841I65400M9977k29247R6066J30978m36766o34033R074N57303L13432r8464
37831G23720p7553o6853l92625m39888J07874M78405J83442m9598L27342N78885
37821A373151L5399n99129m47973L2992m3720m40681l55767J39789L90513L56048
37811D40622M38963N17691J44865n36964q86773o17703j3700M86483N55427J52492
37801F81403l04252l32622p1940m7224k43802j59325K05308L17160J48460K24565
$$ plain form
37871 -803889 -364805 396408 355829 -309606 -428793 325559 1078111 1159421 836628 543669
37861 543669 242239 -230252 -762203 -1106304 -1091648 -709120 -226873 -49149 -242833 -484415
37851 -484415 -621970 -800438 -857114 -318943 640767 1067341 591693 104914 396262 965400
37841 965400 1015377 786130 882196 1013174 576408 -57625 -48551 508752 822184 723720
37831 723720 646167 579314 186689 -253199 -145325 333080 516522 466924 794266 1373151
37821 1373151 1408550 809421 361448 394440 350720 -89961 -445728 -305939 84574 440622
37811 440622 879585 1397276 1542141 1005177 118404 -499299 -512999 -26516 528911 681403
37801 681403 377151 44529 -27411 -74635 -318437 -477762 -272454 44706 193166 417731
37791D17731N09518L66667j72236l12800M8360O9618m47558n70651J17912P08776
37781G35337M59591j32198m18724n48346o44803k85076M52323O39387p030m77499
37771b27038j15970L15021P8364k78060q7219J98909m402k78746j18531M4346
37761d73326k11949l31063J67915O39215M02855m3182P982K12329J311k33220
37751A38867M9131L76477J13231k85807o5172M66940N37290K56493K23752L29632
37741B140834O3420m36813o47160n65995n03210m13739j95503j21544k84469k36266
37731a200445J65401L11479o7533k38528L00799Q21895N14707k01651m67738k98705
37721c60319j74747q1334J30884J85051K2427J73740O73745O00288l74934j067205
$$ plain form
37791 417731 927249 1293916 1121680 808880 857240 926858 479300 -91351 26561 735337
37781 735337 1194928 1062730 644006 95660 -549143 -834219 -381896 257491 250461 -227038
37771 -227038 -343008 -27987 50377 -227683 -314902 -115993 -120395 -399141 -517672 -473326
37761 -473326 -685275 -1016338 -848423 -209208 193647 150465 158447 370776 372087 138867
37751 138867 187998 564475 677706 391899 326727 793667 1330957 1587450 1811202 2140834
37741 2140834 2204254 1767441 1120281 554286 51076 -362663 -558166 -679710 -964179 -1200445
37731 -1200445 -1035044 -723565 -791098 -1029626 -728827 93068 607775 406124 -61614 -360319
37721 -360319 -535066 -616400 -485516 -300465 -278038 -104298 569447 1169735 794801 -272404
37711b72404n28056L57607L05195l34821m09388K2868O0989k72272j75321L93576
37701h52027O98944N05539K21210K6306j55971j70493J7123m1935m80274o09705
37691h41283o7171L54783J6554l38057J45258Q11897N43078l19988n88094j94041
37681d77064m1811k89709k64057J37206L04321P2187j14349o3876O3830K53164
37671d20158M08891J20639n19028n59222L70797J092339N31069n06459o00457
37662h1589L8634J94970j55533o4254M01332K58998m40595n80220K9856L19970
37652g8431j31802m22460N1788O60825P01791L52999K7945k37962l75035j39276
37642D10382K80092L06268r8056k93148L591K54028m6091o24966q22039l40115
$$ plain form
37711 -272404 -800460 -442853 -137658 -472479 -881867 -858999 -798010 -1070282 -1245603 -852027
37701 -852027 -153083 352456 573666 599972 444001 273508 290631 248696 -231578 -841283
37691 -841283 -908454 -553671 -537117 -875174 -729916 81981 625059 305071 -283023 -477064
37681 -477064 -518875 -808584 -1072641 -935435 -631114 -558927 -673276 -737152 -673322 -420158
37671 -420158 -11267 109372 -409656 -968878 -598081 494258 1025327 518868 -81589
37662 -81589 -42955 152015 -3518 -67772 333560 592558 151963 -428257 -398401 -78431
37652 -78431 -210233 -632693 -580905 79920 781711 1134710 1162655 924693 549658 410382
37642 410382 690474 996742 898686 605538 609129 863157 817066 192100 -629939 -970054
37632i70054N09235J036547P22749j79197p80928n77330j0247K81162K89069K86023
37622F07029J85445j61677m75977m45683k37701j17878J0253K30526K75927K4435
37612a05301j90035j71714j69576k28343K7287N56683O89963K16511j91847j11219
37602C22409M4441J7477J65737M10585K4493q61142r57587J08464R03644M26915
37592F05436k70173J9812O28093L96915k43024k63186M9854j04181l54719j5660
37582D49167L32147j14574o57591k50565M64018J99009o17764n39876L72649P35633
37572C72253K10821k29970k07525k87596n28502l46338J98315M38193L18006K66761
37562B04418J39883l81037p29798k17682N45965M57402k43213m18553M9981K91433
$$ plain form
37632 -970054 -460819 575728 1298477 1119280 338352 -238978 -249225 31937 321006 607029
37622 607029 792474 630797 154820 -290863 -528564 -646442 -636189 -405663 -129736 -105301
37612 -105301 -295336 -467050 -636626 -864969 -837682 -280999 408964 625475 433628 322409
37602 322409 366850 384327 550064 960649 985142 124000 -833587 -725123 178521 605436
37592 605436 335263 355075 983168 1380083 1137059 873873 923727 819546 464827 449167
37582 449167 781314 666740 9149 -241416 222602 421611 -196153 -736029 -363380 372253
37572 372253 583074 353104 145579 -142017 -670519 -1016857 -818542 -380349 -62343 204418
37562 204418 344301 -36736 -766534 -984216 -438251 19151 -224062 -642615 -592634 -301201
37552c01201P4324m6413P0406J36561K58293N46630M61251k06297m78108K65621
37542G81067Q43981Q1863r42585n20118O81216O18777o48227j053754l576P64458
37532F03102J37131q05082p94596j18083L25680K98425K6060k00180k2455M85280
37522f4718N33144k00547o75748j5876Q29737N05946m29293m48594L24166M71008
37512H29225j91400n32358k71934j64159k22907J99194P25060L69795m98164o10039
37502c67687l1042R5624j95741J16663P70579M76273n55794p20674J81223O02363
37492C71787L737l67270J01191M19533L8661k02853J77910M54516J61412k22052
37482I36572m32033o79236o16345K47146J097280O63243n06448o37372L97143
$$ plain form
37552 -301201 -226877 -273290 -202884 -66323 191970 738600 1199851 993554 515446 781067
37542 781067 1625048 1706911 764326 244208 925424 1544201 895974 -157780 -161356 603102
37532 603102 740233 -64849 -859445 -977528 -651848 -353423 -327363 -527543 -549998 -64718
37522 -64718 468426 267879 -407869 -423745 405992 911938 482645 34051 358217 829225
37512 829225 637825 105467 -166467 -330626 -553533 -354339 370721 740516 242352 -367687
37502 -367687 -398729 -303105 -498846 -382183 388396 864669 308875 -411799 -230576 371787
37492 371787 375524 8254 109445 528978 567639 364786 542696 997212 1158624 936572
37482 936572 504539 -174697 -791042 -543896 553384 1216627 710179 72807 469950
37473D69950R42823L71823k15619k51294l78287o42145k94776L32964O6387p65194
37463c63368n96931N19487Q43218J3886m41862l6720K6711l89387Q5929J315125
37453I76088J263264l78889j255811k73286N98374n0963o89270N2634P72503M180
37443A018824r95082n53873M60943M03287k71781k28653K37727J63843j2229N05508
37433G28514J013817N35170k62690k99851q5770n68217j096501n42038M74464
37424a03102M92880l25884n47534J85642Q47511P67418K48692k98040o78566o61735
37414g2718l14421j73660l73252k56903M45485R10224M90478j97874l26822j04009
37404B6528o4677O734M63586Q54962N64133j78601o94255p39850m40584M5351
$$ plain form
37473 469950 1412773 1784596 1568977 1317683 939396 297251 2475 335439 401826 -363368
37463 -363368 -960299 -440812 402406 416292 -25570 -62290 -35579 -424966 -339037 976088
37453 976088 2239352 1860463 604652 331366 929740 878777 189507 242141 1014644 1018824
37443 1018824 23742 -530131 -69188 334099 62318 -166335 71392 235235 223006 728514
37433 728514 1742331 2277501 2014811 1714960 1629190 1060973 -35528 -577566 -103102
37424 -103102 389778 63894 -483640 -297998 549513 1316931 1565623 1267583 589017 -72718
37414 -72718 -387139 -560799 -934051 -1190954 -745469 164755 655233 457359 130537 26528
37404 26528 -38149 -31415 432171 1287133 1851266 1672665 978410 238560 -202024 -156673
37394a56673L61177J48888k65933j81083K89282L03428k45017m94806j01705K49341
37384i3101J21130q6972j01915j21997l1291M32481O78317n8189j015914o64303
37374i41754P14290J188147K38612m80543j5757M52627o9245p11501m98114L0472
37364i2766R3647j5734P7529o74l34132k92414J33947Q8138m77521n41899M7516
37353a314363K24838j70855K7051R51812J108056r249q89858n70456n2664j47269
37343h42957j15730M33249N27782r9411j69049O83835R06634j84314r71071l55904
37333a86936L61815M3883k43810M41700Q80643n303r58992n95348J84022P8890
37323E64k21592L19852Q79416L87354l30933j62022J77109k81502p03691j10805
$$ plain form
37394 -156673 204504 353392 87459 -93624 195658 499086 254069 -240737 -342442 -93101
37384 -93101 28029 -58943 -160858 -282855 -314146 118335 796652 738463 -277451 -941754
37374 -941754 -227464 960683 1199295 718752 702995 1155622 1086377 374876 -123238 -92766
37364 -92766 881 -14853 62676 62002 -272130 -564544 -430597 -342459 -819980 -1361879 -1314363
37353 -1314363 -1089525 -1260380 -1233329 -281517 826539 817290 -72568 -643024 -695688 -842957
37343 -842957 -958687 -525438 2344 -97067 -266116 417719 1324353 1140039 168968 -186936
37333 -186936 174879 218762 -25048 416652 1297295 1291992 333000 -262348 -78326 564
37323 564 -221028 98824 978240 1365594 1034661 872639 1049748 768246 64555 -46250
37313d6250N31784P0171n67341r2318O66444L11822n12100m09645J56786r0290
37303A9063p36871n48624J41304J55781k77284q8910O01790R06938Q14663P40997
37293A728847L89008l80292o65450m1487L51414k28002o14482J21521P46558L7548
37283A445183q48849l85077N78485M40833k76610j66158L19122q1877q24890n63889
37273c63727K66201L59050L4548L53860P20559p1448j236118j025843K83858R02183
37263B23123M53748N7851J6118k92407o61790l59694K35709K35230o8553P5821
37253h4844K22155l30620q19523k30782O65866N48845j04835j6106M82122K43556
37243E75834l61313j93587L74415K03056l51328j83185L04681j9539p00949m64983
$$ plain form
37313 -46250 485534 555705 -11636 -103954 562490 874312 362212 -47433 109353 19063
37303 19063 -717808 -1266432 -1125128 -969347 -1246631 -1335541 -733751 173187 987850 1728847
37293 1728847 2117855 1737563 1072113 1030626 1382040 1154038 539556 661077 1407635 1445183
37283 1445183 596334 211257 789742 1230575 953965 787807 1106929 1025052 200162 -363727
37273 -363727 -97526 261524 296072 649932 1370491 1299043 62925 -962918 -679060 223123
37263 223123 676871 734722 750840 458433 -203357 -563051 -327342 -92112 -160665 -84844
37253 -84844 137311 -193309 -1012832 -1243614 -577748 -28903 -133738 -149844 332278 575834
37243 575834 214521 20934 395349 598405 247077 63892 368573 349034 -351915 -816898
37233h16898L75393N49859J80262K40555M14149j73240q29872l37608N89419L84753
37223E76772m97429l94583M58765L81882n64586o39962M07999R28694K86043k81411
37213F62184j9548L27511J99286j4628j46468m82278p22403k83667M16608M58544
37203C95141k4773k06350n2281k7380O7065M77687N07098k79685p87956n7486
37193A1080Q48156N26451k90378q4238O81353M89047m32163o66240k35778k52474
37183E94816n85938k66005L74133K85108j73383J2498L30781k94602j097719n75370
37173a395681O44586O90729k98753n01833L54064P57937K39915j23747L8901J3818
37163D19936k02647O6928N13857K83991k41087j37432J41511l13240p48907N2268
$$ plain form
37233 -816898 -441505 108354 288616 529171 943320 770080 -59792 -397400 192019 576772
37223 576772 79343 -315240 143525 525407 -39179 -679141 -271142 657552 943595 662184
37213 662184 642636 970147 1169433 1154805 1008337 526059 -196344 -480011 -63403 395141
37203 395141 370368 164018 111737 84357 151422 629109 1136207 856522 68566 11080
37193 11080 859236 1385687 1095309 1011071 1692424 2181471 1749308 1083068 847290 594816
37183 594816 8878 -257127 117006 402114 228731 241229 572010 277408 -820311 -1395681
37173 -1395681 -751095 -60366 -359119 -860952 -506888 251049 490964 367217 406118 419936
37163 419936 217289 284217 798074 1082065 840978 703546 845057 531817 -217090 -164822
37153a64822J181551Q24832n24150q19914J9081J99311n93402q11483m3199L54944
37143c77251j36903m44293m7257L02885K41460K27497K78766K8335j61532J94695
37133A06402M94721J09520j88106L35936O55385k09237r98963k68204P67059K20639
37123A025152r68633o49916O18567O43175l62106l54545O02714N99354l65651
37114G88111m77242K93905K13616p10005p10839K67435M81891k11447k18287N05015
37104B22153L81928m95819l91060O33673O84965l43489n25224M25838O32416l66868
37094H58513q30414j33384K96713j00819j96213K77429K85978q1622L03096R65720
37084A644997L67289q67783n92935Q89710J044775m49448j166016l17080J16700
$$ plain form
37153 -164822 1016729 1841561 1317411 497497 516578 715889 122487 -688996 -732195 -377251
37143 -377251 -514154 -958447 -1005704 -702819 -461359 -233862 44904 73239 -88293 106402
37133 106402 601123 710643 522537 858473 1513858 1304621 305658 37454 804513 1025152
37123 1025152 56519 -593397 25170 668345 306239 -48306 554408 1153762 788111
37114 788111 310869 604774 818390 108385 -602454 -335019 146872 -64575 -282862 222153
37104 222153 604081 108262 -282798 350875 1035840 692351 167127 592965 1225381 858513
37094 858513 28099 -105285 191428 90609 -105604 171825 457803 376181 679277 1644997
37084 1644997 2012286 1144503 551568 1441278 2486053 2036605 870589 553509 670209
37075F70209o06694o65818N62646J096459O4215o02787K68364J001527K00416
37066A988537q72076p38781n7253O9556k8289J85800K36419j82162m42354k15528
37056e6131L0226J48713M06668M63054q8670m95353J3274N19622n9659p07522
37046A74222l7283Q42708J29431j136299o83875Q20238Q80367l54097n96147K24127
37036B63392J56042o70825l11403R02340P59860m99703n35505N53054M58850o40892
37026D35210k94530J216935R66486j109995j745946r6501R64883K16587j63560
37017C89569O57133N90902q18753j083623M08806R35162n04921j258264J8368
37008f65621R66883J02773n75104L02715R12634K4229n82004K67137Q22619q5760
$$ plain form
37075 670209 63515 -602303 -39657 1056802 1121017 518230 786594 1788121 1988537
37066 1988537 1116461 377680 320427 389983 361694 547494 783913 601751 159397 -56131
37056 -56131 -25905 122808 529476 992530 903860 408507 421781 941403 881744 174222
37046 174222 136939 979647 1109078 -27221 -711096 109142 989509 635412 39265 263392
37036 263392 419434 -251391 -562794 339546 1099406 599703 64198 617252 1076102 435210
37026 435210 140680 1357615 2324101 1214106 -531840 -628341 336542 553129 389569
37017 389569 1046702 1637604 818851 -264772 144034 1079196 574275 -683989 -665621
37008 -665621 301262 404035 -171069 131646 1044280 1068509 486505 753642 1576261 1490501
36998A490501p93177j66751K22567o30837j066965K1058J025860O22384n2625
36989F72015O0196J25198l60005l88572K20497J84483n32164l58037P39694R19085
36979A282390p3543m42995J28630L9097p17612l75740Q30093O90628p23612r36388
36969b99052L62865Q51431O3040o0474N64630l516j296873p34885J235789J399038
36959B081993l82106q96609L50522M39268r70372q81530R09245J056857q02262
36950I05006j038723J042639J671348k85442j168716M86679J275791m03485j326578
36941A158519K89999J563316O59144j19896M71496J55994j635564j898937J17038
36932G61109J049194k92935p66546P34490J018973r17177j578753L09617J239775
$$ plain form
36998 1490501 697324 530573 753140 122303 -944662 -923604 102256 724640 672015
36989 672015 732211 857409 497404 108832 329329 513812 -18352 -376389 363305 1282390
36979 1282390 1208847 765852 894482 933579 215967 -159773 670320 1360948 637336 -299052
36969 -299052 63813 915244 978284 917810 1482440 1478924 182051 -552834 682955 2081993
36959 2081993 1699887 803278 1153800 1593068 622696 -258834 650411 1707268 905006
36950 905006 -133717 908922 2580270 2294828 1126112 1612791 2888582 2485097 1158519
36941 1158519 1448518 3011834 3670978 3551082 4022578 4178572 2543008 644071 761109
36932 761109 1810303 1517368 750822 1485312 2504285 1587108 8355 317972 1557747
36923A557747l12746j086723L64695R17690n99896r00440J024274J553963m25848
36914B092716j112356P33977J226081q88084j510242P44855J618399m55098j164373
36905A285875J097545J796228q68178k132249K49424J674991k71085j170875J256154
36896B917830K340079m46679k326047k93047J314313m48796j551337N39312J610547
36887C656175o57923j725613P02179J750099r29087k025529J108257K803678j90618
36878D491618k326473L6362J752120o40980k011255Q37020K351496p67335k559053
36869A163520O37151K654032n83720k886868J94319K655010q7875k248691N40496
36860B037374K393138p62887k499976J323142L681776l5753k636874P30952K767073
$$ plain form
36923 1557747 1245001 158278 522973 1440663 840767 -59673 964601 2518564 2092716
36914 2092716 980360 1714337 2940418 2052334 542092 1286947 2905346 2450248 1285875
36905 1285875 2383420 4179648 3311470 1179221 1428645 3103636 2832551 1661676 2917830
36896 2917830 5257909 4811230 2485183 2192136 3506449 3057653 1506316 2045628 3656175
36887 3656175 2998252 1272639 1974818 3724917 2795830 770301 1878558 4682236 4491618
36878 4491618 2165145 2201507 3953627 3312647 1301392 2138412 4489908 3722573 1163520
36869 1163520 1800671 4454703 3870983 984115 1178434 3833444 3745569 1496878 2037374
36860 2037374 4430512 3667625 1167649 2490791 6172567 6136814 3499940 4230892 6997965
36851F997965j249975l378139J286631L963463r74236m301069L84708L797835
36843F527183q45993m066208J125615M780745l49255l706269K172559N764893
36835A1403270q00761m718353K691655P264837p22919n495253M229542J1093867
36827B4945885J916766m434387P094767J5779529N260466N53130K0727606L3540108
36819A05383870J5153741J5362592Q3358162J54967881J13177019l6587592j50910574
36812B99905099j34364437n1453429j1377192k3453321k8546690j0350157m44931
36805C9914942p393887r077595r10518P99468m973756m678777J024944J173228
36797A5878049k134203m77257K149930n88600k369217J824521L438513j455472
$$ plain form
36851 6997965 5747990 2369851 3656482 7619945 6645709 2344640 2729348 6527183
36843 6527183 5681190 1614982 2740597 7521342 7172087 3465818 5638377 11403270
36835 11403270 10602509 5884156 8575811 15840648 15117729 9622476 13852018 24945885
36827 24945885 26862651 22428264 29523031 45302560 50563026 51116156 71843762 105383870
36819 105383870 120537611 135900203 219258365 374226246 487403265 450815673 299905099
36812 299905099 165540662 114087233 102710041 79256720 50710030 40359873 39914942
36805 39914942 32521055 23443460 22532942 23332410 18358654 13679877 14704821 15878049
36797 15878049 13743846 13266589 15416519 14827919 12458702 14283223 17721736 16266264
36789A6266264j878457N321266O749368K90217K283476J3245346J2283168O76335
36781E5236983O758633K8661335K8067083R941100L9326910J25665673J60846647
36774D54504364N6458099j07353395j69893743j00843479j9765235j2057549l4373836
36767F6675226k3747353J772467J68030j4787948r717700M945717K178109q730352
36759A8756196m400547O876065M212473m856443p59025J0349619R695707K42813
36751D0116858k847270j350579n599703j0521343n985992J149542q85675o330741
36743G745097l553190K484539P21158m248911j802741L681018J741464l650268
36735C118166k159013K897259J580660l334462k331091K420358K025455j887014
$$ plain form
36789 16266264 14387807 19709073 26458441 26748658 29032134 42277480 54560648 55236983
36781 55236983 61995616 90656951 118724034 128665134 167992044 293657717 454504364
36774 454504364 510962463 403609068 233715325 132871846 113106611 101049062 66675226
36767 66675226 42927873 44700340 44868370 30080422 20362722 25308439 27486548 18756196
36759 18756196 14355649 21231714 25444187 20587744 19828719 30178338 39874045 40116858
36751 40116858 37269588 35919009 30319306 19797963 13811971 14961513 14075838 7745097
36743 7745097 4191907 6676446 7397604 3148693 1345952 5026970 6768434 3118166
36735 3118166 959153 3856412 5437072 2102610 -228481 2191877 4217332 2330318
36727B330318j360223K084793J386250j643752n35883K413080R34608k202717
36719C406474n01744L161413J978630j395821K1484L959800L452102M35913J929988
36710A6448239O517614P003596L155421K50063j568624n294726q059445n277360
36702A3174778n01308m09942l213489k510942O98044N32937k276979k104415P57359
36693D146043J191888q30855j050321K95639l92038k079382j006382J377771Q22063
36684B474426j449613j068867J064580P97765j081863o84409J148550P21791r96972
36675I25388m49763J198896M41592j283306l31501J625136O21652j564530m61333
36666G22231K336972J746604j416593j985195J55654N21088j229146j170945R04715
$$ plain form
36727 2330318 970095 3054888 4441138 2797386 2261503 4674583 5609191 3406474
36719 3406474 2904730 6066143 8044773 6648952 6670436 10630236 14082338 14518251 16448239
36710 16448239 22965853 29969449 33124870 33374933 31806309 26511583 18452138 13174778
36702 13174778 12673470 12263528 9050039 6539097 7237141 7770078 5493099 3388684 4146043
36693 4146043 5337931 4507076 3456755 3752394 3360356 1280974 274592 1652363 2474426
36684 2474426 1024813 -44054 1020526 1818291 736428 52019 1200569 1922360 925388
36675 925388 475625 1674521 2116113 832807 501306 2126442 2748094 1183564 722231
36666 722231 3059203 4805807 3389214 1404019 1559673 2080761 851615 -319330 585385
36657E85385J230379m95073p47256Q72019J198079j39362m24517L58300k85166
36648B152788j778504j210949Q01659R78773m42496k95968J345779J484943R5368
36639C131393j33659O25470j65774j873204j461143O05462R57042n06440o88674
36630D90473O98030Q33865n31737o09395R86757J507210J60340q19896n21655
36621B193992l75249o79344k47288N20174J20541q10994n07761L67264k7231q91705
36611c37601k31017J009090M82256j008848q83657L84745L12246p34889l36692
36602a344367J165361J262401J8928k54204N56024N80850n6670K38666Q12468
36593B979457j39090j568541j045741N95788N30976r23249j001073L42804N73880
$$ plain form
36657 585385 1815764 1320691 573435 1445454 2643533 2504171 2079654 2437954 2152788
36648 2152788 374284 -836665 -35006 943767 501271 205303 1551082 3036025 3131393
36639 3131393 2997734 3623204 3457430 1584226 123083 728545 1685587 1179147 490473
36630 490473 1188503 2022368 1490631 881236 1867993 3375203 3535543 2715647 2193992
36621 2193992 1818743 1139399 892111 1412285 1532826 721832 214071 581335 554104 -337601
36611 -337601 -568618 440472 922728 -86120 -969777 -585032 -272786 -1007675 -1344367
36602 -1344367 -179006 1083395 1102323 848119 1404143 1984993 1928323 2166989 2979457
36593 2979457 2840367 1271826 226085 821873 1352849 429600 -571473 -228669 345211
36584C45211n51595p90384J74919M63986q0069J45402Q90218M60849n86849j70993
36574C00695J253627J297242q7536p85470m86156o30586r82401j61620R84497
36565G02292M59924j020727j107404m6226O4019n64363m5801J144831R20538l08186
36555A98897l73028M95175L33259n13350j80655P20046J69917j067994p15158
36546i32891N03189J96656q16902P7337J856448J168497j392960j866299K29586
36537i77339J201599k16835j084567P906P07683k34014p39068L26411J023005
36528A4781J62034o16834j40270M22041K71747L01118O69452K30623q12405p95427
36518b93140K79884O11448o6068k14866K70214n0696r20985n70100P21421Q35655
$$ plain form
36584 345211 -206384 -996768 -821849 -357863 -437932 -292530 597688 1058537 471688 300695
36574 300695 1554322 2851564 2764028 1978558 1492402 861816 -120585 -282205 702292
36565 702292 1162216 141489 -965915 -1012141 -948122 -1512485 -1558286 -413455 507083 198897
36555 198897 -174131 321044 654303 140953 -39702 680344 850261 -217733 -932891
36546 -932891 -429702 -233046 -1049948 -972611 883837 2052334 659374 -1206925 -977339
36537 -977339 224260 7425 -1077142 -1069236 -361553 -595567 -1334635 -1008224 14781
36528 14781 176815 -440019 -580289 -158248 113499 414617 1084069 1314692 502287 -293140
36518 -293140 -13256 598192 532124 317258 587472 536776 -384209 -954309 -232888 602767
36508F02767k87022o22636K8112p7773q14849k89687J119990R95402n85546r72165
36498i03407K45900O74065k07049k78322O99980M35622j158574j257816O67330
36489a082271J564062J58183r21726n0044P64733N8757m75564L49761Q64402k296
36479A227997n77323J35662M23478o64073j250356j51574Q59764M12102p9937
36470C35740N16417P91960k37939r96979l63103J75012m45822o61247N93472J471778
36460A179289M02590j003493p78644J21928p5854p83390n18261L30647N76894
36451e48294M20327M65610J77174p60936j150677j77553R38067Q71864K42710
36442D78292J56212K67229j37805n94538m74729j97632j77898N6968O29303O84343
$$ plain form
36508 602767 315745 -306891 -278779 -356552 -1171401 -1461088 -341098 654304 68758 -903407
36498 -903407 -657507 16558 -190491 -468813 231167 666789 -491785 -1749601 -1082271
36489 -1082271 481791 639974 -281752 -331796 432937 491694 16130 365891 1230293 1227997
36479 1227997 650674 786336 1209814 545741 -704615 -856189 3575 415677 335740
36470 335740 852157 1644117 1406178 409199 46096 221108 -224714 -885961 -292489 1179289
36460 1179289 1581879 578386 -200258 -78330 -154184 -937574 -1455835 -1125188 -548294
36451 -548294 -127967 337643 514817 -246119 -1396796 -1574349 -636282 235582 478292
36442 478292 634504 901733 763928 169390 -305339 -502971 -680869 -623901 5402 689745
36432F89745p912l89824K3182K71331j76083m29007J5956K53481k68676o78628
36422f96435l21587J59427K20096K81137N03602L46347r6575m2755K94359j25013
36412E22603r94434q07983M32583R67956K43395k66256K00908N51426J43196j58105
36402H35289L3892p4656n07511k48451N04152L25570o61626p03470L39529N85033
36392D27751l56687n90456M50268Q63638r2019n53828L33394O92421m61040j114319
36382d00877J59366J515108R95984l12510n87152k68042m54197n55335J56004
36373B48349O53925m837p69087m61368K17935K88927K35033N25332L64699m91561
36363H07347p33568J27735N54815k66996p98696L2504P98076K30724m85983j05374
$$ plain form
36432 689745 681833 292009 315191 586522 410439 -18568 -2612 250869 -17807 -696435
36422 -696435 -1018022 -858595 -638499 -357362 146240 492587 396012 353257 647616 522603
36412 522603 -471831 -1279814 -847231 120725 364120 97864 298772 850198 993394 835289
36402 835289 869181 794525 287014 38563 542715 868285 206659 -496811 -157282 427751
36392 427751 71064 -519392 -69124 794514 702495 148667 482061 1174482 713442 -400877
36382 -400877 -241511 1273597 2269581 1957071 1369919 1101877 647680 92345 248349
36373 248349 902274 897437 128350 -333018 -115083 173844 408877 934209 1298908 807347
36363 807347 73779 201514 756329 489333 -309363 -276859 521217 751941 265958 160584
36353A60584L84206k1029j89688P82303J356138J69920j251339r68523J32836
36344E55408J64866m90640l37556L96904N90024M39487N37782K36537q38255j272473
36334a7916j51894Q48249P3092j151304p66425M80244N51527k96578l78722J84531
36324f25196L9683n51042l04735L97398J71257o46627n67869K79772M75799m6459
36314a378019j03273L53925K88017k52002j99815M62786O91745K58559j19845
36305B078k44672m07644l37790K52810O35735J29889m97809k63810K46508L493
36295d81212m93660k13045L69643K09066k14975J54003P24821K35647p22620n34776
36285i67108N47597P66438j02442m71494K24027O92474J48839m92211l45487J35868
$$ plain form
36353 160584 544790 523761 334073 1116376 2472514 2642434 1391095 422572 555408
36344 555408 720274 229634 -107922 288982 879006 1318493 1856275 2092812 1254557 -17916
36334 -17916 -169810 678439 751531 -399773 -1166198 -685954 -134427 -431005 -809727 -625196
36324 -625196 -585513 -1136555 -1441290 -1043892 -872635 -1519262 -2087131 -1807359 -1331560 -1378019
36314 -1378019 -1481292 -1127367 -839350 -1091352 -1291167 -828381 -136636 121923 2078
36305 2078 -242594 -650238 -988028 -735218 -99483 30406 -467403 -731213 -484705 -481212
36295 -481212 -974872 -1187917 -818274 -609208 -824183 -670180 54641 290288 -432332 -967108
36285 -967108 -419511 346927 244485 -227009 -2982 689492 838331 346120 633 136501
36275A36501J68665k33529n59816l95101L39229J056643P96898l74349r70516
36266c5375j24575Q66326M07914q58522j084815j05325N81099L44743M5230J93523
36256B30223K56516l3821j64317J11510L72433L23762O4611l55806p84465o62971
36246f42325J89302Q89359N88321j93405l82593j2149Q3273k25497l63987k13616
36236b83317j31077j13617L8733R4905j35949j93705K40033N49894J78439k91330
36226d6991j31659K05692k9220m30805k04610K93519K08540k04599q3991M01858
36216b2266L80585j21330l03258l4532J25163P5569J33721J51140j66514m16075
36206a97797j09414K89346Q3333l75846l15147O1799O0413j34600Q3110L85982
$$ plain form
36275 136501 305166 71637 -488179 -883280 -544051 512592 1309490 935141 -35375
36266 -35375 -159950 706376 1114290 255768 -829047 -934372 -353273 -8530 36700 230223
36256 230223 486739 452918 288601 400111 772544 1096306 1160917 805111 20646 -642325
36246 -642325 -453023 436336 1024657 831252 448659 436510 519783 294286 -69701 -283317
36236 -283317 -414394 -528011 -489278 -394373 -530322 -724027 -483994 65900 244339 -46991
36226 -46991 -178650 27042 -2178 -432983 -637593 -344074 -135534 -340133 -424124 -22266
36216 -22266 358319 236989 -66269 -100801 24362 99931 233652 384792 218278 -197797
36206 -197797 -307211 -17865 65468 -310378 -625525 -563726 -503313 -637913 -554803 -168821
36196a68821M3003n62647m15190L59713O35140R7588m20482m06846k28529j66392
36186a233463P823L67590O15045N83617L17894j71521o50975n62081J66157P00102
36176A40188L94932k60357m87695l20718j17808K06396O08046M65868l21926p23026
36166d16100j20595N09729J69894m54898k68304K59399K0215o48329n71237J67170
36156a353056M92555K79544L04148N60779L12485l28215m54226L3347K98452L6678
36146A82491k10387j71598j06703k8021K65543N18610L61951O8042M3879n914
36136I17893m43449p84726m98475r8774k61135n04837o2492N84869M76366j02858
36126g77618j73574J63087P2714l03477j02581N71749P85833M19702J99072K64805
$$ plain form
36196 -168821 -125818 -688465 -1103655 -743942 -108802 -11214 -431696 -838542 -1067071 -1233463
36186 -1233463 -1225640 -858050 -243005 340612 658506 486985 -163990 -726071 -559914 140188
36176 140188 535120 274763 -212932 -533650 -651458 -445062 162984 628852 306926 -416100
36166 -416100 -536695 -26966 142928 -311970 -580274 -320875 -300660 -948989 -1520226 -1353056
36156 -1353056 -860501 -580957 -276809 283970 596455 268240 -185986 -152639 145813 182491
36146 182491 -27896 -199494 -306197 -334218 -68675 449935 811886 879928 923807 917893
36136 917893 474444 -310282 -808757 -907531 -1168666 -1673503 -1735995 -1151126 -674760 -777618
36126 -777618 -951192 -788105 -715391 -1018868 -1121449 -549700 236133 655835 854907 1119712
36116A119712J38046q6127O6559K68625j64718q51517q04791j29431J90331J0010
36106b43301M3515L26727K06664k11876j57265K72119J97029l49974l59235L37799
36096F2202O66833O2493o90880p59810k91252J93429M68372M19987M5643k31689
36086e4672q517L73494K99891j09849k85461k07527k25162k02583J81086N99748
36076C60448N19604J31209p9016k27313n49368o14211q7634L76004J58784j42249
36066a53742J76189M90302L717n57118j48265N16290R7270q36501o43278M52948
36056f02188O59448k63230o39665J25965O07476n516n55729p8295O06192M79802
36046C34260o1063j93218K889R6870J43140K34600J29746j48959j98185k9181
$$ plain form
36116 1119712 1257758 1171631 1238190 1506815 1342097 490580 -314211 -443642 -253311 -243301
36106 -243301 -199786 126941 333605 121729 -35536 236583 433612 83638 -275597 62202
36096 62202 729035 791528 100648 -659162 -950414 -756985 -288613 131374 177017 -54672
36086 -54672 -63189 310305 610196 500347 214886 7359 -217803 -420386 -239300 360448
36076 360448 880052 1011261 932245 704932 155564 -458647 -546281 -170277 -11493 -153742
36066 -153742 22447 512749 516466 -40652 -188917 327373 424643 -411858 -1055136 -602188
36056 -602188 57260 -205970 -845635 -719670 -112194 -117710 -673439 -751734 -145542 334260
36046 334260 273197 79979 82868 179738 322878 557478 687224 538265 340080 310899
36036C10899p7394k68690j09710K10013j1154o09383o36923j346L18283l6538
36026i11943k55694J17712M39149K14953j08633j10354m2877n5701J73275N94790
36016E4677O01687J06056j79881O5701K60659j7425l68228l51212j07021J11050
36006A76063K68120K31505j07772l37897J1216N27756L82300l03495n90517k23268
35996C4011R5589k1585k12167k87151m75441o22422k42003M74844P38798L75534
35986a41993j7018j42273k13970j51207L08017P37473M57663j94403k67464J76242
35976E51067J72792l99168o22305k15803N3454j20835j06096K94811L93970j1216
35966i329j43376L49936P02982L17495l11387n03592l22422j35862m5847q4355
$$ plain form
36036 310899 233505 -35185 -144895 65118 53964 -555419 -1192342 -1193688 -875405 -911943
36026 -911943 -1167637 -1049925 -610776 -395823 -504456 -614810 -657687 -713388 -540113 54677
36016 54677 656364 762420 582539 648240 908899 891474 523246 172034 65013 176063
36006 176063 444183 675688 567916 230019 241235 768991 1151291 847796 257279 34011
35996 34011 129600 108015 -104152 -391303 -866744 -1489166 -1731169 -1256325 -517527 -141993
35986 -141993 -159011 -301284 -515254 -666461 -358444 379029 836692 642289 374825 551067
35976 551067 723859 324691 -297614 -513417 -459963 -580798 -686894 -392083 1887 -9329
35966 -9329 -152705 197231 900213 1217708 906321 402729 80307 -55555 -101402 -185757
35956a85757k59972k67559J17327M16075Q6408l93143j35108O26527Q12832K13649
35946A031279l23259l75807l52077m19230k91554q4292j47483j42436M29426R77639
35936C02206N59090l46100m31982K02986K31015n03710p02575M7428O03509L51011
35926C12878P1649J99239N0542n46962o30213J19344O03445J32663m82820m68596
35916f38831k64522l51405k81472K55904O37705M05303P2678J41966L25952K95146
35906E98424J98657N9170l05722n42658j08623N50854M92701o1186q8444K70589
35896A063762m6851q01391n99620M83624P45452j70787n63836K71760P64382m0842
35886A105653p44363j91587M74104N4705m91986J0294O50425J22649q16542p01658
$$ plain form
35956 -185757 -445729 -713288 -595961 -179886 -93478 -486621 -621729 4798 817630 1031279
35946 1031279 708020 332213 -19864 -439094 -730648 -814940 -962423 -1104859 -675433 302206
35936 302206 861296 515196 83214 286200 517215 13505 -689070 -641642 -38133 312878
35926 312878 384527 583766 634308 87346 -542867 -423523 179922 312585 -170235 -638831
35916 -638831 -903353 -1254758 -1536230 -1280326 -642621 -237318 -164640 -22674 303278 598424
35906 598424 797081 856251 550529 7871 -100752 450102 942803 881617 793173 1063762
35896 1063762 1016911 215520 -384100 99524 844976 674189 110353 382113 1146495 1105653
35886 1105653 361290 169703 643807 698512 206526 216820 867245 989894 173352 -528306
35876e28306P8338J64198l09716j72536N63012Q10309K78870l38680o41013o69574
35866g65098k78311M64756P97385K70274l73785l12546R2730J21018n2329L6550
35856F44J11985j84834m05655j02804K58891J68435o865R5387o209n80875q19399
35845a471299j46695O00133M86480J406M6801L62871K44838o1504J6304J83129
35835B62464l1739k12076P7476K37536k66155o63464j34224N88350L77330l32377
35825i6879l48236K12920L31475J3769J00955N01409L09706m38046p02912j82492
35815b98331K71090J10084k15181k02620L0237J89023J80601n597k37730j95328
35805c73752J40361K71214n8601l52619j49405K15756K15528o3694k83147m11544
$$ plain form
35876 -528306 -449968 -285770 -595486 -768022 -205010 605299 884169 545489 -95524 -765098
35866 -765098 -1043409 -578653 218732 489006 115221 -197325 -104595 16423 -35906 644
35856 644 112629 -72205 -477860 -580664 -321773 -153338 -160203 -64816 -71025 -651900 -1471299
35845 -1471299 -1617994 -1017861 -531381 -529975 -483174 -120303 124535 63031 79335 262464
35835 262464 230725 18649 96125 333661 67506 -595958 -730182 -141832 235498 -96879
35825 -96879 -445115 -232195 99280 113049 214004 715413 1025119 587073 -115839 -298331
35815 -298331 -27241 82843 -132338 -334958 -304721 -115698 64903 59306 -178424 -373752
35805 -373752 -233391 37823 -20778 -373397 -522802 -307046 -91518 -155212 -438359 -849903
35795h49903m06514m3034M45912L92846j43662k39171L29146N63473j2814m35476
35785c99197l5653L20423j06937m48045J57769P78969K20236p68878o60974L13753
35775f28534O83123J82092j64668j3957R784k10007j29893K24175K73135K4606
35765B49856l3553K7850j80870l80911n7757M30440L46456j40616k91641o6318
35755i7064M1969L0571J53526J27487l19963o14788j70671M89040N60253K70323
35745D70683K06902R5362m58530q05244k76926L95637K28376k33199O0132O35052
35735C18245L55549l72581k80060M00488L66202l11197l56449K68939L15708l54823
35725C50021n36607k8651j9396p32552q21353K65392J249541J093423L96490N062
$$ plain form
35795 -849903 -1256417 -1299451 -853539 -460693 -604355 -843526 -514380 49093 36279 -399197
35785 -399197 -434850 -114427 -221364 -669409 -511640 267329 487565 -281313 -942287 -628534
35775 -628534 54589 236681 72013 58056 67840 -142167 -272060 -47885 225250 249856
35765 249856 216303 244153 63283 -317628 -375385 55055 401511 260895 -30746 -97064
35755 -97064 -55095 -24524 129002 256489 -63474 -678262 -848933 -359893 200360 470683
35745 470683 677585 772947 314417 -490827 -767753 -372116 -143740 -376939 -316807 318245
35735 318245 673794 301213 21153 421641 787843 476646 120197 389136 704844 350021
35725 350021 -186586 -215237 -234633 -967185 -1788538 -1523146 -273605 819818 1216308 1221370
35715A221370j98283m15625l10829O4616P3286k36848l6482O40248O50115l02513
35705A149055r89583o12405N3501K09442K63385O45427P78691K25686l31510k44284
35695A147405J2721j79757m92741m09065j71213j61479j95463j39079l16274o38063
35685a543008l42471O63557J262324P50008n3506k18789j40663m89012p72345
35676h83905k49056N46664N77140J7110j63221J06167R5912j91895m089O53019
35666E03846Q08536Q4504o70292o99030l47584k62220l50322j57515K42235L80197
35656d67645J57874p2120q9305j5976M2968J60615K93395J90608j80351l95229
35646c75166q1233M94148P07177L88284l0550j75632j27797q8501p1090o7766
$$ plain form
35715 1221370 1023087 607462 296633 361249 434535 197687 161205 801453 1451568 1149055
35705 1149055 159472 -452933 -399432 -189990 73395 718822 1497513 1723199 1391689 1147405
35695 1147405 1160126 980369 487628 78563 -92650 -254129 -449592 -588671 -904945 -1543008
35685 -1543008 -1885479 -1221922 40402 790410 736904 518115 377452 -111560 -883905
35676 -883905 -1132961 -586297 -9157 7953 -155268 -49101 46811 -145084 -149173 503846
35666 503846 1312382 1396886 726594 27564 -320020 -582240 -932562 -1090077 -847842 -467645
35656 -467645 -309771 -381891 -471196 -487172 -444204 -283589 9806 200414 20063 -375166
35646 -375166 -456399 37749 744926 1133210 1102660 927028 799231 710730 639640 571874
35636E71874j41820k13068j28379l4594k17513m85371l06431K72138N23468J38546
35626b1150k83793k10428R3022K41442L74045N78512M46707j52902n95001m56875
35616A3579k05747k50056j73298K79802M12129k08979o91113j99914M79332J85426
35606c58839n87312n17592K72284N26635P1061r9725J98837J15718m01734l61631
35596a142298L77704O79997Q3025m04028p5604L39231O7069m28841l63999J59590
35586g08154N76544O67706M01544k36185q23663p30094j05251K17322N5918J12479
35576e71834N94187P56055K48616k42058k38093k05212m36680l75124K09757N14680
35566B54294N4753l64792l8973L03329k33544r75858o27867N76256J127142M72881
$$ plain form
35636 571874 430054 216986 88607 54013 -163500 -648871 -955302 -683164 -159696 -21150
35626 -21150 -304943 -515371 -422349 -180907 193138 771650 1218357 1065455 470454 13579
35616 13579 -192168 -442224 -615522 -335720 76409 -132570 -823683 -1023597 -544265 -358839
35606 -358839 -946151 -1463743 -1191459 -664824 -593763 -693488 -494651 -378933 -780667 -1142298
35596 -1142298 -764594 -84597 -1572 -405600 -481204 -141973 -74904 -503745 -867744 -708154
35586 -708154 -131610 536096 937640 701455 -122208 -852302 -957553 -740231 -684313 -571834
35576 -571834 22353 778408 1027024 784966 546873 341661 -95019 -470143 -260386 254294
35566 254294 309047 -55745 -94718 208611 -24933 -1000791 -1628658 -1052402 74740 547621
35556E47621l48577m16957r2756j06318l90857l78415N6148M72548M92992J96503
35546C1932q7346j73852j38037j04628o1476N1523J98032L14614L86007L20668
35536G37437j7353m52646n04698q2355K05928q5604m64838k38379L40450M90248
35526g1810K11284J94624N05144M31982j93811n81562k38893K75201L20912J02014
35516I55085Q2770J47465o6046m59034o14589l41955K34245P96335Q69063J90906
35506A794245p61260j124137p23058k52673j88706j72143J87206N50885M14967
35497b74674m8843k70283r9873J26945J55549N9691L1285J71383M05404M99013
35487G55597K93678n2584k50406k59546k30951j69504j284J21996j47k05660j67034
$$ plain form
35556 547621 199044 -217913 -310669 -416987 -807844 -1186259 -1130111 -657563 -164571 31932
35546 31932 -55414 -229266 -367303 -471931 -533407 -481884 -283852 30762 416769 737437
35536 737437 720084 267438 -237260 -319615 -113687 -199291 -664129 -902508 -562058 -71810
35526 -71810 139474 334098 839242 1271224 1077413 495851 256958 532159 853071 955085
35516 955085 1037855 1185320 1119274 660240 45651 -296304 -62059 734276 1603339 1794245
35506 1794245 1032985 -91152 -814210 -1066883 -1255589 -1427732 -1240526 -689641 -274674
35497 -274674 -323517 -593800 -693673 -566728 -411179 -351488 -320203 -148820 256584 755597
35487 755597 1049275 996691 746285 486739 255788 86284 85000 206996 206849 1189 -165845
35476a65845O7513J69830P7251k5541j46409l84331n24497l18431k8916m6550
35466a325926j12815L01681R27718Q95269P9895o35949o52736l52803k07585k0714
35456a103965M61308Q65181P06173J67235j48001l135K89409L23585K2546l04949
35446A275387l04539o9160j05561n75058q80270m42872M00237Q31905O42427K73959
35436A046455N30k57576m52330m19639k74111k01272m4761L07429M47771P8159
35426B30655k60528M4826N42885L55367l42044n90209k00700J28277J24973J54788
35416A88290J77438k21801p15921m68522L70306P10506K71171n3137J51544J99810
35406F09684k27333l98684P7464M73520K51509m1533O5655N0576n17752j000703
$$ plain form
35476 -165845 -98332 71498 148749 123208 -23201 -407532 -932029 -1250460 -1279376 -1325926
35466 -1325926 -1438741 -1137060 -209342 685927 765822 129873 -522863 -875666 -1083251 -1103965
35456 -1103965 -642657 222524 928697 1095932 947931 944796 1234205 1557790 1580336 1275387
35446 1275387 970848 901688 796127 221069 -659201 -1102073 -701836 130069 772496 1046455
35436 1046455 1046985 789409 337079 -82560 -356671 -557943 -602704 -295275 152496 230655
35426 230655 -29873 14953 557838 913205 571161 -19048 -219748 -91471 33502 188290
35416 188290 365728 143927 -571994 -1040516 -670210 40296 311467 258330 409874 609684
35406 609684 382351 -16333 61131 534651 786160 744627 810282 860858 343106 -657597
35396f57597p13504p3789J63351Q4229J76382L46633K11556j16263k49266j51746
35386i80014r594J45322K84516K62240J08833L561j28789m10702m60117J28125
35376a056619Q18465P03565K8340j02625L78527L72148l47038o15371L062K89567
35366D72021n13421j263378p88993K12074M96268K61064L51601N50377K24601
35357B214j77146J16924O01885K48950o29976q45624l20430m8503k42240q7290
35347a381236N81764Q40151K39360m29402m13407m8664K491j99774j66714J64214
35337h11217M04039L24064J08679L3621J09936J40679P6137J03200K40730J37951
35327H67819l46351o66397l07887K59099J76407l87804m46842J49347M48762O1068
$$ plain form
35396 -657597 -1371101 -1444890 -1281539 -1197310 -1020928 -674295 -462739 -579002 -828268 -980014
35386 -980014 -989608 -844286 -559770 -297530 -188697 -185136 -313925 -724627 -1184744 -1056619
35376 -1056619 -238154 465411 493751 391126 769653 1141801 794763 179392 182454 472021
35366 472021 -41400 -1304778 -2093771 -1881697 -1385429 -1124365 -772764 -222387 2214
35357 2214 -174932 -58008 543877 792827 162851 -682773 -1003203 -1051706 -1293946 -1381236
35347 -1381236 -799472 40679 280039 -149363 -562770 -611434 -608943 -808717 -975431 -811217
35337 -811217 -407178 -83114 25565 59186 169122 309801 385938 489138 729868 867819
35327 867819 521468 -144929 -452816 -193717 -17310 -405114 -851956 -702609 -253847 -192779
35317a92779j54402L89386R50769O61924j81789p82306r16668o68843k702O77969
35307b19441N07729m98605j053254m12584M26359L35400j89039q5714M18215M21822
35297c49112O1671J12650M18114K12906l46523m18481p309J21428j02641l4219
35287c31516L30062L09589j13766j96376J91192L18321o3320l02428o8856J18936
35277A91838k9645k4697L78260N54247N0248n30823m19209J18148K32508j94105
35267C26770m65082k13023Q1056q5676m13330k44437L81070O62293J53907n39112
35257c55564n62539L8387M93778M14637J11453r6864k34953l01632j62139J13777
35247e41659L26405N15556P01891M77970l54847r87937n03548N57618P81474M6782
$$ plain form
35317 -192779 -347181 42205 992974 1654898 1473109 690803 -225865 -894708 -897410 -219441
35307 -219441 288288 -210317 -1263571 -1676155 -1249796 -914396 -1103435 -1189149 -770934 -349112
35297 -349112 -287441 -174791 243323 456229 109706 -308775 -316084 -194656 -297297 -331516
35287 -331516 -1454 308135 194369 -2007 189185 507506 444186 141758 72902 191838
35277 191838 162193 137496 515756 1070003 1120251 589428 170219 288367 520875 326770
35267 326770 -138312 -351335 -270279 -355955 -769285 -1013722 -632652 29641 183548 -355564
35257 -355564 -918103 -879716 -385938 28699 140152 43288 -191665 -493297 -655436 -541659
35247 -541659 -215254 300302 1002193 1480163 1125316 137379 -366169 191449 972923 1019705
35237A019705l36121J26406L41365l30390q87814m50180K50179K38791r8416K3325
35227a03150L28756K25222L6151K50756M12748j5992n01914l65231n5148k65750
35217e3552n74770k58800K87339K84938J3432J46810L41665o3015n75387l14024
35207g65364L01751K13490l62183l14902L68347O36159K39657k3261J19377J12918
35197E25989j36530j22699O2388k02597p20712n92415J77287N53087J74031j26535
35187d08706J85533N43636L52520j79368o16377p92908n22454K73524R77757P46283
35177E59440k48691r03360o36559O6302N92062P85448N64853j02529p31590o86471
35167g41095j04802L11096L64472L99607M22833J51542j74004n3024K66052P7746
$$ plain form
35237 1019705 683584 809990 1151355 820965 -66849 -517029 -266850 -28059 -126475 -103150
35227 -103150 225606 450828 486979 737735 1150483 1134491 632577 267346 212198 -53552
35217 -53552 -628322 -887122 -599783 -314845 -301413 -154603 187062 124047 -451340 -765364
35207 -765364 -463613 -250123 -612306 -927208 -558861 77298 316955 293694 413071 525989
35197 525989 389459 266760 329148 126551 -594161 -1186576 -1009289 -456202 -282171 -408706
35187 -408706 -223173 320463 672983 493615 -122762 -915670 -1438124 -1164600 -186843 559440
35177 559440 310749 -592611 -1229170 -1162868 -570806 214642 779495 676966 -54624 -741095
35167 -741095 -845897 -534801 -170329 229278 652111 803653 629649 576625 842677 920423
35157I20423n14984o80309k01214K92003M24384L86379J85001l45496q22105o91293
35147a047211k70772k84944m75034L4859J018054J219823L22959n50899n98254
35138f31419k67694q2784J65280N68581O26422J60365k75777l22473k38421j36749
35128d34669K01767N34097K67842l84885n04963J7136K55331j59351m78203k57097
35118i42995n7735k33904k68205J10624L43269J63885J43194N09030N96280J08297
35108D71740k49646o6451M5484k56640k68980L77254P73618J91338o17843o67064
35098b67190k81658k52726l54350M6283O28605O32514J97859K5009J41462R3317
35088F09125l6430J37472L85403K00562k16090k72004m6753r7229l85136l34536
$$ plain form
35157 920423 405439 -274870 -476084 -184081 240303 626682 811683 466187 -355918 -1047211
35147 -1047211 -1317983 -1602927 -2077961 -2043102 -1025048 194775 517734 -33165 -631419
35138 -631419 -899113 -981897 -816617 -248036 378386 538751 262974 -59499 -297920 -434669
35128 -434669 -232902 301195 569037 184152 -320811 -303675 -48344 -207695 -685898 -942995
35118 -942995 -1000730 -1234634 -1502839 -1392215 -1048946 -885061 -741867 -232837 363443 471740
35108 471740 222094 155643 201127 -55513 -324493 52761 826379 1017717 399874 -267190
35098 -267190 -548848 -801574 -1155924 -1109641 -481036 151478 349337 374346 515808 609125
35088 609125 572695 710167 1095570 1296132 1080042 808038 761285 664056 278920 -55616
35078e5616J24298M43135L80242K39757J44300j73802o96482q88992m32378K47981
35068f67557M88387J93758j18592l1965K25584J38147k55854k96704K72807P14665
35058F62676L18981l98764l97350K40585M35904j31014n84295l93524j19019j66228
35048e32048k5216N47847P41557J9499p28716m51815M03527O42273J49512k26832
35038E39588k24977l51129o46053m77203K76315Q33599O39103J25244l6787J15866
35028G93566P9793k66404n11202l46022j3132M1905j81988k38314N8026K94323
35018b89449J28926q8635J01741L91329J56980l78353l57831K93581O45123K09636
35008H13048l38810l25497n6120o1470j66093j3737J41522n5359k63710M7198
$$ plain form
35078 -55616 68682 511817 892059 1131816 1276116 1102314 405832 -483160 -915538 -667557
35068 -667557 -179170 14588 -104004 -135969 89615 227762 -28092 -324796 -51989 662676
35058 662676 981657 582893 185543 426128 862032 731018 146723 -246801 -365820 -532048
35048 -532048 -557264 -9417 732140 751639 22923 -428892 -25365 616908 766420 539588
35038 539588 314611 -36518 -682571 -1159774 -883459 -49860 589243 714487 677700 793566
35028 793566 873359 606955 95753 -250269 -263401 -221496 -403484 -641798 -583772 -289449
35018 -289449 -160523 -249158 -147417 243912 400892 22539 -335292 -41711 603412 813048
35008 813048 474238 148741 92621 31151 -134942 -148679 -7157 -62516 -326226 -279028
34998b79028O27780P26597J65246m77536o60153l86034P07J72258M1792j62992
34988b31363j76205r2012j95889l98347l07137P4045K83868J62999N6356J00732
34978g22953R737k09588r8337L74383N72067K37395m3694Q9738J16898l15607
34968A0039n67692p0747N47292L94548k22584l46983L3400P3925m16576o63910
34958a229288k24220L41521L67151k1817k42115n5086K59446L29035J11358q7165
34948d51180l2146P4489r1484l47552j65941M37455P52663L74369k26381m82383
34938a58091m89100n18550l67800J71736O53030M99792p0295l03322N6503N31149
34928E052N99496J96394l50256n51109j32788N28129O57772P4546m84145l99763
$$ plain form
34998 -279028 348752 1075349 1240595 763059 102906 -283128 -282421 -110163 -68371 -231363
34988 -231363 -407568 -499580 -695469 -1093816 -1400953 -1326908 -1043040 -880041 -823685 -722953
34978 -722953 -713216 -922804 -1021141 -646758 -74691 162704 119010 208748 325646 10039
34968 10039 -557653 -628400 -81108 313440 90856 -256127 -222727 -148802 -565378 -1229288
34958 -1229288 -1453508 -1111987 -744836 -766653 -1008768 -1063854 -804408 -475373 -364015 -451180
34948 -451180 -483326 -408837 -500321 -847873 -1013814 -576359 176304 550673 324292 -158091
34938 -158091 -647191 -1165741 -1533541 -1361805 -708775 -208983 -279278 -582600 -526097 5052
34928 5052 604548 800942 450686 -100423 -233211 294918 952690 1027236 543091 143328
34918A43328l7012l4854k36036p1986L30505L03997j96680m44939q6309L08840
34908b1146J35878l68347n44179k35288J45519L02134L61341M60850M28981J24498
34898G90241j66751p8567J91105Q6339l90842n53680p8482M21769L12484j39158
34888C94458l28294k70203l13508l88701k97180k60076l71063q9344P52265J132637
34878c9009L18917n33124P0859J324979J091195o31374j514889n37621N51863
34869A01796K51790m76240l08593J46922j62327n99323q3203P47409N43796m16149
34859b54122p26522j28201L84049L47122K12989K02502J01638O461J50815K45342
34849E42073l3125k90419j11470L0140l89427p90053l60983M53133O14464J83240
$$ plain form
34918 143328 106316 71462 -164574 -236560 93945 397942 201262 -243677 -329986 -21146
34908 -21146 114732 -253615 -797794 -1033082 -887563 -585429 -224088 236762 665743 790241
34898 790241 623490 544923 736028 822367 431525 -122155 -200637 221132 533616 394458
34888 394458 66164 -204039 -517547 -906248 -1203428 -1463504 -1834567 -1923911 -1171646 -39009
34878 -39009 279908 -253216 -182357 1142622 2233817 1602443 87554 -450067 101796
34869 101796 353586 -122654 -431247 -284325 -446652 -1045975 -1129178 -381769 162027 -254122
34859 -254122 -980644 -1108845 -724796 -377674 -164685 37817 139455 145916 296731 542073
34849 542073 508948 218529 107059 137199 -252228 -1042281 -1403264 -950131 -335667 -152427
34839a52427L1464K45333J71075k02871k51056M4223J04985r0410m2370J92724
34829E0670R3247k76089l89257k69503k95657k44826L00236Q40390N40659k54721
34819I5149m25587J06566L44659j8557k31749P96O0207k66803l49831M6799L16572
34808c21779J67424N8120J32716q9935n65781m84114L01470P72604L18690k69462
34798A9953j21823L60029L28557j07846k24826Q8604K94076J29473j09341j12520
34788E44336N9745J09209j53242n08104m44141J67297P07352N75682R6540Q817
34778A163491K39497M5400o31271r11880l39814L74044L92516j28025m29160j92765
34768d17967K29150L44167J5176l98265l57545J90554O21983M31439n2922k23763
$$ plain form
34839 -152427 -120963 124370 295445 92574 -158482 -114259 -9274 -99684 -142054 50670
34829 50670 143917 -132172 -521429 -790932 -1086589 -1331415 -1031179 -190789 349870 95149
34819 95149 -330438 -223872 120787 102230 -129519 -128723 -68516 -335319 -685150 -638351 -321779
34808 -321779 -154355 -96235 36481 -53454 -619235 -1103349 -801879 -29275 289415 19953
34798 19953 -101870 258159 586716 478870 254044 342648 636724 766197 656856 544336
34788 544336 604081 713290 560048 51944 -392197 -224900 482452 1058134 1154674 1163491
34778 1163491 1402988 1448388 817117 -94763 -434577 -60533 331983 203958 -225202 -417967
34768 -417967 -188817 155350 170526 -227739 -585284 -394730 227253 658692 605770 382007
34758C82007j30563k10464l86355k37301J16623J50939j29907k22825k4138J23831
34748e68153K00642M44280N82959Q7455p68104j047982m86061J94430M10424L26414
34738f23696K28348J21164O0873J26181M7456l75948o35736j93428M32938L67112
34728d44736o9859J52088Q44485P37928l09098r09471l87171K15932L0810k99255
34718d38347l7777L05068Q5891k30273l2426K60564O5465k22996r895L71046L14246
34707D30566J4086n8243n3900k26404k24042J93344M40460M0043m18194k05794
34697f8078L17518L77136N2393j13315j61557l72760m58485j21431J55079q0587
34687d74087k54967K75635Q80641N54395l37122o10234k13921j40520n54491n58229
$$ plain form
34758 382007 251444 40980 -345375 -582676 -466053 -315114 -445021 -667846 -691984 -568153
34748 -568153 -367511 76769 659728 747183 -20921 -1068903 -1554964 -1360534 -950110 -623696
34738 -623696 -395348 -274184 -213311 -87130 -39674 -415622 -1051358 -1244786 -811848 -444736
34728 -444736 -514595 -362507 481978 1219906 910808 1337 -385834 -169902 -139092 -438347
34718 -438347 -476124 -171056 -85165 -315438 -347864 -87300 -21835 -244831 -254726 116320 430566
34707 430566 444652 386409 332509 106105 -117937 75407 515867 555910 137716 -68078
34697 -68078 249440 626576 678969 565654 404097 31337 -427148 -548579 -393500 -474087
34687 -474087 -729054 -453419 427222 981617 644495 34261 -179660 -320180 -874671 -1432900
34677a432900Q1363M68978J77535m4034L29119O70664L36768k22572k29667K11216
34667C46470L80058J5620m37278m51717K5326M99869L67312l39306p78334l10548
34657f82528N20178O61187N2726l76166j99254j0621k34238m10649j39505J60420
34647f58450P7457K5566M43810P91532K91267o83912r68096k70537M48775M06833
34637i5755m2294j97460l0760Q8800J38531K75106K80783j14849n26337k91031
34627e15266M04663N75596j05092o72625k40088O49790Q15656J29056m99230n74808
34617c2348m43270k95488J41194O75045N24475l38725p22648J14657J147797R26929
34607A697618l34600j113906p16674N7097L43179K38759J75883J65962O5447m1679
$$ plain form
34677 -1432900 -1351537 -882559 -705024 -749058 -419939 250725 587493 364921 135254 346470
34667 346470 726528 742148 304870 -146847 -121521 378348 745660 406354 -371980 -682528
34657 -682528 -162350 498837 551563 175397 -23857 -34478 -268716 -679365 -818870 -658450
34647 -658450 -580993 -555427 -111617 679915 971182 287270 -680826 -951363 -502588 -95755
34637 -95755 -138049 -335509 -366269 -277469 -138938 136168 416951 302102 -224235 -515266
34627 -515266 -110603 464993 359901 -312724 -552812 96978 912634 1041690 542460 -32348
34617 -32348 -475618 -771106 -629912 45133 569608 230883 -491765 -377108 770689 1697618
34607 1697618 1363018 249112 -467562 -410465 -67286 171473 347356 513318 578765 537086
34597E37086j01644k47880m13900k60919K21616N04856K39452k26002l88457k62405
34587c98197j29598K888K23613L02969J1072l32006k01623K99978N33289K71642
34577E84027l0538o3439j37018m95590p14316l16801L69481N80326J52853l71489
34567d42504n62022m39732q9735M08072O49741K37167m17653l85890L94625Q36526
34557A88595K78905m63517l51268K82954L56535k04558m38083N5464N49512L79553
34547F34092j66188m22707j94540K12108L53565m4250p28518r34599k54564O53190
34537h92411Q24848K74717k08729l27543l98971l66822J51555P64846N30375m02965
34527e1100o69409K32143R88144M18348p50784j074640m26771K63593N57371O18284
$$ plain form
34597 537086 435442 187562 -226338 -487257 -265641 239215 478667 252665 -135792 -398197
34587 -398197 -527795 -524907 -301294 1675 12747 -319259 -520882 -220904 312385 584027
34577 584027 553489 490050 353032 -142558 -856874 -1173675 -804194 -223868 -71015 -442504
34567 -442504 -1004526 -1444258 -1533993 -1125921 -476180 -239013 -656666 -1042556 -647931 188595
34557 188595 467500 3983 -347285 -64331 292204 87646 -350437 -294973 254539 634092
34547 634092 467904 45197 -149343 62765 416330 372080 -356438 -1291037 -1545601 -892411
34537 -892411 -67563 207154 -1575 -329118 -728089 -1094911 -943356 -178510 351865 -51100
34527 -51100 -720509 -488366 499778 918126 167342 -907298 -1334069 -1070476 -513105 105179
34517A05179L71383k38754n65080k4492P44936O49997j62234n58486k23716M5875
34507A44608j21965j40944K65292M63911N5884l99139l52112q9765k2789M6624
34497a50395L10771L45053j49827n98686l47112K66210M66756K88912L27852M86872
34487A246406N6825q74947j184006l24625P07544P22964k345k76731J89841N19987
34477G80913J75622k81216k47893k7386j29508k97316j5323M26834K73744m22647
34467B35824p52746k88156L23494L96112J51188J71794M28494M17114K018m03315
34457F81821m34964j81107M1004Q4434Q1007J98575L22232J27427l80751o34808
34447i5130j93374N01265N91648j6075n65259n92899m38982m05211j94790L61344
$$ plain form
34517 105179 476562 237808 -327272 -351764 393172 1043169 880935 322449 98733 144608
34507 144608 22643 -118301 146991 610902 666786 267647 -84465 -174230 -197019 -150395
34497 -150395 160376 505429 355602 -243084 -590196 -323986 142770 431682 759534 1246406
34487 1246406 1303231 428284 -755722 -1080347 -372803 350161 347816 71085 260926 780913
34477 780913 956535 675319 427426 400040 270532 -26784 -42107 384727 658471 235824
34467 235824 -516922 -805078 -481584 -85472 65716 237510 666004 1083118 1085136 681821
34457 681821 246857 65750 106754 191188 272195 470770 793002 920429 539678 -95130
34447 -95130 -288504 212761 804409 788334 223075 -369824 -808806 -1214017 -1408807 -1047463
34437a047463P31306M61050k5812q7695J30261R2333r5783R7905N61783N64828
34427A382713q7734o84564o07379j07736J81860O8011j54629j78887L1127K70162
34417A12944K82466L7266j83774j23739Q9941J35928k5497j36538o4969M5473
34407A69501O5991N8202R5251J17998N3864n1928q0731M4057K65604L73491J73210
34396A284510k39186m92609l49863N538K03120R7121j55966l14838k55720o0568
34386b78461N5937K2722O0400L30816N41928K95990k06102l34974Q74J49522k80530
34375C58122p91485p40344k00615L31332O08838N75384J37542m77584o24170r9460
34365i22440L59146J15436l02730l2472O25003N99528j82721n77187J8296P14437
$$ plain form
34437 -1047463 -316157 144893 119081 31386 161647 253980 158197 256102 817885 1382713
34427 1382713 1294979 610415 3036 -104700 77160 145171 -9458 -188345 -157218 112944
34417 112944 395410 432676 248902 125163 215104 351032 325535 188997 124028 169501
34407 169501 235492 293694 388945 506943 560807 508879 428148 472205 737809 1111300 1284510
34396 1284510 1045324 552715 202852 208390 411510 508631 352665 37827 -217893 -278461
34386 -278461 -222524 -199802 -139402 191414 733342 1029332 823230 488256 489130 638652 358122
34375 358122 -433363 -1173707 -1374322 -1042990 -434152 141232 278774 -198810 -822980 -922440
34365 -922440 -563294 -447858 -750588 -783060 -158057 441471 258750 -318437 -300141 414296
34355D14296M56799m50701q07076j13527Q68425J065828K62592p08753q72333
34346A15550k01993L61470J36853l89030l13569L20408O12530J83585l12299k40064
34336B73441J48029K54852Q223k45671l45636l82640l85094k94814j44971k9010
34326a143291K5144M2278Q6983K81707O17765P51901L22151m60776q92287n87979
34316i56404R5784N89266P09418N54310J80122l01188n67364l80503P3102L73175
34306C69718L03664l9197m13015n51721l13769J07033K96317J29474l0964J29660
34296a2800L64827K25050k00188l17317J36816O58428N81446j04561p94331j003966
34286d66596p68909l23041K31305P17833P05985J9684p07640n91689K75029P70709
$$ plain form
34355 414296 871095 420394 -386682 -500209 368216 1434044 1696636 987883 115550
34346 115550 -86443 275027 411880 22850 -290719 29689 642219 825804 513505 273441
34336 273441 421470 676322 684545 438874 93238 -289402 -674496 -969310 -1114281 -1143291
34326 -1143291 -1118147 -1075869 -988886 -707179 -89414 662487 984638 523862 -368425 -956404
34316 -956404 -860620 -271354 438064 992374 1172496 871308 303944 -76559 -3457 369718
34306 369718 673382 634185 221170 -330551 -644320 -537287 -240970 -111496 -142460 -12800
34296 -12800 352027 577077 376889 59572 196388 854816 1436262 1331701 537370 -466596
34286 -466596 -1235505 -1558546 -1327241 -609408 96577 116261 -591379 -1183068 -908039 -137330
34276a37330K44697n30488m75664K25554M89357P324l97391j51023K69837K62758
34266a92369K6361K5556J42086J738k62090k29722O8944K50359K40740K55192
34256C26795K36290n9253m35659l71555J22107L72728J9495m30957l71964M1386
34246e50587K40388J07632j2754L0767M7447m7082q7655k937O3230L5867J7858
34235a57826P1469J55343K80891M44709M35507P1034l74859m13405o9160J12677
34225E56380q3103k23552j2428J71646n3930l55553j88471L21432N80792L85791
34215A099004L0976k52381m30739l98244j10483J28943K2423k10152j71181M2903
34205b48931O6685l5835N6397K21950R5204j53310k2623L82273M46203Q6872j50812
$$ plain form
34276 -137330 107367 -423121 -898785 -673231 -183874 -176550 -573941 -724964 -455127 -192369
34266 -192369 -166008 -140452 1634 3372 -258718 -488440 -419496 -169137 71603 326795
34256 326795 563085 503832 68173 -303382 -181275 191453 210948 -220009 -591973 -550587
34246 -550587 -310199 -202567 -215321 -184554 -137107 -184189 -271844 -274781 -211551 -175684 -157826
34235 -157826 -86357 68986 349877 794586 1230093 1301127 926268 512863 443703 556380
34225 556380 473277 249725 237297 408943 355013 -540 -189011 132421 713213 1099004
34215 1099004 1129980 877599 446860 48616 -61867 67076 89499 -120653 -291834 -248931
34205 -248931 -182246 -218081 -161684 60266 155470 2160 -20463 361810 808013 894885 744073
34194G44073r3003j24102k73958r4374L50086L75728j36550m57346k56332q3526
34184d9304j96751n5592M60363N35468j31041n50483m6911N18443K18706l49001
34174C53897k33906J31252j24557m87990Q5249J069891R64276k53181j043500
34165D61431o90022q7005J8079k2233J18097J22985l0460J64385O13671M98508
34155A167436k85022p73793m78997p6027p5624m5734K67566K90301k01011m26132
34145f37037Q6104O22173N22394K14437J71537k9258o28535p98695j0458P50069
34135B62731M47698k51447j55382L58963R8138p04638p35637P8620M52019j6993
34125a65928k72352K15207N69762J75832k76995j44691Q0719j39476l51786o8509
$$ plain form
34194 744073 651070 526968 253010 158636 508722 884450 747900 290554 34222 -49304
34184 -49304 -246055 -301647 158716 694184 563143 12660 -34251 484192 702898 353897
34174 353897 119991 251243 126686 -361304 -276055 793836 1758112 1504931 461431
34165 461431 -228591 -315596 -297517 -319750 -201653 -78668 -109128 55257 668928 1167436
34155 1167436 882414 108621 -370376 -446403 -522027 -567761 -300195 -9894 -210905 -637037
34145 -637037 -550933 71240 593634 808071 979608 950350 321815 -476880 -487338 262731
34135 262731 710429 458982 303600 662563 760701 56063 -679574 -600954 -148935 -165928
34125 -165928 -438280 -223073 346689 522521 245526 100835 181554 42078 -309708 -378217
34115c78217K24829j1011k95400m724L98377J24333m99786n09003J12678M70932
34105c66992K38457m580P5131J01236j36460k51391o053K63823K97108L23559
34095E33838M89311M65669L3391m37071n01389k42878J897J37496J72683k4889
34085F28058m24952o16277l26984J10476K40874J62639K42365L82685J48753m44629
34075A03008q23201o11802q4611K60755K68881J48388J40173K61179L00452J03149
34065F6371j22966j1945L53072M06147p3283n16393l65429Q3479J91429k5516
34055a5034q7389M4639L9145k0704K03921M56441J55169m53750m59584K05710
34045F8564N34095J04530j74999L45379Q27836K90525o86628q06785p3922L09547
$$ plain form
34115 -378217 -153388 -164399 -459799 -464523 -66146 58187 -441599 -950602 -837924 -366992
34105 -366992 -128535 -133115 -57984 43252 -93208 -344599 -350652 -86829 210279 533838
34095 533838 1023149 1488818 1522209 1085138 583749 340871 342768 480264 652947 628058
34085 628058 203106 -413171 -740155 -629679 -388805 -226166 16199 398884 547637 103008
34075 103008 -720193 -1331995 -1416606 -1155851 -886970 -738582 -598409 -337230 -36778 66371
34065 66371 -56595 -68540 284532 690679 617396 101003 -264426 -180947 10482 -15034
34055 -15034 -102423 -57784 -18639 -39343 164578 621019 776188 322438 -137146 68564
34045 68564 602659 707189 532190 877569 1705405 1995930 1309302 502517 428595 738142
34035G38142j30357n41352k12810L89782M39390j18949o78274p75273m32157M3877
34025a277981L38293L26785J37609j532L9242K39082M13874K65572k58834o37408
34015d15298k60233O20091R87096L87093m48583p03239n25613m07635k18374K91828
34005f92867O00702J00198o56578n51166L47481P93953K57343l53368k24794J81274
33995a97822J24401j29671R6721N77155M54220l30294p94786l04249N00836O02078
33985E98589M321l59216j6503M08207J96538m00666o39378m20408k22319j24305
33975i75140K12721O11594M36842k00400l58653J84745M09202k46132p74380j91647
33965h91248P60759P76088O3084j97604N7795j45916q55568r53499o2360P82910
$$ plain form
34035 738142 607785 66433 -146377 243405 682795 563846 -114428 -889701 -1321858 -1277981
34025 -1277981 -939688 -612903 -475294 -476826 -437584 -198502 215372 480944 222110 -415298
34015 -415298 -675531 -55440 931656 1318749 870166 166927 -358686 -766321 -984695 -692867
34005 -692867 -92165 8033 -648545 -1199711 -852230 -58277 199066 -154302 -379096 -197822
33995 -197822 -73421 -203092 -106371 470784 925004 594710 -200076 -504325 -3489 598589
33985 598589 602910 243694 227191 635398 831936 431270 -208108 -628516 -850835 -975140
33975 -975140 -762419 -150825 286017 85617 -273036 -88291 320911 74779 -699601 -891248
33965 -891248 -130489 645599 708683 511079 568874 422958 -432610 -1386109 -1448469 -665559
33955f65559P44472K18767j44850l28382l99752j30183L49493M38480O2000j18185
33945B6301J10252Q8282m69901q22720m23941J44282J97202M9959K74596O06802
33935b18886M85738P9279j13126j62515l40329l36482J88707O49183J95597q14079
33925c86913j065261j24942Q87226P83650k21956r40932o68445J89452P45923
33916h02198N78657M6116k32151j24262m9950k54375l46752J17622Q25981R71005
33906G29693L25374m24630n96349l46611k49722l52580j92020L07269N81899L15517
33896I7840p559P6717J44087m00070j064846p61940M50808J227753Q53324K08856
33886H24970K47260N45987K38822m74605p81224n85020l54940j51762J87483L61457
$$ plain form
33955 -665559 78913 297680 152830 -175552 -575304 -705487 -355994 82486 144486 26301
33945 26301 136553 224835 -245066 -1067786 -1491727 -1347445 -1150243 -1100284 -825688 -218886
33935 -218886 266852 346131 233005 70490 -269839 -606321 -417614 231569 427166 -386913
33925 -386913 -1452174 -1577116 -689890 93760 -128196 -1069128 -1737573 -1548121 -802198
33916 -802198 -223541 -177425 -409576 -533838 -583788 -838163 -1184915 -1067293 -241312 729693
33906 729693 1055067 630437 34088 -312523 -562245 -914825 -1106845 -799576 -217677 97840
33896 97840 90281 166998 311085 -88985 -1153831 -1915771 -1464963 -237210 616114 824970
33886 824970 1072230 1618217 1857039 1382434 601210 16190 -338750 -490512 -303029 58428
33876E8428J04204r9876J83254L78150j14327n94909j21613O72328M61568m55570
33866D71637n71843K40259N40584j21707m96440M4596M37703o4194o13025m20288
33856e52718o5104j49206j53337L05672N00512j1322l70438N7024M62325J17665
33846A41073k21162K07477N98198L6007o63116l05971M83316L00536n65883o64737
33836f54262R1239M07333n0051j86774M89983J031229O04518l91184j104536j118574
$$ plain form
33876 58428 162632 62756 246010 624160 509833 -85076 -206689 465639 927207 471637
33866 471637 -100206 140053 680637 558930 62490 107086 544789 480595 -132430 -552718
33856 -552718 -617822 -767028 -920365 -614693 -114181 -125503 -495941 -438917 23408 141073
33846 141073 -80089 127388 725586 761593 98477 -207494 275822 576358 10475 -654262
33836 -654262 -563023 -155690 -205741 -392515 97468 1128697 1733215 1342031 237495 -881079
$$ [...]
##END NTUPLES=NMR SPECTRUM
##END=
