##TITLE=31Pdec_E3e-4-3
 CDCl3, 24 sc
 16.6.2023
##JCAMPDX= 6.0         $$ Bruker NMR JCAMP-DX V2.0
##DATA TYPE= NMR SPECTRUM
##DATA CLASS= NTUPLES
##ORIGIN= UXNMR, Bruker Analytische Messtechnik GmbH
##OWNER= root
$$ XWIN-NMR		Version 3.5
$$ Fri Jun 16 13:44:00 2023 Russian Standard Time (UT+4h)  she@DPX200
##.OBSERVE FREQUENCY= 81.013821
##.OBSERVE NUCLEUS= ^31P
##.ACQUISITION MODE= SIMULTANEOUS
##.ACQUISITION SCHEME= undefined
##.AVERAGES= 24
##.DIGITISER RES= 16
##SPECTROMETER/DATA SYSTEM= spect
##.PULSE SEQUENCE= zgpg30
##.SOLVENT NAME= CDCl3
##.SHIFT REFERENCE= (INTERNAL, CDCl3, 0, 248.564)
##AUDIT TRAIL= $$ (NUMBER, WHEN, WHO, WHERE, WHAT)
$$ ##TITLE= Audit trail, XWIN-NMR		Version 3.5
$$ ##JCAMPDX= 5.01
$$ ##ORIGIN= Bruker BioSpin GmbH
$$ ##OWNER= she
$$ F:/spectra/data/she/nmr/P31/1/pdata/1/auditp.txt
$$ ##AUDIT TRAIL=  $$ (NUMBER, WHEN, WHO, WHERE, WHAT)
(   1,<2023-06-16 13:43:08.50 +0400>,<she>,<DPX200>,
      <created by zg, POWCHK disabled, PULCHK disabled
       configuration hash MD5:
       00 E9 B6 7A A2 85 ED C7 34 08 36 98 17 FE 4E 26
       data hash MD5: 32K
       3A 26 71 E8 03 98 F8 43 29 E0 7F A3 8D B2 59 B4>)
(   2,<2023-06-16 13:43:10.51 +0400>,<she>,<DPX200>,
      <Start of raw data processing
       efp BC_mod = 2 LB = 1 FT_mod = 6 PKNL = 1 PHC0 = -10719.27 PHC1 = 136.2848 SI = 64K 
       data hash MD5: 64K
       1B 4E B0 70 80 39 0F EB 78 50 BB AD 61 C2 9B 18>)
(   3,<2023-06-16 13:43:30.25 +0400>,<she>,<DPX200>,
      <pk PHC0 = 15.15711 PHC1 = 0 
       data hash MD5: 64K
       3D 8E EB 30 60 1F A4 EA D6 82 1D A0 50 1D B5 03>)
$$ ##END=
$$ 
$$ hash MD5
$$ 32 D0 E5 A6 00 6C 66 7C 62 0E C5 40 A8 1E 14 8A
##$RELAX= 
##$RELAX= 
##$RELAX= 
##$RELAX= 
##$RELAX= 
##$RELAX= 
##$RELAX= 
##$RELAX= 
##$RELAX= 
$$ Bruker specific parameters
$$ --------------------------
##$DU= <F:/spectra>
##$EXPNO= 1
##$NAME= <P31>
##$PROCNO= 1
##$TYPE= <nmr>
##$USER= <she>
##$AMP= (0..31)
100 100 100 100 100 100 100 100 100 100 100 100 100 100 100 100 100 100 
100 100 100 100 100 100 100 100 100 100 100 100 100 100 
##$AQSEQ= 0
##$AQ_mod= 1
##$AUNM= <au_zg>
##$AUTOPOS= <>
##$BF1= 81.014009
##$BF2= 200.13
##$BF3= 200.13
##$BF4= 200.13
##$BF5= 200.13
##$BF6= 200.13
##$BF7= 200.13
##$BF8= 200.13
##$BYTORDA= 1
##$CFDGTYP= 0
##$CFRGTYP= 5
##$CHEMSTR= <none>
##$CNST= (0..31)
1 1 145 1 1 1 1 1 1 1 1 1 1 1 1 1 1 1 1 1 1 1 1 1 1 1 1 1 1 1 1 1 
##$CPDPRG= <waltz16>
##$CPDPRG1= <>
##$CPDPRG2= <waltz16>
##$CPDPRG3= <>
##$CPDPRG4= <mlev>
##$CPDPRG5= <mlev>
##$CPDPRG6= <mlev>
##$CPDPRG7= <mlev>
##$CPDPRG8= <mlev>
##$CPDPRGB= <>
##$CPDPRGT= <>
##$D= (0..31)
0 1 0 0 0 0 0 0 0 0 0 0.03 2e-05 3e-06 0 0 0 0 0 0 0 0 0 0 0 0 0 0 0 0 
0 0 
##$DATE= 1686908587
##$DBL= (0..7)
120 120 120 11 120 120 24 19 
##$DBP= (0..7)
150 150 150 150 150 150 150 150 
##$DBP07= 0
##$DBPNAM0= <>
##$DBPNAM1= <>
##$DBPNAM2= <>
##$DBPNAM3= <>
##$DBPNAM4= <>
##$DBPNAM5= <>
##$DBPNAM6= <>
##$DBPNAM7= <>
##$DBPOAL= (0..7)
0.5 0.5 0.5 0.5 0.5 0.5 0.5 0.5 
##$DBPOFFS= (0..7)
$$ [...]
##$SUBNAM2= <"">
##$SUBNAM3= <"">
##$SUBNAM4= <"">
##$SUBNAM5= <"">
##$SUBNAM6= <"">
##$SUBNAM7= <"">
##$SUBNAM8= <"">
##$SUBNAM9= <"">
##$SW= 501.771253377433
##$SWIBOX= (0..15)
0 1 3 0 0 0 0 0 0 0 0 0 0 0 0 0 
##$SW_h= 40650.406504065
##$TD= 32768
##$TD0= 1
##$TE= 0
##$TE2= 300
##$TE3= 300
##$TEG= 300
##$TL= (0..7)
0 120 53 12 22 120 120 120 
##$TP= (0..7)
150 150 150 150 150 150 150 150 
##$TP07= 0
##$TPNAME0= <>
##$TPNAME1= <>
##$TPNAME2= <>
##$TPNAME3= <>
##$TPNAME4= <>
##$TPNAME5= <>
##$TPNAME6= <>
##$TPNAME7= <>
##$TPOAL= (0..7)
0.5 0.5 0.5 0.5 0.5 0.5 0.5 0.5 
##$TPOFFS= (0..7)
0 0 0 0 0 0 0 0 
##$TUNHIN= 0
##$TUNHOUT= 0
##$TUNXOUT= 0
##$USERA1= <user>
##$USERA2= <user>
##$USERA3= <user>
##$USERA4= <user>
##$USERA5= <user>
##$V9= 5
##$VALIST= <valist>
##$VCLIST= <CCCCCCCCCCCCCCC>
##$VD= 0
##$VDLIST= <DDDDDDDDDDDDDDD>
##$VPLIST= <PPPPPPPPPPPPPPP>
##$VTLIST= <TTTTTTTTTTTTTTT>
##$WBST= 1024
##$WBSW= 4
##$XGAIN= (0..3)
0 0 0 0 
##$XL= 0
##$YL= 0
##$YMAX_a= 12340
##$YMIN_a= -11235
##$ZGOPTNS= <>
##$ZL1= 120
##$ZL2= 120
##$ZL3= 120
##$ZL4= 120
##$ABSF1= 0
##$ABSF2= 0
##$ABSG= 0
##$ABSL= 0
##$ALPHA= 0
##$AQORDER= 0
##$ASSFAC= 0
##$ASSFACI= 0
##$ASSFACX= 0
##$ASSWID= 0
##$AUNMP= <proc_1d>
##$AZFE= 0.1
##$AZFW= 0.5
##$BCFW= 0
##$BC_mod= 2
##$BYTORDP= 0
##$COROFFS= 0
##$CY= -3
##$DATMOD= 1
##$DC= 0
##$DFILT= <>
##$DTYPP= 0
##$F1P= 0
##$F2P= 0
##$FCOR= 1
##$FTSIZE= 65536
##$FT_mod= 6
##$GAMMA= 0
##$GB= 0
##$INTBC= 1
##$INTSCL= 6.047779e-11
##$ISEN= 30
##$LB= 1
##$LEV0= 0
##$LPBIN= 0
##$MAXI= 10000
##$MC2= 0
##$MEAN= 0
##$ME_mod= 0
##$MI= 50
##$NCOEF= 0
##$NC_proc= -4
##$NLEV= 6
##$NOISF1= 182.463
##$NOISF2= 159.3651
##$NSP= 0
##$NTH_PI= 0
##$NZP= 0
##$OFFSET= 248.5645
##$PC= 4
##$PHC0= -10704.11
##$PHC1= 136.2848
##$PH_mod= 1
##$PKNL= yes
##$PPARMOD= 0
##$PSCAL= 0
##$PSIGN= 0
##$REVERSE= no
##$SF= 81.0140089999694
##$SI= 65536
##$SIGF1= 159.3651
##$SIGF2= -187.1042
##$SINO= 113.3802
##$SIOLD= 16384
##$SREGLST= <1H.CDCl3>
##$SSB= 0
##$STSI= 65536
##$STSR= 0
##$SW_p= 40650.406504065
##$SYMM= 0
##$S_DEV= 0
##$TDeff= 32768
##$TDoff= 0
##$TI= <>
##$TILT= no
##$TM1= 0
##$TM2= 0
##$TOPLEV= 0
##$USERP1= <user>
##$USERP2= <user>
##$USERP3= <user>
##$USERP4= <user>
##$USERP5= <user>
##$WDW= 1
##$XDIM= 65536
##$YMAX_p= 336171286
##$YMIN_p= -74785567
$$ End of Bruker specific parameters
$$ ---------------------------------
##NTUPLES= NMR SPECTRUM
##VAR_NAME=  FREQUENCY,     SPECTRUM/REAL,   SPECTRUM/IMAG
##SYMBOL=    X,             R,               I
##VAR_TYPE=  INDEPENDENT,   DEPENDENT,       DEPENDENT
##VAR_FORM=  AFFN,          ASDF,            ASDF
##VAR_DIM=   65536,         65536,           65536
##UNITS=     HZ,            ARBITRARY UNITS, ARBITRARY UNITS
##FACTOR=    0.620285442955139, 1,           1
##FIRST=     20137.2065510682, 0,            0
##LAST=      -20513.1999529968, 0,           0
##MIN=       -20513.1999529968, -74785567,   0
##MAX=       20137.2065510682, 336171286,    0
$$ Real data points
##PAGE= N=1
##DATA TABLE= (X++(R..R)), XYDATA
$$ [...]
39827c41105K69156K46246q93j75983j20069K1586O3416M0548Q1917J51405R7853
$$ -341105 -71949 174297 173404 -2579 -122648 -101062 -37646 2902 84819 236224 334077
39816C34077q2947k06848j34223O7646K01353J11885j70648l87741k51668J87543
$$ 334077 251130 44282 -89941 -22295 179058 290943 120295 -267446 -519114 -331571
39806c31571M89404L18535j10242l08353j47165O6302J01587N7881O1590M1683
$$ -331571 157833 476368 366126 57773 -89392 -23090 78497 136378 197968 239651
39796B39651o3128j39738r6409j4263K7633Q0587J59210J48439P552j24051j47561
$$ 239651 176523 36785 -59624 -73887 -46254 34333 193543 341982 349534 225483 77922
39785G7922j36817j40610q2892J1260m0399k23370k05595J58925M69683K85356
$$ 77922 -58895 -199505 -282397 -271137 -311536 -534906 -740501 -581576 -111893 173463
39775A73463j93548l68437r3794J58172L7957j94005j18293K15307M00038K56687
$$ 173463 -20085 -388522 -482316 -324144 -286187 -480192 -598485 -383178 16860 273547
39765B73547P408j12308j45192k16650k51882r3679J79613K91625J50079k9255
$$ 273547 280955 168647 23455 -193195 -445077 -538756 -359143 -67518 82561 53306
39755E3306o5877n8033j33613j85293q7259K2083k6832q2797Q2739K99115J95639
$$ 53306 -12571 -70604 -204217 -389510 -476769 -454686 -481518 -564315 -481576 -182461 13178
39744A3178j57189k72759K0846L28411L02849Q9015l5530p2261j23089j38776
$$ 13178 -144011 -416770 -395924 -67513 235336 324351 288821 216560 93471 -45305
39734d5305q3589n9498o7063N0575K44104J98798j39531l63696k04676N6326R8733
$$ -45305 -128894 -188392 -255455 -204880 39224 238022 98491 -265205 -469881 -413555 -314822
39723c14822Q6945K73215M35070K08948k54670m62658k61637O7445K62347K59861
$$ -314822 -227877 45338 480408 689356 434686 -27972 -289609 -222164 40183 300044
39713C00044P7953j39870j44064M4099L9946k74662l94447N1292N62084M36600
$$ 300044 377997 238127 94063 138162 178108 -96554 -491001 -439709 122375 558975
39703E58975j13666k86248M2504K09590p4545l11015j36062J15586P6570p5316
$$ 558975 445309 159061 201565 411155 336610 25595 -110467 5119 81689 6373
39693F373o0925J7757n711k1830M9622L3034j20301j35399R8069K55219J14015
$$ 6373 -54552 -36795 -42506 -64336 -14714 18320 -101981 -237380 -139311 115908 229923
39682B29923n3329J7483J06956m1398j86829l441K82055K15745j21562k38130
$$ 229923 176594 194077 301033 259635 72806 69365 351420 567165 445603 207473
39672B07473k1526J37152J6886j31547o3351Q8861R0426m3689j47733j55946j08616
$$ 207473 185947 323099 339985 208438 145087 233948 324374 280685 132952 -22994 -131610
39661a31610m5537l621k0750o5091l9502Q9794K30026K61150J54357k0013j66897
$$ -131610 -177147 -180768 -201518 -266609 -306111 -216317 13709 274859 429216 409203 242306
39650B42306k48823l09370l88259m14192k58403P4999L96141N15597M12360J87691
$$ 242306 -6517 -315887 -704146 -1118338 -1376741 -1301742 -905601 -390004 22356 210047
39640B10047m1503j53479n7935J71478K94494J52950j30858k98832k50792j06935
$$ 210047 168544 15065 -42870 128608 423102 576052 445194 146362 -104430 -211365
39630b11365k1949k8150m9460j0123P2158R6174J5103n6876K9485K21699K83033
$$ -211365 -233314 -261464 -310924 -321047 -248889 -152715 -137612 -194488 -165003 56696 339729
39619C39729J01546j36553j74791n288J43076R3536r4239k27386k07513j21975
$$ 339729 441275 304722 129931 124643 267719 361255 267016 39630 -167883 -289858
39609b89858j01031j15804j0177K27361L50576J49731k23608m00452k27162J15455
$$ -289858 -390889 -506693 -516870 -289509 61067 210798 -12810 -413262 -640424 -524969
39599e24969L87173M75964L29349l8728m01902m28209p8220K75067K69646l2088
$$ -524969 -137796 338168 667517 628789 226887 -201322 -279542 -4475 265171 233083
39589B33083k82965k80800j11270M8532J10388Q5986L8184L1717P5636J14985
$$ 233083 -49882 -330682 -441952 -393420 -283032 -197046 -158862 -127145 -51509 63476
39579F3476J00825M9168J8204L9769O6260l551j80156k77786j08371J78980J86369
$$ 63476 164301 213469 231673 271442 337702 334151 153995 -123791 -232162 -53182 133187
39568A33187j60141l94332j37835L04008L65220N0892j45030n6656q784j32657
$$ 133187 -26954 -421286 -559121 -255113 110107 160999 15969 -40687 -49471 -182128
39558a82128j30302R9409J86057o3124k71575j31778N3199o4751k10465L4403
$$ -182128 -312430 -213021 -26964 -90088 -361663 -493441 -440242 -504993 -715458 -681055
39548f81055M13069L29270j62692l91967r3272K50558K18882K8474M3484J74356
$$ -681055 -267986 61284 -101408 -493375 -586647 -336089 -117207 -88733 -45249 129107
39538A29107J17485r6492j53985O0837L10545L14518O0293k09344k67961j52416
$$ 129107 246592 150100 -3885 56952 367497 682015 742308 532964 265003 112587
39528A12587r2786j66974j65800N9047K78764J86653r2649j43154J02394K44421
$$ 112587 19801 -147173 -312973 -253926 24838 211491 118842 -24312 78082 322503
39518C22503L6947k40608k32446k2449P0768r94k3037P9464J41057M7863r7685
$$ 322503 359450 118842 -113604 -136053 -65285 -66279 -89316 -9852 131205 179068 81383
39507H1383j41846n9068O9596J53598J40629L9512q0140j43021j22123l3449P9878
$$ 81383 -60463 -119531 -49935 103663 244292 283804 203664 60643 -61480 -94929 -15051
39496a5051J47274J20892M9024K4739L9991r826j38679k08531j28779n64M0516
$$ -15051 132223 253115 302139 326878 366869 357043 218364 9833 -118946 -119510 -78994
39485g8994K4875O8362J66577K01458J09802o3465k31800k86389j24940J97622
$$ -78994 -54119 14243 180820 382278 492080 428615 196815 -89574 -214514 -16892
39475a6892M06182K66836r9922l30304k50626m1844N3817K3304Q702P7671J65709
$$ -16892 389290 656126 556204 225900 -24726 -66570 -12753 10551 19253 96924 262633
39464B62633J72243M9917j41980k46849j57143K8908J00727N422j03980j20274
$$ 262633 434876 484793 342813 95964 -61179 -32271 68456 73878 -30102 -150376
39454a50376j18358j65277j64527j8453J87768L02200K93399J94892l496k50164
$$ -150376 -268734 -434011 -598538 -616991 -429223 -127023 166376 361268 357772 107608
39444A07608l51826j99937K5693Q8531L3446O2282J68850J82595J16935J46977
$$ 107608 -244218 -444155 -418462 -329931 -296485 -234203 -65353 117242 234177 381154
39434C81154K38557J45137j55630l58019k83297j21775o1642O664J90771K91479
$$ 381154 619711 764848 609218 251199 -32098 -153873 -215515 -208851 -18080 273399
39424B73399R7992k17296l15795j73145m3365l2820m550J25548K56624K74129
$$ 273399 371391 154095 -161700 -334845 -378210 -411030 -415580 -290032 -33408 240721
39414B40721J62407l7766k24509k44629p9373N7289k482r9533J6423K55304K85168
$$ 240721 403128 365362 140853 -103776 -183149 -125860 -128342 -227875 -211452 43852 329020
39403C29020L8430j87265j75267n2559j8962o1508o0178Q597Q5265J05454Q210
$$ 329020 367450 180185 4918 -47641 -66603 -128111 -188289 -179692 -94427 11027 19237
39392A9237j81822k59147l5907L13209L56245k2980l97781l37916J5115J61726
$$ 19237 -162585 -421732 -457639 -144430 211815 188835 -208946 -546862 -531747 -370021
39382c70021o8457l11876j76355K51775N18134L44063n4212k35161o4411J54837
$$ -370021 -438478 -750354 -926709 -674934 -156800 187263 133051 -102110 -166521 -11684
39372a1684J28930k5847j7709J21185Q3455j75684l09937j25246P9701k7174k62384
$$ -11684 117246 91399 73690 194875 278330 102646 -207291 -332537 -252836 -280010 -542394
39361e42394j86839K05340M37139K17463j67404k69212m9107J66908J73304R7446
$$ -542394 -729233 -523893 -86754 130709 -36695 -305907 -355014 -188106 -14802 82644
39351H2644J30174K32288K11194O468k23234l03211k39535j62012j30127p7116
$$ 82644 212818 445106 656300 662768 439534 136323 -103212 -265224 -395351 -472467
39341d72467O0447K27064K91477J83777k2376j65541j52916n5807j368J9423J25216
$$ -472467 -412020 -184956 106521 290298 267922 102381 -50535 -106342 -107710 -88287 36929
39330C6929K94014L04590O1425j73929j06735J23279R8219k43557m64665k57871
$$ 36929 330943 635533 696958 523029 416294 539573 637792 394235 -70430 -328301
39320c28301R4584J51133l8747p7260J07970J62634p2576k54115o2724K79504
$$ -328301 -233717 -82584 -121331 -198591 -90621 72013 -563 -254678 -317402 -37898
39310c7898L29541N8287j84654k28822k24121k43825j47997O9216J75617J04241
$$ -37898 291643 349930 165276 -63546 -287667 -531492 -679489 -610273 -434656 -330415
39300c30415R9669K47794K35725j09156m07638k77680K7479M9450q4429N6593
$$ -330415 -230746 17048 252773 143617 -264021 -541701 -514222 -464772 -549201 -492608
39290d92608L28207J98445k21326k12510L11217N12928j9575n13351k27960L35540
$$ -492608 -164401 34044 -187282 -399792 -88575 424353 404778 -108573 -336533 -993
39280i93K78295k30476l16485J15110L00983n6701l74151k22406P2129J10305
$$ -993 277302 46826 -269659 -154549 146434 89733 -284418 -506824 -434695 -324390
39270c24390l410n2294q3116j15029N310K11839J84370p1381j39116P3372J01858
$$ -324390 -327800 -380094 -463210 -578239 -572929 -361090 -176720 -248101 -387217 -313845 -211987
39259b11987k39694m02613L0342N56333M51311j21908l80165q0530K55000K16810
$$ -211987 -451681 -854294 -823952 -267619 183692 61784 -318381 -398911 -143911 72899
39249G2899k783p5629L891P9652R1794K4889j36021k84793k47463l7910J32257
$$ 72899 70116 -5513 -1622 78030 169824 194713 58692 -226101 -473564 -511474 -379217
39238c79217J52118J24273J32100J06431R721m0175M3144J42218Q6370j02136
$$ -379217 -227099 -102826 29274 135705 145426 105251 148395 290613 376983 274847
39228B74847k27468j54845M6521J81101J18797o6288j51585j8905J60677J11908
$$ 274847 47379 -107466 -60945 120156 238953 172665 21080 2175 162852 274760
39218B74760j41542k23253J02657N18954M95422J7802l42297k03455J04715O6987
$$ 274760 133218 -90035 12622 531576 1026998 1044800 702503 499048 603763 670750
39208F70750k46360l55619j64902n3639j64267j60380J20991L06867J06530j60644
$$ 670750 424390 68771 -96131 -149770 -314037 -474417 -353426 -46559 59971 -100673
39198a00673q2190J65401J44480j01895j71419n235O8006o9031j72952r4607M0007
$$ -100673 -182863 -17462 127018 25123 -146296 -151531 -83525 -152556 -325508 -420115 -380108
39187c80108J18623J45931P8081r4969j66066J8039K06793R3239j18042r908K85361
$$ -380108 -261485 -115554 -37473 -132442 -298508 -280469 -73676 19563 -98479 -108387 176974
39176A76974K44159j46783l30680j17207K4002j82164l51934j55144J29857J68671
$$ 176974 421133 274350 -56330 -173537 -149535 -331699 -683633 -838777 -708920 -540249
39166e40249J23179K10611K14019o7357l04085j12895K77363L67470J44760j4469
$$ -540249 -417070 -206459 7560 -59797 -363882 -476777 -199414 168056 312816 298347
39156B98347Nj3098q4463m0658R0477P5592j07470k04421p6445J20974J90705
$$ 298347 298352 285254 200791 160133 250610 326202 218732 14311 -62134 58840 249545
39145B49545J12119j8883j06657j01041l1962J4035pl7601p3427q5014M329J80338
$$ 249545 361664 342781 236124 135083 103121 117156 117149 79548 6121 -78893 -74564 105774
39133A05774J95384j25605m69419l36980J83270M22043Q0188l20459k32981J23154
$$ 105774 301158 175553 -293866 -630846 -447576 -25533 54655 -265804 -498785 -375631
39123c75631J82994r2906k44803l1883K98106L97351J84855j37595k72353j10824
$$ -375631 -192637 -285543 -530346 -562229 -264123 133228 318083 180488 -91865 -202689
39113b02689J04081P1529j14319j12820O5568O8119j16619n5950L27320M66107
$$ -202689 -98608 -27079 -141398 -254218 -188650 -120531 -237150 -293100 34220 500327
39103E00327L9196m20840l07742J55882L52892J99706M7234j2217j24229k01415
$$ 500327 539523 118683 -189059 -33177 319715 519421 566655 554438 430209 228794
39093B28794n9341J53059J70004O5008K2244q8702l92316n44848j95216L24092
$$ 228794 169453 322512 492516 557524 579768 491066 98750 -446098 -641314 -317222
39083c17222M07378R5410p4428J1350k0402k38983k80492m8758J22841J01222
$$ -317222 90156 185566 111138 122488 102086 -136897 -417389 -466147 -343306 -242084
39073b42084J30331K71305K58633N2385l2959Q1953O5319k09494l80698j81629
$$ -242084 -111753 159552 418185 470570 437611 519564 584883 375389 -5309 -186938
39063a86938J33349K13693R5249J332k7013n7254o7432k8849J12k634K1285O1912
$$ -186938 -53589 160104 255353 256685 229672 172418 104986 76137 76249 73615 94900 156812
39051A56812L8011k4764j9581L1223J3204m9138l8717Q960l2510j14256q6223
$$ 156812 194823 170059 150478 181701 194905 145767 107050 116010 83500 -30756 -116979
39040a16979N607j2057j15306j24137k5430L7598M1191N6531M0389m3418k4499
$$ -116979 -111372 -123429 -238735 -362872 -388302 -350704 -309513 -252982 -212593 -256011 -280510
39029b80510J99282L43733J16570k35722k48807J0669P1943j24145j43851J64016
$$ -280510 -81228 262505 379075 143353 -105454 -94785 -22842 -146987 -290838 -126822
39019a26822M10704L15985P6024p5987j83762k76561k29841q8879r1718k09074
$$ -126822 283882 599867 675891 599904 416142 139581 -90260 -179139 -270857 -479931
39009d79931j05639K67963M91404K86579r6641l04592k98829j71907N1389K36292
$$ -479931 -585570 -317607 173797 460376 363735 59143 -239686 -411593 -360204 -123912
38999a23912J58614j03381j86437j9526M8884j17147j76452N6846K23235L0547
$$ -123912 34702 -68679 -255116 -274642 -225758 -342905 -519357 -462511 -239276 -208729
38989b08729k00367n7028K67087L01370O1814l6884J09076J71293l7429k85264
$$ -208729 -409096 -466124 -199037 102333 164147 127263 236339 407632 370203 84939
38979H4939k93851r8099O8894P9198J4631L7625J83879K83188J49641j46692l15014
$$ 84939 -208912 -307011 -238117 -158919 -144288 -106663 77216 360404 510045 363353 48339
38968D8339j86639R0794K42907J54434n9004j80574r5519P3297R3872n2896j27758
$$ 48339 -138300 -47506 195401 349835 290831 110257 14738 88035 181907 129011 1253
38957A253j3092Q6288J0754n2012Q0858K07035R1205o3779L0663J58984o4525
$$ 1253 -11839 74449 85203 33191 114049 321084 412289 348510 379173 538157 473632
38946D73632m37181l97008M5701K85562P6107j61072j01573N2684Q8931J13623
$$ 473632 36451 -360557 -314856 -29294 46813 -114259 -215832 -163148 -74217 39406
38936C9406J47818j8519l16275l11014Q5293L56672J52609j93384k46637q9505
$$ 39406 187224 168705 -147570 -458584 -373291 -16619 135990 -57394 -304031 -393536
38926c93536k580K6745J10673J66123J45467J92507K88490J55535k06057l44468
$$ -393536 -396116 -369371 -258698 -92575 52892 245399 533889 689424 483367 138899
38916A38899n0724K37130J02216k20850k93965j41797l9035m836O0552P3566K93
$$ 138899 88175 325305 427521 206671 -87294 -229091 -268126 -272962 -212410 -138844 -138551
38905a38551M4771K31265K00073j72346l98063j15474K46948J40937j67522l7608
$$ -138551 -93780 137485 337558 165212 -232851 -348325 -101377 39560 -127962 -165570
38895a65570M51687O06537K09927k09392k28575l2237M9474J681l4473k3361l247
$$ -165570 286117 892654 1102581 893189 664614 632377 681851 683532 649059 625698 622451
38884F22451j9210j19755k49832k27302j0898J61477J15944J3382K2303j1290
$$ 622451 603241 483486 233654 6352 -4546 156931 272875 286257 308560 297270
38874B97270k26894l62365j45095J60076J06458j82553j69680K38895N42408M05439
$$ 297270 70376 -291989 -437084 -277008 -170550 -353103 -522783 -283888 258520 663959
38864F63959P0591j15552j54529j84008j60180O853K05791K22204K733k82333
$$ 663959 734550 618998 464469 280461 120281 127134 332925 555129 557862 275529
38854B75529l96483k44181K2345J34461Q043j48237r0715J72085M05612L73943
$$ 275529 -120954 -365135 -342790 -208329 -200286 -348523 -439238 -267153 138459 512402
38844E12402K7565l94524m79960r0751L32574K45065k14745l44053J13951N77118
$$ 512402 539967 145443 -334517 -425268 -92694 152371 -62374 -406427 -292476 284642
38834B84642M78694K8209k28566j79262n8267N0220J71269J73523l0103k31312
$$ 284642 763336 791545 562979 383717 325450 375670 546939 720462 690359 459047
38824D59047k26741j30008q3748J6059J83327J27535k22147m04546j17841K14472
$$ 459047 232306 102298 18550 34609 217936 345471 123324 -281222 -399063 -184591
38814a84591J28011q5024N7473K92303P2800l54800k80991K15436L30911j27706
$$ -184591 -56580 -141604 -84131 208172 280972 -73828 -354819 -139383 191528 63822
38804F3822m34861j52556K41808K32560k486r5614o4697k4853R3515K07598K7212
$$ 63822 -371039 -523595 -281787 -49227 -51713 -147327 -212024 -236877 -143362 64236 91448
38793I1448l44406l46959J34086M17547N1423m04280k27864L23667M52713P5978
$$ 91448 -252958 -599917 -465831 -48284 3139 -401141 -629005 -305338 147375 223353
38783B23353j50902M7882K02689l4125l17464j99127J75814L23991J07398j76348
$$ 223353 72451 120333 323022 288897 -28567 -227694 -51880 272111 379509 203161
38773B03161k53284j29553O4515K29792K68317J12226j25651j93821k1075J38178
$$ 203161 -50123 -179676 -115161 114631 382948 495174 369523 175702 154627 292805
38763B92805L7193j97285k43295m9877J33506J60996J26182P9048n5425j98909
$$ 292805 329998 132713 -110582 -160459 -26953 134043 260225 339273 283848 84939
38753H4939j23845J19739J58647j12680k84837o6644K18394J48993j26715j99502
$$ 84939 -38906 80833 239480 126800 -158037 -224681 -6287 142706 15991 -183511
38743a83511q7555r4603j86754p1242K10841L16212J80905N9350R097j43635l16123
$$ -183511 -271066 -365669 -552423 -623665 -412824 -96612 84293 143643 152740 9105 -307018
38732c07018j89130J99732L94746J94460p5047j10163j1975N1315J30476K29896
$$ -307018 -496148 -296416 98330 292790 217743 107580 95605 146920 277396 507292
38722E07292J54551j29729l26817k48622j09692j36004j82711k7822K07376K43620
$$ 507292 661843 532114 205297 -43325 -153017 -289021 -471732 -499554 -292178 -48558
38712d8558P9565l9869J6311J59091K45757J82278m4962k97281l48413j49704
$$ -48558 31007 -8862 7449 166540 412297 594575 549613 252332 -96081 -245785
38702b45785P6416J19748L5916k613J8724j7604j38506k24033j55205N4378K61762
$$ -245785 -169369 -49621 -13705 -16318 2406 -15198 -153704 -377737 -532942 -478564 -216802
38691b16802L18509K25726J29698J00885J0929k29852m19656k90459N3607K03139
$$ -216802 101707 327433 457131 558016 568945 339093 -80563 -371022 -317415 -114276
38681a14276j0004k96623l29735j38736M7008J40253K05511K60382K43654J33308
$$ -114276 -124280 -420903 -750638 -889374 -842366 -702113 -496602 -236220 7434 140742
38671A40742j3478j14277j12314k1993N4468J7284j08989j97872j58808l622J82914
$$ 140742 127264 12987 -99327 -121320 -66852 -49568 -158557 -356429 -515237 -518859 -335945
38660c35945K75268J80739k7041j29069k5524J14311R5648k3207o6064l6276o0641
$$ -335945 -60677 120062 93021 -36048 -61572 52739 148387 125180 59116 22840 -37801
38649c7801j23352r9877m872L7616L4101Q0745J13622j7561k20281k09061M5560
$$ -37801 -161153 -261030 -265902 -228286 -194185 -113440 182 -17379 -237660 -446721 -401161
38638d01161K12608P9203j24384p1303J81355K92486J21364j20131j96447j28526
$$ -401161 -188553 -109350 -233734 -305037 -123682 168804 290168 170037 -26410 -154936
38628a54936o5231k6607O1005J39658N2962j50526j89624K4120J80041M4123j02566
$$ -154936 -220167 -246774 -185769 -46111 6851 -143675 -333299 -309179 -129138 -85015 -187581
38617a87581J05567M43483L81692l9311k48197r1756m2759k82854l37260J6514
$$ -187581 -82014 361469 743161 703850 455653 363897 321138 38284 -298976 -282462
38607b82462K32724o9382l56475o5764L71860K39097k19193k20176J96399K69508
$$ -282462 -49738 -119120 -475595 -541359 -169499 69598 -149595 -369771 -173372 96136
38597I6136j37588l41613p0426J07826j52670l73643j16208K84945L26518J16846
$$ 96136 -41452 -383065 -453491 -345665 -498335 -871978 -988186 -703241 -376723 -259877
38587b59877O8756K13785K65741J13520r1153j82294j20758j5121m2859j82552
$$ -259877 -191121 22664 288405 401925 310772 128478 7720 -7401 -50260 -232812
38577b32812j27642K44639N07401K45819j99982j77942J99867J93009l17087n68416
$$ -232812 -360454 -115815 391586 637405 437423 259481 459348 652357 335270 -233146
38567b33146j55984L04637J87335j92492j99576J11866K30794M5640j19603q9639
$$ -233146 -389130 -84493 102842 -89650 -289226 -177360 53434 99074 -20529 -110168
38557a10168K1330R0729O0737r9737k63078k06445R351N2335j08891p8093K73995
$$ -110168 -88838 1891 62628 -37109 -300187 -506632 -497281 -444946 -553837 -631930 -357935
38546c57935M83072K22899j22429p9134J62026J47239n8422q4806L3030j5963
$$ -357935 125137 348036 225607 146473 308499 455738 397316 312510 345540 329577
38536C29577j65764p5612K02121K53512K998j61047k9629J31055M6477j87848
$$ 329577 163813 88201 290322 543834 546832 385785 356156 487211 533688 345840
38526C45840l27426k81457r1574J43457K49855J12348j18285j58440K6348J73742
$$ 345840 18414 -263043 -354617 -211160 38695 151043 32758 -125682 -99334 74408
38516G4408J01703o1775r5286K5599J39740J11171l4806j49002j12457L9587J69733
$$ 74408 176111 114336 19050 44649 184389 295560 260754 111752 -705 38882 208615
38505B08615J96850J33766L404j51350k02579o6711J07083R8437k8713o906J61860
$$ 208615 405465 539231 542635 391285 188706 121995 229078 327515 298802 291896 453756
38494D53756J55512j23872l19027j54615J22774J38086m9276j19989l1197o891
$$ 453756 609268 485396 166369 11754 134528 272614 223338 103349 72152 65261
38484F5261j05272j52747p7196n157j7285m5963l4304p975K2557P9653J38897
$$ 65261 -40011 -192758 -269954 -275111 -292396 -338359 -372663 -380638 -358081 -278428 -139531
38473a39531J52037J31970J20952J16016J03392R6366O6399o0895k53298l34175
$$ -139531 12506 144476 265428 381444 484836 581202 647601 586706 333408 -767
38463g67k07962j1673P5059N9049M4985K8869n9629j72332j60684J6230K00361
$$ -767 -208729 -220402 -145343 -86294 -41309 -12440 -72069 -244401 -405085 -388855 -188494
38452a88494J88277l4854k34703j69728P9726J64244m4957k11654j3396L17705
$$ -188494 -217 -35071 -269774 -439502 -359776 -195532 -240489 -452143 -465539 -147834
38442a47834K96021p6522l12788j88382j1736l3461o0632J08785K80926K05515
$$ -147834 148187 71665 -241123 -429505 -441241 -474702 -535334 -426549 -145623 59892
38432E9892L069o8420k5634k8868m8557K4907J01147K5967j14107j05165M6308
$$ 59892 62961 -5459 -31093 -59961 -108518 -83611 17536 43503 -70604 -175769 -129461
38421a29461J27948M8245o1783p1087j4813j2843j01160j67217o5751J69507K99869
$$ -129461 -1513 46732 -15051 -86138 -100951 -113794 -214954 -382171 -447922 -278415 21454
38410B1454J71627n4267j19546j9121O7333Q4382Q9955N0193o0513p9889Q4228
$$ 21454 193081 138814 19268 147 67480 151862 241817 292010 231497 151608 235836
38399B35836J74086k4587j97716M0736L73063J64461m31342n77059o9083L21147
$$ 235836 409922 385335 187619 228355 601418 765879 334537 -242522 -311605 9542
38389I542R3314k63883k21626l6590o0895q485L79919O14950K20600l20116k57437
$$ 9542 102856 -161027 -382653 -419243 -480138 -488623 -108704 506246 726846 406730 149293
38378A49293J95262K36742j90648l79918o5131K38194J43726j22455k66223l03032
$$ 149293 344555 581297 390649 10731 -54400 183794 327520 205065 -61158 -364190
38368c64190k58535n2509J90201J99446K6351L353J79954K46295P5578r9294j14130
$$ -364190 -622725 -675234 -485033 -285587 -259236 -255883 -75929 170366 245944 146650 32520
38357C2520n9485J1052J42292K07208P467k99208l08236J5683K60075J96543N7661
$$ 32520 -26965 -15913 126379 333587 341054 41846 -266390 -250707 9368 205911 263572
38346B63572N3538M3534j14823k63196k16660n3363O5247J19266J21286K4795
$$ 263572 317110 360644 245821 -17375 -234035 -287398 -222151 -102885 18401 43196
38336D3196j11731r7301J11384K99592K79388R7505j21094l22685m30015l25788
$$ 43196 -68535 -165836 -54452 245140 524528 622033 500939 178254 -251761 -577549
38326e77549n4073J51739J59037Q8748Q3846R9929L8705o3560j06946p9996l5501
$$ -577549 -631622 -479883 -320846 -232098 -148252 -48323 -9618 -73178 -180124 -260120 -295621
38315b95621R229O5792J16604J16514L8418p9184j24966k1679J32717J43270o443
$$ -295621 -286392 -220600 -103996 12518 50936 -28248 -153214 -174893 -42176 101094 94651
38304I4651j06005l6474M7038l005o1766L6594J77764J41393l0777j16298p0910
$$ 94651 -11354 -47828 -790 -3795 -65561 -28967 148797 290190 259413 143115 72205
38293G2205l6102n9085o9171p4509j24734j33921K002J69375J83296J08973J49190
$$ 72205 36103 -22982 -92153 -166662 -291396 -425317 -423315 -253940 -70644 38329 187519
38282A87519K59726J95688o2468k49233k20603j22405q4717k8115J18926K43274
$$ 187519 447245 642933 580465 331232 110629 -11776 -96493 -124608 -5682 237592
38272B37592K14608O6631q1531j56707j35874m7055O720n1547j43167j30031j8949
$$ 237592 452200 518831 437300 280593 144719 97664 104384 52837 -90330 -220361 -239310
38261b39310P1589J10279J47761J47169K2649j50873j70670M964J66282J12246
$$ -239310 -167721 -57442 90319 237488 260137 109264 -61406 -56442 109840 222086
38251B22086j12211k81164k16487M6977K64948K01556q4734k61119j25144J28484
$$ 222086 109875 -171289 -387776 -340799 -75851 125705 40971 -220148 -345292 -216808
38241b16808J91854P0573J5716J06683J50149P625j87161k15101n5257R4271M5871
$$ -216808 -24954 45619 61335 168018 318167 325792 138631 -76470 -131727 -37456 8415
38230H415j49057k21940J293L33513M06086J28663j98882k76393j15770J00470
$$ 8415 -140642 -362582 -361289 -27776 378310 506973 308091 31698 -84072 16398
38220A6398K57493K99697J91997J6128p4215q5908j69097l05244k88004j01238
$$ 16398 273891 573588 765585 781713 707498 621590 452493 147249 -140755 -241993
38210b41993J4582l494P5528K80574K64313r6674l71870k22249M3758J4313j19871
$$ -241993 -227411 -230905 -155377 125197 389510 292836 -79034 -301283 -257525 -243212 -363083
38199c63083L9544L18262K30798j63216l21313p2703J99414K29874J52493O3374
$$ -363083 -323539 -5277 225521 62305 -259008 -331711 -132297 97577 250070 313444
38189C13444j42497l85725l57602k5086K45346K31707J38811J73194K05741O5586
$$ 313444 170947 -214778 -572380 -597466 -352120 -120413 18398 191592 397333 462919
38179D62919j36158k01925j45307r7462p9456k7714O5708J47649J67164J07403
$$ 462919 326761 124836 -20471 -117933 -197389 -225103 -159395 -11746 155418 262821
38169B62821J8058j3239M732m6081j70393j79825M76J31716O718j82651j24601
$$ 262821 280879 267640 272372 226291 55898 -123927 -123451 8265 14983 -167668 -292269
38158b92269J10247J87644L2316j25748j68545j88186j85961m1628J77477K15946
$$ -292269 -182022 5622 37938 -87810 -256355 -444541 -630502 -672130 -494653 -278707
38148b78707K6623j13434Q352K48436L08159Q9253k14456l07129q5808K09165
$$ -278707 -252084 -365518 -357166 -108730 199429 288682 74226 -232903 -318711 -109546
38138a09546K35389j6227k13792j81470j18085j66291j16107J78142M19421K88930
$$ -109546 125843 109616 -104176 -285646 -403731 -570022 -686129 -507987 -88566 200364
38128B00364k4556j33961o1084q4597j76438q2455J53524K29316R0465l3999m9960
$$ 200364 175808 41847 -19237 -103834 -280272 -362727 -209203 20113 110578 76579 26619
38117B6619n4107l6532Q3652J94933J37214J8163K5227N6590p4071k30511j80914
$$ 26619 -27488 -64020 19632 214565 351779 369942 395169 451759 377688 147177 -33737
38106c3737n4385r9841j76712j5613J92958P0241k28279k13032R5332K02284L022
$$ -33737 -88122 -187963 -364675 -380288 -187330 -117089 -345368 -558400 -463068 -260784 -257762
38095b57762q6604Q7969J97165R2446K6880P2608k4562k39501j74817K10573M19808
$$ -257762 -344366 -256397 -59232 33214 60094 132702 108140 -131361 -306178 -95605 324203
38084C24203K15440k6133l3668p7609l39953m63586j69225K05385K49270J09068
$$ 324203 539643 513510 479842 402233 62280 -401306 -570531 -365146 -115876 -6808
38074f808J08761J46376l0422k70599k43538O545J72069J73369J52104J29912
$$ -6808 101953 248329 217907 -52692 -296230 -289685 -117616 55753 207857 337769
38064C37769L1747p1777n8966P090k078l5387K4141J09894O6744q4993j81154
$$ 337769 369516 297739 238773 245863 243785 208398 232539 342433 409177 324184 143030
38053A43030j56283j00413j05250j48071j14307O4765K55199K01846j00763k72105
$$ 143030 -13253 -113666 -218916 -366987 -481294 -416529 -161330 40516 -60247 -332352
38043c32352k5702L63644M13266J33457m8434N107J2856j25147j42160M0347R2653
$$ -332352 -358054 5590 418856 552313 503879 508986 521842 396695 254535 294882 387535
38032C87535j50875l53517k01880J06064K03402P4716o1373j25667j47822q1803
$$ 387535 236660 -116857 -318737 -212673 -9271 65445 4072 -121595 -269417 -351220
38022c51220P6801J60283N1392j01828q7499P2891J82954J25915m5481j82332
$$ -351220 -274419 -114136 -62744 -164572 -252071 -179180 3774 129689 84208 -98124
38012i8124j54962Q533J14009N0226l8485m92M5549n8185j60849l9025J58780
$$ -98124 -253086 -244553 -130544 -80318 -118803 -119295 -73746 -131931 -292780 -331805 -173025
38001a73025J25663n5449n8880O6839j5440k40002j51056K87078N07917J87503
$$ -173025 -47362 -102811 -161691 -94852 -110292 -350294 -501350 -214272 293645 481148
37991D81148k77657m00743k21523j4498J55648K73053J83218r3607k14523p721
$$ 481148 203491 -197252 -418775 -433273 -277625 -4572 178646 85039 -129484 -137205
37981a37205J99712O7824k27776k85947p2594J03203O2527o8780r1453L5239J60819
$$ -137205 62507 130331 -97445 -383392 -455986 -352783 -290256 -359036 -450489 -415250 -254431
37970b54431J00703j10575j97817k2084J72194J30415N590M3372P8377j47195
$$ -254431 -153728 -264303 -462120 -484204 -312010 -181595 -176005 -132633 -54256 -201451
37960b01451l55055p5323M61967N20088k578l83480k02569R8747P4917l6292R9127
$$ -201451 -556506 -631829 -169862 350226 347648 -35832 -238401 -139654 -64737 -101029 -1902
37949a902K69185J57484o8540j00189k2184n7066j14887j1608J48185J65308P3400
$$ -1902 267283 424767 356227 256038 233854 176788 61901 50293 198478 363786 437186
37938D37186n925p1993r3163M4657K46325K16240n7039k14021j03329j0652j06696
$$ 437186 431261 359268 266105 310762 557087 773327 716288 502267 398938 388286 281590
37927B81590j49170N529Q3338r9709k69041j67211K6833Q2586J04574K05357K07375
$$ 281590 132420 137949 221287 121578 -147463 -314674 -287841 -205255 -100681 104676 312051
37916C12051J1396j32082m7210N9277J6362J533J31675J78309J3898j00698n342
$$ 312051 323447 191365 144155 203432 219794 221327 353002 531311 545209 444511 439169
37905D39169M0534j28737k33147q3018K5485j32205k45222k5680K31561J50118
$$ 439169 479703 350966 117819 34801 60286 -71919 -317141 -342821 -111260 38858
37895C8858q3107q7854O7197R6492L1421L6382J2797j50801k47995j09035M0451
$$ 38858 -44249 -132103 -64906 31586 63007 99389 112186 -38615 -286610 -395645 -355194
37884c55194j2442o4168Q0836J79398k22k00029j29132L753p4790j42443Q8872
$$ -355194 -367636 -431804 -350968 -171570 -171792 -371821 -500953 -497200 -571990 -714433 -625561
37873f25561L66223L05993O4677R767N4658p2995k23446j18335M9461l7160j58971
$$ -625561 -259338 46655 111332 121099 175757 102762 -120684 -239019 -189558 -226718 -385689
37862c85689N7700L50845J71711l34619m72163p3833K95403K60701R1742J10217
$$ -385689 -327989 22856 194567 -140052 -612215 -686048 -390645 -129944 -38202 72015
37852G2015K14528J72131l8749l07922m84647l61913R5776N15198M53122j8125
$$ 72015 286543 458674 419925 112003 -372644 -734557 -638781 -123583 329539 311414
37842C11414l74539k90026N2014K78638K15131k5903j68016m7341J38872L9251
$$ 311414 -63125 -353151 -301137 -22499 192632 166729 -1287 -48628 90244 129495
37832A29495l12124m65700k09094J24980K15583K00810K82005L11814J34295o4740
$$ 129495 -182629 -648329 -857423 -732443 -516860 -316050 -34045 277769 412064 347324
37822C47324j11781j39478j74036O8703N36635N60553j71271q75874o59642J58010
$$ 347324 235543 96065 -77971 -9268 527367 1087920 916649 40775 -618867 -460857
37812d60857N18434J46627k51912j89660N2576J18860Q2057Q7862O1398m3656
$$ -460857 57577 204204 -47708 -237368 -184792 -65932 16125 103987 165385 121729
37802A21729j04491o3879j5380j9994o6297j52156k08170r9017J03800J11365
$$ 121729 17238 -46641 -62021 -82015 -148312 -300468 -508638 -607655 -503855 -392490
37792c92490r5093j24150J77528L60538O9557l17847k59969J11469K80512J62734
$$ -392490 -487583 -611733 -434205 -73667 -4110 -321957 -581926 -470457 -189945 -27211
37782b7211O2140O8181M3636J611J4404k2933j29005n8665K13469K66646o2501
$$ -27211 34929 103110 146746 148357 162761 139828 10823 -47842 165627 432273 369772
37771C69772k83660r4466J0612l38921n38844J3796P05342N56685j74448m34210
$$ 369772 86112 -8354 2258 -336663 -875507 -861711 -156369 400316 225868 -208342
37761b08342r2064N3657j73848j10628L61588N13152J02798j75680M8694K10700
$$ -208342 -300406 -246749 -420597 -531225 -169637 343515 446313 270633 319327 530027
37751E30027q3995l30858o9783K86019J79847j98363l39209j98509l6083Q0297
$$ 530027 446032 115174 45391 331410 511257 312894 -26315 -224824 -260907 -180610
37741a80610J60381P9175j36632j82114M0288J85361J8557j77207o6448K12016
$$ -180610 -20229 58946 -77686 -259800 -219512 -34151 -15594 -192801 -259249 -47233
37731d7233L06749J63838j5290j06039j15261p7016n1417p8064p4052L9854J33288
$$ -47233 259516 423354 408064 302025 186764 109748 58331 -19733 -93785 -53931 79357
37720G9357M2228r3306O566K74274L26179J6587l57453m46003j79604K66599N81497
$$ 79357 121585 28279 34845 309119 635298 651885 294432 -151571 -331175 -64576 516921
37709E16921M66289l3120m34894l61529l8401P1192n5300r0512L9060J02019J9027
$$ 516921 983210 950090 515196 153667 115266 186458 131158 40646 79706 181725 200752
37698B00752o4091r2977j21800j17411p3086j27913k46412q8471L89578N97405
$$ 200752 136661 43684 -78116 -195527 -268613 -396526 -642938 -731409 -341831 255574
37688B55574J32702m47994l70299J76869L85744J00929j13729k9820K2106m3982
$$ 255574 388276 -59718 -430017 -253148 132596 233525 119796 89976 112082 68100
37678F8100P6511L43308L06025q7087l47305k48595r0616n0431M4250J78620P3344
$$ 68100 144611 487919 793944 706857 359552 110957 20341 -30090 14160 192780 266124
37667B66124k12285k55742J566J35379j1463r2105P1609J93711Q6878l8890j5526
$$ 266124 53839 -201903 -200337 -64958 -76421 -168526 -96917 96794 183672 144782 129256
37656A29256M4656P0226J19510J01301j11280l05940j87245O6272P2183n2728
$$ 129256 173912 244138 363648 464949 353669 47729 -139516 -73244 -1061 -53789
37646e3789P7191L16149J87473j94632k38066J00753K53029L3648j56335j69945
$$ -53789 23402 339551 527024 332392 94326 195079 448108 481756 325421 155476
37636A55476k63997l42363m713N20387M89933r8752l83909m6835K03258o7325
$$ 155476 -108521 -450884 -455597 64790 554723 455971 72062 25227 228485 161160
37626A61160k87124J3341L46326J71533j83236j90523j561N060o6609J0262O9119
$$ 161160 -125964 -112623 233703 405236 222000 31477 29916 34976 -31633 -21371 47748
37615D7748n1672j20260l153R968j81235j70404J84614L38054m2087m02999j73568
$$ 47748 -3924 -124184 -127337 -117369 -298604 -469008 -284394 53660 11573 -391426 -564994
37604e64994K96871L60688J09780N2190J71786P0812k28121l29959j57221j47
$$ -564994 -268123 92565 202345 254535 426321 497133 269012 -60947 -218168 -218315
37594b18315J4359K3336R1057J47829J63019J12264o6525k85521l06588r3967
$$ -218315 -203956 -180620 -89563 58266 221285 333549 267024 -18497 -325085 -419052
37584d19052J13142J96928K66345K77955L4688l01665k64416J37999L01896k6586
$$ -419052 -305910 -108982 157363 435318 470006 168341 -96075 41924 343820 317234
37574C17234l20618j58976R8601N346j96432p4521K05175K12079M340n7237K4954
$$ 317234 -3384 -162360 -63759 -58413 -254845 -329366 -124191 87888 92228 34991 59945
37563E9945k3906j80882j59665P9892K56065J51081j71054m43065l74677N4585
$$ 59945 36039 -144843 -304508 -224616 31449 182530 11476 -431589 -806266 -751681
37553g51681M31680L35727n6255k00666k8084J1365j83814j53670K33002M12111
$$ -751681 -320001 15726 -40529 -241195 -269279 -257914 -441728 -595398 -362396 49715
37543D9715N3357l23088j79727J79404J78398r0730j39731O6884J69956Q2658
$$ 49715 103072 -220016 -399743 -220339 -41941 -132671 -272402 -205518 -35562 47096
37533D7096K1435K1660p7105k47693k79966j22184O3086J26000M5579p0554k9777
$$ 47096 68531 90191 13086 -234607 -514573 -636757 -573671 -447671 -402092 -472646 -502423
37522e02423K09882L47689R6637k86599k68702J38744L58364J42951r8747m8304
$$ -502423 -292541 55148 151785 -134814 -403516 -264772 93592 236543 137796 89492
37512H9492O7599K7358Q377J05826M8312k28524k92903O8058L77370J95372j59843
$$ 89492 157091 184449 192826 298652 346964 118440 -174463 -106405 270965 466337 306494
37501C06494j50674J13643J13630k31606m73516k83148J80080M94360L78617l4464
$$ 306494 155820 269463 383093 151487 -322029 -605177 -425097 69263 447880 413416
37491D13416k81549j08984J45072L9323k46340k05444Q8171P7438k62064l14303
$$ 413416 131867 22883 167955 207278 -39062 -244506 -156335 -78897 -340961 -655264
37481f55264J02211L81024J50642j42683o8274J12224N2653p0788l6403l6104
$$ -655264 -553053 -172029 -21387 -164070 -232344 -120120 -67467 -138255 -174658 -210762
37471b10762j84461j67941J42384L15388P7804j70097m6925J74611J33380J3042
$$ -210762 -395223 -563164 -420780 -105392 -27588 -197685 -244610 -69999 63381 76423
37461G6423P0056P9473j66786l16330k7161L52626K93024q3557k54600r3738J05785
$$ 76423 146479 225952 59166 -257164 -284325 68301 361325 277768 23168 -70570 35215
37450C5215J62737J20001L0114m1577j2536K4285r5694k20297m7941K46078J58622
$$ 35215 197952 317953 348067 306490 293954 318239 222545 2248 -45693 200385 359007
37439C59007k45854l22065O1562K39115j02883l57527o5319K90285J66095j25269
$$ 359007 113153 -208912 -147350 91765 -11118 -368645 -433964 -143679 22416 -102853
37429a02853p0283J46560J18045L41R8004J79582p0925l62432k49801R9526K26936
$$ -102853 -173136 -26576 91469 91810 189814 369396 298471 -63961 -313762 -214236 12700
37418A2700J26270R0240J41029J28256P6360R139k03406m61736l63031J22334
$$ 12700 138970 229210 370239 498495 574855 583994 380588 -81148 -444179 -321845
37408c21845M25235K17375q8723q2004K3981l9376n1597J55316K36462m3235l17361
$$ -321845 103390 320765 232042 150038 174019 134643 83046 238362 474824 431589 114228
37397A14228k62287j24099j15779L0042L82272M24600n0398m03036j59416J83761
$$ 114228 -148059 -272158 -387937 -357895 24377 448977 398579 -4457 -163873 19888
37387A9888P6103j30079N3868K69831J0608l45431j70802K70499K94168k7866
$$ 19888 95991 -34088 19780 289611 300219 -45212 -216014 54485 348653 320787
37377C20787j17322M0669R249j87443j43465J16348J82105j4115j71571j80824
$$ 320787 203465 244134 253383 65940 -77525 38823 220928 206813 35242 -145582
37367a45582j59789j04210L1581J13640N7668Q489K6276j9547n5229J51777L87648
$$ -145582 -305371 -409581 -378000 -264360 -206692 -198203 -171927 -191474 -246703 -94926 292722
37356B92722J56487l50753l49966J85493L29472k03753m64131P5734N04715K9283
$$ 292722 449209 98456 -251510 -66017 263455 59702 -404429 -328695 176020 205303
37346B05303o17993m41711J58332K26208r9180n8398K75860K85989K6485j7302
$$ 205303 -412690 -854401 -696069 -469861 -569041 -627439 -351579 -65590 -39105 -56407
37336e6407O5559q6286k53087p6635J30864k8668j91526P9961L66045J38365j97037
$$ -56407 9152 -77134 -330221 -406856 -275992 -304660 -496186 -416225 -50180 88185 -108852
37325a08852n4723J85717q2400m46275j80494L61487L28990j16238j44495K51331
$$ -108852 -163575 22142 -60258 -506533 -687027 -325540 3450 -112788 -257283 -5952
37315e952L51074L1980j52062k0228J11196J39635J49667m962l21072l18429J55757
$$ -5952 345122 377102 225040 204812 316008 455643 605310 600348 279276 -39153 116604
37304A16604M24506P0675k60548l1314J54398k58677n71070p8496M83683J91976
$$ 116604 541110 611785 351237 319923 474321 215644 -355426 -433922 49761 241737
37294B41737l38044q4353M33161J25182n38279l20803M61782M51676l16561n37601
$$ 241737 -96307 -180660 252501 377683 -160596 -481399 -19617 432059 115498 -422103
37284d22103K0191K98988J2038l2600K82636J67732l52975l15077L50825N73551
$$ -422103 -401912 -102924 -90886 -123486 159150 326882 -26093 -341170 9655 583206
37274E83206J8704m05369k19164r191r4951l9139K15035J33549k21253j68886
$$ 583206 601910 196541 -22623 -31814 -126765 -165904 49131 182680 -38573 -207459
37264b07459K27592J76784l02905l22221K13088L84635l8510k07462J71239L21991
$$ -207459 20133 196917 -105988 -428209 -215121 169514 131004 -76458 94781 416772
37254D16772p0408k86170K461J33421j99616l35528O8368L73302J34270j89477
$$ 416772 346364 60194 62655 196076 -3540 -339068 -270700 102602 236872 47395
37244D7395j94008j37164j64557K4514L65618L14291j34102l23319q4160L5413
$$ 47395 -146613 -283777 -448334 -423820 -58202 256089 121987 -201332 -285492 -250079
37234b50079j24727j01449J51520J36250j10935m868L65645K56571l03795m23036
$$ -250079 -374806 -476255 -324735 -188485 -299420 -304288 61357 317928 14133 -408903
37224d08903P2718L14104l3118k24584J18263L47941O8913j66518L1425K25480
$$ -408903 -336185 -22081 -55199 -279783 -161520 186421 255334 88816 120241 345721
37214C45721J01951J8436J48131J00479k08447l04084r1307m1160k01935q1665
$$ 345721 447672 466108 614239 714718 506271 202187 110880 69720 -132215 -213880
37204b13880K86377K85057r6097j83410J05252J45605q7832M8781M51008K45746
$$ -213880 72497 357554 261457 78047 183299 328904 241072 289853 740861 986607
37194I86607n15225o73628Q0999O07431K42181j64117J36864N39011K99101k09233
$$ 986607 471382 -202246 -121247 486184 728365 564248 701112 1240123 1539224 1329991
37184A329991l37932k37589k82018l09685j33459m295k4170J02476L31254J81248
$$ 1329991 992059 754470 472452 162767 29308 25013 843 103319 434573 615821
37174F15821k74563k97781K60232N87768K07442l16334l66865p5218K05208L64663
$$ 615821 341258 43477 303709 891477 1098919 782585 415720 340502 545710 910373
37164I10373K47101k38699o03910k91106L05073L43499n3213p7246K35023J34825
$$ 910373 1157474 918775 314865 23759 328832 672331 619118 541872 776895 911720
37154I11720k87212k19553K21441J11942m43461l55877L81946N20718k12060n83268
$$ 911720 624508 404955 626396 738338 294877 -61000 320946 841664 629604 46336
37144D6336n8380L31254l2027l21784J6337K48010r7363k82594J37259L98146
$$ 46336 -12044 319210 287183 -34601 -18264 229746 132383 -150211 -12952 385194
37134C85194P020l08347j1578K63920N624k38868k9914J42233m6259j05700J51625
$$ 385194 392214 83867 72289 336209 341833 102965 73051 215284 169025 63325 214950
37123B14950J55195j70882q7591M63357N32040r6327m13305n2053M7618m70955
$$ 214950 370145 199263 111672 575029 1107069 1010742 597437 545384 593002 122047
37113A22047o11162K3362L24777k72580o29292O8298Q07378N31430j32974k11917
$$ 122047 -489115 -465753 -140976 -413556 -1042848 -974550 -167172 364258 231284 19367
37103A9367l883r6477j22746K55871M06937m8221l21918J06822M31292L759m28786
$$ 19367 15484 -80993 -203739 52132 459069 410848 88930 195752 627044 630803 202017
37092B02017j30480K74779N3474k75477l1830L32745J99139n5186N9374J71829
$$ 202017 71537 346316 399790 124313 92483 425228 624367 569181 628555 800384
37082H00384m4760j00839K53618L55912j14854m29471j81380m8167l57994l34946
$$ 800384 755624 654785 908403 1264315 1149461 719990 538610 490443 132449 -202497
37072b02497L25525O30963L3492n03303k17388J74831j1825j63283K54875N36760
$$ -202497 123028 753991 787483 284180 66792 241623 229798 66515 321390 858150
37062H58150J23038k78079p8337J09618j63671k40850J82839K57148l01354l96075
$$ 858150 981188 703109 624772 734390 570719 329869 512708 769856 468502 72427
37052G2427L94186P51161j01908q83668m53083K70882J37308k29822R2548M84950
$$ 72427 466613 1217774 1115866 232198 -220885 49997 187305 -42517 50031 534981
37042E34981J31981l03785l4249K77023q8394l87298R5253N11774L4633m92443
$$ 534981 666962 363177 328928 605951 517557 130259 225512 737286 771919 279476
37032B79476j18195M56589L00638m4807J07843J03808n64115q61808l8457P40019
$$ 279476 161281 617870 918508 873701 981544 1085352 521237 -340571 -379028 360991
37022C60991L57041k60802M5686N06837M5374n42885j28919N13487J61616n33561
$$ 360991 718032 457230 502916 1009753 1055127 512242 383323 896810 1058426 524865
37012E24865l25168L06173K23125j91252m359L03157j06790n68108j17866N65430
$$ 524865 199697 505870 728995 537743 533384 836541 729751 161643 43777 609207
37002F09207L80087j90725j76962n420l96632o63292l9003N94827K43085k89230
$$ 609207 989294 798569 621607 616187 219555 -443737 -482740 112087 355172 65942
36992F5942M1437M75413p688n83556j49073M75482J15165m47783j4714O15523
$$ 65942 107379 582792 575104 -8452 -157525 317957 433122 -14661 -29375 586148
36982E86148J50512o49110l62354M37184L61966j77276K3479N20043K02444m14321
$$ 586148 736660 87550 -274804 162380 524346 347070 370549 890592 1093036 678715
36972F78715k45489J64780j79875n67077O2455Q44787M69299l43309k40214K11667
$$ 678715 433226 598006 418131 -148946 -86491 758296 1227595 884286 644072 855739
36962H55739j59232o30209Q071Q66187M47120n19032m10818L15897J84730m42623
$$ 855739 696507 66298 74369 940556 1387676 868644 457826 773723 958453 515830
36952E15830k61672L32998J49979l53195r3671L36713p6395n03885J75385R39456
$$ 515830 254158 587156 737135 383940 290269 626982 550587 46702 222087 1161543
36942A161543L80181n42582k10568O75292N84733N9868K90600M54839n31888j324698
$$ 1161543 1541724 999142 788574 1463866 2048599 2108467 2399067 2853906 2322018 997320
36932I97320l62445R34315M64670p60563n59305L91222R1123q16672l93054P18790
$$ 997320 634875 1569190 2033860 1273297 713992 1105214 1196337 379665 -13389 705401
36922G05401N59689l28872j24752N58804k2290j035640n23490P15801N59765m13967
$$ 705401 1265090 936218 811466 1370270 1347980 312340 -211150 504651 1064416 650449
36912F50449k14345O02463K12586o31804q6285Q92099K84291q43736k27770J078041
$$ 650449 436104 1038567 1251153 619349 533064 1425163 1709454 865718 637948 1715989
36902A715989N49296r27389o58559P81386Q13055j82000L0704Q41799J22522j144579
$$ 1715989 2265285 1337896 679337 1460723 2273778 2091778 2122482 2964281 3086803 1942224
36892A942224n73838P28335J21010j269044n82043J059704N61882j030107m49188
$$ 1942224 1368386 2096721 2217731 948687 366644 1426348 1988230 958123 508935
36883E08935J306013P57808j180856p96434J178268Q64251j202809j022626J079985
$$ 508935 1814948 2572756 1391900 595466 1773734 2637985 1435176 412550 1492535
36874A492535J028472j077690j156942Q96361J071117q80157j076246P62528R07695
$$ 1492535 2521007 1443317 286375 1182736 2253853 1373696 297450 1059978 1967673
36865A967673p73146n86701J314148R90322j235313j006944J427411J348924j214619
$$ 1967673 1194527 607826 1921974 2912296 1676983 670039 2097450 3446374 2231755
36856B231755j328275J186318J264580j376464j472525J376715J646811j285135
$$ 2231755 903480 2089798 3354378 1977914 505389 1882104 3528915 2243780
36848B243780j714154J218024J755455j015912j238244J840659J916491j707575
$$ 2243780 529626 1747650 3503105 2487193 1248949 3089608 5006099 3298524
36840C298524k002836K020459K645054j641000k581178J929648L248231j192610
$$ 3298524 1295688 3316147 5961201 4320201 1739023 3668671 6916902 5724292
36832E724292k286587K876717M381043j231604k950845L695833O719600N27272
$$ 5724292 3437705 6314422 10695465 9463861 6513016 10208849 16928449 17455721
36824A7455721j843025O200920R869434J502473m12632J4914152K3977357J0446949
$$ 17455721 15612696 21813616 31683050 33185523 32772891 47687043 71664400 82111349
36816H2111349Q076527N2943959J06403797Q6635654j4477682j03980211j03209524
$$ 82111349 90187876 143131835 249535632 336171286 321693604 217713393 114503869
36809A14503869m2467524m191924j1419541k1944958r892854L321097j444771
$$ 114503869 72036345 67844421 56424880 34479922 24587068 27908165 26463394
36802B6463394r476914m414720L405547j15249o825253l358296M114907K494224
$$ 26463394 16986480 12571760 15977307 15862058 9036805 5678509 9793416 12287640
36794A2287640l995215k539191M210843L470246l422846l129764M703755O097647
$$ 12287640 8292425 5753234 9964077 13434323 10011477 6881713 11585468 17683115
36786A7683115j182844k341684O924262J0565021J851553p78093J3460185K2903861
$$ 17683115 16500271 14158587 21082849 31647870 33499423 32721330 46181515 69085376
36778F9085376J0709494O057458M4734930R6576059Q5491244m531635r2527588
$$ 69085376 79794870 85852328 130587258 227163317 312654561 308122926 215595338
36771B15595338r9374391m4572891n360128r789075k0607451j0463242K294152
$$ 215595338 116220947 71648056 66287928 56498853 35891402 25428160 27722312
36764B7722312j680072r364583m605352L338533R64290m628746j814607L761285
$$ 27722312 26042240 16677657 12072305 15410838 16375128 11746382 9931775 13693060
36756A3693060J969708k349224J52545N631607N401155J691836R38071O00958
$$ 13693060 15662768 13313544 13466089 19097696 24498851 26190687 27128758 27729716
36748B7729716l966825p931657n116791k42025q30242l840948k253226J545523
$$ 27729716 23762891 15831234 10714443 10472418 9642176 5801228 3548002 5093525
36740E093525R11548k230283j564710J393206P40501k171132j610146J367151
$$ 5093525 6005073 3774790 2210080 3603286 4343787 2172655 562509 1929660
36732A929660J236865j297608j074472J393231J245504j170412j266856Q46700
$$ 1929660 3166525 1868917 794445 2187676 3433180 2262768 995912 1842612
36724A842612J056124n47111l52825J232630P89947r17828l26784J719660J528465
$$ 1842612 2898736 2351625 1998800 3231430 4021377 3103549 2776765 4496425 6024890
36715F024890j07458N33985K665570K527046R91370K012846M490828L425629j202631
$$ 6024890 5917432 6451417 9116987 11644033 12635403 14648249 19139077 22564706 21362075
36706B1362075m158017l536474k589958k840432k219708n36726l34622j593729
$$ 21362075 17204058 13667584 11077626 8237194 6017486 5480760 5146138 3552409
36698C552409j459634J97021N03844q08047r76290L72351P32952j67764o9315
$$ 3552409 2092775 2289796 2793640 1985593 1009303 1381654 2114606 1946842 1877527
36689A877527R00407L14026j416198j325232M75516P86539p74814j194792J89774
$$ 1877527 2777934 3091960 1675762 350530 826046 1612585 837771 -357021 -167247
36680a67247O85539m07500o64423M70343O34091o13181q15732N37904R67760j93426
$$ -167247 518292 110792 -553631 -83288 550803 -62378 -878110 -340206 627554 434128
36670D34128o01814M44476P33510l54022n65391P54452J271925P6126p04323n3544
$$ 434128 -167686 276790 1010300 656278 90887 845339 2117264 2193390 1489067 1435523
36660A435523K22414o66644r02358K16085P35602k26382p93150J13857R01652
$$ 1435523 1657937 991293 88935 305020 1040622 814240 21090 134947 1036599
36651A036599M50078o7171J42442O6604o28426o71386J60995L83521k94112l67968
$$ 1036599 1486677 1419506 1561948 1628552 1000126 328740 489735 873256 579144 211176
36641B11176M04958M69927l08511j96476Q83129Q41343o40873j218330m1876P41786
$$ 211176 616134 1086061 777550 581074 1464203 2305546 1664673 446343 404467 1146253
36631A146253m1207o49452L3387M65808l01420o28162N14390J369298M77461p84259
$$ 1146253 1105046 455594 488981 954789 653369 25207 539597 1908895 2386356 1602097
36621A602097p85102k73014m37728o40936m5668N34339K44290j91225l9924M8246
$$ 1602097 816995 543981 106253 -534683 -580351 -46012 198278 7053 -32871 15375
36611A5375l75530m33386K87656O72791R6472l42410J47301O18656K31487k62766
$$ 15375 -360155 -793541 -505885 166906 263378 -79032 68269 686925 918412 655646
36601F55646j05155J21141j05226j48714L72606O75587L03407l3038N1809r2323
$$ 655646 550491 671632 566406 417692 790298 1465885 1769292 1736254 1788063 1695740
36591A695740o16231o43021j3586K05374l21756n47381m7153K06235j91686k72196
$$ 1695740 1079509 436488 422902 628276 306520 -240861 -288014 -81779 -273465 -545661
36581e45661L47660O28531Q1826l01830M4430K73522j15203l31808O0410L12545
$$ -545661 -198001 430530 512356 210526 254956 528478 413275 81467 141877 454422
36571D54422N6688l3773K07308L4643n03318l76827L71724M38599l20657m74261
$$ 454422 511110 477337 684645 719288 215970 -160857 210867 649466 328809 -145452
36561a45452L40654O67477q3728n56840q163L91436j05929m64043j2755K51074
$$ -145452 195202 862679 778951 222111 213948 605384 499455 35412 22657 273731
36551B73731k52901m49647K68901P60422K59223k43638j6358O6909n04823o42316
$$ 273731 20830 -428817 -159916 600506 859729 616091 599733 666642 161819 -480497
36541d80497K17543P87390J89776m42659j11287K77509j68041n79553j27700L08617
$$ -480497 -262954 524436 714212 271553 160266 437775 269734 -309819 -437519 -128902
36531a28902o5251l26832L02279P62808R9993o40613k96423L07983L6642l96348
$$ -128902 -194153 -520985 -218706 544102 644095 3482 -292941 15042 51684 -344664
36521c44664O3410O48894K08157n38797k99902M04449K71173l84085l47251K14711
$$ -344664 -281254 367640 575797 37000 -262902 141547 412720 28635 -318616 -103905
36511a03905K24862k27562k00258K49446K90736n3459j03852P9546m3745k77903
$$ -103905 120957 -106605 -306863 -57417 233319 179860 76008 155554 111809 -166094
36501a66094q0293K79360J89962j41545j37339O6656L4473o0271P4386J14799
$$ -166094 -246387 32973 222935 81390 -55949 10707 45180 -15091 59295 174094
36491A74094j77527k81288J25647L88944K0276l23498l0566K89960n4611n15975
$$ 174094 -3433 -284721 -159074 229870 250146 -73352 -103918 186042 131431 -384544
36481c84544l22548J21002R7359o3787K29840N44893K28704k77242k22957Q2722
$$ -384544 -707092 -586090 -488731 -552518 -322678 222215 450919 173677 -49280 33442
36471C3442m6170l35978j56831K08485J34366j40290n8188J32520n0404k67115
$$ 33442 -12728 -348706 -505537 -297052 -162686 -302976 -361164 -228644 -279048 -546163
36461e46163l437L62488K46677l8703M8724K01895n7429l31979r6031K25830N3722
$$ -546163 -549600 -187112 59565 20862 69586 271481 214052 -117927 -213958 11872 65594
36450F5594k06798K5470L11973L1571l26874j1572N24853L60915k61332l99500
$$ 65594 -141204 -115734 196239 227810 -99064 -110636 414217 775132 513800 114300
36440A14300l6205Q6959j22918j40352M7807K1106j32276j7138K07489J33269
$$ 114300 78095 165054 42136 -98216 -50409 -29303 -161579 -178717 28772 162041
36430A62041p2915m3580K4171j46469j93161K08152N41504K89342o7886Q2236
$$ 162041 89126 45546 69717 -76752 -269913 -61761 479743 769085 701199 783435
36420G83435L01728p3087n89481m22686J09664J04923l14170k99771J53657K85106
$$ 783435 1085163 1012076 422595 -91 109573 214496 -99674 -399445 -245788 39318
36410C9318q620j00565J41012K26888N5993j6968j4138k33659m59182k42702J85147
$$ 39318 30698 -69867 71145 298033 354026 337058 322920 89261 -369921 -612623 -427476
36399d27476K35743K92J7301K22469J24207j64918r6944K44327K65071k7375m5086
$$ -427476 -191733 -191441 -174140 48329 172536 7618 -89326 155001 420072 392697 347611
36388C47611K62533L09858k4847j55859J57233L83379J78602N5361O07426J465567
$$ 347611 610144 920002 895155 739296 896529 1279908 1458510 1513871 2121297 3586864
36378C586864J540956L34355j271203j831493j024460p4192r1082n43010k55516
$$ 3586864 5127820 5462175 4190972 2359479 1335019 1260827 1169745 626735 371219
36369C71219N40150N40493l50917p31284l4978N28375P8063n31203l85665m5460
$$ 371219 911369 1451862 1100945 369661 334683 863058 941121 409918 24253 -21207
36359b1207k04168k71518L15451P14718J65634l97383P3807P27855L27969k72212
$$ -21207 -225375 -496893 -181442 533276 698910 301527 375334 1103189 1431158 1158946
36349A158946N51909K081181J947558j85105k006167j910298q47094k89733k56232
$$ 1158946 1710855 3792036 5739594 5554489 3548322 1638024 790930 501197 244965
36340B44965j49761k5172j03144j31094K4188K8047j61262n9011L89921N19331
$$ 244965 95204 70032 -33112 -164206 -140018 -111971 -273233 -332244 57677 577008
36330E77008N2167l57837j72570K23012K47664k8631k37760l16071l07363q1312
$$ 577008 629175 271338 98768 321780 569444 540813 303053 -13018 -320381 -401693
36320d01693L31596N47617L34277l4692j96852j51119p7975k4952K1907N383r1612
$$ -401693 -70097 477520 811797 777105 580253 429134 351159 326207 348114 353497 261885
36309B61885j74901j69562r4796o372K9694j8615m5183R0705K74294K09857r7608
$$ 261885 86984 -82578 -177374 -183746 -154052 -172667 -217850 -127145 147149 357006 259398
36298B59398k67038j14528O5568k859j81802k40176j82535n1894J82456L63162
$$ 259398 -7640 -122168 -56600 -59459 -241261 -481437 -663972 -715866 -533410 -170248
36288a70248K33698o0133q5652J38616J46924j18265j99183j902R1074J47577
$$ -170248 63450 3317 -82335 56281 203205 84940 -114243 -116145 -25071 122506
36278A22506O65181J335775J063394k40991j137027o90432J65215K14419k48307
$$ 122506 787687 2123462 3186856 2945865 1808838 1118406 1283621 1498040 1249733
36269A249733l05765n8163j29652l52099j77915K35782M51609O04428Q12341N12185
$$ 1249733 943968 885805 756153 404054 226139 461921 913530 1517958 2330299 2842484
36259B842484n08123j223771p54824J26026J77484l48346l53410J41247K26647
$$ 2842484 2334361 1110590 355766 481792 659276 310930 -42480 98767 325414
36250C25414j48482k11644J22829K18159J0m6243L7391j43888l22597J0581M43784
$$ 325414 176932 -34712 88117 306276 306286 260043 297434 153546 -169051 -158470 285314
36239B85314J95708m36645n05890l2371J67144J8981J26023L61333M4551n59855
$$ 285314 481022 44377 -461513 -493884 -326740 -307759 -181736 179597 224148 -335707
36229c35707m62514K92375O02694J69836j11747J52249K54276j59509m21349j16849
$$ -335707 -798221 -505846 96848 266684 154937 307186 561462 401953 -19396 -136245
36219a36245J94767N5882j54270m9563J26837J19978R2036J13659m473j71139
$$ -136245 58522 114404 -39866 -89429 37408 157386 249422 363081 358608 187469
36209A87469p6517J14383m5511l82045l02282J01684J55009j63648j58864L07900
$$ 187469 110952 225335 179824 -202221 -504503 -402819 -247810 -411458 -570322 -262422
36199b62422N66570L24489M3641n0027k69940n69576m17414J47675L72946K3612
$$ -262422 304148 628637 672278 622251 352311 -217265 -634679 -487004 -114058 -90446
36189i0446k28593J9211K94057J81075l1375k4594L4391m187K2687J17096L4375
$$ -90446 -319039 -299828 -5771 175304 143929 119335 153726 149539 172226 289322 323697
36178C23697j61435j40768K9779J785j07074Q9696L74457J97295k41519k27370
$$ 323697 162262 21494 51273 53058 -54016 35680 410137 607432 365913 138543
36168A38543J80897K34884j15373j50000J99769J73233l36125m58836R4726M54733
$$ 138543 319440 554324 438951 288951 488720 661953 325828 -133008 -38282 416451
36158D16451Q5308l57657k57248J930n1014j23631J00686K83919J30552n5392
$$ 416451 501759 144102 -113146 -111216 -162230 -285861 -185175 98744 229296 173904
36148A73904n1795j41382l83873l33013N9525J70204j91836l58949Q062K99759
$$ 173904 122109 -19273 -403146 -736159 -676634 -506430 -698266 -1057215 -1049153 -749394
36138g49394R7867p8762J70428L31226m875k80587J3372L42606P6535l43588j73525
$$ -749394 -651527 -730289 -559861 -228635 -233510 -514097 -500725 -158119 -81584 -425172 -598697
36127e98697L33718M02489K8519j62002n47J45382J26898R1674K0570j70110k78295
$$ -598697 -264979 137510 166029 4027 3480 148862 275760 367434 388004 217894 -60401
36116f0401j23366M5011m8385j79948j4463K73616K80076K2096j74451k20170
$$ -60401 -183767 -138756 -187141 -367089 -381552 -107936 172140 194236 19785 -200385
36106b00385k49731k50835j03696J43999L31187L72042K25930q8590l30981k11081
$$ -200385 -450116 -700951 -804647 -660648 -329461 42581 268511 179921 -151060 -362141
36096c62141J48741K85330N3073j86126j52730L599Q1370J04182Q0762o4948k01326
$$ -362141 -213400 71930 125003 -61123 -213853 -210254 -128884 -24702 56060 -8888 -210214
36085b10214p9740J91749K39474L7420r1440r5553k10514l45557j52815K31925
$$ -210214 -289954 -98205 141269 178689 87249 -8304 -218818 -564375 -717190 -485265
36075d85265K71786l5874r4700K59431M79296K74011K7944o664r4836k96164k18401
$$ -485265 -213479 -249353 -344053 -84622 394674 668685 696629 689965 595129 298965 80564
36064H0564J45789J99987k18859m44172r9082K41744O4455k33385j40381Q0586
$$ 80564 226353 426340 207481 -236691 -335773 -94029 -29574 -262959 -403340 -322754
36054c22754L486j32381N0682K73224Q3567k92545k94570R4059M11812M12608
$$ -322754 -319268 -451649 -400967 -127743 -44176 -336721 -631291 -537232 -125420 287188
36044B87188K13491j2229j24547n3684J8572j49528l58996j56763L50307N07607
$$ 287188 500679 488450 363903 310219 328791 179263 -179733 -336496 13811 521418
36034E21418J40874j49652j5225R1615j98208m89798l39608J6982J79719K14966
$$ 521418 662292 512640 497415 589030 390822 -98976 -438584 -421602 -241883 -26917
36024b6917K67805J43710k09486l77898j42304R6916K4930n1409J42907K80092
$$ -26917 240888 384598 175112 -202786 -345090 -248174 -223244 -274653 -131746 148346
36014A48346M8781k41616k26240j03707j54682j84022K3962K15404J41070J0241
$$ 148346 197127 -44489 -270729 -374436 -529118 -713140 -689178 -473774 -332704 -322463
36004c22463J6447l5540k01817j30769K22437L03860j05086l85247q7689K93903
$$ -322463 -306016 -341556 -543373 -674142 -451705 -147845 -252931 -638178 -725867 -431964
35994d31964K05409m5556L1289K08327R4331o4397N8696J34303j72079m19290
$$ -431964 -226555 -272111 -240822 -32495 61836 -2561 56135 190438 18359 -400931
35984d00931j35418K35922O8016l01341j54438L17362L53092o6615k73413p1030
$$ -400931 -536349 -300427 -232411 -533752 -688190 -370828 -17736 -84351 -357764 -428794
35974d28794J17450J21096J53822J87302J3306j75658m3630J78878J4756l57896
$$ -428794 -311344 -190248 -36426 150876 164182 -11476 -55106 123772 138528 -219368
35964b19368l21312J36545L79212J27717k12362k75960j54377l2960M1309Q966
$$ -219368 -540680 -404135 -24923 102794 -109568 -385528 -539905 -572865 -531556 -522590
35954e22590j20678j01096J95408M09110J74013k24090k30204J11757K74880J04915
$$ -522590 -643268 -744364 -548956 -139846 34167 -189923 -420127 -308370 -33490 71425
35944G1425n9647n5905p8240j88284j86075j4186J53051K33933K67205J64587
$$ 71425 11778 -44127 -122367 -310651 -496726 -510912 -357861 -123928 143277 307864
35934C07864j69016n10341m91211r1159L29909M56038K72712J0241k7425K30327
$$ 307864 138848 -371493 -862704 -953863 -623954 -167916 104796 115037 87612 317939
35924C17939M03117P7374m91004n92468j23936K06824O196k10611J2297K73339
$$ 317939 721056 798430 307426 -285042 -408978 -202154 -195958 -406569 -394272 -120933
35914a20933J06724j32696N8856L77372K61242r7671j54111l488j01678l37623
$$ -120933 -14209 -146905 -88049 289323 550565 452894 298783 295295 193617 -144006
35904a44006k60272M5632J46720O4065Q3195N4273k74213n23030j97364L28230
$$ -144006 -404278 -358646 -211926 -147861 -64666 -10393 -284606 -807636 -1005000 -676770
35894f76770L10069r4760r6676L23251L86779r3058m05631j87594O6108J274m7326
$$ -676770 -366701 -461461 -558137 -234886 151893 58835 -346796 -534390 -468282 -467008 -514334
35883e14334J48587K40794L5815p4356J55010L37243J47025j02225l2454J55544
$$ -514334 -365747 -124953 -89138 -163494 -8484 328759 475784 373559 341105 496649
35873D96649P4239k12352l63868k76579p8524J37093L01401L11466J84504P3009
$$ 496649 570888 358536 -5332 -281911 -360435 -223342 78059 389525 574029 647038
35863F47038J3955j02470k49929k43606p9406P029q4877j70074r0988Q0795K23156
$$ 647038 660993 558523 308594 64988 -14418 -7389 -92266 -262340 -353328 -272533 -49377
35852d9377K92063K28937o234k76223l81055l34433k88677k29152l1442K15456
$$ -49377 242686 471623 465389 189166 -191889 -526322 -814999 -1044151 -1075593 -860137
35842h60137K67267J08683k7902l7854l5165n0779M3937K45645L34634J91199
$$ -860137 -592870 -484187 -512089 -549943 -585108 -635887 -591950 -346305 -11671 179528
35832A79528j5992p0243J1182M3088m8345j07012M1396K72171K19930j95257m98656
$$ 179528 163536 93293 104475 147563 99218 -7794 33602 305773 525703 330446 -168210
35821a68210k51308K43162L08110r5674l39305j57480K90j34708j58784J94203
$$ -168210 -419518 -176356 131754 36080 -303225 -460705 -460415 -595123 -753907 -559704
35811e59704M59109K12840j57972r4926K17953K35809m6648k19308j61185l7971
$$ -559704 -100595 112245 -45727 -140653 77300 313109 266461 47153 -114032 -152003
35801a52003J00208J99174L4161l34704l75685R6909M22841O6875m36737k97110
$$ -152003 -51795 147379 181540 -153164 -528849 -431940 -9099 57776 -378961 -676071
35791f76071K57523M23974J59250P5580K47873J63287k15825l33211m5449J40860
$$ -676071 -418548 5426 164676 240256 488129 651416 435591 102380 56931 197791
35781A97791k6390j81964n4506J26191J06454m5512j80796k15511m7782K48790
$$ 197791 171401 -10563 -65069 61122 167576 122064 -58732 -274243 -322025 -73235
35771g3235K81237j41636n47654l95889J05992L65741L08702K51862J74561j15656
$$ -73235 208002 66366 -481288 -877177 -771185 -405444 -96742 155120 329681 214025
35761B14025l40814j08630K80035K25501j39973j92490P1875J04973j24241j18846
$$ 214025 -126789 -235419 44616 270117 130144 -62346 9529 114502 -9739 -128585
35751a28585J23820R0397k12413k12747J38198K37795n9202j98519J5022J07196
$$ -128585 -4765 85632 -126781 -339528 -201330 36465 -22737 -221256 -206234 -99038
35741i9038q0488q3973K13580K79699n6948k45365l8095P0241j47064j63032K60584
$$ -99038 -179526 -263499 -49919 229780 172832 -72533 -110628 -40387 -187451 -350483 -89899
35730h9899M83156P1594l72053j86161K72984K83918j02126l23705k45227j33137
$$ -89899 393257 464851 92798 -93363 179621 463539 361413 37708 -207519 -340656
35720c40656n5988P5992J58439Q4935K1176R0842J05579m8247j32614j0440M1821
$$ -340656 -396644 -320652 -162213 -77278 -56102 34740 140319 92072 -40542 -50982 -9161
35709i161j60405l16674j45448J23838J60135N1071K7014L4552l2058k4645J61360
$$ -9161 -169566 -486240 -631688 -507850 -347715 -296644 -269630 -235078 -267136 -291781 -130421
35698a30421L04638K03633r680j66690l04389l72131j50089K53700L25927p3269
$$ -130421 174217 377850 368170 201480 -102909 -475040 -625129 -371429 -45502 -118771
35688a18771l58880p8050L65653L48346m0731k62265j86563j09000j36126j10845
$$ -118771 -477651 -555701 -190048 158298 117567 -144698 -331261 -440261 -576387 -687232
35678f87232j9868J626q262R3950K36692K13789K7879j11893p9125O8044J86281
$$ -687232 -707100 -705474 -713736 -619786 -383094 -169305 -141426 -253319 -332444 -264400 -78119
35667g8119J33168r9583k72633j41724J41272J83253l2739q9118J74341L64996
$$ -78119 55049 -44534 -317167 -458891 -317619 -134366 -167105 -256223 -81882 283114
35657B83114J70579j46002k00290o2300k9525j25000j68891j21221n4437K2639
$$ 283114 453693 307691 107401 45101 15576 -109424 -278315 -399536 -453973 -431334
35647d31334Q3655L3587q1947n8162J22170K02779O3012r8712j33263j37991j33565
$$ -431334 -347679 -314092 -396039 -454201 -332031 -129252 -66240 -164952 -298215 -436206 -569771
35636e69771M8153L52334M08715J08773j48169q1315K3202j56712l97341k97281
$$ -569771 -521618 -169284 239431 348204 200035 118720 141922 -14790 -412131 -709412
35626g09412Q3303L65268L87637K32908m4509l44222l88963m5994L72778M60984
$$ -709412 -626109 -260841 126796 359704 315195 -29027 -417990 -463984 -91206 369778
35616C69778K35969K5524j7959j0769o1471j53267k28204k18681q5782P4013J05072
$$ 369778 605747 631271 613312 602543 541072 387805 159601 -59080 -144862 -70849 34223
35605C4223L8452N4054J43970Q9346j39730k71207j50133K9903O1251k579n0984
$$ 34223 72675 126729 270699 360045 220315 -50892 -201025 -171122 -109871 -112450 -163434
35594a63434j01710j32127j3936K29176L64359K77280J01664n2508k08107l10555
$$ -163434 -265144 -397271 -411207 -182031 182328 459608 561272 508764 300657 -9898
35584i898k45976j17671j45460k59535j88863M0576J49281J37117K41187L62255
$$ -9898 -255874 -373545 -519005 -778540 -967403 -926827 -777546 -640429 -399242 -36987
35574c6987J62871k10974k21190J19916J82121j77075k84352J87560N73108K81350
$$ -36987 125884 -85090 -306280 -186364 -4243 -181318 -465670 -278110 294998 576348
35564E76348k44808k98886j073R9513j4957j0084P5483L547r2599K1932J36831
$$ 576348 331540 32654 31581 131094 116137 106053 181536 185083 92484 114416 251247
35553B51247m4708k80845j57753J67486K16804k6783j89374j68048j39133q4959
$$ 251247 206539 -74306 -232059 -64573 152231 125448 -63926 -231974 -371107 -456066
35543d56066J08392K41669O4661j92732j17033J88154K67619P5887j4033Q7273
$$ -456066 -347674 -106005 -41344 -234076 -351109 -162955 104664 180551 166518 253791
35533B53791O3620j89985l62025k43682k3544N8767K5728K6907J20240K32527
$$ 253791 317411 127426 -234599 -478281 -501825 -443058 -417330 -390423 -270183 -37656
35523c7656K00924o8211l63368l00705J22656L88805J44502k67525l05888J7392
$$ -37656 163268 95057 -268311 -569016 -446360 -57555 86947 -180578 -486466 -469074
35513d69074K74818K71510J38409k0844j64004j63426l578N8707j17659k49396
$$ -469074 -194256 77254 215663 194819 30815 -132611 -136189 -77482 -195141 -444537
35503d44537q5390J16465J8710j80623r2156J55272J39051j01561j46374P4021
$$ -444537 -529927 -413462 -394752 -575375 -667531 -512259 -373208 -474769 -621143 -547122
35493e47122K26271J96627J83699J96958M1680j83282j44452J14113J70256p3753
$$ -547122 -320851 -124224 59475 256433 298113 114831 -29621 84492 254748 180995
35483A80995k27262q5791N3160m8324j63902k9628J98648K06277j8298k28518
$$ 180995 -46267 -132058 -78898 -127222 -291124 -320752 -122104 84173 65875 -162643
35473a62643k46092o8328J90297L34100K16749n7354j99756q8798P8720O7035
$$ -162643 -408735 -477063 -286766 47334 264083 206729 6973 -81825 -3105 63930
35463F3930q2894j19915P3773K89268K12735j36391l24087m0010L95983L91325
$$ 63930 -18964 -138879 -65106 224162 436897 300506 -23581 -63591 332392 723717
35453G23717q3580m42012l45600j33276j67694k55779q9832J68195K02340J00674
$$ 723717 640137 198125 -147475 -280751 -448445 -704224 -794056 -625861 -423521 -322847
35443c22847J17720J65213L5361j12155p09K22363K08831Q546o7946l5508j41108
$$ -322847 -205127 -39914 -4553 -116708 -117417 104946 313777 322323 254377 218869 77761
35432G7761k91612j44268K51406M38792K27945p5276j67547p5845M9038J08357
$$ 77761 -213851 -358119 -106713 332079 560024 484748 317201 241356 290394 398751
35422C98751J6136j96678k87931j24048L6139o2869j86791J1640L16751K32467
$$ 398751 414887 218209 -69722 -193770 -157631 -220500 -407291 -395651 -78900 153567
35412A53567j65853l03756k5413K11515J34333L334J0121l9651k07085j78567
$$ 153567 -12286 -316042 -341455 -129940 4393 7727 17848 -21803 -228888 -407455
35402d07455J42627L33404J06877j89607j37710Q8286P3315j33337j55396N3097
$$ -407455 -264828 68576 175453 -14154 -151864 -63578 9737 -123600 -278996 -225899
35392b25899J65838L7799j14478j08483k9858O320N0521J45219J63321M02j85580
$$ -225899 -60061 -22262 -136740 -245223 -275081 -268761 -218240 -73021 90300 90702 -94878
35381i4878j32596J41322L13105J84121n3701j27576p9604j12183j86663j18257
$$ -94878 -227474 -86152 226953 411074 357373 229797 150193 38010 -148653 -266910
35371b66910P877o3476k34005j07004L23933N48056L09931k771l9680l0764k41743
$$ -266910 -259033 -322509 -556514 -663518 -339585 208471 518402 515631 475951 445187 203444
35360B03444l96755j79187J25291R8231o0184P8890L26226J67486k76350l68706
$$ 203444 -193311 -372498 -247207 -148976 -209160 -130270 195956 363442 87092 -281614
35350b81614M856K79778J52194m3945m0354m3705k15205l20176j65063Q1676K32695
$$ -281614 -276758 3020 155214 111269 70915 27210 -187995 -508171 -673234 -591558 -358863
35339c58863L26963L52388J54882j86598l16111j31834M0435m019m3764J02001
$$ -358863 -31900 320488 475370 288772 -27339 -159173 -118738 -122757 -166521 -64520
35329f4520K19895J01805o8320m8338M2655k4026j48041o2665J93918K84466K7415
$$ -64520 155375 257180 188860 140522 183177 159151 11110 -51555 142363 426829 454244
35318D54244l64003n21253l04030P2823K84030K49491J52341R1521n2494k74616
$$ 454244 90241 -431012 -735042 -662219 -378189 -128698 23643 115164 62670 -211946
35308b11946k80922L0822K25494q3917n31995m42922J41961N03283L13612K1916
$$ -211946 -492868 -462046 -236552 -320469 -852464 -1295386 -1153425 -650142 -336530 -314614
35298c14614M0089J74968J30485K5902O7161J32614M3746q6803j02091j03501
$$ -314614 -274525 -99557 30928 56830 123991 256605 300351 213548 111457 7956
35288G956k05880k60735j24230L8328J9027o3694K9516K31126K48195J0801k09793
$$ 7956 -197924 -458659 -582889 -544561 -525534 -589228 -559712 -328586 -80391 -69590 -279383
35277b79383j46380J40196L16633J38408k37772l79900j04235K60845L11236J07732
$$ -279383 -425763 -285567 31066 169474 -68298 -448198 -552433 -291588 19648 127380
35267A27380oN1803K2506j40429k07934q8039M9310J04113J33674Q8428j40259
$$ 127380 127374 179177 201683 61254 -146680 -234719 -185409 -81296 52378 140806 547
35256E47l80216l16960k0705J17528L2505O0994K73774K96691l542k15890n5413
$$ 547 -379669 -696629 -717334 -599806 -567301 -506307 -232533 64158 60616 -155274 -210687
35245b10687J73240J17127q1079j36603r8408j07324p0000O6906R9750k9119k6826
$$ -210687 -37447 79680 -1399 -138002 -236410 -343734 -413734 -346828 -247078 -276197 -303023
35234c03023J88312J98468j87256m28116p3828L75199J86608l67519l76487K49260
$$ -303023 -114711 83757 -103499 -531615 -605443 -230244 -43636 -411155 -787642 -538382
35224e38382O17374K47221k56812k34803P7959J08019j10733j29817J02163J99703
$$ -538382 78992 326213 69401 -165402 -87443 20576 -90157 -219974 -117811 81892
35214H1892M689j92832j34701O0944J45274Q6159K0458l051o2317j67770j80936
$$ 81892 86581 -106251 -240952 -180008 -34734 51425 71883 68832 6515 -161255 -342191
35203c42191j0160J94350J86538k9510j63170l4691J46508P8839j57152j80255
$$ -342191 -352351 -158001 28537 -973 -164143 -198834 -52326 26513 -130639 -310894
35193c10894J15226L37170J19568l20393m25460n2861L23102K69751k7934j08993
$$ -310894 -195668 141502 261070 -59323 -484783 -537644 -214542 55209 27275 -81718
35183h1718M8187M8786k21161l76806j62159J22030J08926n3181K833K26376K54944
$$ -81718 -33531 15255 -205906 -582712 -744871 -622841 -513915 -567096 -564263 -337887 -82943
35172h2943K6618j62093j63291j18439r9319j8394Q4393O7500J9706J40153K68041
$$ -82943 -56325 -218418 -381709 -500148 -599467 -617861 -533468 -465968 -446262 -306109 -38068
35161c8068L8584m04639m33509J03118N22626K82136k16600k86566K1136J60972
$$ -38068 516 -404123 -837632 -734514 -211888 70248 -146352 -432918 -411782 -250810
35151b50810N4611J09877L80415M05745M776l58363k55487R4062K05135J6220
$$ -250810 -196199 -86322 294093 699838 704614 346251 90764 184826 389961 406181
35141D06181j46093j17217n6736r1742j06244J8022J62990J40813j3587j03906
$$ 406181 260088 142871 86135 -5607 -111851 -93829 69161 209974 196387 92481
35131I2481q5441j06178k04504j99646j0465J35796K9128j59078j11311J47778
$$ 92481 7040 -99138 -303642 -503288 -513753 -377957 -348829 -507907 -619218 -471440
35121d71440L01038K16722O4637j7336n1102k3497R2414J19008j32321m16044
$$ -471440 -170402 46320 110957 93621 42519 19022 111436 230444 98123 -317921
35111c17921k60248K63040M79733O9938m07487l15336J60501L77017J78581n4257
$$ -317921 -578169 -315129 164604 234542 -172945 -488281 -327780 49237 227818 173561
35101A73561j01626j06118j46912j06347J8422P6981O6179J09663J35562l9314
$$ 173561 71935 -34183 -181095 -287442 -269020 -192039 -125860 -16197 119365 80051
35091H0051k78323k04312J82177L83884J07178k87300l08066q889J89004J38169
$$ 80051 -198272 -402584 -220407 163477 270655 -16645 -324711 -333600 -144596 -6427
35081f427N1260M1376l6460k37472l43456j77690J07874K39286J84483J24560
$$ -6427 44833 86209 49749 -187723 -531179 -708869 -600995 -361709 -177226 -52666
35071e2666J36586J16826K4967j3129N2343L4087k19032m93438m09429M2241M14183
$$ -52666 83920 200746 225713 212584 264927 299014 79982 -413456 -822885 -780644 -366461
35060c66461L64523R1850J1349J49705J51554j30524l66217k17146J46750K54292
$$ -366461 -1938 89912 101261 250966 402520 271996 -94221 -311367 -164617 89675
35050H9675k7134l30714l04693l9616J51301J76158J68230J64998N9191j28994
$$ 89675 62541 -268173 -572866 -612482 -461181 -285023 -116793 48205 107396 -21598
35040b1598j84963M215K62493L33546J57408j21202k98690k35384J2503J59581
$$ -21598 -206561 -202346 60147 393693 551101 429899 131209 -104175 -91672 67909
35030F7909j1319k90770k52233J05882K78529P691k61594l8029M10876M10596
$$ 67909 56590 -234180 -486413 -380531 -102002 -94311 -355905 -393934 16942 427538
35020D27538j09403n02051l30254R3307K60533J47172O3084J02148P5002r8720
$$ 427538 318135 -183916 -514170 -420863 -160330 -13158 49926 152074 227076 128356
35010A28356k08081k8406L35958M93806J98784l02265m89097j87399J96671J97052
$$ 128356 -79725 -108131 227827 721633 920417 618152 129055 -58344 138327 335379
35000C35379j15079k72908n8364K47905K63723m0622l29898k60384J36157M07961
$$ 335379 220300 -52608 -110972 136933 400656 360034 30136 -230248 -94091 313870
34990C13870J61451l81635n66000j68562K57814J74262j65810j60489J97669L79224
$$ 313870 475321 93686 -472314 -640876 -383062 -208800 -374610 -535099 -337430 41794
34980D1794J83682m2012n1832j0987o7190j11424r9581j57385k19579j6233L95704
$$ 41794 225476 183464 131632 120645 53455 -57969 -157550 -314935 -534514 -550747 -155043
34969a55043N30269J53396l18514l81333q0497J91503K38532J08913j36678l83522
$$ -155043 375226 528622 210108 -171225 -251722 -60219 178313 287226 150548 -232974
34959b32974l84800m5879L32895L71438Q4602j84098k20222j09019k365O7251
$$ -232974 -617774 -663653 -330758 40680 125282 -58816 -279038 -388057 -390422 -323171
34949c23171J22514J42848Q7803l2784j40475j46325m0101J00082K01362K39732
$$ -323171 -200657 -57809 29994 -2790 -143265 -289590 -329691 -229609 -28247 211485
34939B11485J76541k0671k38291k69563j08177J1867k909N0193K50111L03336
$$ 211485 388026 367355 129064 -140499 -248676 -236809 -239718 -189525 60586 363922
34929C63922L3387k07142n2476K28730J35422k29628l35595j09440J3206j04588
$$ 363922 397309 190167 137691 366421 501843 272215 -63380 -172820 -159614 -264202
34919b64202j20353Q7905K00349Q8424N1329K12520K55575Q860k27587j93176
$$ -264202 -384555 -296650 -96301 -7877 43452 255972 511547 520407 292820 99644
34909I9644l3575O2304J25918J30018m5369k01743L6085M63100L58878l64358
$$ 99644 66069 128373 254291 384309 338940 137197 173282 636382 995260 630902
34899F30902p91950k79273N48820O88019J21833l80423m35132k99019j96162p5868
$$ 630902 -161048 -440321 108499 796518 918351 537928 102796 -196223 -392385 -468253
34889d68253M1998L3409m0684j3391Q4307J15799J02668J07276M0165j25660j77261
$$ -468253 -426255 -392846 -433530 -446921 -362614 -246815 -144147 -36871 3294 -122366 -299627
34878b99627k001J50885O7121n8565Q015J03924l857j58962j20423l6915j38270
$$ -299627 -301628 -150743 -83622 -142187 -134172 -30248 -34105 -193067 -313490 -350405 -488675
34867d88675k21635K3938L90901M09333R4824j01413j0272J00997N3500m3348
$$ -488675 -710310 -686372 -295471 113862 208686 107273 97001 197998 251498 208150
34857B08150j10877j89997k07912m1895J87126K32146J03146Q431j6919q1310
$$ 208150 97273 -92724 -300636 -342531 -155405 76741 179887 188318 171399 90089
34847I0089j21997L691J77150J52046j3465l8013R5818J19118m8150j64752o6033
$$ 90089 -31908 -28217 148933 300979 287514 249501 345319 464437 416287 251535 185502
34836A85502J11209J66675O5488j04854k25603k09648j12284r1759j41156n3017
$$ 185502 296711 463386 528874 424020 198417 -11231 -123515 -215274 -356430 -409447
34826d09447J87436K57735Q520j94511j0142K83861J96772j94686l82761k08956
$$ -409447 -222011 35724 44244 -150267 -160409 123452 320224 125538 -257223 -466179
34816d66179L639K7662m2682j08426j61725r7779J44624L11080J41935j17792
$$ -466179 -462540 -434878 -477560 -585986 -747711 -845490 -700866 -389786 -247851 -365643
34806c65643j6571L40132L85743l789k83198p9509K66286K62579m3433k44265
$$ -365643 -382214 -42082 343661 339872 56674 -22835 243451 506030 462597 218332
34796B18332j58190M0212J10618k0489k18032k56531q0204Q9159N9446k1309R0387
$$ 218332 60142 100354 210972 190483 -27549 -284080 -364284 -275125 -215679 -236988 -146601
34785a46601K91938K73566L1872j30445j00179o1641r1964n0882N7795J5352j94361
$$ -146601 145337 418903 450775 320330 220151 158510 66546 15664 73459 88811 -105550
34774a05550k64213l3762K33343K38939O4676r791P8064J36852J1746k17253l09168
$$ -105550 -369763 -403525 -170182 68757 133433 123642 201706 338558 350304 133051 -176117
34763a76117j24818J62492K18644j3434k01054r4876J06507J03175k8120l4064
$$ -176117 -300935 -138443 80201 66767 -134287 -229163 -122656 -19481 -47601 -81665
34753h1665L9566k6949j72110j50522J3109R1246Q4347J46725J79412j4419k42240
$$ -81665 -42099 -69048 -241158 -391680 -378571 -287325 -202978 -56253 123159 108740 -133500
34742a33500j30437K08008K85484L5116j11643q097q60k04194k41738K6113J74675
$$ -133500 -263937 -55929 229555 264671 153028 144931 144071 -60123 -301861 -275748 -101073
34731a01073k7416j55081J26739M21863K56209j08258j36672P3053K6656k63446
$$ -101073 -128489 -283570 -156831 265032 521241 412983 276311 349364 376020 112574
34721A12574l12721j5504K01385J14595j459N3216O5981j30653k93220j53468
$$ 112574 -200147 -215651 -14266 100329 98870 152086 218067 87414 -205806 -359274
34711c59274J30117K13394P0611l2165L2509J16159P4259l5447r1125r3707j21404
$$ -359274 -229157 -15763 54848 22683 55192 171351 245610 210163 119038 25331 -96073
34700i6073j75095j71239p5070M1044R2948P9717N1176L2025K4907M3077P4398
$$ -96073 -271168 -442407 -517477 -476433 -383485 -303768 -252592 -220567 -195660 -152583 -78185
34689g8185M4841r9866k80064l28701j73427Q2844K79960L42418K79933J19502
$$ -78185 -33344 -133210 -413274 -741975 -915402 -832558 -552598 -210180 69753 189255
34679A89255q3532j99945j14857Q8003J44071o2727k70640j44393K13195L31773
$$ 189255 105723 -94222 -209079 -121076 22995 -39732 -310372 -454765 -241570 90203
34669I0203L7013k70069k01360N6047Q9593q4651j45234o3880p8674j52239l730
$$ 90203 127216 -142853 -344213 -288166 -198573 -283224 -428458 -492338 -571012 -723251 -726981
34658g26981K97267L25490N071k13189o0949J68068J74744R9980J33928J38185
$$ -726981 -429714 -104224 -99153 -312342 -373291 -205223 -30479 69501 203429 341614
34648C41614k0193j60671j29060o6925n9378P0255L16931L07246q1696l78365
$$ 341614 321421 160750 31690 -35235 -94613 -24358 292573 599819 518123 139758
34638A39758k09971J03660J07062p1394o6354N4611J8250r4026n7590K3159l6211
$$ 139758 -70213 33447 140509 69115 2761 57372 75622 -18404 -75994 -52835 -89046
34627h9046r4523k1524o5743l49325m20003N4801N60788M39061m6986j54996J26757
$$ -89046 -183569 -205093 -270836 -620161 -1040164 -985363 -424575 14486 -32500 -187496 -60739
34616f0739J93973n2710j30593N1295N5814j90320k14956J42804M30295L13955
$$ -60739 133234 80524 -50069 1226 57040 -133280 -348236 -205432 224863 538818
34606E38818J631k03837k44552j42348K1848M353k45611k97551J32613N37443
$$ 538818 540449 336612 92060 -50288 -28440 -24087 -269698 -567249 -434636 102807
34596A02807L13442j87884j79614K30740K59018j33895j81371K76651M88194J16581
$$ 102807 416249 228365 48751 279491 538509 404614 223243 499894 988088 1104669
34586A104669k42586j97803j53258l60823l93583m4556J89553L4210m2212K36713
$$ 1104669 862083 664280 511022 150199 -243384 -287940 -98387 -64177 -106389 130324
34576A30324L67377m292l77972k43646J03349J93825J33123J38600K7650k46955
$$ 130324 497701 493409 115437 -128209 -24860 168965 302088 440688 468338 221383
34566B21383k46851J72353M31583J77890p6323Q8230J90406k24288o16604l35063
$$ 221383 -25468 146885 578468 756358 680035 768265 958671 734383 117779 -217284
34556b17284J88959J37367l11506l40088J18495L71342J51922j16187j49388r3385
$$ -217284 -28325 109042 -202464 -542552 -424057 -52715 99207 -16980 -166368 -259753
34546b59753m1619N2008O1130j20342k21736J3862L02245K44073L306l9118O401
$$ -259753 -301372 -249364 -188234 -308576 -530312 -516450 -214205 29868 33174 -5944 457
34535D57j53269k93998m1259L18826K05545k47995l69228l7769K00189R0549k7942
$$ 457 -152812 -446810 -488069 -169243 36302 -211693 -580921 -618690 -418501 -327952 -355894
34524c55894O3339J55278J18597J04998J42518O3042j09722j78348j59315j81298
$$ -355894 -292555 -137277 -18680 86318 228836 291878 182156 3808 -155507 -336805
34514c36805j00854K41078N13517K77004k22314l21157L6109K48336N1568j65427
$$ -336805 -437659 -196581 316936 593940 371626 50469 86578 334914 386482 221055
34504B21055j33615p2262j13551l8742J78372J86124j19183l39170k17503k5703
$$ 221055 87440 15178 -98373 -137115 41257 227381 108198 -230972 -448475 -474178
34494d74178l5419r3228o324J01745J12934J69115L09233K58842r1793l66207
$$ -474178 -509597 -602825 -609149 -507404 -394470 -225355 83878 342720 250927 -115280
34484a15280k19305J17111J75329p1195k26183n4313K47303L36242J04950k23223
$$ -115280 -334585 -217474 -42145 -113340 -339523 -393836 -146533 189709 294659 71436
34474G1436l18018j00582J47818J34569o6680j62540o8087N6459J14740J29067
$$ 71436 -246582 -347164 -199346 -64777 -131457 -293997 -362084 -305625 -190885 -61818
34464f1818N4064j34673k18289K4293L74556L86037N5673j65886j04545j04031
$$ -61818 -7754 -142427 -360716 -336423 38133 424170 479843 313957 209412 105381
34454A05381l58160n02568j97558K80113M28805K33633P5520J01407J03371k6877
$$ 105381 -252779 -755347 -952905 -672792 -243987 -10354 65166 166573 269944 243067
34444B43067j09570j1666J22712J14866L3448O1976J80195J69885m7395k50916
$$ 243067 133497 121831 244543 359409 392857 454833 635028 804913 757518 506602
34434E06602k08526k362J03233M3686j9925l0397j07930k40170k07042L6994J92533
$$ 506602 298076 295714 398947 442633 422708 392311 284381 44211 -162831 -125837 66696
34423F6696M1383k00811k04045J0187J80809K04190J53340N6096q2979j70652
$$ 66696 108079 -92732 -296777 -286590 -105781 98409 251749 307845 224866 54214
34413E4214j64271j73270k18805j09452J98400L78230J97877m7211L4707K82656
$$ 54214 -110057 -283327 -502132 -611584 -413184 -34954 162923 115712 150419 433075
34403D33075K28987j47725m07990l34958j60292r5866p2034j826O3562J11654
$$ 433075 662062 514337 106347 -228611 -388903 -484769 -556803 -558629 -495067 -383413
34393c83413J92141K26599Q3993j39509k00140o8357O5107J27127K13540L10508
$$ -383413 -191272 35327 119320 -20189 -220329 -288686 -223579 -96452 117088 427596
34383D27596K61068L8259j90938k88957k47956j13774J6236K1441n0076P518J82966
$$ 427596 688664 726923 535985 247028 -928 -114702 -98466 -77025 -127101 -119583 63383
34372F3383J70303q5109j44779K20538M90431J25578n00426o00516j74093Q1470
$$ 63383 233686 148577 3798 224336 714767 840345 339919 -260597 -434690 -353220
34362c53220m7632n5754K71523M64803K34971k5404M0589J69746J6018k49996
$$ -353220 -400852 -456606 -185083 279720 514691 489287 529876 699622 715640 465644
34352D65644k99956j90530j45360j28266p583J13486O1068j01376j73412p3911
$$ 465644 165688 -24842 -170202 -298468 -306051 -192565 -131497 -232873 -406285 -480196
34342d80196J37252L10547K33197j30197m07577j86674L48361N68986K73319o7298
$$ -480196 -342944 -32397 200800 70603 -336974 -523648 -175287 393699 667018 599720
34332E99720q1580r359j75179m14353l83874j08080J31661K03490J45447J1252
$$ 599720 518140 508781 333602 -80751 -464625 -572705 -441044 -237554 -92107 -80855
34322h0855p8118L0673K41544K25012r6016l58790k57362N6844K71875L23150
$$ -80855 -158973 -128300 113244 338256 242240 -116550 -373912 -317068 -45193 277957
34312B77957K89392J63208l8701j73159j78012j59361j36652J4445K27973K00106
$$ 277957 567349 730557 691856 518697 340685 181324 44672 59117 287090 487196
34302D87196j30364l90553k87115J823J68685J92416J79963J09665j4678m6639
$$ 487196 356832 -33721 -320836 -319013 -150328 42088 222051 331716 317038 270399
34292B70399K7648r823k12893k99320j11056R4255P3589k3673Q636O6280J1859
$$ 270399 298047 288224 75331 -223989 -335045 -240790 -167201 -190874 -182238 -115958 -104099
34281a04099j7318R5633J68250O1100l3366K3643P661k16099l12883p200L55717
$$ -104099 -121417 -25784 142466 203566 170200 193843 201504 -14595 -327478 -334678 21039
34270B1039K89697p7162k55885j59944o9925m4326O2468J45176j2277k38135j76790
$$ 21039 310736 233574 -22311 -182255 -252180 -296506 -234038 -88862 -101139 -339274 -516064
34259e16064P3486R0960j31295j60417J20844L07919J55536m9425Q007K16686
$$ -516064 -442578 -351618 -482913 -643330 -522486 -214567 -59031 -108456 -100449 116237
34249A16237L01132K05881L4254j28802j98560j31778o1040j45024k60590j37566
$$ 116237 417369 623250 657504 528702 330142 198364 137324 -7700 -268290 -405856
34239d05856J72734L01623J06032j31237j51574m8719j0409k4888k747N0040J16049
$$ -405856 -233122 68501 174533 43296 -108278 -156997 -167406 -192294 -195041 -145001 -28952
34228b8952K07252K28276L7977k61790l56987j48457J05121J75262J24891O9058
$$ -28952 178300 406576 444553 182763 -174224 -322681 -217560 -42298 82593 151651
34218A51651k6040j47325j35586K2864Q8946l0140p3190J15922K30964k1763l45095
$$ 151651 125611 -21714 -157300 -134436 -45490 -75630 -148820 -32898 198066 176303 -168792
34207a68792k22628K57589M66251J39975k66311k80263k8784J03521P9203J14223
$$ -168792 -391420 -133831 332420 472395 206084 -74179 -102963 558 79761 193984
34197A93984K00206J23596j04481k08028p6997O8964M1689n5811o5219l1308m4309
$$ 193984 394190 517786 413305 205277 128280 197244 238933 183122 117903 86595 42286
34186D2286k9676P9687J32471q409j53669l2243K24102K15111r4420k76724r4159
$$ 42286 12610 92297 224768 216359 62690 30447 254549 469660 375240 98516 4357
34175D357J46487J14372l6713p009J03143J1258j74308q7003K40466L39521J5377
$$ 4357 150844 265216 228503 221494 324637 335895 161587 74584 315050 654571 669948
34164F69948l42140l45129j34459n1267p9754K3043K12131J77662j16862k86193
$$ 669948 327808 -17321 -151780 -203047 -282801 -259758 -47627 130035 13173 -273020
34154b73020n8901K96506L08992o0577l74799l01647l957J54748J03620N9051
$$ -273020 -331921 -35415 273577 213000 -161799 -463446 -467403 -312655 -209035 -149984
34144a49984J17707J20772k7067j44835m2536J56413J68631m4483k33316k11121
$$ -149984 -32277 88495 61428 -83407 -125943 30470 199101 154618 -78698 -289819
34134b89819n6247O8560J21375J31138R3022K4763K0131J17904J81406M5392k28726
$$ -289819 -346066 -277506 -156131 -24993 68029 92792 112923 230827 412233 457625 228899
34123B28899l69502k13241P0922J53466o0324k82134j69085K12053L91521P6531
$$ 228899 -140603 -353844 -282922 -129456 -189780 -471914 -640999 -428946 -37425 39106
34113C9106l99529m40829K0857M00588K41623j78788k86073j5385J98076J22737
$$ 39106 -360423 -801252 -780395 -379807 -138184 -316972 -603045 -618430 -420354 -297617
34103b97617j4511l651N1221M9062J12185K73884K97616P5683j10281l2914Q7556
$$ -297617 -312128 -315779 -264558 -215496 -103311 170573 468189 543872 433591 400677 488233
34092D88233o341j17967K8835K01337P323l58279l55599l401J42626o5948j60442
$$ 488233 481892 363925 392760 594097 601420 243141 -112458 -115859 26767 -39181 -199623
34081a99623P9320K65990J49662K4958P4553l657l09633l74245R895K67545k3296
$$ -199623 -120303 145687 295349 320307 394860 391203 81570 -292675 -282780 -15235 -38531
34070c8531l27531m9617L68155J78335l21417k60330K70008L38458k16814n03955
$$ -38531 -366062 -415679 -47524 130811 -190606 -450936 -180928 157530 -59284 -563239
34060e63239r3582L15535J41967j82851j13243Q7673j5077j71100N0901M17596
$$ -563239 -656821 -341286 -199319 -382170 -495413 -407740 -422817 -593917 -543016 -125420
34050a25420M01614L9897k13255k13649j42937m3620J29389K03165K7995j66217
$$ -125420 276194 316091 102836 -110813 -253750 -297370 -167981 35184 63179 -103038
34040a03038j08901K8689m9505j99754j06737R7343O0861r5943M4265L89358L80705
$$ -103038 -211939 -183250 -232755 -432509 -539246 -441903 -381042 -476985 -432720 -43362 337343
34029C37343q1809m11207k33949P1904N0610j27501n3811K00288K32070k3655
$$ 337343 255534 -155673 -389622 -317718 -267108 -394609 -448420 -248132 -16062 -39717
34019c9717k21436j37351Q6705K25032K03646M3177j78496k82537j42820Q7000
$$ -39717 -261153 -398504 -311799 -86767 116879 160056 -18440 -300977 -443797 -356797
34009c56797J34336K2120L5878K04487J76593j75630m05023j24750L06426K68009
$$ -356797 -222461 -200341 -164463 40024 216617 40987 -364036 -488786 -182360 85649
33999H5649j28404j89748K08586L69876p4347m91295k28815L26686L62694r2022
$$ 85649 -42755 -232503 -23917 345959 271612 -219683 -448498 -121812 240882 148860
33989A48860k97040m133K67898J65404l6069n5296n0565j85559k66359j07803
$$ 148860 -148180 -152313 115585 280989 244920 189624 139059 -46500 -312859 -420662
33979d20662J24817K02945J53781Q6589j1180j27489j43844m5317L5502O9125
$$ -420662 -295845 -92900 60881 147470 136290 8801 -135043 -180360 -144858 -75733
33969g5733J45451J95910M6201j90579j66551J44248L37505J71655j10412k06528
$$ -75733 69718 265628 311829 121250 -45301 98947 436452 608107 497695 291167
33959B91167j31729j7362R6666J22514m8659k51196j75116R7344J41269j02442
$$ 291167 159438 142076 238742 361256 312597 61401 -113715 -16371 124898 22456
33949B2456j94601M7447K35293J06063n3185n974j791k05746k67919M9451L40285
$$ 22456 -172145 -124698 110595 216658 163473 157499 155708 -50038 -317957 -268506 71779
33938G1779J91958j16379j22182M7083J3676j27139o3439Q2646R232j39613m7076
$$ 71779 263737 147358 25176 72259 85935 -41204 -104643 -21997 -12765 -152378 -199454
33927a99454J31079N1487j17263K7426L25678K63281j22047k70515k7429J54180
$$ -199454 -68375 -16888 -134151 -106725 218953 482234 360187 89672 62243 216423
33917B16423O508j91331j69766l7279N0957J29693K04604J86397J14437R9396
$$ 216423 222931 31600 -138166 -175445 -124488 5205 209809 396206 510643 610039
33907F10039N2876j59717l60490k70505j0045O3307m9800l6885J38317J99050
$$ 610039 662915 503198 142708 -127797 -137842 -74535 -124335 -161220 -22903 176147
33897A76147P9361j9430p1464k10871l03053q3911K74325L09176R093j67256n2170
$$ 176147 255508 236078 164614 -46257 -349310 -433221 -158896 150280 159373 -7883 -60053
33886f0053N1036J0626N2153J85520R3382k31539l60729j42343O9187R2985J84534
$$ -60053 -9017 1609 53762 239282 332664 101125 -259604 -401947 -332760 -239775 -55241
33875e5241L86351L12468r5162k94212l4328J65288p7015l00613k4776L42536
$$ -55241 331110 643578 548416 254204 219876 385164 308149 7536 -17240 325296
33865C25296J72792k86592l17652P6884K35563n3750l13983k39057o5171O614
$$ 325296 498088 211496 -106156 -29272 206291 152541 -161442 -400499 -465670 -459056
33855d59056J12201K84046K63569k4836k55736j85973K501N7233M0808J28769
$$ -459056 -346855 -62809 200760 175924 -79812 -265785 -263284 -206051 -165243 -36474
33845c6474K59547K28117P53k42791l16128j82979K9007J32832P1931m63P6029
$$ -36474 223073 451190 451943 209152 -106976 -289955 -260948 -128116 -56185 -56648 19381
33834A9381K26922K38448N8410j57272k70270k57723j13684J33230K97703J74195
$$ 19381 246303 484751 543161 385889 115619 -142104 -255788 -122558 175145 349340
33824C49340j34992k55346k7422K35655J46486k41338n10134l95234l8811K45727
$$ 349340 214348 -40998 -68420 167235 313721 72383 -437751 -832985 -871796 -626069
33814f26069K89056J33657n2463p5303J36129L92674L66431k7851m41800m36660
$$ -626069 -337013 -203356 -255819 -331122 -194993 197681 564112 536261 94461 -342199
33804c42199j0597L69007L12381m4422k47785j01783J25262R5563j34897j90244
$$ -342199 -352796 16211 328592 284170 36385 -65398 59864 155427 20530 -169714
33794a69714R7733M00253K73748k38567o05131m54797m276K98977L34638K67644
$$ -169714 -71981 328272 602020 363453 -241678 -696475 -700751 -401774 -67136 200508
33784B00508J46296r0283k89926j97048P8076J15087j68835l29732n9637L31535
$$ 200508 346804 256521 -33405 -230453 -152377 -37290 -206125 -535857 -595494 -263959
33774b63959L77744R7963j39760j59282o3585L5663P9532O438j12929o3332J59412
$$ -263959 113785 211748 71988 -87294 -150879 -115216 -35684 -29246 -142175 -205507 -46095
33763d6095K22709l2728k44562o7746K16589J19664k32685k73342Q1819K82752
$$ -46095 176614 143886 -100676 -168422 48167 167831 -64854 -338196 -256377 26375
33753B6375N960l62424l12263J05171M10303K82657j44902m38843k69179K12162
$$ 26375 32335 -330089 -642352 -537181 -126878 155779 10877 -427966 -697145 -484983
33743d84983M68242K23548j50061j61933R3485J63921p938p9882J9715q110k24873
$$ -484983 -16741 206807 56746 -105187 -11702 152219 144281 64399 84114 76004 -148869
33732a48869l08523j34701J8629K826K9200J83445K16716N6543K4938K48688L32896
$$ -148869 -457392 -592093 -573464 -570638 -541438 -357993 -141277 -84734 -59796 188892 521788
$$ [...]
##END NTUPLES=NMR SPECTRUM
##END=
