##TITLE=31Pdec_E3e-4-2
 CDCl3, 24 sc
 16.6.2023
##JCAMPDX= 6.0         $$ Bruker NMR JCAMP-DX V2.0
##DATA TYPE= NMR SPECTRUM
##DATA CLASS= NTUPLES
##ORIGIN= UXNMR, Bruker Analytische Messtechnik GmbH
##OWNER= root
$$ XWIN-NMR		Version 3.5
$$ Fri Jun 16 13:51:55 2023 Russian Standard Time (UT+4h)  she@DPX200
##.OBSERVE FREQUENCY= 81.013821
##.OBSERVE NUCLEUS= ^31P
##.ACQUISITION MODE= SIMULTANEOUS
##.ACQUISITION SCHEME= undefined
##.AVERAGES= 24
##.DIGITISER RES= 16
##SPECTROMETER/DATA SYSTEM= spect
##.PULSE SEQUENCE= zgpg30
##.SOLVENT NAME= CDCl3
##.SHIFT REFERENCE= (INTERNAL, CDCl3, 0, 248.564)
##AUDIT TRAIL= $$ (NUMBER, WHEN, WHO, WHERE, WHAT)
$$ ##TITLE= Audit trail, XWIN-NMR		Version 3.5
$$ ##JCAMPDX= 5.01
$$ ##ORIGIN= Bruker BioSpin GmbH
$$ ##OWNER= she
$$ F:/spectra/data/she/nmr/P31/1/pdata/1/auditp.txt
$$ ##AUDIT TRAIL=  $$ (NUMBER, WHEN, WHO, WHERE, WHAT)
(   1,<2023-06-16 13:50:58.03 +0400>,<she>,<DPX200>,
      <created by zg, POWCHK disabled, PULCHK disabled
       configuration hash MD5:
       00 E9 B6 7A A2 85 ED C7 34 08 36 98 17 FE 4E 26
       data hash MD5: 32K
       C8 AE CC BE CF 13 DC F2 52 60 E0 5A 1C 03 02 2A>)
(   2,<2023-06-16 13:51:00.45 +0400>,<she>,<DPX200>,
      <Start of raw data processing
       efp BC_mod = 2 LB = 1 FT_mod = 6 PKNL = 1 PHC0 = -10704.11 PHC1 = 136.2848 SI = 64K 
       data hash MD5: 64K
       A4 23 FA 5C 8A AE B1 A3 93 53 FC 6C 9F 69 1F 5D>)
(   3,<2023-06-16 13:51:15.29 +0400>,<she>,<DPX200>,
      <pk PHC0 = -0.3637592 PHC1 = 0 
       data hash MD5: 64K
       C7 B8 F7 AF E4 E0 0E E4 20 9F AF 7A 6A 2A 68 AC>)
$$ ##END=
$$ 
$$ hash MD5
$$ 6A F6 35 BD A7 94 CA 06 A5 65 8B A9 DB 4E C4 2C
##$RELAX= 
##$RELAX= 
##$RELAX= 
##$RELAX= 
##$RELAX= 
##$RELAX= 
##$RELAX= 
##$RELAX= 
##$RELAX= 
$$ Bruker specific parameters
$$ --------------------------
##$DU= <F:/spectra>
##$EXPNO= 1
##$NAME= <P31>
##$PROCNO= 1
##$TYPE= <nmr>
##$USER= <she>
##$AMP= (0..31)
100 100 100 100 100 100 100 100 100 100 100 100 100 100 100 100 100 100 
100 100 100 100 100 100 100 100 100 100 100 100 100 100 
##$AQSEQ= 0
##$AQ_mod= 1
##$AUNM= <au_zg>
##$AUTOPOS= <>
##$BF1= 81.014009
##$BF2= 200.13
##$BF3= 200.13
##$BF4= 200.13
##$BF5= 200.13
##$BF6= 200.13
##$BF7= 200.13
##$BF8= 200.13
##$BYTORDA= 1
##$CFDGTYP= 0
##$CFRGTYP= 5
##$CHEMSTR= <none>
##$CNST= (0..31)
1 1 145 1 1 1 1 1 1 1 1 1 1 1 1 1 1 1 1 1 1 1 1 1 1 1 1 1 1 1 1 1 
##$CPDPRG= <waltz16>
##$CPDPRG1= <>
##$CPDPRG2= <waltz16>
##$CPDPRG3= <>
##$CPDPRG4= <mlev>
##$CPDPRG5= <mlev>
##$CPDPRG6= <mlev>
##$CPDPRG7= <mlev>
##$CPDPRG8= <mlev>
##$CPDPRGB= <>
##$CPDPRGT= <>
##$D= (0..31)
0 1 0 0 0 0 0 0 0 0 0 0.03 2e-05 3e-06 0 0 0 0 0 0 0 0 0 0 0 0 0 0 0 0 
0 0 
##$DATE= 1686909057
##$DBL= (0..7)
120 120 120 11 120 120 24 19 
##$DBP= (0..7)
150 150 150 150 150 150 150 150 
##$DBP07= 0
##$DBPNAM0= <>
##$DBPNAM1= <>
##$DBPNAM2= <>
##$DBPNAM3= <>
##$DBPNAM4= <>
##$DBPNAM5= <>
##$DBPNAM6= <>
##$DBPNAM7= <>
##$DBPOAL= (0..7)
0.5 0.5 0.5 0.5 0.5 0.5 0.5 0.5 
##$DBPOFFS= (0..7)
$$ [...]
##$SUBNAM2= <"">
##$SUBNAM3= <"">
##$SUBNAM4= <"">
##$SUBNAM5= <"">
##$SUBNAM6= <"">
##$SUBNAM7= <"">
##$SUBNAM8= <"">
##$SUBNAM9= <"">
##$SW= 501.771253377433
##$SWIBOX= (0..15)
0 1 3 0 0 0 0 0 0 0 0 0 0 0 0 0 
##$SW_h= 40650.406504065
##$TD= 32768
##$TD0= 1
##$TE= 0
##$TE2= 300
##$TE3= 300
##$TEG= 300
##$TL= (0..7)
0 120 53 12 22 120 120 120 
##$TP= (0..7)
150 150 150 150 150 150 150 150 
##$TP07= 0
##$TPNAME0= <>
##$TPNAME1= <>
##$TPNAME2= <>
##$TPNAME3= <>
##$TPNAME4= <>
##$TPNAME5= <>
##$TPNAME6= <>
##$TPNAME7= <>
##$TPOAL= (0..7)
0.5 0.5 0.5 0.5 0.5 0.5 0.5 0.5 
##$TPOFFS= (0..7)
0 0 0 0 0 0 0 0 
##$TUNHIN= 0
##$TUNHOUT= 0
##$TUNXOUT= 0
##$USERA1= <user>
##$USERA2= <user>
##$USERA3= <user>
##$USERA4= <user>
##$USERA5= <user>
##$V9= 5
##$VALIST= <valist>
##$VCLIST= <CCCCCCCCCCCCCCC>
##$VD= 0
##$VDLIST= <DDDDDDDDDDDDDDD>
##$VPLIST= <PPPPPPPPPPPPPPP>
##$VTLIST= <TTTTTTTTTTTTTTT>
##$WBST= 1024
##$WBSW= 4
##$XGAIN= (0..3)
0 0 0 0 
##$XL= 0
##$YL= 0
##$YMAX_a= 10574
##$YMIN_a= -9496
##$ZGOPTNS= <>
##$ZL1= 120
##$ZL2= 120
##$ZL3= 120
##$ZL4= 120
##$ABSF1= 0
##$ABSF2= 0
##$ABSG= 0
##$ABSL= 0
##$ALPHA= 0
##$AQORDER= 0
##$ASSFAC= 0
##$ASSFACI= 0
##$ASSFACX= 0
##$ASSWID= 0
##$AUNMP= <proc_1d>
##$AZFE= 0.1
##$AZFW= 0.5
##$BCFW= 0
##$BC_mod= 2
##$BYTORDP= 0
##$COROFFS= 0
##$CY= -3
##$DATMOD= 1
##$DC= 0
##$DFILT= <>
##$DTYPP= 0
##$F1P= 0
##$F2P= 0
##$FCOR= 1
##$FTSIZE= 65536
##$FT_mod= 6
##$GAMMA= 0
##$GB= 0
##$INTBC= 1
##$INTSCL= 6.047779e-11
##$ISEN= 30
##$LB= 1
##$LEV0= 0
##$LPBIN= 0
##$MAXI= 10000
##$MC2= 0
##$MEAN= 0
##$ME_mod= 0
##$MI= 50
##$NCOEF= 0
##$NC_proc= -4
##$NLEV= 6
##$NOISF1= 182.463
##$NOISF2= 159.3651
##$NSP= 0
##$NTH_PI= 0
##$NZP= 0
##$OFFSET= 248.5645
##$PC= 4
##$PHC0= -10704.47
##$PHC1= 136.2848
##$PH_mod= 1
##$PKNL= yes
##$PPARMOD= 0
##$PSCAL= 0
##$PSIGN= 0
##$REVERSE= no
##$SF= 81.0140089999694
##$SI= 65536
##$SIGF1= 159.3651
##$SIGF2= -187.1042
##$SINO= 113.3802
##$SIOLD= 16384
##$SREGLST= <1H.CDCl3>
##$SSB= 0
##$STSI= 65536
##$STSR= 0
##$SW_p= 40650.406504065
##$SYMM= 0
##$S_DEV= 0
##$TDeff= 32768
##$TDoff= 0
##$TI= <>
##$TILT= no
##$TM1= 0
##$TM2= 0
##$TOPLEV= 0
##$USERP1= <user>
##$USERP2= <user>
##$USERP3= <user>
##$USERP4= <user>
##$USERP5= <user>
##$WDW= 1
##$XDIM= 65536
##$YMAX_p= 273448812
##$YMIN_p= -109614572
$$ End of Bruker specific parameters
$$ ---------------------------------
##NTUPLES= NMR SPECTRUM
##VAR_NAME=  FREQUENCY,     SPECTRUM/REAL,   SPECTRUM/IMAG
##SYMBOL=    X,             R,               I
##VAR_TYPE=  INDEPENDENT,   DEPENDENT,       DEPENDENT
##VAR_FORM=  AFFN,          ASDF,            ASDF
##VAR_DIM=   65536,         65536,           65536
##UNITS=     HZ,            ARBITRARY UNITS, ARBITRARY UNITS
##FACTOR=    0.620285442955139, 1,           1
##FIRST=     20137.2065510682, 0,            0
##LAST=      -20513.1999529968, 0,           0
##MIN=       -20513.1999529968, -109614572,  0
##MAX=       20137.2065510682, 273448812,    0
$$ Real data points
##PAGE= N=1
##DATA TABLE= (X++(R..R)), XYDATA
$$ [...]
##PAGE= N=2
##DATA TABLE= (X++(I..I)), XYDATA
41969 280956 121807 192896 399256 441564 352908 384125 547828 623792 497837 244775
41959 244775 -633 -70848 161264 549487 702987 443374 51934 -122365 -97675 -91223
41949 -91223 -118768 -30785 165665 265160 112604 -235569 -542272 -533515 -150852 294805 414219
41938 414219 236969 175966 426148 707176 745972 675587 710332 731610 531650 255712
41928 255712 235342 481483 662403 549722 240429 -32113 -104800 54968 312542 432421
41918 432421 337762 240834 358919 576869 578446 275792 -73097 -188992 -82169 1117
41908 1117 -117145 -329301 -347666 -48717 350888 544594 477631 302195 109828 -55844
41898 -55844 -23421 325662 722111 744432 446555 337580 607419 810827 558925 117788
41888 117788 -13672 200881 426014 490850 465551 385625 249190 159039 173868 153904 16064
41877 16064 -32962 194525 505538 585990 455903 344695 285696 194803 193962 440032 721390
41866 721390 648787 230165 -124895 -173785 -55426 71647 244049 488345 710504 855131
41856 855131 927388 851396 571088 269829 191127 264852 242666 177091 357012 722156 794088
41845 794088 366790 -119633 -141544 258114 626072 680835 504240 321478 304059 477842
41835 477842 669231 639939 371599 94421 -24320 -45111 -47829 20568 182057 326492
41825 326492 403010 506753 647229 658520 498856 401110 518341 643305 532809 321499
41815 321499 324952 566649 794166 873369 879246 857247 776414 684022 637403 516197 192293
41804 192293 -129353 -73697 339997 623258 442871 40075 -144191 -12128 232729 450324
41794 450324 616855 652143 484991 250059 176715 281616 365513 308667 178491 45543
41784 45543 -98187 -200068 -127682 133618 426738 635286 784252 859000 731730 412365
41774 412365 184123 275039 514345 549702 342470 199837 310248 484494 442606 184342
41764 184342 -46677 -73387 51318 162824 192834 231574 373356 531505 509737 294884
41754 294884 137871 226872 416782 465876 418677 492040 648383 613951 364126 253286
41744 253286 506170 857758 917787 683040 434521 277494 80844 -173236 -269911 -68757
41734 -68757 256688 402490 277542 74143 15389 97250 128467 22064 -42562 155707
41724 155707 545058 800707 727229 449729 193348 43632 1055 99525 330992 562008
41714 562008 656638 611189 481117 278429 48458 -52861 108662 485689 902525 1200348
41704 1200348 1280679 1130356 889161 760691 753196 648640 345528 69066 76132 300463
41694 300463 487338 552193 586420 617825 615975 663802 857821 1063041 1027957 756698 522117
41683 522117 470427 449669 304760 123504 67687 119058 122481 -13922 -250930 -470519 -536687
41672 -536687 -390265 -141866 2946 -39066 -141539 -117899 103812 448743 743263 795120
41662 795120 546671 186921 10370 116522 325436 414521 339232 180233 -9652 -206388
41652 -206388 -329966 -278020 -56309 192092 323916 340654 363404 463209 565002 561897 476788
41641 476788 420074 410218 361678 262502 217417 266104 313851 320361 387079 536826 584409 406646
41629 406646 190750 192158 355529 418810 316835 219646 206070 172034 80672 52308 155179
41618 155179 319598 499846 706627 838527 719834 389967 136374 135264 253850 306816
41608 306816 300523 296510 241909 112397 59905 224222 507100 700816 742278 683604 518924
41597 518924 230874 -55714 -158574 -65275 68605 138308 180665 251135 326846 355407 333215
41586 333215 320821 397470 566584 704224 688400 594640 631350 835864 1001959 995736 944723
41575 944723 964857 918544 685836 481775 566560 760848 654024 274169 112864 390459
41565 390459 730655 768011 672326 754343 893732 780405 499903 412989 557424 623464
41555 623464 491819 347645 243360 22585 -230723 -168949 200212 373602 138821 15355
41545 15355 465069 1085174 1174245 799410 606421 720157 615596 144039 -99416 272091
41535 272091 785896 849315 615801 594461 787497 792423 528939 301626 247315 224260 207611
41524 207611 331242 526463 540981 367024 278125 382026 485504 467964 444276 466880
41514 466880 400304 210873 71412 46205 -28364 -196707 -210922 98501 522516 746724
41504 746724 723062 589166 424194 284562 293484 470505 606904 509316 259034 76947
41494 76947 63802 214632 516955 852190 964800 744114 416184 269210 315534 395851
41484 395851 449763 475480 399918 241264 238390 539037 905855 1028199 970342 965202 922847
41473 922847 591962 129881 -3966 227004 320189 -8707 -414894 -496192 -356318 -297913
41463 -297913 -306075 -201381 -57555 -88186 -260880 -355526 -313605 -242342 -144144 89711 446059
41452 446059 759213 888240 793162 530519 299379 328207 548388 582011 271857 -15877
41442 -15877 77709 317496 245792 -36488 10274 500314 922508 894917 617353 402946
41432 402946 228849 7344 -103930 15228 162160 127472 49088 145772 318972 336666
41422 336666 231595 198600 244048 253212 280630 442182 600809 497998 178886 -20470
41412 -20470 69036 267103 348590 284827 125615 -132723 -449278 -651648 -567523 -213949
41402 -213949 174448 307042 88014 -258646 -396964 -242594 757 178334 337504 474032
41392 474032 419405 168794 36391 209089 393085 237443 -99179 -186704 26833 210912
41382 210912 193168 87925 -48888 -262944 -422533 -329143 -122079 -141292 -341608 -290391
41372 -290391 147665 558791 576354 342147 183014 170089 204819 251758 286830 246567 165001
41361 165001 132328 56245 -231318 -573461 -578921 -226821 35126 -33079 -125959 27573 184758
41350 184758 27463 -294459 -448253 -448311 -495332 -520082 -309999 45785 216648 77344 -176362
41339 -176362 -287940 -120571 291879 689222 742293 444951 165992 157248 257890 257120 228288
41328 228288 253612 158214 -144140 -342103 -144401 248585 473434 549845 681435 758429
41318 758429 549531 220167 150233 322575 371677 194774 57685 101787 176243 187721
41308 187721 230042 318929 331069 251262 205475 243024 323888 462213 635583 666431 477960
41297 477960 323991 437721 613327 515324 244826 168392 321712 450046 521854 691464
41287 691464 837139 688688 384619 338648 540080 559825 298576 137162 251039 383482
41277 383482 443311 694244 1117083 1206537 740604 209775 105984 266944 317459 301785
41267 301785 423874 544654 427045 200509 125369 120391 -48958 -303828 -379502 -260518
41257 -260518 -113987 56937 318645 507787 421347 217714 247351 530176 759112 796697
41247 796697 801485 833476 702817 340236 21954 26564 250767 375550 325773 355191 655197
41236 655197 1051206 1211555 1071848 870613 764661 635306 384748 192907 251191 410768
41226 410768 387676 214911 172118 317878 427662 394576 356904 392967 415078 420605 523462
41215 523462 662846 603379 314427 34182 -129458 -324467 -576692 -645423 -411757 -80161
41205 -80161 166697 385643 587310 592778 386064 266923 409209 579837 542684 428928
41195 428928 436305 467373 377404 314364 479719 756090 876053 787598 599628 362893 149810
41184 149810 132431 321496 443273 327842 185525 238013 340320 272137 136875 123973
41174 123973 130133 7794 -43534 219731 567317 561646 253155 136605 420193 766403
41164 766403 814405 600344 378442 311749 413844 573036 595926 413354 231122 287747
41154 287747 504010 578332 390323 110215 -49311 -6872 198275 416292 474158 416075
41144 416075 515032 853112 1083735 884717 464630 279112 389891 494840 496335 594589
41134 594589 812451 871633 660919 466611 569943 883673 1143390 1238016 1203480 1080449
41124 1080449 938123 899748 986746 1014660 775300 304066 -108009 -175412 122472 531052
41114 531052 757497 706768 491536 292905 277380 532283 918841 1092108 899918 668854
41104 668854 781948 1054045 962141 498805 257642 515224 789583 620488 271215 223437
41094 223437 405053 428695 279607 243636 371327 496771 614420 798572 917136 833723
41084 833723 709171 711153 655151 356483 80901 167206 448506 553041 522516 582377 575199
41073 575199 264520 -39843 121845 520180 557940 295199 325992 697145 845160 653392
41063 653392 635588 894559 845524 300609 -67138 205680 634917 641291 432393 460029
41053 460029 613634 566403 419361 408678 409643 287105 309963 649095 877089 578422 96965
41042 96965 42070 356180 528412 488351 597350 889132 991637 782488 546293 467038
41032 467038 454579 467976 551092 567732 352051 94474 121652 323111 286849 6313 -76079
41021 -76079 192319 423725 347472 223224 335969 500149 408592 172707 140842 343580
41011 343580 465593 323378 97041 49816 196014 329104 303402 198901 180329 249912
41001 249912 255259 159076 135604 286824 425666 339537 149358 147601 331514 387613 174825
40990 174825 -53679 -24123 185200 307076 271250 246573 362842 542392 607208 469173
40980 469173 213916 39947 93176 320572 514875 546782 512916 575636 679067 565130
40970 565130 154421 -217759 -152160 248232 426314 101182 -306170 -228534 255288 543164
40960 543164 354115 40253 -6811 152362 306949 526544 951396 1367697 1375769 937879
40950 937879 450938 240268 215806 109014 -119357 -238380 -68338 254845 397944 220050
40940 220050 -35350 -25156 280057 603474 727750 661625 472891 210203 27370 110417
40930 110417 375101 487630 317529 129967 184319 393303 553172 648305 711492 650280
40920 650280 483785 492846 792850 977515 603951 -95918 -427864 -129029 364009 573686
40910 573686 511745 439528 447468 470858 494086 535450 543981 449693 260125 56442 -45353
40899 -45353 57893 345075 628922 738493 706407 660129 610754 516399 462206 549866 668301
40888 668301 627082 483874 468188 594817 653137 596990 611600 718680 664495 354237 76592
40877 76592 85381 236616 285388 288861 411908 529317 378695 25266 -160151 11699 348761
40866 348761 583483 649893 626824 610839 688484 859449 955133 806935 523686 408865
40856 408865 548168 683427 594491 410184 387748 540660 678356 720807 768765 882720
40846 882720 963019 878170 614543 294795 113415 208099 502251 730853 735873 669891 760569
40835 760569 944156 939800 663979 340142 171868 136457 151687 202504 216914 70265 -163316
40824 -163316 -221722 -69265 -15758 -208644 -314029 -26200 376315 408046 126758 22150
40814 22150 232473 382342 241627 57268 85170 212599 244891 220903 233000 226459 180742
40803 180742 230685 419483 570990 566706 497018 401523 170121 -125870 -157970 155377 406710
40792 406710 258325 -75675 -232620 -254825 -338267 -342790 -56229 280620 267754 35665
40782 35665 81662 470025 751556 690951 522431 416741 256838 84699 208553 626145
40772 626145 859214 670556 468975 624573 825296 603019 158975 91022 475369 792757
40762 792757 737583 576519 617925 772790 819091 764710 731972 702520 573363 332616 44781
40751 44781 -225188 -377925 -293833 17032 372368 589959 604057 393745 -12309 -373098
40741 -373098 -305460 271169 902767 1059964 761500 495303 552030 723720 725275 626433
40731 626433 674810 879626 1014854 962186 828872 731512 659809 603727 651851 857108 1093667
40720 1093667 1158100 989638 715827 487764 336990 214796 113735 78697 100301 85222
40710 85222 -2092 -32250 139882 439147 622340 590369 500319 503736 529462 441719 276335
40699 276335 166524 140828 162109 271016 491762 663698 594566 365978 267495 407691
40689 407691 586926 583386 379626 83203 -175857 -233562 -3567 317911 370101 67000
40679 67000 -259266 -274904 -37744 161471 199762 199452 300562 500708 670477 648303 400392
40668 400392 142812 176512 514019 803648 733953 386299 66617 -75761 -102051 -74806
40658 -74806 -878 59622 23562 -50374 27431 336042 689050 793667 562973 230769 115324
40647 115324 278048 496303 597409 680887 897707 1151168 1217937 1077171 889114 706811
40637 706811 466051 226282 135978 160783 140737 119932 281339 526145 516235 240247 121291
40626 121291 375494 666135 649998 491821 517010 678846 735553 699790 737375 813489 791060
40615 791060 715802 676423 547217 202557 -162297 -257012 -112167 42976 173625 378442
40605 378442 567311 549715 359846 186451 72822 -33765 -68925 17270 71248 -14234
40595 -14234 -48484 120989 248428 81167 -116325 65761 464589 565370 331027 209823
40585 209823 353995 453079 379346 371163 469556 395851 164840 207933 629318 912452 701977
40574 701977 375831 449139 817321 1002955 852461 605898 488141 538112 677330 741047
40564 741047 621282 484713 574813 727467 489991 -133214 -525477 -296834 181275 387615
40554 387615 341743 314126 294834 205717 250359 549968 762558 584042 325380 436385
40544 436385 728354 683139 329568 161955 310608 450278 473063 584559 726467 584983
40534 584983 255171 211880 460832 417995 -95673 -433785 -118635 362700 312908 -110116
40524 -110116 -227954 86625 363691 402125 485918 709018 714394 302485 -174664 -280447
40514 -280447 -20192 325350 600942 762124 704607 409324 124746 131690 389538 630724
40504 630724 736435 795441 848797 836151 797248 864659 994186 943750 627600 279224 128939
40493 128939 117703 96173 115764 292767 519423 570416 431708 285837 216590 168333 168660
40482 168660 328104 597895 775667 799021 805618 856801 845450 743767 681479 675553 552189
40471 552189 288205 161628 345476 578931 507613 187749 -23858 29879 188297 280445
40461 280445 277906 169478 -54797 -271856 -294977 -112127 120001 331397 594676 893955
40451 893955 1041379 912360 611874 318241 90259 -82442 -164342 -136019 -95547 -166050
40441 -166050 -316721 -369386 -191022 176018 570461 834725 870029 650851 271762 -35456
40431 -35456 -43520 237162 524851 556588 379271 253604 303617 407619 441742 450670 497853
40420 497853 511805 420831 325137 373523 537515 667424 728654 810042 902026 849996 599198
40409 599198 349865 345829 558317 698275 572810 354336 401064 792836 1144199 998526
40399 998526 390809 -122907 -55547 497675 1013880 1111964 849011 516100 308143 234103
40389 234103 233724 277111 353365 417887 394751 251823 70146 14790 208914 609848 996642
40378 996642 1121524 946461 713382 665131 690601 434819 -145481 -565150 -382526 180009
40368 180009 506581 389211 182428 162787 171055 37015 -52651 101745 301838 228174
40358 228174 -53767 -199883 -101625 7898 -78040 -313646 -520699 -534754 -266741 197882
40348 197882 598131 747256 715932 640030 506346 335627 379488 791010 1217609 1137081
40338 1137081 595622 198443 289448 548523 564856 414832 393283 484229 457577 304842
40328 304842 211868 187406 75902 -66273 41674 437504 731319 592211 229007 131257
40318 131257 411462 684075 644169 497541 617835 945038 1028231 664869 200270 61656
40308 61656 233387 405862 467485 562850 737162 830534 764359 677466 687589 717813 658867
40297 658867 531466 387970 220642 79315 106021 302945 428120 316706 176465 325096
40287 325096 703481 910642 727154 356525 85342 -62999 -206033 -324028 -298894 -138186
40277 -138186 27443 144546 278582 451134 574688 590523 567415 605503 705927 781565
40267 781565 752456 603962 398982 254968 255873 361334 450354 465884 451568 437602 388065
40256 388065 301604 262171 317909 391760 388221 316877 243215 201170 222478 346182 514148
40245 514148 582361 539172 554780 670161 635812 300551 -23548 72620 473071 678118
40235 678118 537404 404741 499807 576384 410910 200011 194300 286161 282206 287252 455318
40224 455318 603254 473604 210329 161830 320713 371276 238817 181169 325459 495902
40214 495902 553459 560434 541075 413086 248912 280857 515799 634958 428853 85831
40204 85831 -89445 -10065 258512 631484 921070 892027 594844 390155 429735 387719
40194 387719 -4159 -410909 -282990 341722 841293 799620 420707 112930 17865 78821
40184 78821 269931 546333 756563 807363 806038 883683 974918 925743 742539 572664 477477
40173 477477 383267 259151 196337 258242 355816 349264 221453 80520 18446 40136 131116
40162 131116 311300 567196 785346 846639 786053 764985 850216 912548 816019 624300 506304
40151 506304 490983 459711 370990 335093 425195 553847 602410 551582 417298 195852 -31898
40140 -31898 -92883 37995 131276 21996 -100746 24725 267499 259705 8555 -32492 366937
40129 366937 822404 846271 486608 180864 173548 379989 675792 976962 1096380 864246
40119 864246 422419 129701 134977 272955 393394 527938 679051 715712 595548 476796
40109 476796 491340 583077 662733 734470 772776 676262 470443 368121 484223 658129 699123
40098 699123 634585 560542 434260 223363 105734 274500 631678 901465 984761 985737 943532
40087 943532 786531 566533 509212 740144 1091196 1258400 1091899 709820 384907 318354
40077 318354 469546 614508 596506 465454 343615 265691 236072 325983 567858 820859
40067 820859 893252 778823 661326 705481 919973 1169608 1242173 992887 536684 211252
40057 211252 223974 426193 568369 649880 817435 1032385 1109650 1041436 992519 961586 753570
40046 753570 378278 177576 369509 696315 764900 578694 456086 505498 501629 324908
40036 324908 213545 392338 669151 678007 421406 247922 282485 242862 -21813 -169164
40026 -169164 133791 614132 748730 572663 599325 934759 1062990 700510 296977 328377
40016 328377 575369 586595 476352 663578 1043503 1072330 640352 258982 290227 513055
40006 513055 611792 629950 712449 776809 703228 573086 485004 363240 150529 -23629 -54039
39995 -54039 -27939 818 183643 603693 1022343 1139511 965727 720566 509368 339085
39985 339085 318937 551008 866915 946417 725267 480144 468082 642421 771499 715309
39975 715309 536312 408888 436961 523134 462212 221940 41714 134385 375345 467988
39965 467988 379920 389489 644723 889370 782218 362831 8701 -36175 98584 185569
39955 185569 241291 436336 738558 855711 610056 229810 117992 369874 659504 626356
39945 626356 263063 -134284 -311385 -255105 -81773 154745 471082 807829 980115 847443
39935 847443 503568 217961 178313 347792 569453 720678 750004 675387 604215 657056
39925 657056 801507 853939 719993 527990 426354 363743 216130 45310 45638 248658
39915 248658 442196 419913 217822 72724 180608 480855 677991 561927 310440 308528
39905 308528 616314 851082 742415 538740 592739 774915 689027 343926 162428 319797
39895 319797 510096 469468 332748 302407 322710 313327 418829 734433 1004286 904022
39885 904022 497677 138760 3258 -20685 -34061 14458 151942 287548 370988 491013
39875 491013 722772 966497 1031768 860355 608044 495275 598398 799935 919284 848635
39865 848635 581330 210373 -64663 -53547 204643 443968 508397 558833 780135 1024614
39855 1024614 1005245 757829 601335 650398 686869 559734 389523 279185 143323 -21160
39845 -21160 2821 312239 665588 833530 928542 1123774 1267669 1110539 769784 610488
39835 610488 712934 795072 683573 555220 614688 767383 757748 512288 230633 171876
39825 171876 382675 619143 583373 283829 63833 173893 442840 548216 492041 537549
39815 537549 720378 756315 514678 268100 288848 455790 514382 519938 683914 885243
39805 885243 736779 192883 -277234 -294808 -52569 47212 -13498 43026 271372 447394
39795 447394 478706 501860 552386 498845 372896 398618 572934 591580 368987 237372 368910
39784 368910 406794 60200 -288100 -80895 534221 883863 727577 486021 513639 673744
39774 673744 727998 674343 552692 325849 115924 191054 542035 793469 698513 430816
39764 430816 255129 212480 257356 385143 482180 369187 133283 85394 254899 306008
39754 306008 127160 83709 429125 863683 999358 919306 932931 1076095 1200225 1283825
39744 1283825 1312775 1116040 672532 331756 377516 615493 731033 767553 868768 870577
39734 870577 628571 457524 683050 986939 819896 306450 64804 197663 189346 -132804
39724 -132804 -277903 39923 382742 303373 41838 77894 389216 601072 596510 553703
39714 553703 555293 537301 517288 556522 567725 421852 184508 26868 -25646 -46776 3454
39703 3454 205406 439295 472315 311173 244567 454954 761806 866237 730391 571110
39693 571110 534995 539678 460024 330294 269724 303371 383891 526380 752172 915561 790251
39682 790251 391050 36481 331 243931 565272 832979 968850 904034 720016 655718
39672 655718 785562 856352 654011 367918 336712 562558 754679 764396 696648 646546 596476
39661 596476 547018 511989 419980 239900 135829 263175 499977 634276 694712 784013
39651 784013 730761 331124 -145735 -196418 147274 306744 33002 -231619 -98072 164230
39641 164230 125260 -106233 -121928 117544 308391 344867 398213 504746 468332 221686
39631 221686 -14902 -23786 163494 378562 517315 564544 536882 471094 414807 399158 443439
39620 443439 562693 727789 851154 869572 825880 822797 893600 934805 783478 405971 22569
39609 22569 -50803 238595 579704 672371 588728 586762 682459 673101 533991 483507 619916
39598 619916 780692 835320 850682 878040 840833 739616 702371 708155 537769 157328 -123212
39587 -123212 -68782 157230 295157 358868 464330 543908 525071 572143 816547 1023756
39577 1023756 891608 557634 434847 607668 758520 678330 499074 394873 376318 430106
39567 430106 563554 653853 545995 367320 437597 759188 908073 609535 156478 31912
39557 31912 315379 695502 915153 953736 862705 675954 477734 369628 348794 342784 353414
39546 353414 437909 556042 576376 464067 348412 356274 463075 560722 607473 644834 693331
39535 693331 692454 566159 341719 183376 262087 557227 823590 822783 581002 345670 283266
39524 283266 318824 317815 307658 389657 497980 431063 154909 -88657 -74244 122512 258032
39513 258032 262594 301614 513264 815036 994693 913853 616698 303516 178404 249211
39503 249211 314924 239928 169207 313718 575177 614215 319596 -28341 -153134 -111098
39493 -111098 -80341 -43919 92586 235673 236217 201657 382231 750187 967272 829848 512414
39482 512414 283668 195547 171990 208585 314928 401616 410946 466355 703386 1006578 1105756
39471 1105756 927684 682636 583556 633713 726265 796581 803531 699512 526153 433744 483405
39460 483405 513489 350238 105110 90293 413954 807704 932543 757023 537996 485894
39450 485894 560251 599276 557977 550868 678924 883694 1014566 1002085 892359 727578 511616
39439 511616 332452 370225 651042 899945 825640 500839 255148 211435 176702 34354
39429 34354 -39258 99614 268617 227307 65314 44786 155271 132640 -84866 -218617
39419 -218617 -58521 225403 329156 221039 139716 257410 486278 617724 570045 467075
39409 467075 479605 599554 621490 405425 113031 67631 364949 733802 843864 677323
39399 677323 517442 600230 854259 1007212 911856 709394 639160 734665 806870 735040 641710
39388 641710 695696 854464 939622 898883 832385 788608 711162 609472 608481 749037 873690
39377 873690 824603 670547 611209 691944 747599 663007 578166 719094 1045418 1207480 945623
39366 945623 446360 158217 281287 598075 810248 843118 759282 602771 481640 597887
39356 597887 961258 1213704 1010780 509706 204465 292779 479139 437534 201218 536
39346 536 -50988 34560 247947 552207 820350 943356 957255 981342 1070307 1170013 1167429
39335 1167429 971929 632336 384825 469216 854959 1247124 1395429 1291748 1047577 740444
39325 740444 462362 365400 514404 773229 956777 1032700 1063561 1024257 835813 568574
39315 568574 451379 613623 915514 1110141 1104560 967250 736867 391328 43028 -23326
39305 -23326 321102 780209 904598 613731 242818 72026 57162 78706 168745 339486
39295 339486 445462 425538 464739 687560 897197 875500 737321 690510 650048 454785
39285 454785 286569 431248 733061 771285 540495 444940 593530 653204 523921 578225
39275 578225 959858 1175039 789426 135252 -129814 102288 395205 452664 361171 254617
39265 254617 141563 52606 53466 117222 202078 377152 642110 750504 515594 196051 228733
39254 228733 610527 904398 883161 796689 890877 1011064 897656 621119 459654 486580
39244 486580 534827 514661 527370 627938 663149 465830 129083 -48190 92586 375568
39234 375568 514573 469497 457105 608415 767178 724459 549757 532088 795766 1109500
39224 1109500 1149482 890714 644079 690786 956188 1125152 1048476 905160 918343 1049705
39214 1049705 1100169 1013890 911223 865044 826367 774192 769456 824800 858752 818497 740208
39203 740208 672410 640232 668720 725531 686055 506199 367513 450695 624045 609833 423589
39192 423589 345621 454634 537682 521562 608563 841830 924398 700821 466216 503929 628259
39181 628259 533794 332654 336095 489516 471051 268657 218858 450549 676818 636907 444998
39170 444998 375620 516466 742020 879449 831657 656217 545942 615231 727073 680918
39160 680918 537278 555267 797668 1006439 937440 653435 400093 314118 341792 369798
39150 369798 361783 382768 495945 628691 613927 427207 281165 355180 517373 495613 281546
39139 281546 157632 305597 580369 730399 678953 513718 347965 291098 425634 679292
39129 679292 805243 636423 321539 164899 237578 304733 187884 33271 79426 279842
39119 279842 378548 325576 351094 559806 726090 662069 541263 600233 725564 674952 562807
39108 562807 710136 1054549 1160612 887844 609606 607054 664952 528131 389639 564277
39098 564277 927095 1068855 888049 677211 662636 758049 798313 791849 869706 1085767 1302318
39087 1302318 1274587 927001 538253 484130 762976 987947 916223 729460 669128 679746
39077 679746 615989 540949 556450 549049 393586 251812 378527 732359 1030246 1103081 985602
39066 985602 760416 528674 437131 528755 647442 645803 569217 503661 420776 324233 327527
39055 327527 403243 308552 -13566 -228977 -78415 224763 366899 409456 522365 537404
39045 537404 234665 -145473 -178084 106812 348251 485375 746183 1092690 1220681 1103392
39035 1103392 1026033 1063075 1014736 887683 924656 1086251 1021631 685545 490443 657837
39025 657837 863697 755346 444132 249148 256823 346415 407856 379348 284547 310512 609371
39014 609371 1000068 1159585 1107389 1139657 1277476 1216968 898153 659096 678553 709724
39004 709724 562590 438622 557332 808989 996921 1097013 1090451 880168 560656 433214
38994 433214 580206 766153 891399 1123362 1419425 1414833 1039182 752523 846549 984708
38984 984708 808706 536782 518341 622886 572310 506119 671707 862513 734193 438729
38974 438729 376313 515017 533873 479305 663758 992901 1020459 698170 492272 653496
38964 653496 883848 874297 726654 664814 697338 746256 815864 887029 889638 871274 949577
38953 949577 1045281 937794 646369 470642 572003 785217 922916 990574 1008897 902944
38943 902944 689892 527379 454640 323611 105744 20306 206788 491849 649710 702953
38933 702953 791275 904951 931265 853968 755064 700261 718870 793398 797682 591000 265216
38922 265216 134952 352968 679618 775423 592814 334413 161154 124365 274489 612493
38912 612493 966086 1105425 989635 770281 582673 477801 513842 714116 925686 932655
38902 932655 777666 766589 1027793 1255130 1097273 682153 488105 712157 1043302 1142338
38892 1142338 1080378 1110752 1213287 1155693 921341 757840 770394 766084 625720 566786 814990
38881 814990 1184802 1255554 914630 496712 377527 615793 1017712 1368923 1528030 1438040
38871 1438040 1164585 869160 679563 617535 649850 716838 704290 532693 336406 396221
38861 396221 769625 1134151 1184442 1065961 1154282 1459569 1578664 1296184 889905 668675
38851 668675 536900 305680 151209 348304 715970 804414 584496 458828 551005 513944
38841 513944 205826 25872 274963 643472 724384 644629 735635 906755 861507 691377
38831 691377 707986 852340 826173 693435 769125 965392 859297 445093 219526 413043
38821 413043 702692 824149 900452 988069 884226 633486 646051 994005 1151350 818845
38811 818845 461247 552009 792034 656156 301100 279725 637167 948344 1073729 1234265
38801 1234265 1428437 1398752 1175573 1086408 1171317 1101850 772099 511167 586936 881375
38791 881375 1152002 1264177 1112683 696767 340114 433053 849848 1018803 704925 320767
38781 320767 279266 443379 486936 449085 576578 842058 975754 870933 673281 525973
38771 525973 455826 477634 615865 819045 984555 1074544 1126953 1163145 1146699 1038005 878447
38760 878447 813914 961363 1193044 1173120 766022 306772 236363 530340 771631 774912
38750 774912 794513 1029840 1281832 1302853 1194710 1188747 1242489 1155789 957445 870713 941965
38739 941965 978034 863051 706278 630393 607086 578463 589113 692594 818738 844719 770794
38728 770794 736522 839378 992472 1028551 941832 931559 1131713 1376883 1379869 1118582 870286
38717 870286 822372 839436 736005 612061 705413 981681 1118643 960004 791244 1000927
38707 1000927 1540546 1908586 1729042 1211797 896063 992667 1180767 1107338 868554 804492
38697 804492 963581 1057932 931884 779065 803911 925885 981900 1008805 1102150 1149708 983090
38686 983090 733499 747583 1107210 1477260 1535045 1356418 1227195 1217658 1148910 938328
38676 938328 776799 889070 1218166 1444429 1321120 958455 741541 925932 1317964 1443344
38666 1443344 1093328 610595 497959 798555 1063819 959268 666856 550189 630610 642110
38656 642110 488646 348805 338578 364895 378155 486760 686604 742552 553732 421648
38646 421648 673189 1151800 1396536 1272342 1096873 1112162 1153744 981589 684241 548710
38636 548710 676821 920436 1103914 1143862 1021713 807223 669696 707749 786462 691594
38626 691594 434104 241803 238705 311755 350515 428504 617500 781738 756443 646151 717064
38615 717064 995983 1197993 1117793 895686 775334 764035 710876 616020 650819 891245
38605 891245 1215511 1484088 1657702 1698931 1529456 1189685 916078 916506 1117135 1255458
38595 1255458 1212012 1136520 1214884 1401040 1459907 1253960 907812 657067 593845 635001
38585 635001 708649 848592 1061451 1214402 1162188 932657 684659 514085 402229 336048
38575 336048 364004 502996 660987 688929 499327 160136 -108241 -100132 146026 352305
38565 352305 316826 155016 129917 323356 605428 855789 1048450 1156779 1149912 1081122
38555 1081122 1033333 988122 887482 789995 798121 860582 834207 722591 653857 638740 575759
38544 575759 492611 529469 659990 702316 657400 736170 955000 1028189 834622 680760 847430
38533 847430 1129083 1127313 823321 537576 433111 391300 349047 435759 700663 943265
38523 943265 944542 744475 588363 653097 888599 1110375 1212826 1264925 1375351 1505388
38513 1505388 1498590 1285321 965274 695411 595890 730145 1019759 1196332 1036944 667076
38503 667076 423770 399661 379317 277527 315540 604487 869114 842690 690306 738795
38493 738795 968321 1099994 1073935 1099265 1260125 1389221 1377613 1351323 1445328 1579558
38483 1579558 1566148 1349475 1070682 928642 990220 1122202 1140775 1030812 935254 917555
38473 917555 871921 727788 597657 623081 791622 994242 1142512 1156572 997137 807755
38463 807755 847078 1146107 1404996 1381708 1206943 1134901 1162375 1128564 1053102 1105064 1296085
38452 1296085 1443422 1425943 1296313 1153238 1047260 988404 930541 794739 607331 533183
38442 533183 658607 836529 880779 825457 842230 961602 1023144 890599 630698 479486
38432 479486 628474 987374 1215543 1120949 938437 985633 1147668 1068189 807982 822471
38422 822471 1187260 1382647 1095782 723977 716973 889032 855543 755665 969615 1377892
38412 1377892 1493857 1212341 903547 828633 922133 1093101 1300819 1375590 1182126 924813
38402 924813 900642 1011101 928832 680212 601746 734752 745367 510430 335298 461617
38392 461617 733649 900924 951615 1010221 1134465 1298881 1393269 1233404 784442 341269
38382 341269 246798 468522 692527 765304 773176 766641 713053 671325 726441 807463 825647
38371 825647 878007 1042741 1145990 1053605 982545 1133594 1251845 1030444 720335 763104
38361 763104 1005337 941896 629290 626568 1029841 1309932 1203819 1039551 1016866 891106
38351 891106 612191 579582 944268 1288251 1334420 1373283 1627320 1789858 1612605 1393166
38341 1393166 1418212 1432354 1151835 842205 863053 1042094 1033685 945003 1062975 1260208
38331 1260208 1223871 1043068 1038978 1189784 1220579 1121361 1109413 1186220 1157089 1005956 885956
38320 885956 839703 848091 997056 1259481 1308168 940136 511989 523365 902966 1153890
38310 1153890 1107058 1054416 1158043 1198561 994517 698249 559271 655686 924212 1232521
38300 1232521 1393592 1311008 1115544 995170 956770 939234 1033986 1325858 1613999 1597087
38290 1597087 1293790 1002883 897624 944795 1158390 1579719 1999722 2063558 1748133 1442527
38280 1442527 1437813 1582620 1563360 1305518 960273 674926 527394 561764 744902 948425
38270 948425 1058755 1057327 964077 796326 632356 614404 798923 1052422 1170247 1079300
38260 1079300 876285 691801 581363 553606 629770 810497 1018374 1156069 1210881 1212869
38250 1212869 1118819 897418 725609 850565 1168001 1235635 908530 649733 875554 1269732
38240 1269732 1213370 711872 341867 348443 403696 323683 399526 794600 1158713 1153521 928447
38229 928447 771897 684421 598925 635851 811077 858305 685977 643789 952422 1231901
38219 1231901 1053618 655254 600461 947723 1267108 1332715 1298133 1266213 1155252 974909
38209 974909 838256 714713 514320 365484 458115 666319 692465 552050 549929 782114
38199 782114 1014737 1079469 1068713 1106922 1207131 1361315 1509526 1450479 1077018 671415
38189 671415 646598 994461 1303546 1323599 1181695 1023463 806415 538287 388656 432211
38179 432211 547516 673456 895026 1164093 1223094 978514 711086 715640 910750 999727
38169 999727 880102 696466 574442 495793 428186 438477 623998 962280 1259867 1299108
38159 1299108 1079848 864700 899341 1124117 1264727 1179712 993684 888681 896494 940780
38149 940780 982827 1049572 1150675 1224596 1191231 1058728 938394 906289 898804 844438 846677
38138 846677 1056147 1356453 1401309 1057013 616298 451766 626215 962629 1296238 1479925
38128 1479925 1336097 864472 400456 320845 623247 981580 1170959 1244294 1312214 1353147
38118 1353147 1297038 1169934 1079381 1089725 1145757 1140389 1069965 1055596 1136010 1143387 954639
38107 954639 772761 899816 1272033 1528905 1543570 1521964 1523422 1317191 890432 667629
38097 667629 927553 1352769 1499903 1426139 1477648 1692110 1810510 1730044 1573568 1410393
38087 1410393 1236501 1148897 1244456 1417487 1506823 1542680 1610470 1607638 1405716 1129009 996799
38076 996799 998895 987824 970726 1044199 1161526 1224018 1267395 1300935 1139991 707590 327791
38065 327791 359614 673598 862187 851762 905276 1098129 1221988 1205387 1223334 1332240
38055 1332240 1346668 1162572 917384 758137 694590 725689 875306 1058358 1124085 1073280
38045 1073280 1055512 1134468 1213440 1189944 1052248 859524 739274 821551 1060494 1235787
38035 1235787 1236792 1181776 1155843 1077530 973880 1080098 1434694 1687727 1591319 1362747
38025 1362747 1253829 1130330 869352 770500 1049694 1290696 1036592 634627 761234 1295760
38015 1295760 1477357 1141831 961451 1314576 1705740 1612840 1253765 1116620 1227588 1301770
38005 1301770 1275370 1305123 1438653 1556678 1524990 1287377 948542 777653 933375 1232622
37995 1232622 1431297 1602357 1885379 2031368 1710365 1182649 1055862 1350714 1451668
37986 1451668 1114031 855828 1086200 1462974 1495292 1271494 1159747 1195794 1207161 1225491
37976 1225491 1349096 1433490 1302488 1086282 1027601 1120353 1221931 1346364 1562435 1752128
37966 1752128 1742783 1570523 1389843 1228095 1027769 839892 802537 979074 1299591 1582449
37956 1582449 1610401 1352319 1103721 1173370 1425530 1431254 1117898 917919 1146031 1563548
37946 1563548 1744784 1592043 1300364 1069785 1039553 1270484 1605128 1743486 1602827 1410237
37936 1410237 1349351 1356523 1343997 1332332 1264951 1014427 689712 589529 718370 736609 556673
37925 556673 545429 882210 1176449 1089812 924265 1131479 1561810 1712383 1502887 1286935
37915 1286935 1220245 1125854 953833 907036 1055254 1202034 1216923 1203254 1268912 1384512
37905 1384512 1518111 1670763 1730055 1525272 1109442 791661 797108 1036561 1273016 1374693
37895 1374693 1340654 1222924 1131330 1217827 1526611 1884436 2044850 1964655 1863629 1956046
37885 1956046 2175866 2262283 2097122 1821843 1589796 1369923 1101493 883203 836565 898103
37875 898103 936365 977186 1109601 1262745 1306683 1291118 1329133 1325554 1126141 888884 954900
37864 954900 1324243 1607270 1577669 1445157 1454126 1516839 1426327 1201371 1032681 1038112 1201001
37853 1201001 1420644 1542559 1472379 1309132 1235985 1285127 1373557 1518270 1777641 2022220
37843 2022220 2055123 1948194 1944345 2027934 1949113 1700328 1560906 1579924 1451222 1077048
37833 1077048 829707 987635 1278099 1300435 1108311 1020444 1072242 1029365 840589 745428
37823 745428 935564 1325686 1666543 1755633 1556918 1204121 877156 671513 638042 860858
37813 860858 1312380 1694847 1692484 1391698 1189416 1264101 1420096 1485463 1533639 1620121 1625764
37802 1625764 1501858 1387979 1354834 1304988 1245907 1355999 1630858 1773040 1619928 1400411
37792 1400411 1374426 1484785 1560680 1598185 1623612 1532261 1299007 1130349 1176856 1290214
37782 1290214 1282360 1235001 1329591 1537492 1695026 1750010 1752203 1732277 1743192 1876122 2094898
37771 2094898 2207233 2124685 1981800 1885226 1753655 1551205 1458648 1611918 1838858 1862356
37761 1862356 1652357 1404816 1262502 1205491 1161724 1121299 1160609 1360505 1648536 1789249
37751 1789249 1654938 1422306 1338933 1408327 1506966 1644281 1811279 1756530 1327638 902495
37741 902495 984673 1428030 1602459 1334788 1099617 1184105 1277024 1103741 906907 995293
37731 995293 1278356 1544772 1788372 1980260 1923646 1622676 1417526 1480455 1551922 1436144
37721 1436144 1353296 1496602 1629999 1472799 1163302 1022385 1139909 1445097 1859731 2142319
37711 2142319 1957776 1384973 988223 1098480 1398673 1505655 1535144 1730269 1944106 1922765
37701 1922765 1768685 1700374 1642390 1452784 1281258 1309565 1390519 1317391 1210164 1285818
37691 1285818 1482589 1629695 1738168 1834978 1798790 1642198 1624461 1794463 1805306 1507996
37681 1507996 1302215 1508897 1836297 1920036 1939189 2155104 2273503 1921775 1426189 1397495
37671 1397495 1746721 1822909 1439867 1100036 1188724 1523873 1767806 1810611 1682668 1479191
37661 1479191 1410392 1604262 1871684 1944217 1857737 1815502 1812214 1720014 1604045 1614545 1706048
37650 1706048 1781448 1927141 2161621 2181900 1781826 1318008 1289694 1609920 1775960 1642911
37640 1642911 1526227 1601146 1699754 1708284 1715747 1729006 1628875 1449410 1364928 1383589 1362391
37629 1362391 1314857 1395514 1589128 1705575 1672174 1577213 1469325 1360556 1351601 1495063
37619 1495063 1619849 1547935 1381912 1319304 1319382 1253012 1241983 1493592 1883007 2065922 1988960
37608 1988960 1959689 2181294 2486439 2585568 2391166 2060591 1839475 1866425 2068919 2279844
37598 2279844 2430650 2505858 2392222 2044735 1745514 1817120 2083548 2079382 1836788 1894821
37588 1894821 2376439 2694096 2468353 2107910 2066359 2127538 1948868 1767612 1949231 2268089
37578 2268089 2279689 2073830 2043336 2188257 2237158 2200755 2237401 2217880 1983399 1789019
37568 1789019 1923780 2128311 1972703 1599282 1501111 1748881 2019364 2213514 2446960 2572851
37558 2572851 2332264 1908667 1763016 1946948 2078093 1958432 1759942 1642383 1601618 1641651
37548 1641651 1746140 1787719 1768310 1941509 2373841 2673502 2542168 2276419 2277710 2402809
37538 2402809 2311681 2132940 2204613 2419773 2420215 2228876 2131847 2134649 2069578 2030506 2176404
37527 2176404 2322857 2234857 2077903 2084911 2080784 1865653 1724606 1966026 2294419 2273882
37517 2273882 2087854 2182584 2475840 2597624 2600092 2725881 2782825 2477749 2075900 1996027
37507 1996027 2057530 1882530 1711775 2000122 2504179 2626010 2397896 2279905 2265057 2070373
37497 2070373 1924674 2219316 2633272 2579182 2273778 2353856 2672392 2564313 2110118 1982055
37487 1982055 2163358 2019470 1594622 1610377 2125541 2407851 2251255 2227424 2472892 2432416
37477 2432416 2038706 1954221 2328550 2457955 2039142 1673481 1753264 1907337 1930161 2189289
37467 2189289 2684593 2770572 2311163 2091884 2542096 3012219 2891809 2530492 2445047 2461488
37457 2461488 2268258 2063437 2061739 2045738 1918082 2010898 2388130 2565080 2368795 2314949
37447 2314949 2661316 2878673 2590884 2268341 2404157 2708273 2707022 2495204 2337894 2148849
37437 2148849 1886145 1844261 2055365 2033052 1595485 1290146 1514682 1892220 2019142 2120609
37427 2120609 2409212 2515743 2199440 1963811 2283092 2793368 2917041 2748198 2653238 2511241
37417 2511241 2059477 1574080 1515110 1793863 1971590 1925088 1853604 1905414 2163201 2666138
37407 2666138 3153146 3201398 2879342 2754619 3000864 3114874 2829316 2600473 2765623 2931415
37397 2931415 2728798 2503231 2652878 2884743 2767742 2500519 2489151 2610862 2508459 2235404
37387 2235404 2071449 2056194 2149436 2443924 2813956 2827055 2415827 2125755 2284603 2496902
37377 2496902 2411304 2359733 2683800 3032529 2960982 2700855 2693416 2822893 2747353 2572269
37367 2572269 2583431 2686462 2671906 2662433 2777098 2755312 2435228 2192987 2376404 2699307
37357 2699307 2712151 2476972 2282000 2110214 1900681 1910608 2283982 2649480 2653890 2515288
37347 2515288 2578001 2730387 2736897 2723965 2854639 2933943 2798487 2677146 2733215 2710907 2468799
37336 2468799 2358812 2614250 2882574 2844809 2759448 2895729 3000288 2867282 2841630 3141480
37326 3141480 3264310 2769596 2150442 2184940 2806244 3312820 3383566 3252784 3152923 3133625
37316 3133625 3183782 3121857 2699475 2136537 2064475 2589626 3013049 2891516 2692162 2888542
37306 2888542 3146498 3047207 2900891 3093243 3273013 3002897 2650197 2790994 3215901 3354240
37296 3354240 3249626 3302028 3435460 3318819 3070570 3000852 2982623 2764099 2548371 2603507
37286 2603507 2688573 2520329 2382685 2603996 2880688 2813025 2647148 2765339 2917930 2726537
37276 2726537 2485918 2661094 3012087 3031055 2857051 2949575 3221684 3288125 3218883 3284876
37266 3284876 3329230 3137499 3020511 3272727 3506873 3319515 3114148 3382083 3677354 3312323
37256 3312323 2642712 2576522 3103258 3390983 3152879 2880034 2834971 2799496 2767877 2986196
37246 2986196 3326150 3415774 3322101 3367632 3423546 3153042 2782965 2833081 3221298 3412357
37236 3412357 3305258 3220020 3192196 3061179 3062494 3513301 4068048 4094877 3649300 3296915
37226 3296915 3156902 2947043 2791573 3077131 3589898 3688190 3334804 3137054 3335772 3531931
37216 3531931 3479375 3435547 3622226 3920564 4156663 4222750 3993014 3570469 3422648 3781078
37206 3781078 4176882 4113378 3858088 3932708 4185470 4131933 3917105 4097179 4629222 4886130
37196 4886130 4615118 4186716 3952617 3972644 4286538 4871990 5403084 5515762 5178984 4474623
37186 4474623 3376219 2158783 1540781 1857008 2522012 2848204 2905166 3032993 3118772
37177 3118772 3020569 3091576 3535663 3828075 3539561 3135571 3177009 3384133 3340707 3419577
37167 3419577 4032618 4628706 4492240 3937983 3663735 3547074 3198355 3046240 3612916
37158 3612916 4287435 4158905 3593629 3620158 4156583 4256363 3801709 3532750 3605897 3513809
37148 3513809 3298752 3489734 3907846 3836136 3348985 3241178 3652513 3930410 3829384 3733409
37138 3733409 3752483 3675970 3701835 4141107 4580412 4428230 4041794 4155657 4493564 4229073
37128 4229073 3557160 3419120 3831171 3913511 3519855 3416811 3804515 4027275 3865302 3838681
37118 3838681 4106282 4247735 4215911 4375887 4598635 4443276 4163217 4367156 4820376 4820055
37108 4820055 4578659 4873020 5467100 5362683 4589395 4237806 4626556 4912426 4682459
37099 4682459 4500151 4647978 4689229 4524200 4605359 4894159 4827895 4463951 4438171 4720125
37089 4720125 4678525 4403799 4607149 5167272 5208456 4715044 4600201 5023802 5134175 4689410
37079 4689410 4437501 4617519 4573462 4181237 4178876 4681711 4808345 4252783 3879332 4251644
37069 4251644 4803873 4945482 4849324 4743889 4516750 4349715 4689396 5340009 5612796 5490278
37059 5490278 5568451 5846189 5761362 5387842 5310624 5371552 4923202 4275081 4400400 5199937
37049 5199937 5583255 5307722 5172747 5349553 5165229 4653168 4644524 5152509 5316181 5093166
37039 5093166 5312187 5907909 5888748 5253978 5115989 5675301 5934036 5688168 5868381 6558391
37029 6558391 6665150 6008250 5748008 6218050 6331597 5731158 5506613 6075491 6342651
37020 6342651 5770246 5366060 5765426 6182734 6130525 6351137 7131555 7471031 6875985 6306079
37010 6306079 6431029 6584385 6295380 6195177 6554297 6588673 6065376 5932449 6528888 6866288
37000 6866288 6513851 6448878 7159580 7666897 7367397 7110773 7480575 7716352 7329130 7102096
36990 7102096 7487507 7660741 7163240 6869535 7346871 7832754 7753991 7673501 7882782 7705080
36980 7705080 7029727 6844142 7419254 7695715 7257568 7101398 7660191 7974335 7651441
36971 7651441 7659536 8290625 8398030 7624173 7286504 8001492 8547229 8203717 8071969 8843324
36961 8843324 9392648 8918347 8432278 8774542 9137091 8880786 8821872 9387044 9504256 8683796
36951 8683796 8197256 8821595 9416360 9111877 8877081 9495593 10003417 9598794 9160443
36942 9160443 9453638 9728317 9400584 9179473 9334634 8933080 7947641 7867796 9026162
36933 9026162 9708304 9156994 8917460 9855626 10526729 10032045 9760405 10593019 11096162
36924 11096162 10312692 9673387 10246815 10742842 10172033 9822231 10624676 11241630 10772132
36915 10772132 10625689 11664850 12299564 11555485 11156100 12294203 13237493 12531146 11696509
36906 11696509 12271308 13029437 12672245 12419135 13338751 13966556 13181576 12564525 13302738
36897 13302738 13758379 12764658 12186305 13405075 14495913 13838125 13226108 14302888 15290884
36888 15290884 14544545 13915002 15099338 16092825 14968889 13784712 14852012 16447031
36880 16447031 16213332 15542300 16475143 17514203 16730144 15825643 16845591 18062936 17435031
36871 17435031 16830611 18384814 20045864 19354537 18234754 19283277 20764259 20185414
36863 20185414 19325829 20649411 22281111 21733896 20981950 22516594 24166622 23343437 22440483
36854 22440483 24250357 26206216 25274029 24195196 26360477 28970688 28222833 26720940
36846 26720940 28396652 30759343 29993213 28936046 31662139 35040580 34535135 33355950
36838 33355950 36403950 40367388 40028647 38973431 42949218 48182301 48400380 47692023
36830 47692023 53046063 60033053 60742936 59923072 66553430 75553875 77034425 77542178
36822 77542178 89338836 104157744 105718586 105029225 126802321 154482869 130081200
36815 130081200 31639102 -81835870 -133805589 -116687245 -83621805 -71594611 -70197196
36808 -70197196 -60597946 -47045073 -40537702 -38213285 -32658607 -25805987 -22517963 -20783745
36800 -20783745 -16592446 -11245030 -7833411 -5756993 -2818832 1068497 4685063 7412855
36792 7412855 9605699 12579732 17189323 21758274 24417739 27415185 33829244 40654664
36784 40654664 43253354 45782443 55445480 66959161 69648080 71311124 90212831 113333098
36776 113333098 92019200 4347463 -99902219 -149103450 -132666714 -101173598 -91847576
36769 -91847576 -92485452 -82068422 -67580806 -63584127 -64351471 -57789551 -48211607 -45809141
36761 -45809141 -47089580 -43041688 -36242870 -34406241 -35320929 -32127535 -26789125 -25921383
36753 -25921383 -28913623 -31054027 -33077513 -37616454 -41286475 -39781907 -36227318 -35785810
36745 -35785810 -36560688 -34125276 -30424092 -29823362 -30597875 -28585924 -25458826 -25339410 -26687835
36736 -26687835 -25352818 -22553326 -22257827 -23445437 -22312152 -19672399 -19094541 -19905304
36728 -19905304 -18842364 -16647125 -16472376 -17561562 -16805328 -14893530 -14824393 -15862398 -14936728
36719 -14936728 -12657280 -12128723 -12974501 -12184944 -9929318 -9081947 -9740726 -9438689 -8277527
36710 -8277527 -8960536 -12042327 -15497423 -18517250 -21651339 -23873001 -23582540 -21931792
36702 -21931792 -21359307 -21555482 -20520743 -18670513 -18109792 -18683044 -18461738 -17402794 -16999700
36693 -16999700 -17109177 -16530081 -15843041 -16337400 -17094481 -16439218 -15210932 -15266479 -15909754
36684 -15909754 -15249836 -13927817 -13920020 -14711693 -14288762 -12980431 -12691749 -13174236 -12672219
36675 -12672219 -11511206 -11453343 -12158183 -11830514 -10778784 -10806751 -11604363 -11266693 -9997402
36666 -9997402 -9834447 -10958124 -11582753 -11293664 -11307624 -11659646 -11259716 -10514472 -10817868
36657 -10817868 -11652823 -11223196 -9763795 -9243287 -9959429 -10351540 -10012401 -9993637 -10281173
36648 -10281173 -9821755 -8937541 -8963782 -9643446 -9544466 -8793722 -8719790 -9156300 -8879290 -8313262
36638 -8313262 -8884766 -10037721 -9910633 -8731070 -8459600 -9207423 -9146401 -7983069 -7374655
36629 -7374655 -7729549 -7697133 -7128553 -7485651 -8858580 -9511061 -8932412 -8561650 -8952348
36620 -8952348 -8955521 -8282323 -8171485 -8857176 -8979427 -8197155 -7864275 -8409243 -8519748 -7681897
36610 -7681897 -7126030 -7455569 -7644786 -7190877 -7017596 -7433836 -7393881 -6630041 -6382748 -7119867
36600 -7119867 -7576296 -6986656 -6346699 -6535719 -6996021 -7153404 -7413441 -7901754 -7875378 -7199005
36590 -7199005 -6841983 -7186405 -7369964 -6947228 -6653646 -6892625 -6993545 -6594236 -6296319
36581 -6296319 -6389830 -6354790 -6091699 -6190036 -6574083 -6397016 -5670923 -5451760 -6015428 -6426601
36571 -6426601 -6301958 -6370267 -6853043 -6945038 -6408741 -6082468 -6287795 -6293926 -5857850 -5727223
36561 -5727223 -6105546 -6178190 -5689502 -5461706 -5826470 -6041864 -5758888 -5573624 -5677663 -5494211
36551 -5494211 -5079716 -5283791 -6061158 -6279237 -5704828 -5475490 -6016050 -6239014 -5542913
36542 -5542913 -4901291 -5112223 -5544527 -5512581 -5422064 -5660041 -5738945 -5417968 -5356561 -5824068
36532 -5824068 -6044365 -5610471 -5266459 -5509456 -5704316 -5374423 -5090197 -5263372 -5313827 -4869945
36522 -4869945 -4588691 -4941722 -5335358 -5241454 -5073691 -5169974 -5054440 -4501690 -4198994 -4543189
36512 -4543189 -4879382 -4724171 -4634242 -5042919 -5338398 -4976908 -4484267 -4466323 -4581525 -4363447
36502 -4363447 -4156965 -4373086 -4633546 -4468536 -4125784 -3986679 -3909652 -3754251 -3790876 -4054776
36492 -4054776 -4100206 -3868056 -3917742 -4362474 -4556854 -4297909 -4260762 -4714014 -4935940 -4539201
36482 -4539201 -4238404 -4561415 -4887477 -4594678 -4162998 -4251653 -4553190 -4444588 -4039698 -3801774
36472 -3801774 -3768209 -3826253 -4093249 -4443364 -4355142 -3757292 -3305704 -3358546 -3458690 -3264154
36462 -3264154 -3131321 -3313949 -3464249 -3400605 -3490965 -3832685 -3962004 -3787201 -3837244 -4182291
36452 -4182291 -4159623 -3607447 -3264807 -3471585 -3617591 -3383740 -3321072 -3639631 -3687412 -3270933
36442 -3270933 -3195960 -3770887 -4086971 -3602798 -3128385 -3323994 -3529066 -3104693 -2674789 -2906789
36432 -2906789 -3240801 -3015276 -2744240 -3045302 -3352818 -2985520 -2512892 -2719307 -3102076
36423 -3102076 -2782350 -2124531 -2053729 -2439173 -2536780 -2448975 -2769953 -3260837 -3215869 -2785485
36413 -2785485 -2703313 -3001096 -3110626 -2936244 -2797348 -2642502 -2289356 -2060545 -2249229 -2406132
36403 -2406132 -2093598 -1814700 -2180566 -2711894 -2580172 -2026624 -1867641 -2044235 -1889562
36394 -1889562 -1458925 -1335623 -1405154 -1077466 -501194 -303535 -311956 161817 886807 969144
36384 969144 593548 991596 2226963 2401305 -27696 -3979661 -6743200 -6882538 -5438441
36375 -5438441 -4357523 -4365253 -4664602 -4405266 -3826439 -3644800 -3828141 -3744118 -3331339 -3171104
36365 -3171104 -3338650 -3224581 -2739594 -2573781 -2847657 -2712206 -1887828 -1326174 -1544029
36356 -1544029 -1638955 -992193 -534141 -948105 -1057814 108815 832096 -1334988 -5646457
36347 -5646457 -8646407 -8595661 -7166641 -6399345 -6185522 -5611975 -4903564 -4762508 -5007619
36338 -5007619 -5050313 -4931068 -4969898 -5018958 -4795471 -4425426 -4099387 -3709847 -3266139 -3106048
36328 -3106048 -3298806 -3414920 -3254839 -3201330 -3476449 -3675020 -3458205 -3120436 -3022605 -3012225
36318 -3012225 -2865853 -2792146 -3001950 -3218882 -3113748 -2871593 -2870829 -3094443 -3262691 -3281246
36308 -3281246 -3195456 -2956599 -2579172 -2310686 -2341433 -2535486 -2676188 -2746323 -2758761 -2589679
36298 -2589679 -2227481 -1926968 -1861410 -1855371 -1692470 -1439795 -1236720 -1033266 -798403 -706010
36288 -706010 -805876 -788664 -445830 -85687 -8949 190334 1090441 2163516 1822248 -741512
36278 -741512 -4209095 -6275346 -6037070 -4691323 -3845252 -3769511 -3656570 -3081582 -2519979
36269 -2519979 -2460917 -2607423 -2289311 -1482068 -1112626 -2198630 -4641159 -7000928 -7761510
36260 -7761510 -6877148 -5741855 -5491867 -5799696 -5686604 -5002671 -4427203 -4315095 -4359198
36251 -4359198 -4330521 -4357292 -4387752 -4128317 -3692908 -3607126 -3933166 -4077403 -3758507 -3482482
36241 -3482482 -3672591 -3970148 -3874741 -3532994 -3384301 -3471259 -3581965 -3678142 -3736325 -3553007
36231 -3553007 -3141864 -2942793 -3211977 -3588629 -3676651 -3623619 -3667855 -3584371 -3156971 -2790072
36221 -2790072 -2986592 -3499512 -3665647 -3398702 -3209492 -3337070 -3471664 -3354758 -3139354
36212 -3139354 -3065042 -3143257 -3246898 -3271630 -3179655 -3025586 -2891879 -2745357 -2531693 -2427600
36202 -2427600 -2662796 -3016237 -2943122 -2395646 -2027956 -2283937 -2755826 -2831862 -2549742 -2372244
36192 -2372244 -2484638 -2758580 -3094420 -3370333 -3335604 -2955586 -2609200 -2609467 -2803748 -2922894
36182 -2922894 -2975170 -3026123 -3002677 -2985842 -3210340 -3495139 -3278917 -2582815 -2237819 -2651896
36172 -2651896 -3088994 -2836316 -2357166 -2437799 -2837855 -2806917 -2463480 -2543395 -3041688 -3220500
36162 -3220500 -2898499 -2691818 -2900722 -3094081 -2973648 -2836117 -2938686 -3074871 -3020177 -2866230
36152 -2866230 -2735208 -2613337 -2560188 -2652546 -2691494 -2411589 -1992442 -1916743 -2313243 -2854997
36142 -2854997 -3265339 -3489927 -3438251 -3040626 -2542691 -2297371 -2291970 -2286267 -2311071 -2545736
36132 -2545736 -2787531 -2591845 -1968923 -1462701 -1465622 -1830447 -2187386 -2309113 -2166608 -1925978
36122 -1925978 -1862313 -2046053 -2234550 -2276811 -2374412 -2672646 -2915985 -2866497 -2735158 -2795092
36112 -2795092 -2902423 -2828168 -2703061 -2676421 -2538953 -2190955 -2030961 -2290060 -2467203 -2125721
36102 -2125721 -1760376 -2038436 -2617421 -2674561 -2273502 -2162426 -2431511 -2470813 -2193928 -2201969
36092 -2201969 -2645560 -2946245 -2818254 -2638673 -2627562 -2556920 -2453819 -2680199 -3080680 -2967816
36082 -2967816 -2272408 -1827043 -2109431 -2527162 -2418534 -2019476 -1903181 -2082613 -2223485
36073 -2223485 -2266855 -2335412 -2391745 -2394992 -2473867 -2641857 -2677388 -2527075 -2459884 -2602509 -2706414
36062 -2706414 -2587448 -2415101 -2369949 -2389404 -2420185 -2537176 -2663910 -2574321 -2310586 -2196936
36052 -2196936 -2318938 -2400100 -2289858 -2140537 -2028694 -1874450 -1797612 -2023663 -2354187 -2309974
36042 -2309974 -1926657 -1796160 -2129521 -2400520 -2185198 -1768408 -1598100 -1665638 -1764935 -1893403
36032 -1893403 -2059545 -2108948 -2038951 -2091210 -2283628 -2279094 -1974172 -1770400 -1967166 -2302899
36022 -2302899 -2401971 -2290491 -2171124 -2050292 -1890266 -1818031 -1914459 -2056678 -2142139 -2182912
36012 -2182912 -2085990 -1719136 -1292568 -1239121 -1588591 -1908900 -1977171 -2000584 -2051451 -1884259
36002 -1884259 -1532045 -1465890 -1844163 -2177907 -2101648 -1922762 -1997323 -2095970 -1880927 -1562823
35992 -1562823 -1554364 -1808718 -1995265 -2058300 -2143858 -2197663 -2062488 -1819647 -1697054 -1771852
35982 -1771852 -1986927 -2262371 -2412694 -2226508 -1816352 -1589001 -1691453 -1828580 -1799755 -1796624
35972 -1796624 -1941637 -1992527 -1821611 -1748269 -2009509 -2282390 -2150298 -1734035 -1457659 -1451542
35962 -1451542 -1560970 -1703785 -1860053 -1911458 -1804458 -1690231 -1670757 -1638004 -1557942 -1608271
35952 -1608271 -1823943 -1954785 -1905384 -1924520 -2094061 -2073782 -1702480 -1405372 -1561029 -1858637
35942 -1858637 -1791910 -1471845 -1400946 -1656674 -1838014 -1711447 -1442330 -1244365 -1189226 -1319793
35932 -1319793 -1623165 -1914540 -1984928 -1822055 -1554625 -1318328 -1270433 -1490816 -1754351 -1714874
35922 -1714874 -1443751 -1393622 -1663841 -1791195 -1532229 -1306682 -1467110 -1671334 -1510874 -1274952
35912 -1274952 -1444955 -1815737 -1836465 -1562607 -1526857 -1800708 -1911075 -1671574 -1435014 -1460840
35902 -1460840 -1608583 -1741595 -1914240 -2060559 -1972162 -1696852 -1538156 -1566151 -1531707 -1347871
35892 -1347871 -1242715 -1323662 -1393366 -1347825 -1387246 -1648532 -1944934 -2063361 -2056704 -2061553 -2062206
35881 -2062206 -2016609 -2009992 -2092099 -2119522 -1946109 -1668072 -1523456 -1610151 -1818222 -1989799
35871 -1989799 -2046922 -1991518 -1867614 -1739380 -1665739 -1662724 -1680731 -1641612 -1528048 -1413910 -1369792
35860 -1369792 -1384985 -1438457 -1561904 -1729620 -1799642 -1728544 -1708511 -1847165 -1868300 -1512063
35850 -1512063 -1128766 -1350670 -2121899 -2626729 -2394380 -1922739 -1861888 -2093278 -2104949 -1866165
35840 -1866165 -1730818 -1722353 -1540888 -1200258 -1092093 -1380300 -1786551 -2037145 -2137235 -2142832
35830 -2142832 -2018895 -1810615 -1658176 -1571069 -1449384 -1353469 -1450524 -1645405 -1595148 -1212754
35820 -1212754 -862059 -882292 -1162571 -1384022 -1480050 -1611278 -1802792 -1873274 -1727431 -1510233
35810 -1510233 -1397021 -1370335 -1315780 -1253247 -1317837 -1514871 -1656525 -1613429 -1485586 -1406779
35800 -1406779 -1326641 -1176794 -1125938 -1385403 -1796113 -1924683 -1636255 -1287055 -1228731 -1381654
35790 -1381654 -1472216 -1472351 -1572285 -1838641 -2114226 -2218738 -2109139 -1867641 -1624416 -1471128
35780 -1471128 -1397176 -1324259 -1201518 -1041050 -917412 -981114 -1343384 -1830253 -2028444 -1793900
35770 -1793900 -1539893 -1710356 -2115532 -2192400 -1843260 -1545223 -1603929 -1778745 -1768709 -1630506
35760 -1630506 -1539971 -1525058 -1617420 -1909605 -2277684 -2387979 -2157359 -1881120 -1762810 -1685535
35750 -1685535 -1590769 -1651498 -1865285 -1919869 -1720445 -1612842 -1790282 -1923803 -1731104 -1478640
35740 -1478640 -1509866 -1673886 -1674506 -1622083 -1740141 -1834545 -1588268 -1153411 -934464 -971543 -1030791
35729 -1030791 -1115948 -1361741 -1568385 -1404941 -1017455 -906934 -1209643 -1581487 -1797288 -1974798
35719 -1974798 -2154689 -2142836 -1902199 -1691650 -1658121 -1637876 -1518623 -1473856 -1638051 -1810553
35709 -1810553 -1715366 -1397492 -1152122 -1136359 -1218113 -1199482 -1069545 -975763 -989138 -1013933 -993843
35698 -993843 -1072470 -1359688 -1634487 -1572279 -1253528 -1105483 -1281767 -1468438 -1417144 -1265325
35688 -1265325 -1149406 -943884 -661063 -658749 -1058657 -1367431 -1163626 -820176 -978317 -1555943
35678 -1555943 -1904951 -1815796 -1708036 -1821707 -1859749 -1587457 -1248323 -1138910 -1177973 -1163363
35668 -1163363 -1150461 -1299144 -1539744 -1640378 -1516259 -1300274 -1149906 -1096594 -1080536 -1077420
35658 -1077420 -1148303 -1322688 -1470306 -1420988 -1224586 -1122492 -1218373 -1377884 -1510434 -1686016
35648 -1686016 -1863031 -1812774 -1510183 -1289787 -1353658 -1426588 -1224990 -982934 -1102897 -1497038
35638 -1497038 -1727107 -1668828 -1581976 -1585068 -1520113 -1361693 -1335060 -1519348 -1669034 -1568762
35628 -1568762 -1324821 -1181226 -1217861 -1325310 -1364937 -1296798 -1204434 -1184380 -1196319 -1126201 -1016065
35617 -1016065 -1030453 -1127804 -1043600 -755218 -652107 -985159 -1433425 -1548107 -1379684 -1280147
35607 -1280147 -1289582 -1174230 -966152 -983979 -1283814 -1494107 -1319650 -937111 -764177 -990696
35597 -990696 -1410257 -1641950 -1524237 -1307722 -1347414 -1601941 -1674801 -1408581 -1110811 -1045279
35587 -1045279 -1069821 -1011227 -1009127 -1161517 -1204976 -955072 -729452 -871702 -1151092 -1143669 -953129
35576 -953129 -990339 -1225504 -1259158 -1042813 -940010 -1076390 -1163758 -1019968 -810458 -723084
35566 -723084 -783944 -992659 -1273206 -1343137 -1025949 -625681 -576373 -805443 -899775 -806879
35556 -806879 -836479 -1007880 -988241 -746947 -698507 -1035259 -1416503 -1509953 -1402837 -1281444
35546 -1281444 -1114157 -883511 -785983 -949727 -1198886 -1301777 -1273676 -1296211 -1475668 -1740986
35536 -1740986 -1863800 -1623754 -1109000 -732833 -737463 -855512 -751487 -577335 -680468 -960697
35526 -960697 -1041830 -971077 -1164119 -1650856 -1950770 -1801358 -1503175 -1402149 -1472540 -1550046
35516 -1550046 -1579171 -1509304 -1306634 -1142265 -1213304 -1368159 -1314798 -1171971 -1310226 -1639105
35506 -1639105 -1640487 -1216353 -897538 -1004663 -1182758 -1061187 -848076 -899428 -1124648 -1218918
35496 -1218918 -1178683 -1221843 -1404068 -1592604 -1661867 -1545855 -1273641 -1041379 -1025585 -1093142
35486 -1093142 -985178 -782974 -805958 -1032223 -1086728 -882294 -768450 -906069 -1017833 -956701
35476 -956701 -983734 -1206110 -1264802 -946672 -650835 -827236 -1305632 -1584962 -1504501 -1268317
35466 -1268317 -1057304 -940724 -945530 -949749 -749996 -443619 -430372 -814628 -1174072 -1184123
35456 -1184123 -1069530 -1115279 -1157079 -979665 -831683 -1031213 -1350041 -1331259 -1023126 -864545
35446 -864545 -963673 -1013102 -882923 -809358 -944112 -1121083 -1167348 -1140734 -1165678 -1258918 -1380130
35435 -1380130 -1478014 -1457188 -1253335 -958604 -756624 -739437 -864895 -1037166 -1150644 -1136871
35425 -1136871 -1052678 -1041724 -1152115 -1291611 -1388405 -1453580 -1472562 -1422743 -1404394 -1512279 -1568959
35414 -1568959 -1303628 -853173 -709273 -1024020 -1350388 -1289030 -1024064 -932040 -993969 -946780
35404 -946780 -763723 -624729 -595323 -657715 -885038 -1265605 -1517145 -1405205 -1117835 -1010131
35394 -1010131 -1096189 -1114597 -996554 -926466 -976984 -1004026 -922300 -827877 -816034 -876387 -980682
35383 -980682 -1100964 -1139641 -1002108 -750242 -560541 -526377 -589587 -650333 -675108 -717175 -857579
35372 -857579 -1080766 -1230956 -1198744 -1109794 -1152263 -1251496 -1162521 -889253 -713714 -748362 -783608
35361 -783608 -701246 -707179 -959394 -1257562 -1333649 -1213125 -1068956 -937332 -788745 -670576
35351 -670576 -583887 -436808 -297541 -427492 -847959 -1161612 -1079719 -858720 -895972 -1134546
35341 -1134546 -1234195 -1145450 -1115063 -1215649 -1241658 -1061830 -794584 -633243 -688748 -948899
35331 -948899 -1224576 -1240786 -958571 -681029 -665087 -792081 -822625 -780545 -821151 -894707 -850015
35320 -850015 -757538 -830485 -1092858 -1372169 -1541739 -1557945 -1385249 -1114314 -998407 -1114030
35310 -1114030 -1168189 -954054 -794788 -1111450 -1679581 -1812353 -1287589 -622291 -341645 -418791
35300 -418791 -592727 -811209 -1084662 -1231478 -1113905 -938522 -996457 -1209143 -1241318 -1026688
35290 -1026688 -865414 -933917 -985610 -724985 -288676 -97753 -300508 -623595 -792365 -836370
35280 -836370 -881722 -894300 -815720 -758505 -840975 -969586 -1001344 -980607 -990785 -943757 -792459
35269 -792459 -760764 -1001467 -1199768 -966994 -510211 -388752 -649448 -784099 -597724 -498470
35259 -498470 -744092 -1002361 -958633 -828230 -897648 -1013310 -931942 -796157 -842848 -954194
35249 -954194 -905874 -794530 -834669 -970705 -1047496 -1125282 -1272771 -1293660 -1034183 -744575
35239 -744575 -759017 -1004382 -1175522 -1199697 -1176095 -1065148 -824128 -674618 -844457 -1178331
35229 -1178331 -1352913 -1328372 -1252538 -1111031 -858763 -713881 -877085 -1081144 -879476 -339072
35219 -339072 -21318 -260331 -816643 -1267255 -1429500 -1374188 -1277958 -1287707 -1360487 -1289874 -1024790
35208 -1024790 -802426 -790539 -825488 -747324 -734022 -974227 -1246230 -1209211 -924509 -693856
35198 -693856 -558978 -388416 -305978 -559578 -1039292 -1370152 -1444882 -1461902 -1488999 -1405225
35188 -1405225 -1241133 -1160314 -1114026 -919361 -681671 -728764 -1080506 -1360906 -1309648 -1062555
35178 -1062555 -869522 -821039 -893268 -1011648 -1060492 -1039716 -1136921 -1411996 -1566234 -1349640
35168 -1349640 -1037687 -1093867 -1467166 -1669581 -1494444 -1204932 -1027963 -919152 -857546 -931937
35158 -931937 -1067701 -1061395 -941770 -924165 -985128 -889071 -671967 -661784 -933336 -1163886 -1146753
35147 -1146753 -1052458 -1043534 -998062 -774812 -451231 -178889 -67577 -245532 -709666 -1099632
35137 -1099632 -1009833 -580255 -373209 -593690 -868432 -903491 -886086 -1039201 -1219646 -1218246
35127 -1218246 -1094519 -958884 -749654 -473002 -358337 -525198 -765527 -877705 -943330 -1060285
35117 -1060285 -1093766 -937280 -751522 -692176 -653800 -536879 -510794 -720836 -961364 -959890
35107 -959890 -812807 -815733 -981826 -1045693 -886347 -662214 -535309 -495211 -480692 -500892 -591567
35096 -591567 -748300 -922526 -1039603 -1047293 -982454 -950557 -1018923 -1167715 -1318921 -1346385 -1133867
35085 -1133867 -765666 -583130 -834512 -1293796 -1469816 -1211135 -850445 -696720 -659480 -512625
35075 -512625 -301418 -281480 -554417 -921825 -1082497 -920226 -614235 -445387 -467808 -483054
35065 -483054 -415293 -502729 -896784 -1273744 -1196341 -752081 -442022 -481654 -626376 -690282
35055 -690282 -775955 -894646 -820665 -519779 -321177 -420098 -557216 -464563 -323581 -463517
35045 -463517 -831389 -1085176 -1075866 -957201 -901156 -929362 -974130 -950292 -821997 -687470 -695150
35034 -695150 -814977 -852802 -761731 -729033 -839528 -886118 -700918 -476228 -520348 -816533
35024 -816533 -1054323 -1044023 -912727 -900546 -1085205 -1307895 -1323329 -1061214 -743152 -643720
35014 -643720 -737169 -733604 -495129 -235475 -229194 -487021 -815295 -1046924 -1104030 -966197 -708750
35003 -708750 -493404 -421719 -450995 -500489 -558383 -640113 -728437 -803022 -863395 -898151 -887036
34992 -887036 -824848 -688543 -436777 -130457 25177 -108363 -406565 -620218 -641908 -526095
34982 -526095 -364558 -283850 -415059 -683202 -794053 -642598 -531713 -716316 -965419 -938917
34972 -938917 -768972 -799396 -928764 -779981 -442552 -422040 -803014 -1078242 -962650 -795652
34962 -795652 -897307 -1056350 -973333 -767163 -688350 -676934 -551454 -376160 -338214 -454079
34952 -454079 -613900 -732117 -726933 -589670 -555669 -885958 -1388268 -1539228 -1208452 -834666
34942 -834666 -725979 -678160 -526779 -538830 -871732 -1128976 -943112 -618742 -668115 -1000209
34932 -1000209 -1117807 -917628 -752560 -813433 -956041 -1092376 -1286732 -1456259 -1389188 -1111945
34922 -1111945 -900217 -874739 -880054 -814387 -805338 -966060 -1178767 -1226330 -1042717 -787553 -710250
34911 -710250 -906120 -1178195 -1231910 -1036551 -852881 -864111 -970460 -1016138 -995284 -929845
34901 -929845 -781301 -616328 -620982 -803968 -931211 -903731 -920638 -1086801 -1172400 -1014038
34891 -1014038 -855699 -974918 -1213430 -1217644 -958035 -683343 -518838 -428820 -439025 -577404
34881 -577404 -694332 -630929 -486321 -474826 -615507 -782503 -932940 -1057760 -1055959 -910215
34871 -910215 -848168 -1062627 -1381243 -1461924 -1223207 -875189 -640763 -628950 -826787 -1026697
34861 -1026697 -942305 -584691 -309704 -306632 -326557 -159392 -40452 -234687 -534631 -596696
34851 -596696 -507118 -547878 -638373 -529225 -363057 -471512 -724651 -679573 -354782 -257310
34841 -257310 -565337 -853814 -798033 -643196 -739763 -1027196 -1241736 -1311681 -1287898 -1134494
34831 -1134494 -838295 -559631 -475779 -577283 -728777 -824895 -830094 -785681 -801747 -917930
34821 -917930 -997155 -912632 -774749 -755678 -759119 -552943 -206632 -69693 -268961 -545589
34811 -545589 -685370 -803964 -1052445 -1305926 -1351225 -1208319 -1073368 -1053966 -1110359 -1167792
34801 -1167792 -1155970 -1005268 -725118 -461770 -392659 -549530 -767929 -826031 -663047 -461666
34791 -461666 -454463 -646329 -833653 -909100 -974003 -1080808 -1079353 -876738 -657450 -630580 -708603
34780 -708603 -676518 -562842 -580201 -763054 -921279 -939582 -907362 -941370 -1038850 -1109106 -1052621
34769 -1052621 -857436 -678696 -692112 -796866 -679953 -309803 -98325 -346922 -795303 -1013278
34759 -1013278 -989481 -976451 -987392 -888778 -826374 -1058331 -1421279 -1453646 -1081799 -740845
34749 -740845 -735838 -882954 -897250 -781361 -681027 -631550 -591012 -540064 -481654 -486275 -690059
34738 -690059 -1051133 -1222936 -961552 -549465 -454840 -655781 -722819 -529660 -405694 -539895
34728 -539895 -712824 -741286 -745102 -809580 -792422 -655173 -610105 -734999 -793879 -653078 -537671
34717 -537671 -640274 -789393 -764503 -665376 -697077 -810933 -818998 -695400 -551811 -462745 -464650
34706 -464650 -550268 -553683 -286212 82286 76880 -444665 -997745 -1075633 -794256 -631795 -735789
34695 -735789 -841655 -772056 -674448 -749799 -976119 -1146660 -1079948 -806460 -581285 -610670
34685 -610670 -746859 -644598 -278340 -52361 -262358 -698133 -964261 -954418 -789921 -535186
34675 -535186 -264133 -203680 -462812 -741829 -664127 -335694 -220351 -455620 -647538 -450085
34665 -450085 -54193 87526 -155046 -482407 -574623 -437014 -312681 -355796 -479780 -518268
34655 -518268 -438841 -327584 -236481 -173749 -208877 -420171 -718314 -885141 -837717 -706499
34645 -706499 -605815 -496891 -351036 -270751 -337360 -486609 -641336 -818221 -994899 -1037621
34635 -1037621 -904843 -779544 -847328 -1061979 -1258317 -1355403 -1315237 -1077817 -723471 -532408
34625 -532408 -653992 -850513 -810954 -596289 -501295 -577738 -611037 -516819 -417333 -317597 -65232
34614 -65232 287309 434147 286062 164869 300899 419622 134180 -455162 -907773 -1071752
34604 -1071752 -1182815 -1351977 -1353726 -1046514 -676070 -557238 -685534 -869391 -1042543 -1204188
34594 -1204188 -1224574 -1010567 -766452 -776875 -967187 -991782 -762487 -560804 -570739 -645371
34584 -645371 -658943 -736930 -926700 -972311 -720261 -477879 -593647 -872058 -833961 -470205
34574 -470205 -280694 -524455 -857492 -873402 -656771 -561465 -678070 -795990 -778497 -721317
34564 -721317 -746016 -814961 -798597 -635798 -387853 -180281 -121762 -251290 -513249 -764102
34554 -764102 -849255 -740624 -589866 -577165 -710622 -848102 -897529 -885835 -842381 -757468 -667847
34543 -667847 -634032 -624314 -587188 -621644 -843386 -1089111 -1065241 -835240 -785317 -990012 -1039904
34532 -1039904 -719295 -405023 -449786 -595447 -459001 -241555 -393864 -816615 -981718 -725703
34522 -725703 -380907 -205587 -199250 -392583 -777383 -1012319 -764000 -309866 -225989 -501573
34512 -501573 -598873 -404252 -394163 -722491 -900754 -672561 -497140 -761207 -1138101 -1205151
34502 -1205151 -1142317 -1271126 -1365149 -1033543 -467226 -194918 -295476 -404099 -368864 -383012
34492 -383012 -519851 -597647 -528227 -451271 -499172 -679551 -955353 -1217696 -1258235 -998760
34482 -998760 -664624 -519713 -543112 -584400 -688958 -988258 -1366811 -1527665 -1357141 -1001560
34472 -1001560 -627626 -314465 -140901 -176310 -374303 -585532 -657860 -502066 -187119 253
34462 253 -196720 -616808 -787281 -543155 -272913 -374041 -731569 -953891 -880709 -624697
34452 -624697 -338590 -176266 -265763 -498474 -572172 -436317 -400541 -583679 -630355 -298810
34442 -298810 50262 -22048 -350141 -486605 -420662 -440343 -511397 -380107 -147589 -149683 -344046
34431 -344046 -390665 -291579 -363100 -579970 -557350 -251454 -79446 -210815 -311182 -172864
34421 -172864 -51664 -136595 -193176 -29101 124736 7435 -277060 -545883 -844507 -1160566
34411 -1160566 -1189876 -744658 -111195 326404 540861 618642 382997 -303980 -1085296 -1426479
34401 -1426479 -1290309 -1089803 -1051544 -1038982 -975959 -1015245 -1208961 -1370090 -1385183 -1375221 -1411918
34390 -1411918 -1332855 -1013983 -632304 -466058 -554777 -726727 -872283 -1011816 -1130426 -1125127
34380 -1125127 -964068 -786126 -761795 -889638 -989918 -908674 -703998 -600353 -730903 -938268
34370 -938268 -912194 -587668 -322166 -512433 -1042037 -1338732 -1096566 -706151 -716043 -1050961
34360 -1050961 -1151723 -833528 -535465 -603383 -793920 -764080 -640122 -693320 -768491 -547876
34350 -547876 -206579 -246842 -699349 -1013519 -834205 -428698 -195148 -166640 -210918 -353012
34340 -353012 -627786 -880330 -976203 -1015532 -1124863 -1219998 -1169506 -1020116 -890068 -820331
34330 -820331 -872406 -1131901 -1435790 -1377437 -845382 -302566 -217020 -439270 -499344 -320228
34320 -320228 -213067 -295531 -381976 -416406 -554159 -774349 -849212 -786868 -873652 -1130633 -1157218
34309 -1157218 -755520 -338259 -402397 -869906 -1267452 -1346014 -1203984 -966550 -678810 -427401
34299 -427401 -281532 -174061 -60987 -76962 -283652 -421234 -242245 30724 -23626 -358719
34289 -358719 -508608 -325624 -196317 -384624 -615297 -561834 -364397 -342179 -491426 -615668
34279 -615668 -713292 -862964 -908012 -657407 -297683 -210245 -420860 -604568 -622118 -656653
34269 -656653 -770882 -741309 -489615 -316638 -462337 -701481 -658532 -348566 -120234 -159078
34259 -159078 -321516 -434144 -504188 -588588 -661350 -707524 -797680 -941142 -973266 -765891 -515586
34248 -515586 -601983 -1067633 -1431745 -1226439 -610612 -190722 -261236 -521066 -594243 -499900
34238 -499900 -440688 -433315 -409387 -438205 -547560 -527144 -250247 -20047 -204819 -644268 -847061
34227 -847061 -725210 -670655 -871342 -1022958 -860288 -563538 -436738 -511933 -665215 -828205
34217 -828205 -894889 -707371 -349648 -204019 -492155 -959935 -1201251 -1098754 -795921 -469197
34207 -469197 -298850 -420868 -707368 -812427 -619220 -412384 -429018 -507320 -406546 -213130
34197 -213130 -162268 -277274 -439990 -601895 -688176 -548319 -266573 -231104 -569661 -818383
34187 -818383 -559157 -109397 -82450 -466850 -700155 -554101 -363645 -366766 -384773 -287810
34177 -287810 -286897 -551339 -893542 -1023355 -848586 -427499 77406 324654 28439 -600573
34167 -600573 -982855 -880823 -646664 -610384 -613075 -411700 -186303 -262951 -563054 -728577
34157 -728577 -678424 -669816 -843182 -1035122 -1069692 -964494 -791286 -557954 -309286 -167423
34147 -167423 -184334 -282766 -396294 -519243 -558079 -332487 118321 401464 196952 -261898
34137 -261898 -440221 -246625 -169258 -514958 -886129 -764721 -339418 -246458 -593704 -823165
34127 -823165 -629790 -429422 -628154 -935298 -848299 -460441 -268557 -388814 -488515 -403745
34117 -403745 -318253 -322519 -258464 -85705 -4925 -96184 -168831 -97718 -14887 -43364 -110635
34106 -110635 -148520 -221724 -333954 -353247 -256054 -203676 -252003 -243838 -134583 -142441 -367236
34095 -367236 -528852 -364476 -76064 -54929 -286307 -368606 -96404 278243 401866 194478
34085 194478 -186443 -548975 -753287 -760240 -686918 -701807 -804165 -824639 -700025 -598768
34075 -598768 -662077 -751470 -626098 -309481 -95968 -187896 -482014 -742520 -837145 -757301
34065 -757301 -563579 -396103 -390086 -471029 -381332 -48761 227032 143948 -189151 -441324
34055 -441324 -533040 -630037 -760811 -797366 -794251 -958413 -1225134 -1252085 -956749 -687655 -696457
34044 -696457 -803967 -793722 -765323 -828865 -805787 -573327 -398441 -544142 -793609 -768103
34034 -768103 -512112 -351232 -348073 -335723 -348869 -554178 -829385 -874538 -718321 -676230 -810426
34023 -810426 -871882 -803354 -840793 -1021593 -1031507 -707724 -327936 -212977 -342374 -532630
34013 -532630 -720152 -890079 -956403 -882356 -748435 -601770 -425237 -318705 -473463 -862724
34003 -862724 -1171939 -1152204 -878481 -592040 -456239 -499882 -616660 -612990 -450647 -391720
33993 -391720 -640312 -917783 -768992 -270129 15261 -149049 -379801 -350369 -268170 -409377
33983 -409377 -623619 -660971 -627360 -712306 -755898 -520966 -186413 -129429 -344329 -492011
33973 -492011 -452173 -433625 -562579 -728950 -863068 -1040031 -1258635 -1391613 -1403013 -1368791
33963 -1368791 -1258575 -970728 -628411 -532397 -700007 -746086 -418356 -31 82114 -139510
33953 -139510 -285688 -240351 -269821 -508740 -714069 -696401 -651099 -771110 -809655 -447558
33943 -447558 54577 78018 -453022 -893542 -772824 -405131 -315923 -470038 -489729 -341739
33933 -341739 -308274 -422916 -428970 -271469 -196091 -322474 -484891 -543975 -534156 -470041 -325877
33922 -325877 -234652 -372013 -596731 -556426 -232096 -27512 -190988 -474474 -527645 -341937
33912 -341937 -126024 9757 61615 29523 -30764 -20519 21454 -74958 -337684 -581317 -689756
33901 -689756 -754232 -843738 -872447 -806584 -773390 -833313 -854064 -747691 -642818 -684474 -821307
33890 -821307 -903530 -855060 -683695 -468776 -365285 -448006 -561619 -538895 -521327 -763132
33880 -763132 -1140956 -1231888 -922610 -552089 -367344 -251356 -119200 -141127 -360795 -509324
33870 -509324 -461594 -490988 -774413 -1012159 -886388 -576374 -441744 -463625 -393188 -238803
33860 -238803 -205414 -297228 -345151 -320330 -306290 -274763 -185206 -180462 -377291 -578623 -512350
33849 -512350 -268176 -177019 -308618 -401867 -287715 -93562 17683 78901 200201 353848
33839 353848 366071 112088 -282218 -486553 -328140 -60171 -71676 -359347 -562616 -523703
33829 -523703 -445915 -415328 -202102 242422 504849 258405 -229165 -490821 -493276 -508068
33819 -508068 -589611 -585978 -502371 -457372 -387191 -159187 97883 115388 -109113 -314675 -340643
33808 -340643 -244565 -128703 -81441 -208494 -497592 -732698 -734607 -581652 -433856 -312461
33798 -312461 -231910 -317389 -551096 -647358 -473991 -355265 -607353 -995470 -1061191 -822274
33788 -822274 -701788 -848046 -967870 -837740 -593573 -451959 -438983 -463109 -458211 -433403
33778 -433403 -501556 -774198 -1112041 -1164002 -828659 -451516 -343074 -364330 -273852 -196099
33768 -196099 -361771 -624998 -674376 -550228 -523132 -607342 -625010 -618807 -757761 -941644 -937533
33757 -937533 -813487 -803822 -847464 -716334 -510275 -539950 -769540 -855393 -712919 -579882
33747 -579882 -535393 -422254 -247781 -209553 -307806 -344636 -289118 -244701 -140628 94453 178397
33736 178397 -168583 -628654 -656091 -356596 -318230 -612790 -738228 -592989 -646873 -957179
33726 -957179 -907276 -285444 217242 80266 -238836 -164519 23997 -195389 -567665 -487584
33716 -487584 -86237 -40668 -459375 -750168 -594433 -347402 -346875 -424309 -339926 -251988 -439688
33705 -439688 -812338 -989144 -789155 -436702 -252677 -262120 -227638 -55716 33938 -112318
33695 -112318 -248376 -82083 188628 124349 -225503 -355447 -126685 7990 -210754 -420518
33685 -420518 -319907 -223880 -469354 -740382 -572272 -189841 -199403 -631963 -926646 -806545
33675 -806545 -587506 -587816 -753563 -955746 -1191700 -1360130 -1246307 -894184 -644335 -637476
33665 -637476 -607702 -361047 -145170 -270284 -587679 -660781 -358052 -10 63271 -204974
33655 -204974 -620607 -996745 -1185427 -1080596 -742748 -436028 -371708 -444786 -393731 -205107
33645 -205107 -134451 -276097 -382850 -270246 -136117 -222202 -390424 -387031 -354558 -636639
33635 -636639 -1133178 -1327965 -1020491 -587481 -393507 -366500 -334337 -358893 -469564 -433443
33625 -433443 -119103 193628 197831 20937 -25322 49857 13884 -140258 -209448 -163248 -164682
33614 -164682 -232698 -201400 -46613 19992 -136220 -368953 -466337 -447504 -533664 -853172 -1250908
33603 -1250908 -1444003 -1360433 -1214093 -1166733 -1066024 -717777 -286793 -116240 -205287 -234548
33593 -234548 -119254 -116450 -290733 -330595 -101068 55491 -139095 -443633 -526162 -498807
33583 -498807 -625932 -793343 -718883 -484206 -401082 -479638 -461020 -299895 -215721 -304211 -445794
33572 -445794 -563039 -660715 -672101 -564323 -506256 -617275 -665468 -384837 5889 25648
33562 25648 -359599 -677591 -624149 -385835 -228113 -166576 -164940 -287250 -484602 -535139 -369353
33551 -369353 -206889 -223218 -310991 -306736 -229243 -153531 -62140 24522 -42331 -333120 -677406
33540 -677406 -848666 -809613 -674788 -534695 -410977 -308940 -249504 -288380 -477855 -727191
33530 -727191 -785726 -534367 -221427 -186580 -405453 -576912 -625262 -771596 -1060542 -1192193
33520 -1192193 -987085 -695910 -623392 -702572 -690033 -573043 -510477 -518470 -488517 -429564 -444475
33509 -444475 -518065 -546388 -539105 -588980 -661518 -610885 -413327 -218277 -148977 -189217 -272074
33498 -272074 -341875 -324207 -188792 -71826 -179700 -502517 -753451 -683513 -360669 -51011
33488 -51011 81443 48047 -102679 -335788 -560286 -661856 -640287 -601032 -578120 -488559 -316480
33477 -316480 -201854 -233197 -267637 -116784 152161 271946 114041 -183208 -422019 -527959
33467 -527959 -518331 -450628 -437591 -563742 -742418 -792281 -686127 -571247 -519042 -445929 -330398
33456 -330398 -283115 -306655 -225948 -8510 82148 -137110 -445861 -528641 -439481 -465074 -641330
33445 -641330 -732298 -650606 -578238 -635828 -711939 -699056 -668801 -708741 -754467 -681656 -454241
33434 -454241 -134572 150064 250086 138662 8162 60271 203854 157150 -128852 -376070
33424 -376070 -383072 -294479 -326692 -420679 -369964 -176619 -64244 -170518 -402746 -603397 -717052
33413 -717052 -765251 -770936 -758275 -746371 -687228 -476517 -108348 215114 242145 -23771 -274936
33402 -274936 -247425 -56014 -49524 -348412 -688010 -771910 -624684 -482383 -457533 -472564 -461452
33391 -461452 -462492 -500073 -508480 -423771 -283074 -196568 -246383 -407283 -540323 -491995 -239820
33380 -239820 78050 295014 340260 232288 35133 -148754 -237487 -268278 -339048 -411326
33370 -411326 -313343 -23828 205817 158511 -48829 -147668 -96358 -74774 -168191 -273811 -300389
33359 -300389 -251314 -103306 183628 480593 509126 160950 -317396 -566521 -483269 -283448
33349 -283448 -241544 -412392 -583992 -497479 -147208 160472 117803 -226602 -510214 -472393
33339 -472393 -236736 -126574 -269696 -484508 -559580 -540127 -634094 -870716 -1019754 -924863
33329 -924863 -750276 -719508 -739831 -556986 -230796 -121539 -339009 -539381 -434591 -209753
33319 -209753 -198029 -376243 -468251 -393966 -328629 -398280 -556660 -702423 -724368 -519374 -159731
33308 -159731 61888 -39104 -274769 -360509 -323177 -380787 -545832 -656894 -718865 -876647
33298 -876647 -1080324 -1104631 -913132 -701566 -560374 -394490 -211563 -180835 -332270 -478976
33288 -478976 -520791 -558200 -625575 -593600 -447833 -384887 -478503 -502165 -275050 13434 27648
33277 27648 -290394 -677244 -832897 -653347 -298756 -107105 -294404 -661245 -761222 -449789
33267 -449789 -79502 -29555 -239232 -387842 -369878 -353741 -452236 -576573 -624496 -621599 -615979
33256 -615979 -567960 -444373 -356133 -470592 -749338 -884366 -633675 -183805 13560 -190742
33246 -190742 -454732 -438857 -251193 -187454 -247119 -224352 -136220 -191137 -387523 -512110 -529811
33235 -529811 -601366 -681289 -496777 -39421 295123 233639 -19880 -134864 -72914 30501
33225 30501 127434 188450 112543 -82950 -198133 -167008 -206930 -447762 -655753 -574405 -325020
33214 -325020 -206284 -288648 -471641 -747111 -1104284 -1340983 -1293917 -1131383 -1099922 -1099706 -857257
33203 -857257 -430366 -164274 -175152 -251730 -283526 -400634 -604190 -630683 -354666 -28892
33193 -28892 73665 16633 -4290 -10420 -143645 -367957 -516647 -557308 -583693 -595422 -515873
33182 -515873 -418047 -490995 -721953 -830332 -638787 -332323 -186833 -190411 -157082 -113738 -270110
33171 -270110 -587439 -697824 -403097 3007 125963 -18185 -138227 -145432 -172959 -216224
33161 -216224 -126864 28052 -30510 -335807 -550933 -451435 -239021 -185181 -231458 -192889 -144912
33150 -144912 -305523 -639696 -860717 -797024 -546236 -282619 -92305 4480 18401 -8901
33140 -8901 -59493 -163435 -292000 -307087 -135878 77785 136423 43665 -57941 -156762 -387357
33129 -387357 -750509 -992616 -871873 -468471 -125668 -83010 -236123 -303513 -190066 -79981
33119 -79981 -138689 -256334 -211789 9366 233052 356047 375713 224811 -140096 -487757
33109 -487757 -479663 -175475 -42904 -301916 -570526 -400432 95041 431168 375717 91217
33099 91217 -202522 -412647 -502560 -497663 -517438 -611855 -649420 -541041 -437748 -490973 -563852
33088 -563852 -439623 -187560 -38921 -13338 26623 52509 -56145 -186572 -117962 40324
33078 40324 -81095 -549356 -985960 -1069615 -869495 -600292 -372488 -292570 -473775 -776985
33068 -776985 -834876 -529701 -198017 -167552 -325631 -356908 -197783 -27913 14020 -118807
33058 -118807 -459901 -928757 -1272927 -1328290 -1236580 -1205842 -1167388 -898594 -411166 10137
33048 10137 125391 -79668 -469771 -825416 -893092 -598964 -213750 -113300 -362128 -689740
33038 -689740 -855123 -842772 -708315 -463323 -179448 -13946 -34995 -156229 -304743 -501123
33028 -501123 -701272 -730132 -501725 -187289 -41321 -148214 -430133 -781152 -1069270 -1131846
33018 -1131846 -942174 -699646 -586802 -517437 -315622 -57198 28532 -37608 1553 162974
33008 162974 101961 -348398 -813723 -842899 -530950 -337628 -403024 -426692 -223244 -13261
32998 -13261 -39313 -208150 -312009 -377555 -564443 -850195 -1026180 -943320 -619613 -182510
32988 -182510 166894 233321 33056 -149477 -67654 179192 286785 127979 -166524 -438125
32978 -438125 -609202 -604232 -401262 -185954 -219124 -467595 -576797 -340622 -21390 -24342
32968 -24342 -372933 -713200 -788903 -697420 -644507 -644403 -587462 -481429 -446744 -494031 -483963
32957 -483963 -371506 -335674 -524464 -773829 -783134 -541165 -344613 -349520 -362372 -217229 -105701
32946 -105701 -267778 -531165 -505792 -176775 65385 26899 -30698 114661 239692 41644
32936 41644 -338380 -502607 -374090 -233085 -228160 -220692 -157289 -218248 -429722 -463525 -110049
32925 -110049 283670 214135 -242661 -487030 -221227 153617 132365 -207255 -392025 -249781
32915 -249781 -88415 -198485 -460114 -543642 -340211 -81293 -81865 -401653 -739230 -716498
32905 -716498 -342167 -91510 -359787 -919510 -1170503 -910920 -552626 -491957 -596375 -522397
32895 -522397 -265941 -95427 -116565 -228469 -398003 -629864 -719967 -424526 81269 288089
32885 288089 23606 -304765 -326602 -230718 -376051 -664281 -716870 -533398 -505308 -754852
32875 -754852 -904005 -659949 -263398 -105841 -182376 -232237 -222656 -331557 -541011 -620808
32865 -620808 -526853 -466441 -488046 -350257 26940 286662 87080 -372717 -591195 -426437
32855 -426437 -209655 -219081 -338993 -315020 -117251 75492 116787 11846 -126913 -178917
32845 -178917 -119856 -43744 -32948 -44129 -13337 -11830 -139488 -292847 -238690 42868 269354
32834 269354 189930 -125648 -410325 -505889 -477458 -502053 -684560 -922266 -965564 -706545
32824 -706545 -362307 -230559 -317115 -396136 -382121 -374726 -349369 -141959 172217 226323 -128101
32813 -128101 -540848 -610823 -381990 -170925 -116212 -144151 -195581 -228448 -146137 33620 88634
32802 88634 -87614 -242527 -116334 123728 121256 -123181 -293419 -268923 -237566 -324767 -452297
32791 -452297 -568283 -690711 -711318 -492894 -198124 -176023 -444133 -619453 -472276 -220750
32781 -220750 -135048 -173353 -200717 -266845 -419887 -491598 -349612 -191583 -309953 -667887
32771 -667887 -947844 -944915 -708197 -374775 -77983 33990 -98245 -325835 -428426 -351706
32761 -351706 -189070 -1807 169732 181802 -93591 -511247 -731281 -624141 -418832 -357503
32751 -357503 -372521 -255283 -26254 61981 -126558 -431404 -612446 -620502 -568641 -521444 -433951
32740 -433951 -285621 -167871 -193914 -362761 -538671 -553398 -349343 -60833 80456 -8200
32730 -8200 -141150 -91377 95394 167548 50484 -45903 9885 14362 -275608 -735684 -997917
32719 -997917 -922860 -723945 -628599 -627544 -606139 -543866 -488235 -440805 -366724 -277531 -249484
32708 -249484 -361313 -605209 -847116 -921980 -805415 -637155 -541145 -506653 -490305 -509597
32698 -509597 -547000 -494129 -315717 -149180 -112403 -145774 -181207 -289655 -468395 -483392 -201226
32687 -201226 96709 72139 -135101 -124782 104571 172633 -21196 -151791 -69675 -46939
32677 -46939 -236883 -360688 -204920 -12217 -45847 -132987 -22326 120160 8594 -213272
32667 -213272 -198596 -26309 -105983 -483191 -708735 -490679 -103981 -218 -263455 -594939
32657 -594939 -676464 -454448 -163314 -89610 -240848 -324805 -169216 -2301 -95621 -297359
32647 -297359 -264046 -56077 -73755 -384480 -569201 -382565 -138648 -183098 -345003 -271794
32637 -271794 -57596 -118576 -540026 -938261 -990641 -782800 -554226 -376311 -234482 -231520
32627 -231520 -487314 -880747 -1074031 -870463 -479240 -318325 -524350 -756638 -611584 -181819
32617 -181819 6549 -318198 -763375 -737236 -183434 394436 581973 457162 318747 280433
32607 280433 265648 211098 99865 -100021 -369867 -571266 -573591 -419777 -275407 -253606
32597 -253606 -357089 -519320 -619764 -547308 -355432 -262365 -371034 -492195 -410615 -221291
32587 -221291 -172060 -238118 -139088 198930 481399 442728 171054 -86926 -242846 -350364
32577 -350364 -447340 -558417 -708682 -813456 -714719 -448393 -288490 -374579 -491405 -397899
32567 -397899 -162723 53623 319796 713150 961933 722581 157258 -175512 -43070 216474
32557 216474 247905 114481 25776 -46600 -236429 -472359 -558150 -477972 -422204 -520911 -667672
32546 -667672 -627987 -303158 112274 292995 156976 -24019 3488 137488 151622 103415
32536 103415 191979 300647 87680 -434511 -809690 -745287 -457545 -269969 -215489 -217329
32526 -217329 -320847 -506328 -568576 -436231 -345048 -451489 -557096 -483213 -412945 -530915
32516 -530915 -625550 -456856 -252066 -347099 -532298 -317220 229109 482558 161740 -313822
32506 -313822 -502663 -484415 -496707 -464178 -222967 75017 130750 -74199 -289984 -351777
32496 -351777 -312851 -281610 -283644 -263353 -153149 8363 29077 -227007 -576856 -672615 -474153
32485 -474153 -324891 -435920 -551680 -348608 31340 131203 -218625 -704530 -927827 -806888
32475 -806888 -572236 -502849 -674530 -875831 -806197 -439996 -106351 -81707 -214682 -157596
32465 -157596 106687 236286 38186 -270314 -405693 -381835 -366746 -371665 -305427 -218396 -243869
32454 -243869 -337259 -315571 -175403 -137903 -297388 -439522 -352338 -147477 -84165 -191959
32444 -191959 -281806 -263113 -221055 -200655 -149398 -93575 -134051 -219389 -182515 -91325 -261010
32433 -261010 -730778 -1030729 -783486 -312177 -251508 -676194 -1056830 -1059696 -913271 -870530
32423 -870530 -781585 -474622 -189695 -258217 -573083 -751448 -695674 -635249 -680576 -692596 -600404
32412 -600404 -517433 -481326 -374344 -199273 -164609 -360476 -583466 -639041 -607752 -634092 -650683
32401 -650683 -538852 -406909 -446293 -606866 -684055 -674837 -762544 -948959 -998163 -818450 -625516
32390 -625516 -596904 -609590 -500665 -376761 -425446 -563969 -547980 -369972 -287735 -447613
32380 -447613 -702711 -847719 -844105 -755030 -629152 -526322 -512005 -542985 -486222 -330267 -248952
32369 -248952 -364688 -574818 -715087 -764539 -760532 -645931 -384236 -133246 -91208 -207815
32359 -207815 -255970 -179893 -149990 -242678 -304776 -235229 -181168 -292395 -462433 -522456 -551513
32348 -551513 -730387 -963629 -961656 -726662 -629713 -851967 -1032441 -736517 -90808 370571
32338 370571 408682 278299 213969 102587 -168987 -382304 -312258 -170243 -347112 -784485
32328 -784485 -979884 -672219 -187611 37093 -9870 -65545 -47885 -71744 -131543 -83072 63019
32317 63019 107007 -22859 -169355 -270811 -536921 -1081671 -1556828 -1468857 -847737 -302842
32307 -302842 -306990 -657443 -820202 -623688 -353325 -247141 -214971 -126510 -103334 -326977
32297 -326977 -702760 -934725 -896832 -749538 -680664 -688564 -673697 -615954 -558676 -477413 -279521
32286 -279521 45244 344295 433803 299060 103354 -23093 -138518 -374511 -716181 -987609
32276 -987609 -1038115 -863206 -573935 -348624 -366891 -631875 -873358 -813386 -536621 -384013
32266 -384013 -454204 -482924 -306830 -136027 -179576 -299328 -300832 -293082 -418453 -466684 -190276
32255 -190276 155884 88223 -337855 -547214 -297286 -13008 -96982 -357800 -405507 -263340
32245 -263340 -243043 -429567 -619704 -675443 -687124 -814578 -1096920 -1371770 -1353549 -939973
32235 -939973 -461406 -389032 -726407 -972058 -804950 -482200 -351742 -311895 -94528 170407
32225 170407 98874 -336624 -724203 -744968 -501043 -295435 -312688 -528632 -751872 -760565
32215 -760565 -540893 -330143 -285379 -248318 -57664 62295 -234948 -823536 -1148472 -924596
32205 -924596 -468297 -218300 -221163 -274166 -335147 -523992 -819825 -1004308 -922058 -644998
32195 -644998 -344566 -118910 -15717 -132915 -540079 -1069499 -1341358 -1146529 -724820 -475184
32185 -475184 -434128 -292578 47023 243675 8635 -439611 -655763 -528121 -307055 -203300
32175 -203300 -220894 -312693 -445300 -527861 -477293 -345457 -244292 -203789 -222993 -332272 -446905
32164 -446905 -334907 36900 298954 120408 -287093 -449922 -305036 -201135 -293512 -379963
32154 -379963 -360150 -406687 -572215 -649470 -583740 -624252 -850913 -928270 -614099 -193643 -78371
32143 -78371 -221578 -283778 -193104 -167726 -280915 -367227 -348460 -340190 -391687 -372188 -190057
32132 -190057 58358 229073 287323 275658 231742 172459 81540 -85452 -301092 -405406
32122 -405406 -275765 -49519 -22696 -282145 -574565 -619253 -438567 -271319 -244056 -272890
32112 -272890 -260978 -230031 -214566 -173726 -108614 -146595 -354613 -548524 -490585 -255588 -167196
32101 -167196 -326291 -459106 -361710 -239318 -373344 -651539 -734706 -578469 -454525 -479670
32091 -479670 -463533 -290413 -151584 -260911 -559149 -836545 -969915 -914759 -643185 -253361
32081 -253361 -11626 -113671 -458886 -767302 -857831 -737022 -509815 -309153 -247969 -339432
32071 -339432 -487162 -589569 -602320 -499627 -291210 -105736 -113409 -295605 -424237 -354454
32061 -354454 -207118 -160466 -195515 -187437 -144630 -193982 -378415 -607257 -782946 -872592 -881935
32050 -881935 -843063 -789709 -679034 -416365 -51574 147193 -28998 -430721 -695963 -679719
32040 -679719 -569694 -564587 -628894 -645577 -637897 -686787 -733014 -644602 -449645 -322007 -314296
32029 -314296 -287216 -187222 -212597 -522978 -900050 -943442 -592338 -211568 -106513 -187829
32019 -187829 -228613 -218403 -260166 -294102 -186772 -12121 9536 -167022 -366347 -461307 -484035
32008 -484035 -462543 -354457 -185832 -74089 -54542 -34265 33667 71889 19834 -77670 -159525
31997 -159525 -204052 -181345 -86250 -21393 -86281 -179441 -99447 138840 301661 286002 227511
31986 227511 186442 9199 -336915 -562656 -445684 -223104 -288840 -605024 -738594 -477874
31976 -477874 -110388 -1906 -147514 -299730 -369017 -472993 -638084 -685435 -504517 -283748
31966 -283748 -293948 -496786 -572127 -370905 -133574 -135260 -298168 -357491 -278379 -251574 -340543
31955 -340543 -413411 -425807 -488521 -596649 -569601 -381586 -303055 -533101 -873883 -968285 -744981
31944 -744981 -451511 -328318 -406723 -569792 -669362 -610979 -432340 -286117 -285940 -400779 -528267
31933 -528267 -597463 -563437 -402733 -186025 -72734 -153254 -345251 -493657 -523932 -476505
31923 -476505 -453459 -532272 -655439 -639167 -418733 -241926 -415536 -848291 -1080670 -847027
31913 -847027 -382023 -47863 113806 258987 350407 170031 -303440 -754020 -843761 -578853
31903 -578853 -296548 -296220 -518216 -641864 -498546 -256503 -120785 -39631 86718 88789 -236515
31892 -236515 -665716 -746887 -480083 -357604 -611453 -876705 -823166 -677523 -775994 -966958
31882 -966958 -883003 -548862 -280054 -155784 -30182 54496 -84496 -355970 -456312 -357334
31872 -357334 -332043 -444333 -415847 -131718 86818 -66544 -425461 -592033 -471012 -325972
31862 -325972 -382643 -584691 -741399 -765225 -708920 -642052 -566309 -461703 -362823 -323722 -320078
31851 -320078 -271992 -174725 -104391 -67427 25489 176087 236334 135939 33996 96272 229531
31840 229531 208688 -436 -218113 -314017 -325245 -308435 -225381 -37615 157168 152398 -170156
31829 -170156 -652293 -926461 -770995 -368679 -84352 -25997 -17658 20483 -48432 -247632
31819 -247632 -335040 -149923 129524 260587 251377 209204 94952 -134703 -325814 -323269 -231089
31808 -231089 -248866 -378413 -497880 -575035 -595987 -455960 -160194 39048 -37071 -207252
31798 -207252 -227886 -181171 -252044 -316570 -146603 107018 62075 -307892 -623319 -631976 -448781
31787 -448781 -267408 -160547 -169040 -281980 -330544 -184413 -11908 -44724 -159052 -50386
31777 -50386 228151 300948 38583 -295436 -473010 -493710 -356443 -60595 151148 2400
31767 2400 -320787 -353593 -92152 -27749 -326658 -549585 -414443 -268034 -453377 -714371
31757 -714371 -660170 -413484 -337428 -437726 -489925 -498051 -578716 -602488 -389677 -98074 -7773
31746 -7773 -70750 -65633 -39308 -174687 -361672 -355600 -263612 -390179 -642783 -602288 -223682
31735 -223682 48017 -6328 -44682 211433 451641 239660 -290466 -608282 -520767 -353921
31725 -353921 -416082 -604018 -638075 -467406 -289137 -266046 -365570 -459820 -476615 -419080 -314082
31714 -314082 -218421 -242091 -458669 -760830 -890853 -685465 -252900 142067 327630 311190
31704 311190 173339 -29450 -252594 -425372 -473377 -383931 -236745 -138716 -109100 -73877
31694 -73877 -19728 -82372 -365631 -715128 -841171 -690293 -522702 -547129 -641878 -564012 -308469
31683 -308469 -97530 -78713 -185696 -275695 -277686 -209633 -154344 -218759 -421276 -610500 -588090
$$ [...]
##END NTUPLES=NMR SPECTRUM
##END=
