##TITLE=31Pdec_E3e-4-1
 CDCl3, 24 sc
 16.6.2023
##JCAMPDX= 6.0         $$ Bruker NMR JCAMP-DX V2.0
##DATA TYPE= NMR SPECTRUM
##DATA CLASS= NTUPLES
##ORIGIN= UXNMR, Bruker Analytische Messtechnik GmbH
##OWNER= root
$$ XWIN-NMR		Version 3.5
$$ Fri Jun 16 14:00:46 2023 Russian Standard Time (UT+4h)  she@DPX200
##.OBSERVE FREQUENCY= 81.013821
##.OBSERVE NUCLEUS= ^31P
##.ACQUISITION MODE= SIMULTANEOUS
##.ACQUISITION SCHEME= undefined
##.AVERAGES= 24
##.DIGITISER RES= 16
##SPECTROMETER/DATA SYSTEM= spect
##.PULSE SEQUENCE= zgpg30
##.SOLVENT NAME= CDCl3
##.SHIFT REFERENCE= (INTERNAL, CDCl3, 0, 248.564)
##AUDIT TRAIL= $$ (NUMBER, WHEN, WHO, WHERE, WHAT)
$$ ##TITLE= Audit trail, XWIN-NMR		Version 3.5
$$ ##JCAMPDX= 5.01
$$ ##ORIGIN= Bruker BioSpin GmbH
$$ ##OWNER= she
$$ F:/spectra/data/she/nmr/P31/1/pdata/1/auditp.txt
$$ ##AUDIT TRAIL=  $$ (NUMBER, WHEN, WHO, WHERE, WHAT)
(   1,<2023-06-16 13:59:51.81 +0400>,<she>,<DPX200>,
      <created by zg, POWCHK disabled, PULCHK disabled
       configuration hash MD5:
       00 E9 B6 7A A2 85 ED C7 34 08 36 98 17 FE 4E 26
       data hash MD5: 32K
       5C FC F1 8E D2 BB EB 7F 81 FE 2C 7D 4A 6A D9 16>)
(   2,<2023-06-16 13:59:54.18 +0400>,<she>,<DPX200>,
      <Start of raw data processing
       efp BC_mod = 2 LB = 1 FT_mod = 6 PKNL = 1 PHC0 = -10704.47 PHC1 = 136.2848 SI = 64K 
       data hash MD5: 64K
       F2 58 B4 F3 F6 15 46 C9 F5 52 A9 A3 5C F1 D3 67>)
(   3,<2023-06-16 14:00:09.09 +0400>,<she>,<DPX200>,
      <pk PHC0 = -0.5041787 PHC1 = 0 
       data hash MD5: 64K
       72 D9 15 B6 4B BB 1A 48 D7 86 82 57 48 DE 7B FC>)
$$ ##END=
$$ 
$$ hash MD5
$$ 18 67 30 37 9D 25 FD 15 E9 EC F3 CE BC 13 CD CA
##$RELAX= 
##$RELAX= 
##$RELAX= 
##$RELAX= 
##$RELAX= 
##$RELAX= 
##$RELAX= 
##$RELAX= 
##$RELAX= 
$$ Bruker specific parameters
$$ --------------------------
##$DU= <F:/spectra>
##$EXPNO= 1
##$NAME= <P31>
##$PROCNO= 1
##$TYPE= <nmr>
##$USER= <she>
##$AMP= (0..31)
100 100 100 100 100 100 100 100 100 100 100 100 100 100 100 100 100 100 
100 100 100 100 100 100 100 100 100 100 100 100 100 100 
##$AQSEQ= 0
##$AQ_mod= 1
##$AUNM= <au_zg>
##$AUTOPOS= <>
##$BF1= 81.014009
##$BF2= 200.13
##$BF3= 200.13
##$BF4= 200.13
##$BF5= 200.13
##$BF6= 200.13
##$BF7= 200.13
##$BF8= 200.13
##$BYTORDA= 1
##$CFDGTYP= 0
##$CFRGTYP= 5
##$CHEMSTR= <none>
##$CNST= (0..31)
1 1 145 1 1 1 1 1 1 1 1 1 1 1 1 1 1 1 1 1 1 1 1 1 1 1 1 1 1 1 1 1 
##$CPDPRG= <waltz16>
##$CPDPRG1= <>
##$CPDPRG2= <waltz16>
##$CPDPRG3= <>
##$CPDPRG4= <mlev>
##$CPDPRG5= <mlev>
##$CPDPRG6= <mlev>
##$CPDPRG7= <mlev>
##$CPDPRG8= <mlev>
##$CPDPRGB= <>
##$CPDPRGT= <>
##$D= (0..31)
0 1 0 0 0 0 0 0 0 0 0 0.03 2e-05 3e-06 0 0 0 0 0 0 0 0 0 0 0 0 0 0 0 0 
0 0 
##$DATE= 1686909591
##$DBL= (0..7)
120 120 120 11 120 120 24 19 
##$DBP= (0..7)
150 150 150 150 150 150 150 150 
##$DBP07= 0
##$DBPNAM0= <>
##$DBPNAM1= <>
##$DBPNAM2= <>
##$DBPNAM3= <>
##$DBPNAM4= <>
##$DBPNAM5= <>
##$DBPNAM6= <>
##$DBPNAM7= <>
##$DBPOAL= (0..7)
0.5 0.5 0.5 0.5 0.5 0.5 0.5 0.5 
##$DBPOFFS= (0..7)
$$ [...]
##$SUBNAM2= <"">
##$SUBNAM3= <"">
##$SUBNAM4= <"">
##$SUBNAM5= <"">
##$SUBNAM6= <"">
##$SUBNAM7= <"">
##$SUBNAM8= <"">
##$SUBNAM9= <"">
##$SW= 501.771253377433
##$SWIBOX= (0..15)
0 1 3 0 0 0 0 0 0 0 0 0 0 0 0 0 
##$SW_h= 40650.406504065
##$TD= 32768
##$TD0= 1
##$TE= 0
##$TE2= 300
##$TE3= 300
##$TEG= 300
##$TL= (0..7)
0 120 53 12 22 120 120 120 
##$TP= (0..7)
150 150 150 150 150 150 150 150 
##$TP07= 0
##$TPNAME0= <>
##$TPNAME1= <>
##$TPNAME2= <>
##$TPNAME3= <>
##$TPNAME4= <>
##$TPNAME5= <>
##$TPNAME6= <>
##$TPNAME7= <>
##$TPOAL= (0..7)
0.5 0.5 0.5 0.5 0.5 0.5 0.5 0.5 
##$TPOFFS= (0..7)
0 0 0 0 0 0 0 0 
##$TUNHIN= 0
##$TUNHOUT= 0
##$TUNXOUT= 0
##$USERA1= <user>
##$USERA2= <user>
##$USERA3= <user>
##$USERA4= <user>
##$USERA5= <user>
##$V9= 5
##$VALIST= <valist>
##$VCLIST= <CCCCCCCCCCCCCCC>
##$VD= 0
##$VDLIST= <DDDDDDDDDDDDDDD>
##$VPLIST= <PPPPPPPPPPPPPPP>
##$VTLIST= <TTTTTTTTTTTTTTT>
##$WBST= 1024
##$WBSW= 4
##$XGAIN= (0..3)
0 0 0 0 
##$XL= 0
##$YL= 0
##$YMAX_a= 8840
##$YMIN_a= -7831
##$ZGOPTNS= <>
##$ZL1= 120
##$ZL2= 120
##$ZL3= 120
##$ZL4= 120
##$ABSF1= 0
##$ABSF2= 0
##$ABSG= 0
##$ABSL= 0
##$ALPHA= 0
##$AQORDER= 0
##$ASSFAC= 0
##$ASSFACI= 0
##$ASSFACX= 0
##$ASSWID= 0
##$AUNMP= <proc_1d>
##$AZFE= 0.1
##$AZFW= 0.5
##$BCFW= 0
##$BC_mod= 2
##$BYTORDP= 0
##$COROFFS= 0
##$CY= -3
##$DATMOD= 1
##$DC= 0
##$DFILT= <>
##$DTYPP= 0
##$F1P= 0
##$F2P= 0
##$FCOR= 1
##$FTSIZE= 65536
##$FT_mod= 6
##$GAMMA= 0
##$GB= 0
##$INTBC= 1
##$INTSCL= 6.047779e-11
##$ISEN= 30
##$LB= 1
##$LEV0= 0
##$LPBIN= 0
##$MAXI= 10000
##$MC2= 0
##$MEAN= 0
##$ME_mod= 0
##$MI= 50
##$NCOEF= 0
##$NC_proc= -5
##$NLEV= 6
##$NOISF1= 182.463
##$NOISF2= 159.3651
##$NSP= 0
##$NTH_PI= 0
##$NZP= 0
##$OFFSET= 248.5645
##$PC= 4
##$PHC0= -10704.97
##$PHC1= 136.2848
##$PH_mod= 1
##$PKNL= yes
##$PPARMOD= 0
##$PSCAL= 0
##$PSIGN= 0
##$REVERSE= no
##$SF= 81.0140089999694
##$SI= 65536
##$SIGF1= 159.3651
##$SIGF2= -187.1042
##$SINO= 113.3802
##$SIOLD= 16384
##$SREGLST= <1H.CDCl3>
##$SSB= 0
##$STSI= 65536
##$STSR= 0
##$SW_p= 40650.406504065
##$SYMM= 0
##$S_DEV= 0
##$TDeff= 32768
##$TDoff= 0
##$TI= <>
##$TILT= no
##$TM1= 0
##$TM2= 0
##$TOPLEV= 0
##$USERP1= <user>
##$USERP2= <user>
##$USERP3= <user>
##$USERP4= <user>
##$USERP5= <user>
##$WDW= 1
##$XDIM= 65536
##$YMAX_p= 434157740
##$YMIN_p= -214890654
$$ End of Bruker specific parameters
$$ ---------------------------------
##NTUPLES= NMR SPECTRUM
##VAR_NAME=  FREQUENCY,     SPECTRUM/REAL,   SPECTRUM/IMAG
##SYMBOL=    X,             R,               I
##VAR_TYPE=  INDEPENDENT,   DEPENDENT,       DEPENDENT
##VAR_FORM=  AFFN,          ASDF,            ASDF
##VAR_DIM=   65536,         65536,           65536
##UNITS=     HZ,            ARBITRARY UNITS, ARBITRARY UNITS
##FACTOR=    0.620285442955139, 1,           1
##FIRST=     20137.2065510682, 0,            0
##LAST=      -20513.1999529968, 0,           0
##MIN=       -20513.1999529968, -214890654,  0
##MAX=       20137.2065510682, 434157740,    0
$$ Real data points
##PAGE= N=1
##DATA TABLE= (X++(R..R)), XYDATA
$$ [...]
39759E6422j03527J62004j15308k81771n0375J22642q813m5086K49439M80520
39749D66147L39606J11534O8402o997k31476j86885L20655O31832J37944o06739
39739A044023n93233N3026K39085l11217n78264N6684P18483M07438l95534n26910
39729A13581Q780J75983l16541o07572j82186L54383L89935K15536K67596K78726
39719F98221j27537o07260n77392j02469L26774N27013N57944L16530j85498m87383
39709C38943k55912J13372R1097j25409k7812K52941J87658j95422l88783k62450
39699b71777o3085K39314P38067R18997K28654p51964q37018n0163K99129l15974
39689A34180p54874o6106R04320P77569k64380q15328l17317L10845J42383n30353
$$ y = [56422, -47105, 114899, -409, -282180, -332555, -209913, -218726, -263812, -14373, 466147, 805753, 917287, 985689, 978692, 747216, 560331, 880986, 1512818, 1650762, 1044023, 450790, 503816, 742901, 431684, -146580, -89896, 628587, 1036025, 640491, 113581, 122361, 298344, -18197, -625769, -807955, -453572, -63637, 151899, 419495, 698221, 570684, -36576, -613968, -716437, -389663, 137350, 695294, 1011824, 826326, 338943, 83031, 196403, 287500, 162091, 134279, 387220, 574878, 379456, -9327, -271777, -334862, -95548, 642519, 1561516, 1790170, 1038206, 201188, 151025, 450154, 134180, -620694, -686800, 217520, 995089, 730709, -84619, -401936, -91091, 51292, -479061]
39679d79061p31117p9379P89996R73700L16432m25089n15379j13928J41086J81021
39669E8282M43188Q07940N38334m13485r90772n26903J93721J85723j78496O7006
39659A84538O97709N90091l47368q78433l36118L70084K05932m71056o14022p1617
39649f70260L80452K83543k5639j38480j17282j62822j95006j2384L48144O03925
39639B94191N15611J23187k65599l46072j34374N6731L2273l9776M7356J52725
39629D36253K0232k27850k39413n5433q5017l29119k01732N08655J033938N97570
39619A458084l65458p21367k26427K25388J3799l90617l27407Q0173L27274L17053
39609C90495K20961K1940k67229l38041p7151O8148k12114m23447J9815P36255
$$ y = [-479061, -1210178, -1289557, -499561, 474139, 790571, 365482, -149897, -263825, -122739, 58282, 501470, 1309410, 1847744, 1434259, 443487, -83416, 110305, 296028, 117532, 184538, 882247, 1472338, 1124970, 246537, -89581, 280503, 486435, 15379, -598643, -670260, -289808, -6265, -31904, -170384, -287666, -450488, -645494, -657878, -309734, 294191, 809802, 932989, 667390, 321318, 186944, 243675, 275948, 236172, 283528, 436253, 456485, 228635, -10778, -66211, -151228, -480347, -682079, -173424, 860514, 1458084, 1092626, 371259, 144832, 370220, 384019, -6598, -334005, -253832, 73442, 390495, 611456, 633396, 366167, 28126, -49025, 19123, -192991, -616438, -596623, 139632]
39599A39632Q16328J52337m53872m66160j51179R0203K07180J90138o9352m14365
39589D0890m51712j17843K33692L91404M57767M25907J35441k60506l40882o1335
39579D52823J58830R0348r4625l17011o66688q82871m77017L90940Q64583N49127
39569F8439N3835q605R8411j30570n04843m64665J6406M34412M49198J45455k08182
39558e0709l39029j26673J83882K02691o886L6170M00861M94550j2842n67080
39548B14935n15520m5241K08235J01631l5525m7850j3327R4886K62069J72313
39538C96606l53469q40507o43858J42692P61293P19976K23394k51422m04470k00088
39528d49853J33307K48061R3351K7433K45740L82045P3305l78001m24668j21075
$$ y = [139632, 955960, 1108297, 654425, 188265, 37086, 127289, 334469, 524607, 455255, 40890, -410822, -528665, -294973, 96431, 554198, 980105, 1115546, 855040, 514158, 452823, 611653, 702001, 607376, 290365, -376323, -1259194, -1736211, -1345271, -480688, 68439, 122274, 113669, 212080, 81510, -423333, -887998, -871592, -437180, 12018, 157473, -50709, -389738, -516411, -332529, -129838, -136724, -100554, 300307, 794857, 782015, 214935, -300585, -345826, -137591, -35960, -71485, -119335, -132662, -37776, 224293, 396606, 43137, -797370, -1441228, -1298536, -537243, 182733, 406127, 154705, -249765, -449853, -316546, -68485, 24866, 52299, 298039, 680084, 753389, 375388, -49280, -170355]
39518a70355M2277j7478M1099K18930J11391k88372m08575J4437M49828L37577
39508C30759j17125l35119k05159o4766n1583K0270J78341J74306k0224j6452
39498a06752L96576P47260M06004m73517j011442o97089J4588M09177L66047J66454
39488B17306q6290l16656j46288N49967J011851M13654p31649r83082J0903R15638
39478H55354N95632l44143o25032j36315K18548L5017k28796k27097j57475j62232
39468a76539l8069K64974L95072R0792m07486o23428l46597J95348N43564M10862
39458C08493k7189l31450l37639k88525l49913l02070Q8332O46450R52773P47383
39448A106645Q7038o40211q50314l21842L58272M24028J7414n1318L05823K58675
$$ y = [-170355, -128078, -145556, -104457, 114473, 225864, -62508, -471083, -456646, -6818, 330759, 213634, -121485, -326644, -391410, -442993, -422723, -244382, -70076, -90300, -106752, 289824, 1037084, 1443088, 969571, -41871, -738960, -724372, -315195, 50852, 217306, 131016, -185640, -331928, 218039, 1229890, 1643544, 911895, -71187, -60284, 855354, 1450986, 1106843, 481811, 345496, 564044, 599061, 370265, 143168, -14307, -176539, -214608, 50366, 445438, 536230, 128744, -494684, -841281, -645933, -102369, 308493, 281304, -50146, -387785, -676310, -1026223, -1328293, -1239961, -593511, 359262, 1106645, 1193683, 553472, -296842, -618684, -260412, 163616, 181030, 129712, 435535, 694210]
39438F94210m34804q22361l08206K58346l402m58794n9263P47158O66562k80622
39428a176p72559k91704K33523R1432k19356o7960L27620M99821M52498L14744
39418E66883q480m27711n33360k12580J47148K90952L47186L04339n9873n36327
39408a21823n31846l3178K32692o7519l43200r9770K54158J51991k11776k94982
39398a065253n5734J56803J78444M9983j86421l54830j83201K37939M52720L19880
39388d49670J79191J42231j04487n03270m40055J81554N17107P0786m02015q8437
39378h97065N31288N10049J800j16500K26334L25649L5839j04131j3578j75592
39368C24093n29465m09201J90690M08602n1738l53285P5337N67025L52006j92716
$$ y = [694210, 259406, -562955, -871161, -612815, -616217, -1075011, -1134274, -387116, 279446, -1176, -773735, -1065439, -831916, -740484, -959840, -1027800, -700180, -200359, 252139, 566883, 558403, 130692, -402668, -615248, -468100, -177148, 170038, 474377, 414504, -121823, -653669, -686847, -454155, -521674, -864874, -964644, -710486, -558495, -770271, -1065253, -1120987, -964184, -785740, -735757, -922178, -1277008, -1460209, -1222270, -769550, -449670, -270479, -128248, -232735, -736005, -1176060, -994506, -477399, -406613, -808628, -897065, -365777, 144272, 146072, 29572, 255906, 581555, 617394, 513263, 499685, 324093, -205372, -614573, -423883, -15281, -67019, -420304, -344967, 222058, 574064, 381348]
39358C81348k86233m8923r1684k85430q188N93954O56976k9388o39425n42943
39348b99936j19655J9599n8280K6383K07814J64956l3272m1246J41380J62797
39338A70540r8955l74619m40069l34947j11592K46341N58303M91135O4510k28970
39328e8323p9093J50703o1816n81079p29603j92607N71118R11076O85962K42280
39318H58618q2319k30829l00301l32393k66030m6418K45135M04331K92300o936
39308E35158k61579k98610j10351J59638K74028O9118l07449m54161j99577R5740
39298d98045m701l39874l16035K07855O26989M16979j03493k19497J79004N00421
39288D49603L26878o5698k06342p5817K0169k1696n3144n3971j88714m27375m35044
$$ y = [381348, 95115, 46192, -45492, -330922, -339110, 254844, 911820, 882432, 243007, -299936, -419591, -399992, -458272, -431889, -224075, -59119, -92391, -133637, 7743, 170540, 71585, -303034, -743103, -1078050, -1189642, -943301, -384998, 106137, 170647, -58323, -137416, 13287, -48529, -629608, -1359211, -1551818, -980700, -69624, 616338, 858618, 776299, 545470, 245169, -87224, -353254, -399672, -154537, 249794, 542094, 535158, 273579, -25031, -135382, 24256, 298284, 367402, 59953, -394208, -593785, -498045, -502746, -842620, -1158655, -950800, -323811, 93168, -10325, -229822, -50818, 449603, 776481, 710783, 504441, 428624, 448793, 427097, 373953, 319982, 131268, -296107, -731151]
39277g31151k6175M82578O02839K52501j98437l89150k76645k9401J70171K00640
39267E7770O0908j00130j33370o8220k4699k383P0099J37756J00743M5266J15159
39256B58899J84550P363k86091k63345J12087L02315l0887m82032m90736j38013
39246h25890Q1576M3007N9801K76515M52116L63489P9277j92027k71697p2023
39236e856K58890L43127J1866l66110l27023K1249J70788j2307j41615L2290K76384
39225B61683L11856J92883P5002n3347k11855k74502j57264M4996K10774K69762
39215F69988J15481k48221m68565j80362L49976M36289o476k60842N1997L03722
39205G62987r3957o01397l72120K66948K47688m35139n61527L69276J174490O69756
$$ y = [-731151, -757326, -274748, 328091, 580592, 382155, -6995, -283640, -313041, -142870, 57770, 118678, 18548, -114822, -183042, -207741, -210124, -140025, -2269, 98474, 143740, 258899, 443449, 450812, 164721, -98624, 13463, 315778, 284891, -197141, -687877, -825890, -744314, -701307, -641506, -364991, 87125, 450614, 529891, 337864, 66167, -5856, 253034, 596161, 608027, 241917, -85106, -63857, 106931, 94624, -46991, -14701, 261683, 573539, 766422, 841424, 788077, 576222, 301720, 144456, 189452, 400226, 669988, 785469, 537248, 68683, -111679, 238297, 674586, 668110, 407268, 459265, 762987, 669030, 67633, -304487, -37539, 210149, -224990, -786517, -417241, 757249, 1427005]
39195A427005n64562j044438m51281K07992K50570M4977L2715K7002j74144k70781
39185e14945k2543K61073K51319J29085J33929O0328k78413n09215k21027K97969
39175d12440M64604K77180J43390P5184k03430m99471l36468J09264J23249l62741
39165f21679n82307k04093J17690o8619j70030L68447Q97186M73447n23863q03537
39155a117358n7100O42336M87997k3036j19418M7067p6843l31065j19107M47178
39145b19349N68656J7311m06728l7019O37289O58751n3832o74835o38280k10211
39135c58247J18998K13882J17005j60844m31105l71247k3229J91820J53249J89407
39125c60311L22646Q7520m92859n80811J57187P36172K92350m21670j88884O28248
$$ y = [1427005, 862443, -181995, -633276, -425284, -174714, -129737, -97022, -70020, -244164, -514945, -537488, -276415, -25096, 103989, 237918, 298246, 19833, -489382, -710409, -412440, 52164, 329344, 472734, 547918, 344488, -154983, -491451, -382187, -258938, -621679, -1203986, -1408079, -1290389, -1359008, -1529038, -1160591, -263405, 210042, -313821, -1117358, -1174458, -532122, -44125, -67161, -186579, -139512, -216355, -547420, -666527, -219349, 349307, 366618, -40110, -77129, 560160, 1218911, 1165079, 490244, -148036, -358247, -239249, -25367, 91638, -69206, -500311, -871558, -894787, -702967, -549718, -360311, -37665, 49855, -443004, -1023815, -866628, -130456, 161894, -259776, -448660, 179588]
39115A79588O66673j45074n19832n0664J84402l65341p29673j45285O26111O05487
39105C06392P1631k06847k24754k75178j09199M55567Q25589M83366r2814k32031
39095A001722j32699k48393l10316O2997M18962J81686k30266p0057L97592L05731
39085A376959l88571r06499q31595l93793J46728N57761M37845j84468m80513
39076f66146N0639N94995J95442o29015o68756R928K78693j16774k98121Q9125
39066a159990L85990K50520J57094K88998J42898m01727o96438l89706O4486K85463
39056a072412M52986O32622N09741R4409j50916j42382k93852n93689m67865J63235
39046h68123N93110M24702J10329N9924L4035k02159l79636k62489l7399J17802
$$ y = [179588, 846261, 701187, 181355, 130691, 315093, -50248, -779921, -925206, -299095, 306392, 378023, 171176, -53578, -328756, -437955, 17612, 843201, 1326567, 1233753, 1001722, 869023, 620630, 310314, 373311, 792273, 973959, 743693, 673636, 1071228, 1376959, 988388, 81889, -749706, -1143499, -996771, -439010, -1165, -185633, -666146, -615507, -20512, 174930, -454085, -1122841, -1112913, -834220, -950994, -1249115, -1159990, -774000, -523480, -366386, -77388, 65510, -336217, -1032655, -1422361, -1357875, -1072412, -619426, 13196, 522937, 617346, 466430, 324048, 30196, -563493, -1031358, -868123, -275013, 149689, 260018, 319942, 353977, 151818, -227818, -490307, -527706, -409904]
39036d09904K52299K82872O8800j16584O0016K24391j83811o97860l18451P04848
39026a33384R58188O6998o05560q7650P15188N48219l08228p20249m17584M103
39016B0041J92000K18539Q7408j84462l32013k24029q8705l318K76289O56380
39006F18130O02485Q1471k04728K1396J05197l45491p06564m66300j60865l41725
38996g96994m96969O769O60807N78844m5062l25595j16928j3488k00270k68122
38986a017008l5797K41261L81165L84205K11629m8096q8027J03471P6851k82260
38976g2606l89795L8504L22126r8854n97573l17343L72173M40394j58133m86413
38966i47520r6878M81375O63349L81494j95091p62587p92944o3054P95584R22147
$$ y = [-409904, -157605, 125267, 194067, 77483, 137499, 361890, 178079, -519781, -838232, -133384, 824804, 891802, 286242, 198592, 913780, 1461999, 1153771, 433522, 15938, 20041, 212041, 430580, 517988, 333526, 1513, -222516, -311221, -314539, -38250, 618130, 1220615, 1302086, 1097358, 1118754, 1223951, 878460, 171896, -294404, -455269, -796994, -1293963, -1287194, -626387, -47543, -92605, -418200, -535128, -548616, -748886, -1017008, -1052805, -811544, -430379, -46174, 165455, 117359, 29332, 132803, 209654, -72606, -462401, -423897, -101771, -200625, -798198, -1115541, -743368, -302974, -461107, -947520, -1044398, -563023, 100326, 481820, 286729, -475858, -1268802, -1331856, -536272, 385875]
38956C85875L11671k90175l93496r0777L75655P43426O62144J18168l24247k96120
38946A202124k66108p13235j096069n72253N39926J045111N46788j27607k43937
38937C14740j7438L8708j22147k40599j71847M2162J98721N2883k97307l64109
38927e66233J8552L00061M7047k67128k0115M25997K64182l44128m27099K52884
38917c15980Q14390N91353j1630k82481j28866P1592M0944k32956n46746n86288
38907e86668k62073J15256K75480L68613N22035L91651k57243q76250p79010j93616
38897a281825J20749P7474K02895N33170N45674J90755K7343K04639K15649j30268
38887G06255l38532j07607J78715J39006p2550j81554j62920j6640K40764K53751
$$ y = [385875, 697546, 407371, 13875, -76902, 298753, 1042179, 1704323, 1822491, 1498244, 1202124, 936016, 222781, -873288, -1445541, -905615, 139496, 686284, 558677, 314740, 297302, 336010, 213863, -26736, -198583, -156421, 42300, 95183, -202124, -566233, -547681, -247620, -200573, -467701, -487816, -61819, 202363, -141765, -568864, -315980, 498410, 1089763, 1078133, 795652, 666786, 738378, 779322, 546366, -380, -586668, -848741, -733485, -458005, -89392, 432643, 824294, 567051, -309199, -1088209, -1281825, -1161076, -1083602, -880707, -347537, 198137, 388892, 416235, 620874, 836523, 706255, 367723, 260116, 438831, 577837, 505287, 323733, 160813, 144173, 384937, 638688]
38877F38688l34538j097530j115772k58108N61674O63082L88237K87680K75739
38868I152P9464j09572q084J75899O8340k49248l72695j37164K45622M52044K98879
38857D52637q1477k89607j31838M3402j46645m39115l10205J00058J80622o7506
38847f89674r063M33800N15911n4331n01188k05974K84140K08120j31000N9750
38837h9509O47867P08337m1017p97341p90844j99027K79887L09316R6624m3266
38827H1027m1588m9764j89112l56569l07391L8469M23404M67180Q4815l36316
38817a85845k75380K94800P17439L69102m39484p08080o1182O79848O12152m7804
38807I55566m51543l95875l47171m27766k65441J41288K76484K1415n9717L37965
$$ y = [638688, 304150, -793380, -1909152, -2167260, -1605586, -942504, -554267, -266587, 9152, 88616, -20956, -29040, 146859, 215199, -34049, -406744, -543908, -298286, 153758, 452637, 371160, 81553, -50285, -6883, -153528, -592643, -902848, -802790, -622168, -689674, -698737, -264937, 250974, 196643, -304545, -510519, -226379, -18259, -149259, -89509, 558358, 1266695, 1225678, 428337, -362507, -561534, -281647, 27669, 124293, 81027, 39439, -10325, -199437, -556006, -863397, -824928, -401524, 65656, 150471, -185845, -461225, -166425, 551014, 920116, 480632, -227448, -288630, 391218, 1003370, 955566, 504023, 108148, -239023, -666789, -932230, -790942, -514458, -493043, -552760, -214795]
38797b14795P08029N21321J2316k52775j54182M7539J83505J78103j05927o10626
38787C12508q96363n96777P3883N64679O18220M07262J67010l4546j86399k15894
38777B13583o9416J35402J27276k21825o06067n21308O6926N54500M58833Q7093
38767B24997O8951M35140O29979L29298k30454o84864q38763n69526P1017O24347
38757F0122N65338k8717n24511n02692j39627J74865K31574K5917k45957k49648
38747f33336P8751L01970O8315k52064o5199M51850N21063p0332o42213n89252
38737h30447j03466K39901J63107j68931l24603N3845P27956Q78296J37284o88759
38727H4183o23304N5936K94722p1133k36025N6736J75499n7199L839M65703M86178
$$ y = [-214795, 493234, 1014555, 1026871, 774096, 619914, 667453, 850958, 1029061, 923134, 312508, -583855, -1180632, -1106749, -542070, 76150, 483412, 650422, 615876, 429477, 213583, 144167, 279569, 406845, 185020, -421047, -942355, -875429, -320929, 137904, 224997, 293948, 729088, 1359067, 1688365, 1457911, 773047, -65716, -635242, -564225, 60122, 625460, 596743, 72232, -430460, -570087, -395222, -163648, -137731, -383688, -633336, -554585, -252615, -184300, -436364, -501563, -49713, 471350, 401018, -241195, -830447, -933913, -694012, -530905, -699836, -1024439, -970594, -242638, 635658, 772942, 84183, -539121, -483185, -188463, -259596, -495621, -438885, -263386, -320585, -316746, 148957, 635135]
38716F35135j73682m79375J57435P09012J73742o67168m64110N08350Q34617J80545
38706A414501m28348l80066j36378o3768R8026L39865J31947m95229o47954O3784
38696a03620P16101L51870n77468q68045k56891L85390L97274M6968j72297k40935
38686c21653k97261j82540K26649N72646M27950q105j45457J04962K12398j14239
38676D75350m79374m34419r6021J50245J59036l6828l66627n10096o2171P08701
38666d92204Q60268P0590o91175n02603J27695J54341k78826k09477L82483N61143
38656a7765J37314l5130L11056L32059l39752p96188l50231L20673L81293J74182
38646A17511L54438N46884L3420p88363q48457o3475N43395L65788p6008j01884
$$ y = [635135, 461453, -17922, 139513, 848525, 1022267, 355099, -109011, 399339, 1233956, 1414501, 986153, 606087, 469709, 405941, 503967, 843832, 975779, 480550, -167404, -103620, 612481, 964351, 386883, -481162, -738053, -352663, 44611, 91579, -80718, -321653, -618914, -801454, -574805, -2159, 425791, 417686, 272229, 377191, 589589, 475350, -4024, -438443, -534464, -384219, -225183, -262011, -628638, -1138734, -1200905, -492204, 368064, 438654, -252521, -755124, -627429, -473088, -751914, -961391, -578908, -17765, 119549, 84419, 395475, 727534, 387782, -408406, -758637, -437964, -56671, 117511, 471949, 1018833, 1052253, 263890, -584567, -648042, -104647, 261141, 185133, 83249]
38636H3249J91619K57247q4410m42934l37409K20829O44172M08398k51108o02857
38626H6796l92519q2789k7500j7771R1089k2114m50680n85287K3791P98851Q46433
38615B68300K24722k22291j07902J42250J31920L120k4632o3103k40824l43900
38605b32340r5544L37149M18857n8126n37946k95932M95439P83229N7969p59535
38595A13220n41524L33190M81945l80227r99109m87655M42290O87446K41273k07931
38585c17082l87574l95208j50043L58319P16513O17209L43003K20493Q6454k11840
38575H80244l68453k17851j59432l92408m07029Q5299M45463J35730k84797j42617
38565d25851J03027k60508p18521k95386O16734O92124j84304o92020j50609N55563
$$ y = [83249, 274868, 532115, 447705, 4771, -332638, -111809, 532363, 940761, 689653, 86796, -305723, -388512, -416012, -433783, -342694, -364808, -815488, -1400775, -1376984, -578133, 268300, 493022, 270731, 162829, 305079, 436999, 440119, 415487, 352384, 111560, -232340, -327884, 9265, 428122, 369996, -167950, -463882, 31557, 814786, 872755, 113220, -428304, -95114, 386831, 6604, -992505, -1480160, -1037870, -350424, -109151, -317082, -704656, -1099864, -1249907, -891588, -175075, 442134, 785137, 1005630, 1092084, 880244, 511791, 293940, 134508, -257900, -664929, -579630, -134167, 1563, -283234, -425851, -322824, -583332, -1301853, -1597239, -980505, -288381, -472685, -1164705, -1315314, -759751]
38555g59751N07858J4781j85174k6472J39101J81119J10162o2766r5265K59801
38545H3394O19712K91991n58834q92051k80253M22542L90221L071N3518M24133
38535E57444L66197k63990q04351p04933r7849M91036O15324J80818m46198o94893
38525h01395l74935J24348L62345L35895K66668K01565R0593R379J4500k6636
38515B02327k05396l61375l31697j95894m0173K57048O91700Q44403L55176m37260
38505G78859p69681l68463K68499N26088K77233k03119n80771o12307k76420Q4621
38495h75461M7448k90225l21855J83529N89163K68767l24054j95454O34727R97863
38485G14448K88565n57966m46703K38515L26585k60959m83054M9139M84511K08274
$$ y = [-759751, -251893, -237112, -422286, -448758, -309657, -128538, -18376, -81142, -176407, 83394, 703106, 995097, 436263, -455788, -736041, -313499, 76722, 79793, 133311, 557444, 923641, 659651, -144700, -849633, -947482, -456446, 158878, 339696, -106502, -801395, -1176330, -1051982, -689637, -353742, -87074, 114491, 205084, 214463, 228963, 202327, -3069, -364444, -696141, -892035, -932208, -675160, 16540, 860943, 1216119, 778859, 9178, -359285, -90786, 435302, 712535, 509416, -71355, -683662, -960082, -875461, -828013, -1118238, -1440093, -1256564, -667401, -398634, -722688, -918142, -283415, 714448, 1003013, 445047, -1656, 236859, 563444, 302485, -180569, -131430, 353081, 561355]
38475E61355j96738m8446K82365R7134m18587n70206l03244j18102j04097R9650
38465g18916M85770O01514L11871k5854j96433l15383l28328J6089N22812N29277
38455H82419j43437p53029n77697R9837M33076J78751j13080q275K44789K23240
38445D66594j750m7763J21922J37593j50349l63030j23222L74636O19606M31596
38435A465833K5399m22012q43103r82270n47359K17882N89509K47406k65557k65479
38425g79751J87290M67670K60902j01307j52384J16308K62730m9578n57384o12655
38415i58159q731O30097N90662J4905l48784k30254j00438l00414n07558l02583
38405a521257K02734N75223N59417J89965k72226m20542q1525L42463L18578n0242
$$ y = [561355, 364617, 316171, 598536, 695670, 277083, -293123, -596367, -714469, -818566, -718916, -233146, 368368, 680239, 654385, 457952, 142569, -185759, -169670, 353142, 882419, 738982, -14047, -591744, -491907, -58831, 119920, 6840, -1435, 243354, 466594, 464844, 417081, 539003, 676596, 526247, 163217, 39995, 414631, 1034237, 1465833, 1491232, 1069220, 226117, -756153, -1303512, -1085630, -496121, -248715, -514272, -779751, -592461, -124791, 136111, 34804, -117580, -1272, 261458, 211880, -345504, -958159, -966890, -336793, 253869, 268774, -80010, -310264, -410702, -711116, -1218674, -1521257, -1318523, -743300, -183883, 6082, -266144, -686686, -768211, -425748, -107170, -157412]
38395a57412k15868q0285l1948j10433M4803L32547K07414k43679k61745K24421
38385b92185L20449k46436m73723K03289P46990J61871p45194o06189K95024N60815
38375g5289n7089m83895k12591J32372J68607K95189O05094N02744j74729o82128
38365A8285m81896m532J41307q27j08417j49383j65080j0126L08952M57459K47762
38354B53504o2195j72769j15178n4766l7041n0350o3217L3992K44085K91362j3108
38343B54319l60448l38473r5942p6182k06552l739N17418P27156L11639k85567
38333D43629n41461m38660j82860J45780M17232L84198O9932j26667L9394L06582
38323E17099K91252m556k47410j90460N8169J20320k31758o66720n55019J60947
$$ y = [-157412, -373280, -453565, -485513, -595946, -551143, -218596, -11182, -254861, -516606, -292185, 28264, -218172, -691895, -488606, 258384, 420255, -324939, -931128, -636104, -75289, -132378, -616273, -828864, -696492, -527885, -232696, 372398, 875142, 700413, 18285, -463611, -468143, -326836, -327663, -436080, -585463, -750543, -760669, -451717, 5742, 253504, 191309, 18540, -96638, -151404, -188445, -238795, -302012, -268020, -23935, 267427, 254319, -106129, -444602, -540544, -616726, -823278, -827017, -309599, 417557, 729196, 443629, -97832, -536492, -719352, -573572, -156340, 227858, 297790, 171123, 210517, 517099, 808351, 803795, 556385, 365925, 424094, 544414, 312656, -354064, -909083, -748136]
38313g48136P10935M88638o6396j32258K52094L24841j48316n41914l75007M3292
38303a92227J92685K8904j59168j91001q2316M6165M4957r0154j69037j21518
38293f92710j41226k30402L2783P75989J266467P88738j71632m81003J1629L35774
38283A494407l4716m53285k58347K09676K64729r5496l79571l90859l16185k94813
38273b54460k93409k41543o1987K45100M38222K44420j62086k46903J62881O01414
38263D31649O04499K86737L7093o1868k00419m02744m38890j83148J27540J14450
38253C14899k53680n21135k92256J50929J46107l68542o53490k06922M79567O25442
38243e79081K12754j66243j76361P3035M15507O62851N15800k8387m41881l49926
$$ y = [-748136, -37201, 451437, 385041, 252783, 504877, 829718, 681402, 139488, -235519, -192227, 458, 29362, -129806, -320807, -403123, -356958, -312001, -402155, -571192, -692710, -833936, -1064338, -1031555, -255566, 1010901, 1799639, 1628007, 1147004, 1158633, 1494407, 1459691, 1006406, 748059, 957735, 1222464, 1126968, 747397, 356538, 40353, -254460, -547869, -789412, -851399, -606299, -168077, 76343, -85743, -332646, -169765, 431649, 1036148, 1322885, 1359978, 1298110, 1097691, 694947, 256057, 72909, 200449, 314899, 61219, -459916, -752172, -601243, -455136, -823678, -1477168, -1684090, -1204523, -579081, -366327, -532570, -708931, -635896, -220389, 442462, 958262, 929875, 487994, 138068]
38233A38068j14035j79045k70266L8075L74639R7466n06374n30441J45537P02938
38223a03438O24008J98689k12337n35070n62383p5328N01631M22197k59885o96390
38213f98306m89507j04637Q0771K55820N01255N10111K59588J54005K29651L0238
38203G28989m40441n01431P1962N11535J64598n34232p36771l06125K19971M01212
38193d20733K45062O0340J55236M35590L65813k76689q41319o35182m1391P6349
38183h76924j46852J47807Q38257P75149k59414r35365l46624O15501O72679o5916
38173D18298o23652o23879l38658O7067M76035N19015R0954k78900j90721p105
38163d91546j48817l35980j66879J13090J01220j8151J04718K98140K60003J64291
$$ y = [138068, 24033, -155012, -425278, -387203, -12564, 84902, -421472, -951913, -806376, -103438, 520570, 719259, 506922, -28148, -590531, -665859, -164228, 257969, -1916, -698306, -1187813, -1292450, -1211679, -955859, -454604, 55507, 315095, 469100, 698751, 728989, 288548, -212883, -140921, 370614, 535212, 980, -735791, -1041916, -821945, -420733, -175671, -115331, 39905, 475495, 841308, 564619, -276700, -911882, -953273, -876924, -1023776, -875969, -37712, 737437, 478023, -457342, -803966, -188465, 484214, 418298, -205354, -829233, -1167891, -1100824, -624789, -105774, -14820, -293720, -484441, -491546, -640363, -976343, -1143222, -1030132, -928912, -947063, -842345, -544205, -284202, -119911]
38153a19911K33616J95367j66242m11346j20748K92585K11813j60541k00751Q0900
38143a65258K05779J44631K19301L10361L6164l87632l31776J86825M38378J05928
38133G62701k54574j34382J66317Q8707k81713l39314J14320M78082J04142p19743
38123a5457r53177j54175P73389O85962k47980q42456o10828k47948k58159j51629
38113b022458M79095J009199O99668p9581l93636r4541J75753O6665j50590k08574
38103e19000j55479p1569L8742R4456K6713n6125m2797O55J8416P9575J36900
38092d49513K4801j26355O2964N24269O31797J20951m44212n16367k96031j66505
38082f34201l1885K09104J67108l40993o68924k43724L85975L24826k16631k66208
$$ y = [-119911, 113705, 309072, 142830, -268516, -389264, -96679, 115134, -45407, -246158, -165258, 40521, 185152, 404453, 714814, 750978, 363346, 31570, 218395, 656773, 762701, 508127, 373745, 540062, 628769, 347056, 7742, 122062, 600144, 704286, -15457, -968634, -1122809, -349420, 336542, 88562, -753894, -1364722, -1612670, -1870829, -2022458, -1543363, -534164, 165504, 85923, -307713, -402254, -226501, -159836, -310426, -519000, -674479, -746048, -707306, -612850, -586137, -642262, -685059, -684404, -665988, -586413, -449513, -424712, -551067, -488103, 36166, 667963, 788914, 344702, -171665, -467696, -634201, -666086, -456982, -289874, -630867, -1299791, -1543515, -1157540, -832714, -1049345, -1315553]
38072a315553L05801O02355J71837l42738k99669L5885R8627q7189r9636J79546
38062g50734M70831N10076K75429p9525l37634l37113q8681K39900M53244M28033
38052G83826J77029j25567k86965l06891l07873k56576l703L52532M58732J93235
38042F77779j34753k23851j32254m6531n585j5303j32213k77692k76202j89901
38032g56506k42521l12712M225O37479Q92320L94240l10805n04031k14340M3758
38022c68893O8496K0610l3593j34997j66911j454K14678K62860K16134K96105
38012C73035M71563M68724J34230l73503p09901o21847k06818J41886K01529J88117
38002F7015L08880L02929j13105n71613m58040J21592M59193K91794K5686o9835
$$ y = [-1315553, -1009752, -407397, -235560, -578298, -877967, -842082, -743455, -830644, -930280, -750734, -279903, 230173, 505602, 426077, 88443, -248670, -337351, -97451, 355793, 783826, 960855, 835288, 548323, 241432, -66441, -323017, -326720, 25812, 484544, 677779, 543026, 319175, 186921, 140390, 134805, 119502, -12711, -290403, -566605, -756506, -999027, -1311739, -1307514, -670035, 222285, 616525, 305720, -198311, -412651, -368893, -300397, -279787, -313380, -448377, -615288, -616742, -402064, -139204, 76930, 373035, 844598, 1313322, 1447552, 1074049, 364148, -257699, -464517, -322631, -121102, 67015, 375895, 678824, 565719, -5894, -463934, -342342, 116851, 408645, 434331, 364496]
37992C64496j32682j48747P0535K88232N9987l73908l21564J44335K18496k27453
37982e8273l88934K8108K90192Q223j58039K37071N80892L14772j43103k93271
37972D17638l68056n43712l81666J83839L72217r7370k95057L43034Q59671L09207
37962G99745o19129p53114k59762p532J9356K85478M57473L1053m47872k12714
37952g07018K73623J21309l33623j78618L34001K92816j05187K1353M36967K06822
37942C62445l51376o3659Q10263P24190m74530j072247k83938M57160m5451p90993
37932g28136l98161N30457M64044n03366q13599J19237J088689R18678K3248l88257
37922C12834l9380J96883k71937p98661m38588N27024Q32873N2513p40572n66717
$$ y = [364496, 231814, 83067, 153602, 441834, 501821, 127913, -193651, -49316, 169180, -58273, -447207, -419099, -128907, -120684, -278723, -41652, 539240, 854012, 710909, 417638, 49582, -494130, -875796, -691957, -319740, -417110, -712167, -369133, 490538, 799745, 180616, -572498, -832260, -839792, -820436, -534958, -77485, -46432, -494304, -707018, -433395, -312086, -645709, -824327, -490326, -197510, -302697, -281344, 155623, 362445, 11069, -52590, 757673, 1481863, 1007333, -64914, -348852, 108308, 62857, -728136, -1126297, -595840, -131796, -635162, -1448761, -1329524, -240835, 677843, 701091, 312834, 273454, 470337, 198400, -600261, -1038849, -511825, 321048, 373561, -367011, -933728]
37912i33728Q7981K27659r0674j30780J38287J36521j53924j93283O9699J46450
37902f95792m9609j11390L8644O1434r0770j32779l7419K7690J68895M54279M35336
37891F8519j83385p41729m67867J98620K39493k44070k21944M71014Q52199M22422
37881C93272j62674k99369j88268r5244R4829K83635R2921l19650l10164J30281
37871c80431K49227k04661n51152l27364O1348J83880J82062J72380o5117m04506
37861a084334k39879N03642R90395N93658k37893o57582m21453J13865M88356
37852D8775L95921r0200m39708k69659N1834k7182k98698j92707J38588J11268
37842e71768j21747P3320N13954M24430p8243j05521L22710K32935m36743n54310
$$ y = [-933728, -845747, -618088, -708762, -839542, -701255, -564734, -718658, -911941, -842242, -695792, -745401, -856791, -818147, -756713, -847483, -980262, -1017681, -989991, -821096, -366817, 68519, -114866, -856595, -1324462, -1125842, -886349, -1130419, -1352363, -881349, -29150, 393272, 230598, -68771, -257039, -352283, -257454, 26181, 119102, -200548, -510712, -380431, -131204, -335865, -887017, -1214381, -1153033, -969153, -787091, -614711, -679828, -1084334, -1324213, -820571, 169824, 763482, 525589, -131993, -553446, -439581, 48775, 444696, 354496, -85212, -354871, -303037, -330219, -628917, -821624, -683036, -571768, -693515, -620195, -106241, 318189, 239946, 134425, 457135, 690070, 253327, -300983]
37832c00983J67837N21621j14274o80254l31694J59719J7700n4286O19184J072176
37822A076746K46395r27586q03539L62598Q83000K71231l76947m25114l71673
37813f4889m24389n2335O93629Q53953Q9230o40484n13558K6955J99027N3970
37803B21109J4092l6744l77245o44878k68856M95439P51644K03782m43700m92782
37793e78139j08350J33232J06776R0134J25287n882k29029j89659P5865P9601
37783e00164k47744k46285M39682J080074P97419j15752o23117m42679k24624
37774h3190k99499k13877K78690O35214L56053k36325n01001l01235O4722L66660
37764F6212N04575L68864j6505l87840m97909l43760o8527J64087J87308j7519
$$ y = [-300983, -133146, 388475, 274201, -406053, -737747, -578028, -560328, -614614, 4570, 1076746, 1323141, 395555, -407984, -45386, 837614, 1108845, 731898, 306784, -64889, -489278, -541613, 152016, 1005969, 1095199, 454715, -58843, -31888, 167139, 221109, 235201, 198457, -178788, -823666, -1092522, -597083, 154561, 358343, -85357, -578139, -686489, -553257, -446481, -356347, -231060, -236942, -465971, -655630, -579765, -500164, -747908, -994193, -554511, 525563, 1322982, 1207230, 584113, 141434, -83190, -382689, -596566, -317876, 317338, 673391, 437066, -63935, -365170, -300448, 66212, 570787, 939651, 923146, 535306, 37397, -306363, -374890, -210803, -23495, -41014]
37754d1014j90093p9574J81396K74669J60866J6265j29033k86316k45297Q4113
37744b54018K74603p3156n62201m63211J65896N66540M33448J93528J14878k7346
37734C68961k66737k49305M9215J54116j08261l34717l05676l13609m59412l37794
37724a803219K11974O78183N95631J63200j99872m16421n46329m77778j41064
37715a935695L13860P28923R90201Q68037K88413k69323k54305Q4468K767n36588
37705B80758p54625k77220L40917N31839L87049J62827j44504m41100m31201j34877
37695d80137R5969K05418M03901N00557J29095l30920j08221N47476N01958m06990
37685A058106r44451m46209J05661k22225p74266n18423K16156M26186J18847
$$ y = [-41014, -231107, -310681, -129285, 145384, 306250, 322515, 193482, -92834, -338131, -254018, 20585, -52571, -614772, -1077983, -912087, -345547, 87901, 281429, 396307, 368961, 102224, -147081, -97866, 56250, -52011, -386728, -692404, -1006013, -1465425, -1803219, -1591245, -913062, -317431, -154231, -354103, -770524, -1316853, -1794631, -1935695, -1621835, -892912, 97289, 965326, 1253739, 984416, 730111, 814579, 817346, 280758, -473867, -751087, -410170, 121669, 508718, 671545, 527041, 85941, -345260, -480137, -384168, -178750, 225151, 725708, 854803, 523883, 415662, 963138, 1465096, 1058106, 113655, -332554, -226893, -449118, -1223384, -1741807, -1525651, -1099465, -980618]
37676i80618O9650L77103M38137J18879p1310J19926M05567M90808K91093j95498
37666A063737p21658p84204k81332J79258J22115q9189N9321L31880K05146k04739
37656a19665m04624l59358l46050k89806L2757L96069M36656L19061M08974N37078
37646F11092L08465q2643j15674J31449R4528l13054n99603n41537m01831k77600
37636a186408L3132M12229M08874N5341j6705L96504O02709P4453n88618m65235
37626b73724K41118M04488l41201r56487m60809N93723Q56061Q9195n48259k23838
37616f19733M58168N20875M7958j77274J2870P5171k08590m21452k75167j1324
37606e98498Q5447N1237N433l2818l3060J65p6209k64621k28376J98327N46738
$$ y = [-980618, -910968, -533865, -95728, 23151, -48159, 71767, 477334, 968142, 1259235, 1063737, 342079, -442125, -723457, -544199, -422084, -511273, -451952, -120072, 85074, -119665, -524289, -883647, -1229697, -1519503, -1486746, -1090677, -654021, -334960, 74014, 611092, 919557, 836914, 721240, 852689, 947217, 634163, 34560, -506977, -908808, -1186408, -1153276, -741047, -332173, -276832, -293537, 102967, 705676, 780129, 191511, -273724, -32606, 371882, 30681, -925806, -1386615, -792892, 63169, 152364, -395895, -619733, -161565, 359310, 407268, 229994, 242864, 318035, 109445, -312007, -587174, -598498, -513051, -461814, -456381, -489199, -522259, -522094, -598303, -862924, -1091300, -892973, -346235]
37595c46235L10760k17556l37751K2281L28375L33934K46341J38574p8602k11808
37585A88313l1522J73105P612k61566j34712J92024K08058Q6031K66773L78519
37575A072635j87101q75269n97078L24690M41591m47651r02348k24129M63511
37566i31149K08915k96121j68103J69170L1447j92178P0256L56600N0246l49315
37556a050232n2359N64823N33669j00826l70199J22406P25733P07963N0022o79464
37546D51536q41908k77354M28709N21701M9969k07394J02845M46094K89302j98409
37536G65091n68403o04179k50152L34747N91093J48990m25829l28198J67102J60758
37526h980k28632m3896O66273P51514l0920n43154k45430J4836k25104k06897
$$ y = [-346235, -35475, -253031, -590782, -568501, -240126, 93808, 340149, 478723, 400121, 188313, 156791, 329896, 337508, 75942, -58770, 133254, 341312, 427343, 694116, 1072635, 885534, 10265, -586813, -262123, 179468, -268183, -1170531, -1394660, -931149, -722234, -1018355, -1186458, -1017288, -985841, -1178019, -1107763, -751163, -700917, -1050232, -1102591, -537768, -4099, -104925, -475124, -352718, 373015, 1080978, 1131000, 451536, -390372, -667726, -239017, 282684, 332653, 125259, 228104, 674198, 963500, 765091, 196688, -407491, -657643, -322896, 268197, 417187, -8642, -336840, -169738, -8980, -237612, -281508, 384765, 1136279, 1105359, 562205, 316775, 331611, 106507, -100390]
37516a00390L46576M41034l04207o90664l820O17416J75708m29530j23793L86871
37506C15201N4793m81398j38010N02014K41499m95488m27343K93213M62151j3571
37496C13061j65533J79663L01278Q8349P1167J68351j32818n64533m43608j8587
37486b03210r5915n51642n45587J415M37239O39047R44387J071206M57807m70706
37476A684041o84233j20301L11214J81918j25952l74163o25442o33519j78576
37467e65013K16277j8109m14349k19481K02655K6457m02038r3406P02357P67974
37457B03324J293m20405p6674J19403l00468n53353j16969L11622O4680l80722
37447a148269k72031K51122N36160L96955J80782K19000N09587O89576L15844
$$ y = [-100390, 246186, 687220, 383013, -307651, -311471, 305945, 481653, 52123, -71670, 315201, 369994, -111404, -249414, 252600, 494099, -1389, -428732, -135519, 326632, 313061, 147528, 327191, 628469, 716818, 787985, 956336, 823518, 258985, -184623, -203210, -299125, -850767, -1396354, -1394939, -957700, -318653, 625734, 1696940, 2154747, 1684041, 999808, 879507, 1190721, 1372639, 1246687, 872524, 247082, -386437, -565013, -348736, -366845, -781194, -1000675, -798020, -771563, -1173601, -1267007, -564650, 203324, 204617, -215788, -292462, -173059, -473527, -1026880, -1143849, -832227, -767547, -1148269, -1420300, -1169178, -633018, -236063, -55281, 163719, 673306, 1362882, 1678726]
37438A678726n03756r59613m96796L46563O35111K60682j84324m01664m86740
37429a11811l66945J6514K39935n2800m08527k08816K67747L20322K2886k4506
37419c06001J67743J16953j11273n7835J68238J01709j23508m5620J52100r214
37409E3292k71218q4808K15286o8972n72081l45391L92387M80433j94640m80340
37399h76052N6484M56663J06097k88668o9215K93627J93494j11928k05158k54164
37389f98820l49736k0590P85407J067351R0029j246661j400545k75287O86872
37380a361980N16228j07608n9445N68985P47454J60446l43711j79658J7586m26902
37370d68605q58480k68216Q14658Q89526j10830o28786j6453M82262N945m24729
$$ y = [1678726, 1174970, 215357, -281439, 65124, 700235, 960917, 776593, 374929, -111811, -478756, -462242, -222307, -275107, -683634, -892450, -624703, -304381, -281495, -306001, -138258, -21305, -132578, -190413, -22175, 79534, -43974, -89594, 62506, 53292, -217926, -302734, -87448, -156420, -728501, -1073892, -681505, -201072, -395712, -876052, -819568, -362905, -256808, -545476, -614691, -321064, -127570, -239498, -444656, -698820, -1048556, -1069146, -283739, 783612, 873641, -373020, -1773565, -2048852, -1361980, -845752, -953360, -1012805, -443820, 303634, 464080, 120369, -59289, -41703, -468605, -1327085, -1595301, -780643, 108883, -1947, -630733, -647186, -164924, -158979, -583708]
37360e83708J56789Q29983M15837l96017l03961K77176O0246o92977o06221L43801
37350d99052P47136Q3080o22117n65657q3404L43722O52080O40179P7391n42001
37340B31357m69953P7862K57568J8730J7502K62776J40161k71353k36535K23910
37330B52025K55737l30685o96379l43060K33934M94495M90842L68342J05341j18877
37320G11715p5503q153k58725n26554l14535J29889K20380Q7284K41527M95285
37310G02610K97757j41203k04366o7091l30973p06364l76927M52296P20260K25122
37300E71121j32061Q0026K53806l4756l41260j94963K24590M76051L11633k35447
37290I78740p15085n29445J32451K42248n09183r69789k87126O06177N38408Q2595
$$ y = [-583708, -426919, 403064, 818901, 422884, 118923, 396099, 456345, -236632, -842853, -499052, 248084, 331164, -290953, -856610, -940014, -596292, 55788, 695967, 773358, 231357, -238596, -160734, 96834, 115564, 133066, 395842, 536003, 264650, 28115, 252025, 507762, 177077, -519302, -862362, -628428, -133933, 356909, 725251, 830592, 711715, 636212, 628059, 369334, -157220, -471755, -341866, -121486, -34202, 207325, 702610, 1000367, 859164, 654798, 587707, 256734, -449630, -826557, -374261, 345999, 571121, 439060, 519086, 772892, 738136, 396876, 201913, 426503, 902554, 1214187, 978740, 263655, -265790, -133339, 108909, -400274, -1370063, -1657189, -1051012, -512604, -430009]
37280d30009L79176R26559M85948n13670o02898J20397K00630n37322p58612q3278
37270h13079L57867Q1215o2118K72564L13819j36740k15344K95045M75056N709
37260E73994k57881K4379O3811l84857l73262M70102J026940M22007n97241q75923
37250I2069m00281J28893L76815L74269J67338n7289r0879j21234m01359n92854
37240e24512k51713K41396K10307j17247l1213L43049L52872J05088J30076J44860
37230F02963l83302q40369k85897O75718O56437j43252k86498L20811L36848m49029
37220B04430o71302J20274O63244K57236j61128P3888K30835k24804n75901k36049
37210c19277K55356L52582L05487K80644n545l39517p5109M93852L13966n19087
$$ y = [-430009, -50833, 875726, 1361674, 848004, 245106, 365503, 566133, 28811, -729801, -813079, -455212, -373997, -436115, -163551, 150268, 13528, -201816, 93229, 568285, 573994, 316113, 340492, 404303, 19446, -353816, 116286, 1143226, 1565233, 967992, 92069, -308212, -179319, 197496, 571765, 739103, 681814, 590935, 469701, 68342, -524512, -776225, -534829, -324522, -441769, -472982, -129933, 222939, 328027, 458103, 602963, 219661, -620708, -906605, -230887, 425550, 282298, -4200, 316611, 653459, 204430, -466872, -346598, 316646, 573882, 412754, 486642, 717477, 492673, -83228, -319277, -63921, 288661, 594148, 874792, 869247, 529730, 454621, 948473, 1262439, 743352]
37200G43352o59187K12341P09369J7231p90949n87434J05699K54797K2189L02957
37190C30365J242228J976138J544212j09996j738633j781638l47926N66300k25370
37181A455680j274658q06736L93305M65178k55839n0649Q42712O39633n37625
37172H71001o94315M38331R14330J02786l44563K48450L75376o00628j087771
37163B22997k35089M37837j55753p31626j19971N76630P2023q02252o68018J30845
37153a272377M81224L67470L31934K65512k4233j29292R7538R9109k42563k55274
37143b80952J45641J31029m34144n78249J059L24892r1498m20802q6361L79230
37133i10155N53536O90139O91834J03442o08245m47573K87857L75089j38632j24268
$$ y = [743352, 84165, 296506, 1005875, 1023106, 232157, -355277, -249578, 5219, 27408, 330365, 1572593, 3548731, 5092943, 4982947, 3244314, 1462676, 1114750, 1681050, 1455680, 181022, -625714, -232409, 232769, -23070, -73719, 768993, 1408626, 871001, 176686, 615017, 1529347, 1632133, 1287570, 1536020, 1911396, 1310768, 222997, -12092, 425745, 269992, -461634, -581605, -4975, 67048, -735204, -1403222, -1272377, -791153, -423683, -91749, 173763, 149530, 20238, 117776, 216885, -25678, -280952, -135311, -4282, -438426, -1016675, -1015616, -690724, -782222, -1203024, -1289385, -910155, -356619, 333520, 1025354, 1128796, 520551, 72978, 360835, 735924, 597292, 473024]
37123D73024L25058Q7672n35997j54658Q59998O71379o31920r51241Q9666M96426
37113G29407l56175o34428L54987P97105j60605p95560r4518M64358o1490l30545
37103h7464L86256N93254m15824r22271J4317O81203m3141n46151L45641J008358
37093A014178J16866p43915k0597R20968M10357n08967k94004J83130l96666j043873
37083c62523l62611O79108M84878l48232l72348J25017J27216m6832K51350M46382
37073F21405L1586j91241K18752K66413l92646m43890M75657O26341o50286j296703
37063g34612j10412Q65476r7166j239043m36067J074871J056121P3661q8950K19533
37053E83412k18974p12032j04314O61378K62681l46384K42689J038374M01555
$$ y = [473024, 798082, 885754, 349757, 195099, 1055097, 1726476, 1094556, 143315, 232981, 729407, 373232, -261196, 93791, 890896, 730291, -65269, -159787, 304571, 243081, -87464, 298792, 892046, 476222, -446049, -431732, 249471, 206330, -339821, 5820, 1014178, 1131044, 387129, 366532, 1287500, 1697857, 1188890, 894886, 1078016, 681350, -362523, -725134, -46026, 438852, 90620, -281728, -156711, -29495, -76327, 175023, 621405, 652991, 461750, 680502, 946915, 554269, 110379, 586036, 1212377, 562091, -734612, -845024, 20452, -76714, -1315757, -1751824, -676953, 379168, 452829, 363879, 583412, 364438, -347594, -451908, 209470, 472151, 125767, 368456, 1406830, 1808385]
37044A808385q70729r68464j73574R3233l6146L19574O39118J01031m69688n4268
37034C88472N16741J27366m97569l11261K2334l41901o17067j24231P7090o38462
37024a398488p76920N72443J581813O46202p31606n69911K91324J86208k65175
37015d64110J69565O40160K8832n42713J65095Q71062O9608j026901o68913K98906
37005d59409L07052K4529N90831R52827q8981j183978p01706L04401K31905j24831
36995a47360L80261N88218n48121j296523j08314J159337L55401j030143n94738
36986a241982O54275M46922m69987p0226R09987N42787m59332k49933N09979J60870
36976G33360n20006K7734Q13316J67607q43171m09946M68556k3829q93237k95239
$$ y = [1808385, 937656, -30808, -204382, -111149, -147295, 172279, 811397, 912428, 442740, 388472, 905213, 1032579, 535010, 223749, 246083, -95818, -712885, -837116, -760026, -1398488, -2175408, -1602965, -21152, 625050, -106556, -676467, -385143, -198935, -464110, -294545, 345615, 374447, -168266, -3171, 867891, 937499, -89402, -758315, -459409, -152357, -127828, 463003, 1415830, 1326849, 142871, -558835, -254434, -22529, -147360, 232901, 821119, 272998, -1023525, -1131839, 27498, 382899, -647244, -1241982, -587707, -140785, -610772, -680998, 228989, 771776, 312444, 62511, 572490, 733360, 213354, 241088, 1054404, 1222011, 378840, -31106, 437450, 413621, -479616, -774855]
36966g74855Q03213N29372k71462J03262P58884J89404m45266L24383R41467l63395
36956A795007j787934r40803P60055P28424j52811K74763J035138J68713j041113
36947H39439m37960O74890K8006j072562k21068J351591J097218o6087J25542
36938B319009P24661k17349j315972m76214O63575k33080j368690j03027J633086
36929A625999O20414j544255j254511N94757O24798p27260o48722M20081K34226
36920e4473l12334P38943J687616J68380j597511l95276J703429P95132j647078
36911A086828j448143P18254J026494l52560l50521O96440K69633p28123J53282
36902A071584J491039N75702r33279r2491J298231J22534j614390m91579J372988
$$ y = [-774855, 28358, 557730, 286268, 389530, 1148414, 1337818, 892552, 1216935, 2158402, 1795007, 7073, -933730, -173675, 554749, 401938, 676701, 1711839, 1880552, 839439, 401479, 1076369, 1104375, 31813, -189255, 1162336, 2259554, 2193467, 2319009, 3043670, 2826321, 1510349, 1034135, 1697710, 1464630, 95940, -7087, 1625999, 2246413, 702158, -552353, 42404, 667202, -60058, -708780, -288699, -54473, -366807, 372136, 2059752, 2228132, 630621, 235345, 1938774, 2733906, 1086828, -361315, 356939, 1383433, 1030873, 680352, 1376792, 1646425, 918302, 1071584, 2562623, 3138325, 2205046, 2112555, 3410786, 3533320, 1918930, 1427351, 2800339]
36893B800339J72102k031786j045971J372024Q84909j160633p33442Q53942J273
36884A112757j434383K14710K461178R32976j908272j140683J222291L47635j799987
36875H222n22792J927374O98589j732586l20405K178729M26006k451465n11777
36866c00105K962703J258496k617315j457258K136107Q69562k682582r92917L311982
36857B488673K230459j926441j116740K392959P17527l250779j129685L636276
36849D042249J653573l624995j907047L590628J941029l756655j945749M312295
36841D305328K754138l596230j781377N041103L041384m347561k050032O337241
36833I703994M248821m647023k021507Q584453P026611l184965K037J2492206
$$ y = [2800339, 2972441, 940655, -105316, 1266708, 2151617, 990984, 257542, 1111484, 1112757, -321626, -106916, 2354262, 3287238, 1378966, 238283, 1460574, 1808209, 8222, -514570, 1412804, 2111393, 378807, 58402, 2237131, 2663137, 211672, -300105, 2662598, 3921094, 1303779, -153479, 1982628, 2852190, 169608, -823309, 2488673, 4719132, 2792691, 1675951, 4068910, 4786437, 1535658, 405973, 4042249, 5695822, 2070827, 163780, 3754408, 5695437, 1938782, -6967, 4305328, 7059466, 3463236, 1681859, 6722962, 9764346, 5416785, 3366753, 9703994, 13952815, 9305792, 7284285, 15868738, 22895349, 19710384, 19712421, 32204627]
36825C2204627R790376j754620P877350K9919102K4872777N730694L6843844J15984822
36817B61468972J37522836L5165932j03495262j43514963p8393130j4889391j1987444
36810H1877550k7196723j6905137o0222k701933j0197678m324309K704547j959385
36802B1236710o693084j575197K626788j571426m043880M96941K293702j815031
36794A0955523k026916K865287K736270j731458J76057N904918M040448o42626
36786B2277503M206673J0770118N152948j1488J3244886K6600505J5792902J0894343
36778A08928390N8303195J21590515J01907589j6842291j21911423j16546281
36772A35429694m3237757m357463j8143359k6736135p619664M766869n425656
$$ y = [32204627, 41995003, 40240383, 48117733, 78036835, 102909612, 108640306, 145484150, 261468972, 398991808, 434157740, 330662478, 187147515, 108754385, 93864994, 81877550, 54680827, 37775690, 37715468, 35013535, 24815857, 20491548, 23196095, 21236710, 14543626, 12968429, 15595217, 14023791, 9979911, 10476852, 12770554, 10955523, 8928607, 11793894, 14530164, 12798706, 12974763, 18879681, 22920129, 22277503, 26484176, 37254294, 42407242, 42395754, 55640640, 82241145, 98034047, 108928390, 167231585, 288822100, 390729689, 373887398, 251975975, 135429694, 92191937, 87834474, 69691115, 42954980, 35335316, 40102185, 34676529]
36765C4676529j2006358k075072L899682l824787p458552J096057N886212m00748
36757A9792963l437423L838080R016143N121106J318825J851967j346447q955821
36749B7199393j0026955k986742L51906l553455m694378R2184J597927k676718
36741E303162l481689J595044L185685j534579l470005O83930K527063j331995
36733C476616l100896N68843K427261p32799k125199J196143K664218n70585k157289
36724A646313P75172K258133m44313j687412J048878K322841j89819j161269J626099
36715F194623K979369P65327K4799K850719M505628L050844K552672L595046J176616
36706B7695643m689142o922838l431958p99573k404893l286220o36786R56905
$$ y = [34676529, 22670171, 20595099, 24494781, 20669994, 13211442, 14307499, 20193711, 19792963, 16355540, 20193620, 29209763, 34330869, 35649694, 37501661, 36155214, 27199393, 17172438, 14185696, 14537602, 10984147, 6289769, 6381953, 7979880, 5303162, 1821473, 3416517, 6602202, 5067623, 1597618, 2281548, 4808611, 3476616, 375720, 944563, 3371824, 2639025, 513826, 1709969, 4374187, 3803602, 1646313, 2421485, 4679618, 4235305, 2547893, 3596771, 5919612, 5729793, 4568524, 6194623, 9173992, 9939319, 9964118, 12814837, 17320465, 20371309, 22923981, 26519027, 27695643, 23006501, 16083663, 12651705, 11852132, 9447239, 6161019, 5524233, 6481138]
36698F481138r78878j971271K95945J441497p01025j729859M74099J444285j016016
36689C739915k381603j74370J298100n99830j874987R8466J570312p8942j428563
36680A68498m0131R46180m94842j164700O39798J398086n97419j542364N32007
36671a54887J789928K4146j049936Q45175J966851j84305j905142l14632J259240
36662B276438k00181j761417m31449J200945K42548j040311K7131J384599N75173
36653B273476n54813N6677N54649o60154j262752L76490J498114n3071j640937
36644E87679o42135R71947P61184J47219P59873Q22193r08854j866665k67753
36635C64688J183086R5472j210594j26009J401662O21215j031687q52277M14311
$$ y = [6481138, 5502260, 3530989, 3826934, 5268431, 4567406, 2837547, 3311646, 4755931, 3739915, 1358312, 1183942, 2482042, 1882212, 7225, 105691, 1676003, 1597061, 168498, 128367, 1074547, 579705, -584995, 54803, 1452889, 855470, -686894, -154887, 1635041, 1659187, 609251, 1454426, 3421277, 3236972, 1331830, 1017198, 2276438, 2076257, 314840, -116609, 1084336, 1326884, 286573, 313704, 1698303, 2273476, 1718663, 1775340, 2329989, 1669835, 407083, 783573, 2281687, 2228616, 587679, -54456, 917491, 1678675, 1825894, 2585767, 3407960, 2499106, 632441, 364688, 1547774, 1643246, 432652, 306643, 1708305, 2329520, 1297833, 445556, 859867]
36626H59867O63804L17013N62297N34640n13591j023634l5310O17749l15092j044130
36616F23613k25439M31461l50200p95873L38328J085785n241r64998j24024P21040
36606G34452j41218j005190p6309J067245M79779o29200l90662M51748N34302
36597A024947M47789Q07340N17181p08799j008279K34855P70163n47759j491194
36588D6244m74328O17555J03872m64691L76849J070762K06301o48815q6308L79479
36578A126920n23495j098445L3535J071060L47858n75656l6143N89818j66950
36569G68502q10472J54350J101106K64634q94404m44280M88071O6617p88924l64344
36559d59144O09640N76824M539J5408J56033j79419j97281M02256L23736o77816
$$ y = [859867, 1523671, 1840684, 2402981, 2937621, 2424030, 1400396, 1365086, 1982835, 1667743, 623613, 398174, 829635, 479435, -316438, 21890, 1107675, 1102434, 137436, 13412, 734452, 593234, -411956, -488265, 578980, 1058759, 429559, 38897, 490645, 1024947, 1472736, 2280076, 2797257, 2088458, 1080179, 1315034, 2085197, 1537438, 46244, -428084, 189471, 293343, -171348, 205501, 1276263, 1482564, 833749, 747441, 1126920, 603425, -495020, -461485, 609575, 957433, 381777, 345634, 935452, 768502, -41970, 112380, 1213486, 1478120, 583716, 139436, 627507, 694124, -94800, -459144, 150496, 727320, 731859, 747267, 903300, 723881, 526600, 928856, 1252592, 574776]
36549E74776p40549O43609J140640l77395j521123m66425R22580O24706j36003
36540F64816K16997N14883m15673r87515J08410J027478L6019j172812n54016
36531e61413O41964M48020k60577M2920L82143m88996j197263k81453P89238K45897
36521b39520p03895k86148N47331K67356k18034K86219N90629l60230q93107L22684
36511f86715J288562J03946j302478m54347J220237J006111l75517n52826J06038
36502C53011j87331q28967k22153P10889K03537p69453k76775P79978L70687o88475
36492e55052k43476J058008R21959l99138p34794Q0072L60130j34740k44836K1764
36482A29897j25316k12367M51396Q24110j07766r85381k35279R38152N83795n41413
$$ y = [574776, -165773, 477836, 1618476, 1241081, -280042, -746467, 176113, 800819, 664816, 881813, 1396696, 981023, -6492, 101918, 1129396, 1165415, -7397, -561413, 80551, 528571, 267994, 310914, 693057, 204061, -993202, -1274655, -485417, -239520, -943415, -1229563, -682232, -414876, -632910, -346691, 243938, -116292, -1009399, -686715, 601847, 705793, -596685, -1051032, 169205, 1175316, 799799, 246973, 353011, 165680, -663287, -885440, -174551, 28986, -740467, -1017242, -237264, 133423, -555052, -798528, 259480, 1181439, 782301, 47507, 127579, 487709, 352969, 108133, 129897, 4581, -207786, 243610, 1067720, 959954, -25427, -260706, 677446, 1261241, 719828]
36472G19828n30799K37045K82982M7258N71893P93018n42881j838119r68853Q20595
36462d08033Q77192l85453n92304K58787K74655n39042o04071m2442j51307m61757
36452a773775K86492J155907M28818r22546o85087N92173O46885k95205j20995
36443f87333J014073R55168l71041q48207j9341M36548K7148m2356L61260J48514
36433I74433m50646j89261N21322J80591q11222o90988M09988P05523r778k90422
36423C49540P1062j2160l86587M2352P90245M42883n24232m41097M43481M49481
36413A224968l52453m01609K98132L31610k95926l69979m8106l49511o78598J43739
36403d97733J101227M30817r09550o39052P10571P20344m73861n65527N11258
$$ y = [719828, 189029, 426074, 709056, 756314, 1328207, 2121225, 1578344, -259775, -1228628, -408033, 469159, 83706, -508598, -249811, 24844, -514198, -1118269, -1160711, -1312018, -1773775, -1487283, -331376, 97442, -825104, -1510191, -918018, -271133, -566338, -687333, 326740, 1281908, 910867, 62660, 43319, 479867, 507015, 464659, 825919, 974433, 523787, 334526, 855848, 1036439, 225217, -465771, -55783, 649740, 639962, 349540, 420602, 408442, 21855, 64207, 854452, 1297335, 773103, 332006, 775487, 1224968, 872515, 470906, 769038, 1100648, 804722, 434743, 386637, 37126, -641472, -497733, 603494, 1034311, 124761, -514291, 196280, 916624, 442763, -122764, 388494]
36394C88494O27784k68141j31366Q87592M89087j094870r83381J041370J759031
36385B715600L93272N83873M172368P119909M798639j417313n945302n714326
36377F706720k596189j71492n6995j113014j270331j24575O14463j90828j155352
36368F42407o03385N96694O30715r0250p858N08501J58174l42875L78683J176932
36358C047738K65933q91954J64406J881915J019422p53881J298499O146783O694576
36349A8873437L63040o274019o711613k958303p56490j008768p89780M35583O99369
36340A872456j53344m18685J00096J25946l82467l79627L2352r7443o08724n55391
36330d64831P3384N43666O27616M33888j31771p20828m74633M81082P86973m0989
$$ y = [388494, 1016278, 748137, 616771, 1504363, 1993450, 898580, -84801, 956569, 2715600, 3108872, 3692745, 7865113, 14985022, 19783661, 18366348, 12421046, 6706720, 4110531, 3939039, 3882044, 2769030, 1498699, 1374124, 1988587, 1797759, 642407, 39022, 635716, 1266431, 1176181, 1168323, 1676824, 1834998, 1492123, 1870806, 3047738, 3313671, 2421717, 2586123, 4468038, 5487460, 4733579, 6032078, 12178861, 18873437, 19236477, 12962458, 6250845, 3292542, 2536052, 1527284, 737504, 1173087, 1872456, 1719112, 1300427, 1400523, 1526469, 1144002, 764375, 796727, 699284, 90560, -464831, -391447, 152219, 779835, 1213723, 1081952, 361124, -113509, 367573, 1154546, 1113557]
36320A113557p43228m14632J72879K35181J98362L15335p7519r01395q47419L57278
36310e91601J112913M91363l24218k55648L3206j24094r5490L86904L54823l74093
36300F14065m61112M35124P15562k63748q24406M514O63930q675o48664q2092
36290A44498M85650J16921K04693J464123J797788J86513j91858L344489P395296
36281A4948113O144980l83512o067306o536226l502948r45444l54300o96347o37458
36272A969552K30907J107324Q45968L3634J026551M186728N740828K304574l591523
36263A3854543o040167l479505j99961J84902j011705j065078j49573M0498m75749
36254A658205n35697j55855j52201l76510j31764L04489J39166m14904m90861
$$ y = [1113557, 370329, -44303, 128576, 363757, 562119, 877454, 799935, -101460, -948879, -591601, 521312, 1012675, 688457, 432809, 466015, 341921, 246431, 633335, 988158, 614065, 152953, 588077, 1303639, 1039891, 215485, 219999, 883929, 875254, 226590, 144498, 630148, 747069, 951762, 2415885, 4213673, 4400186, 4208328, 7552817, 14948113, 21093093, 20709581, 14642275, 8106049, 4603101, 3657657, 3303357, 2607010, 1969552, 2200459, 3307783, 4153751, 4187385, 5213936, 9400664, 15141492, 17446066, 13854543, 7814376, 4334871, 4134910, 4319812, 3308107, 2243029, 2093456, 2133954, 1658205, 1122508, 966653, 814452, 437942, 306178, 610667, 749833, 334929, -155932]
36245a55932j45637k31543p41841n93960N89859J567453J075482l04228q23106
36236B36547M5459R02906M63904o15434q03512J9862N52242J69559l07163j91237
36226D73133L7050j35300k61914R5859M04133J24906j80745K06959P79204N18661
36216B061946m18066r08495n60343j04715r1772j75786Q5491M71159M77288K9691
36206H66398m61178n78165k97288N3426K20294K95502M06294L66882L8445k07156
36196G03454P602L05034R2655k96688l3205O55450O00479l73185r48418l22569
36186C90609N46815N20992k9759j43300P0728j18020n96320o24541j82753R61
36176a64588l40419o59812m56464J48060O88622P80717L66243j60945k81334j1303
$$ y = [-155932, -301569, -533112, -1274953, -1868913, -1279054, 288399, 1363881, 1059653, 236547, 282006, 1184912, 1648816, 1033382, 229870, 249732, 801974, 971533, 664370, 473133, 510183, 374883, 112969, 208828, 612961, 737867, 557122, 764081, 1543285, 2061946, 1643880, 735385, 175042, 70327, -21445, -197231, -111740, 359419, 836707, 866398, 405220, -172945, -470233, -416807, -196513, 98989, 505283, 872165, 910610, 703454, 711056, 1016090, 1108745, 812057, 778852, 1434302, 2034781, 1661596, 713178, 390609, 937424, 1458416, 1428657, 1285357, 1356085, 1238065, 641745, 17204, -165549, -164588, -505007, -1164819, -1621283, -1473223, -784601, -3884, 362359, 201414, -79920, -91223]
36166i1223J08056j44950l56059k42104j05426j53615k2825N07286R06214O03025
36156A008379j29666n66061m63179j31889J05353J01062j72382m82133m02164
36147a132680J67207P74313R11616N11635j09237n04029l41805K01369M21965
36138I00354n0389n95273m50075Q3183J63169j27857J5553N60748N82052r4231
36128I87234n31078l07136j71819n45636o53238Q4668Q93379P76186j6694n06830
36118I036l67171m4488M9465j00475k41894o1189L97331N37299o845n72215k86347
36107f87493N03941O77600Q2246l83334l59373l38732l87294m6084L88054R1400
36097d59069n85768l74546O56097R56850O9773o17580l22056k1817l28114l15914
$$ y = [-91223, 16833, -128117, -484176, -726280, -831706, -985321, -1008146, -500860, 405354, 1008379, 878713, 312652, -150527, -282416, -177063, -76001, -248383, -730516, -1132680, -965473, -191160, 720456, 1232091, 1122854, 618825, 277020, 478389, 900354, 849965, 254692, -195383, -112200, 50969, -76888, -61335, 499413, 1081465, 987234, 456156, 149020, -22799, -568435, -1221673, -1137005, -243626, 532560, 515866, 9036, -358135, -402623, -353158, -453633, -695527, -756716, -359385, 177914, 171069, -401146, -687493, -183552, 494048, 576294, 192960, -166413, -505145, -892439, -938523, -550469, -459069, -1044837, -1419383, -763286, 193564, 263337, -354243, -676299, -698116, -1026230, -1342144]
36087a342144M30833P18851J4194k75651O50047J212213J01215j214085q03689
36078e08216N38296P90832L5579j94846J58798l4488o16430m63146J59839q551
36068a42333p28811n32676N43246Q17195j90874r30946l67038N28432N30346j10372
36058e83831m44751j87041L32216P23049O51346R6081l73269k45976J09810L6412
36048A14046k77316j87914J72803J52591j62635j13701K44578K15396k24266l58728
36038d25146k0597J91288O9489P7550L19595K71364k17587n59563l41168J23873
36028e10902L53078K20786j37905m31403k92820K64378O91711O54042M93328M33735
36018A738028K4673q54061j249316m88829M70160L63225l61408l62825K81443
$$ y = [-1342144, -911311, -192460, -178266, -453917, 196130, 1408343, 1509558, 295473, -508216, 30080, 820912, 856491, 661645, 820443, 785955, 169525, -293621, -133782, -142333, -871144, -1403820, -860574, -43379, -234253, -1165199, -1532237, -1003805, -473459, -583831, -1028582, -1215623, -883407, -160358, 490988, 587069, 213800, -32176, 77634, 114046, -163270, -351184, -178381, -25790, -188425, -302126, -57548, 157848, -66418, -425146, -445743, -254455, -184966, -107416, 212179, 483543, 265956, -293607, -634775, -510902, -157824, 62962, -74943, -506346, -799166, -534788, 156923, 810965, 1304293, 1738028, 1762701, 908640, -340676, -829505, -359345, 3880, -357528, -720353, -438910]
36009d38910L34829l01496m47284J41436L15781l30547o74105o0663N47520K93519
35999f19920j32268J83060P68319O37622p0901m48009k50823N737K5930m6940
35989E1807j37585k58240k09633J37521M16758J68296m14895o32579j95142L83949
35979f89743M34558o1464m84564l35946K12926O31360O95623N47530K30120l18229
35969H62171p83157o44162n2549J65049k27335l73621K91175R32774N18633m72111
35959B16867o89036M2359N35514J19284m59718l31609K38198M05653l9652n47404
35949e09544o01211k52655O8122J02252O1175K72027N85732N21299Q9460q2451
35939B54206K52694M53689n482n92099m73590J94900N10862J17133m54115o05808
$$ y = [-438910, -104081, -405577, -852861, -711425, -395644, -726191, -1400296, -1460959, -913439, -619920, -752188, -569128, 199191, 836813, 765912, 317903, 67080, 72817, 98747, 51807, -85778, -344018, -553651, -416130, 628, 168924, -245971, -878550, -1073692, -689743, -255185, -316649, -801213, -1137159, -924233, -292873, 402750, 950280, 1180400, 862171, 79014, -565148, -617697, -452648, -679983, -1053604, -762429, 170345, 688978, 216867, -472169, -429810, 105704, 224988, -234730, -566339, -328141, 77512, 37860, -509544, -1110755, -1363410, -1295288, -1193036, -1131861, -859834, -274102, 247197, 336657, 254206, 506900, 960589, 955107, 363008, -110582, 84318, 595180, 712313, 258198, -347610]
35929c47610k60020K73448N48091K62377l35470n81762k49085J35868J33405k1762
35919d42520o4325k13726n05221l99275K33724N59192P4730l68700J09061Q63939
35909a53121P47794J0657k21744J32655K14694q5576r5861J33622j31221p29367
35899a77468o18418L05379Q65448M56611j06734o2052K16083J59174n4479j00967
35889H82577j36074k74118k53729q3969k30156p30481r18460m56761J08315K38876
35879a853980J22450J13613J88136L16281O27896Q51341M08572n06746q06493
35870e38930j9411Q76175P82775n7640o35551n82910k55909P9165L46036L02333
35860B96133j49908n23568l02753K24609L29172q1162l76937j78592J94288L45665
$$ y = [-347610, -607630, -334182, 213909, 476286, 140816, -440946, -690031, -554163, -420758, -442520, -506845, -720571, -1225792, -1625067, -1391343, -832151, -757421, -1126121, -1017060, -153121, 594673, 605330, 383586, 516241, 730935, 645359, 549498, 683120, 551899, -177468, -795886, -490507, 374941, 831552, 724818, 662766, 878849, 1038023, 983544, 882577, 746503, 472385, 218656, 134687, -95469, -825950, -1744410, -2201171, -2092856, -1853980, -1731530, -1617917, -1429781, -1113500, -485604, 365737, 774309, 267563, -538930, -558341, 317834, 1100609, 1042969, 407418, -175492, -431401, -352236, -6200, 296133, 146225, -377343, -680096, -455487, -126315, -207477, -584414, -763006, -568718, -223053]
35850b23053L39971L90366M16377K29159p5084k34792k46228l54937n91384o05519
35840i55124j39873N23664Q25178N41779n7575n55489o59809k99968K32569M02894
35830a41754P0716j95587P0210L86939K7668o51229n88625K66576P71536L80748
35820C97198q8783J8667J44818k41399n23188q7169M10802J30130m22399k45600
35810e06923M02893M67590j17844m51873k28038j2018p7888j11355l903O5131
35800e74228K06895N33636N43338j77079r23884o98973J82681N33379J53200o9031
35790b90066J64059J82149k21888l45012J24551N41295M02007M294k80456m59584
35780a78651m49543p6945L27818K60525l1375L6368J71047l33012j002621o00116
$$ y = [-223053, 116918, 507284, 923661, 1152820, 1077736, 842944, 596716, 241779, -349605, -955124, -1094997, -571333, 253845, 795624, 738049, 182560, -477249, -777217, -544648, -141754, -71038, -266625, -196415, 190524, 218192, -433037, -1021662, -755086, 16450, 397198, 308415, 327082, 471900, 230501, -292687, -379856, 30946, 161076, -261323, -506923, -104030, 363560, 245716, -206157, -434195, -446213, -524101, -635456, -639359, -574228, -367333, 166303, 709641, 532562, -391322, -1090295, -907614, -374235, -221035, -290066, -126007, 56142, -165746, -510758, -386207, 155088, 557095, 561389, 280933, -178651, -628194, -705139, -377321, -116796, -148171, -111803, 59244, -273768, -1276389, -1876505]
35770a876505P09086J267236M47222l97670j98542K43378q2691o26192m12371
35761i27049K13776L15868j5401m7936K27135K87988J41135J39703J73239k0417
35751D88041j56266J04278L96786K50585k1703P2470J94951k16636p37662m92262
35741a17418L13673N69409k4721n35648k92288K09472K69993l224j63629k50432
35731b4813n30512q02001n60855K38095J007408J140458N89668j53234n20343
35722C83871l47515J4154J05157j02393k07407K2977K91442K17798o0125j07820
35712B10139P7091O1863k12857k15977K58109N56087J37494m26859k54663L89700
35702E80127M52698k04574n91727k25995J71416J0495k32546n105L72856M31757
$$ y = [-1876505, -1167419, 99817, 547039, 149369, -49173, 194205, 111514, -514678, -927049, -713273, -397405, -412806, -460742, -233607, 54381, 195516, 335219, 508458, 488041, 331775, 436053, 832839, 1083424, 1061721, 1134191, 1329142, 1112506, 374844, -117418, 196255, 765664, 740943, 205295, -86993, 122479, 392472, 389248, 225619, -24813, -555325, -1357326, -1918181, -1680086, -672678, 467780, 1057448, 904214, 383871, 36356, 50510, 155667, 53274, -154133, -131156, 160286, 378084, 317959, 210139, 287230, 349093, 136236, -79741, 178368, 734455, 871949, 445090, 190427, 580127, 1032825, 828251, 236524, 10529, 181945, 192440, -40106, -45211, 327645, 759402]
35692G59402L45762L07557m856n82530o39621R0584N45811j05020r53902o56035
35682h92848M65787R72170M52721k25852m53492l74012j29220K00974J82193l47909
35672a49488o35908j19566L90040m1578o75637j86868R56948J086475O3808n64526
35662A23700j73126J93091n6222j67851K02620K25903l96364o67031o1326M77830
35652b98776J86636k78363j41156K32709K66454J82585K28251K1831m87934n15873
35642f03636K45398Q47384M81681l12467o41064n08074l13419n7694K01247N3535
35632f07109l85988k98479M54766Q51610L36155k50665j87975o3693m48818o47511
35622a247707L417P07465M39831l19272m51310n896K14697J68615L05585L93071
$$ y = [759402, 1105164, 1412721, 1407865, 825335, 185714, 276298, 822109, 717089, -236813, -892848, -427061, 545109, 997830, 771978, 318486, -55526, -184746, 16228, 198421, -149488, -785396, -904962, -514922, -556500, -1232137, -1419005, -462057, 624418, 688226, 123700, -49426, 143665, 87443, -80408, 122212, 348115, -48249, -715280, -776606, -298776, -112140, -390503, -531659, -298950, -32496, 150089, 378340, 400171, -87763, -603636, -358238, 489146, 970827, 658360, 17296, -490778, -804197, -861891, -660644, -607109, -993097, -1291576, -836810, 14800, 350955, 100290, -87685, -151378, -600196, -1247707, -1244290, -536825, -96994, -416266, -867576, -873472, -658775, -490160, -184575, 208496]
35612B08496l0832n34497m22372k3538r1491l95945k20756J88938P6955k88887
35602a533929j2040P10527P85564J30600j35612L71252O21321q6459r32338q16418
35592h97532R8811P94147P56817L22358N671k8966K6898r0469l63096m48226j56092
35581B0321J83803J34613k20221m17859k62782K5000J99817J85979j5471l00137
35571d66937m32333l00355q1757M0188J32338K94191M22915L95029K48762M1543
35561B93584k00345l12742j39685J03651O9273j10880l6579J44053q2909n20440
35551g93019l48452M39629P77002K03359l12011K7907M99125J19626o45652o51452
35541f83938Q7004N66068M17408J64951P2594j29421l98901k77533K34492M94005
$$ y = [208496, 177664, -356833, -779205, -802743, -894234, -1290179, -1510935, -1321997, -1245042, -1533929, -1545969, -835442, -49878, 80722, -54890, 316362, 937683, 851224, -81114, -897532, -798721, -4574, 752243, 1074601, 1080272, 1051306, 1078204, 987735, 624639, 176413, 20321, 204124, 338737, 118516, -299343, -562125, -537125, -337308, -151329, -166800, -466937, -899270, -1199625, -1281382, -1241194, -1108856, -814665, -391750, 3279, 252041, 293584, 93239, -219503, -359188, -255537, -186264, -297144, -333723, -189670, -272579, -793019, -1141471, -701842, 75160, 278519, -33492, -5585, 493540, 613166, -32486, -683938, -596934, -30866, 386542, 551493, 624087, 494666, 95765, -181768, 52724, 546729]
35531E46729R7424n90943r06648n38016K35539P05405L60017m18228o63527q2045
35521a254293N44215N27917J63524j4569q9000k46519j84913K05660L27000j02501
35511a23479k88255L61522R71254M48131o49934r07923k62758J01878j71124k44659
35501g65347J75010L20651j01547l23073J9477J49539m08081q03774j90045Q02154
35491a125036R30555J42350m86753l60014J7967N9007n5556J26834M76972M50617
35481A76943j5187l02169j1352L70379J67562m02423n11984j2148L43955J07217
35471h9207k56683k85141k19852k95409j37352M47690Q00909L52754l46576m14637
35461d43504K8071K28678J03003J70949M46381M02239k7752l20162k53365j45943
$$ y = [546729, 644153, 53210, -853438, -1391454, -1155915, -450510, -90493, -508721, -1172248, -1254293, -710078, -182161, -18637, -33206, -122206, -368725, -553638, -347978, -20978, -123479, -411734, -50212, 921042, 1369173, 719239, -188684, -451442, -349564, -520688, -765347, -590337, -269686, -371233, -694306, -674829, -525290, -933371, -1737145, -1927190, -1125036, -194481, -52131, -538884, -898898, -880931, -821924, -877480, -750646, -273674, 176943, 161756, -140413, -151765, 218614, 386176, -16247, -528231, -540379, -196424, -89207, -345890, -631031, -850883, -1146292, -1283644, -835954, -35045, 317709, -28867, -443504, -415433, -186755, -83752, 87197, 533578, 935817, 908065, 587903, 334538, 188595]
35451A88595j78769j87079j52695k46821l52420j44358L19664O07180N09358J96104
35441E58759j33423l42686k79229j9296O3296j20670j15368K76726M58038k1829
35431C24318n28203k25984N33039P12549J90992j96668o7414J13429K7356r8290
35421G85124j51243k92568l90282j55136J25467j12229o23783n37609K29460P21833
35411d00966L93279j36735j85768m544j11459l19001r4311M93397P78829L47603
35401G60324m52846q35714l53546N65039R70220M51450l82209p25053n19370j89193
35391g10898J23481M48729N01858N9829m29165l67915O9644K81852K36651K92523
35381E06589L06941q6970n13365k66717L84107M69926o8728k87235P3364J34239
$$ y = [188595, 9826, -177253, -329948, -576769, -929189, -1073547, -753883, -146703, 362655, 558759, 425336, 82650, -196579, -215875, -152579, -273249, -388617, -111891, 346147, 324318, -203885, -429869, 103170, 815719, 1006711, 810043, 742629, 856058, 883414, 785124, 633881, 341313, -48969, -204105, -78638, -190867, -814650, -1352259, -1122799, -400966, -7687, -144422, -330190, -334734, -446193, -765194, -859505, -366108, 412721, 760324, 307478, -528236, -881782, -316743, 653477, 1104927, 722718, -2335, -521705, -710898, -587417, -138688, 363170, 422999, -6166, -374081, -304437, -22585, 214066, 506589, 813530, 726560, 213195, -53522, 330585, 800511, 731783, 444548, 517912, 652151]
35371F52151m60550p52765o1211P75113O63159j21427n58367m43827l00787k12180
35361h20691J81108P08443O88154O3o26893o00012j67286J11162J49798K34296
35351a41858L80317K56661j87975m30459o3590M50781K88507m72630q01241k13873
35341i35360M18520J66538n15329n21528J78711N95691L16890l2656J1877J23964
35331a92682M948p6481N8471P3848k07903l48684J4761N20887N85509J98403j71076
35320D60001k13093l0774P7338o4008k86036k26648J12170K07402j99903n02559
35310f66110n6954O66090O36950j28990n34977j01611L41076M3867n32880n70027
35300i03566j07807K57716L21859K46302K7636l48555n25178j63186M49992O84501
$$ y = [652151, 191601, -561164, -622375, 152738, 815897, 694470, 136103, -307724, -608511, -820691, -639583, 68860, 757014, 757077, 130184, -469828, -637114, -525952, -376154, -141858, 238459, 495120, 307145, -123314, -186904, 263877, 552384, 79754, -721487, -935360, -516840, -350302, -865631, -1387159, -1208448, -612757, -295867, -328523, -316646, -192682, -187734, -264215, -205744, -131896, -339799, -688483, -673722, -152835, 432674, 631077, 460001, 246908, 216134, 293472, 229464, -56572, -283220, -171050, 36352, -163551, -666110, -723064, -56974, 579976, 450986, -83991, -185602, 155474, 199341, -333539, -903566, -1011373, -753657, -431798, -185496, -157860, -506415, -1031593, -1194779, -744787, -60286]
35290f0286L63390j06843k99130j42597J68747L79894L49549J79539Q2098O7058
35280I81419m0709k36319k87313j44204o3052j67523k29479r0322L1593p3782
35270c19691j98905k6928L34141M71211K52204j6509n5048J0830j21939m47177
35260a17811o01826l52504O2571K61238K44786L06641M89244N15719K89021M6755
35250A143834p1590j86993l06769k65938j62817k88758m68941j69157M81349N97651
35240C01871q3399o03922k11443M67276N06864J29689N7718J36333j91173n72722
35230f2908k32581N38523O87902O5907m40151l74727j31760O5852M04897O58229
35220A179183L15850l47522m94523j39226j44454o31652o68603J05041P70458
$$ y = [-60286, 303104, 196261, -102869, -245466, -76719, 303175, 652724, 832263, 914361, 981419, 940710, 704391, 417078, 272874, 209822, 42299, -187180, -277502, -245909, -319691, -518596, -545524, -211383, 259828, 512032, 495523, 440475, 451305, 329366, -117811, -719637, -1072141, -1009570, -748332, -503546, -196905, 292339, 808058, 1097079, 1143834, 1072244, 885251, 578482, 312544, 149727, -139031, -607972, -777129, -295780, 301871, 218472, -385450, -596893, -129617, 377247, 506936, 564654, 700987, 509814, -62908, -295489, 243034, 930936, 996843, 556692, 181965, 50205, 116057, 520954, 1179183, 1495033, 1147511, 652988, 513762, 369308, -262344, -930947, -825906, -55448]
35211e5448N50985j37405n71791o61374m97612N1499P38558Q38855K28543k70345
35201B14465j38296J03913o8451l06651j73146L9412l1935r0998J78705M15674
35191A42692K24186q1315n0847J29398Q1246p0437o7414q2375k98796l95876p0189
35180e39727L31939K83194j59066n31378n65786k37828L58341Q23971O46738l5564
35170C74834l99946p1687K99671O4267m58059o09421m00665k11683O91M40937
35160i71061P97599N99419L7290k60239j56850j04023l42151n36382l02742K32683
35150a006457N27813K05142m61376p35893k85615L16576L37587n9194j04509L32285
35140i33641N64512K36510j60938j64220L1987J26675J86197K32590L9437l19897
$$ y = [-55448, 495537, 358132, -213659, -875033, -1372645, -1321146, -582588, 256267, 484810, 214465, 76169, 180082, 111631, -195020, -368166, -328754, -360689, -451687, -272982, 142692, 366878, 285563, 234716, 364114, 445360, 374923, 307509, 225134, -73662, -469538, -539727, -207788, 75406, -83660, -615038, -1180824, -1418652, -1060311, -236340, 410398, 374834, -25112, -96799, 202872, 267139, -190920, -800341, -1201006, -1412689, -1411998, -971061, -173462, 425957, 463247, 203008, 46158, -57865, -400016, -936398, -1239140, -1006457, -478644, -273502, -734878, -1470771, -1756386, -1439810, -1102223, -1161417, -1265926, -933641, -369129, -132619, -293557, -457777, -425790, -299115, -112918, 119672, 159109, -160788]
35130a60788l78764m4430K18116K35835L82311O87520N83824m8927n10295m44343
35120E20059m03176o55485n04554L75846R72364L95843n51125n32899K38088M46257
35110C01218j91600o47902l58288N6606M0887o6561J42686L68468J62683k98127
35100d89930m73441j81512K66410M77293L30073L1153r2653P3654K97937K44322
35090D83306j75083o80204p94099k62141N25734P49133J32107n43536m04456K89398
35080f79841N89026L18741J60188L12100J75085l88339o12637j40206K69335P68
35070D220l75864j12464M59806N51427J78858o3709m0765p0794k13539k62031
35060E5145j99444j33203m3422L1119n0566j11268K20615O68265L81273o77828
$$ y = [-160788, -539552, -583982, -365866, -130031, 252280, 939800, 1523624, 1474697, 964402, 520059, 116883, -538602, -1043156, -667310, 305054, 700897, 149772, -383127, -145039, 301218, 109618, -538284, -896572, -839966, -799079, -865640, -722954, -354486, -191803, -489930, -963371, -1144883, -878473, -401180, -71107, -39954, -132607, -58953, 238984, 483306, 308223, -371981, -1166080, -1428221, -902487, -153354, -21247, -564783, -969239, -679841, -90815, 227926, 388114, 700214, 875299, 486960, -125677, -265883, 3452, 4220, -371644, -484108, -24302, 527125, 705983, 642274, 601509, 530715, 317176, 55145, -144299, -277502, -320924, -289805, -340371, -451639, -231024, 437241, 818514, 140686]
35050A40686j302086o72552M15867P71374M56182K70022K86477J3591m58784n80234
35040f59457l39506j70427p1980K79022P05961O70917J49730l38617m80614l61360
35030f16331r0227K16221L00484J15771L3627K57747M23322K27339n0302j50818
35020F66833l41395p13531o74638P6589P20212L78618n21557q92545n31238p3782
35010a906434J77404L92856M99716K85763J378K8874J98095J59191O5433J49122
35000E1398J09311k56158l76759J80380P09457L65021l79479m74400j1366J17951
34990C5356j17745r130L54442J78063m39271m88574K08053O27125J94293m48119
34980I4493o40807n12733k61124K46636P71915O74123J7288k71298J97738O34919
$$ y = [140686, -1161400, -1833952, -1418085, -646711, -190529, 79493, 365970, 379561, -79223, -659457, -998963, -1169390, -1241370, -962348, -256387, 414530, 564260, 225643, -254971, -616331, -706558, -490337, -189853, -74082, -40455, 217292, 640614, 867953, 817651, 666833, 325438, -388093, -1062731, -986142, -265930, 112688, -408869, -1301414, -1832652, -1906434, -1729030, -1336174, -836458, -550695, -549317, -520443, -322348, -163157, -97724, 51398, 160709, -95449, -472208, -291828, 417629, 782650, 403171, -71229, -82595, 35356, -82389, -91519, 262923, 440986, 1715, -486859, -278806, 348319, 542612, 94493, -546314, -1059047, -1320171, -1073535, -301620, 372503, 389791, 118493, 316231, 951150]
34970I51150L27515l05302m75473j62043P9948l8019l43367n25349l91951o2372
34960i45263P2065j11403j53062K88775P26078N15337n2581j90424R3407J22422
34950C65351j75618k10854O7144M2171l60717m51304r730L07478J29652m3924
34940c40351J83816M42402L18658k7016l21728n36528n30346j04153L81500K81589
34930b52157k34301k83274K76198N14261m6990o17124m16370J66471L71783K19516
34920c01987J41441J35437J3757l4818J94316M12792K60953j16311l62310m11190
34910f7920l42119j45387N4033k683k04089q0629M05158O64050L91532N1738P2326
34899G96010J85985K9851j91046j53132j2172l5649r0732N639M4812j77792l95922
$$ y = [951150, 1278665, 973363, 497890, 335847, 415795, 377776, 34409, -490940, -882891, -945263, -873198, -984601, -1137663, -848888, -122810, 392527, 339946, 149522, 242929, 365351, 189733, -21121, 46023, 88194, -272523, -723827, -733557, -426079, -296427, -340351, -156535, 285867, 604525, 577509, 255781, -280747, -811093, -915246, -533746, -252157, -486458, -769732, -493534, 20727, -26263, -643387, -1059757, -893286, -521503, -301987, -160546, -25109, -11352, -46170, 148146, 560938, 821891, 705580, 343270, -67920, -410039, -555426, -501393, -504076, -708165, -788794, -383636, 280414, 671946, 723684, 796010, 981995, 1011846, 820800, 667668, 655496, 619847, 529115, 534754, 579566, 401774, 5852]
34888E852k60778J20648M11600M77643K88849j85921o52698n41794J88021P37929
34878E89351M42066l23789o90591m18671K7092K46715K33329J06175j7947K3587
34868B17317K51379L88638J87441j82475l32039j57732P7002J03650q6730k99911
34858A66540l35273j43651J54104L92349M56922K80189o8560k60582p190L86585
34848A021433K18225n71847j071265n90557L03843N86465J69459k46769l42709
34839e23722l28212j90314K57619O93857N73432M7541k52934k53280l60722m94783
34829h31518k12523K79262L41553J11236L05794P85317O31616j56482m77827k9027
34819G47401R4990o40390j101232l16125Q19591Q74981J2270m72488j40591K63133
$$ y = [5852, -254926, -134278, 277322, 754965, 1043814, 857893, 205195, -336599, -148578, 589351, 1031417, 707628, 17037, -401634, -374542, -127827, 105502, 211677, 193730, 217317, 468696, 857334, 1044775, 862300, 530261, 372529, 449531, 553181, 466451, 166540, -168733, -312384, -158280, 234069, 690991, 971180, 902620, 642038, 634848, 1021433, 1239658, 667811, -403454, -994011, -690168, -103703, 65756, -181013, -523722, -851934, -1042248, -784629, -90772, 482660, 530201, 277267, 23987, -336735, -831518, -1044041, -764779, -423226, -311990, -6196, 779121, 1410737, 1254255, 776428, 747401, 842391, 202001, -899231, -1215356, -395765, 479216, 491486, 18998, -121593, 141540]
34809A41540J69112j73402l37359k47781o7402M745r3182j13260K00983N38823
34799B2817K91534m41610q09260m33466Q3308K19200K64152N16960N98268J88115
34789E00018k93724l95239l38715l84096j91006M61512R62406O70223o6375m18180
34779E06824j90099J94551L98880L10219p6766m37745k98840J50367J01061n62144
34769I6308q30697r3744P75378O89327o4555m50010k53766m0647l9930m1038k1991
34758b75365m3314J02374M07989L34313k69126n61951N7243P64321M43382n31048
34748D28818q62445l18730J16778p7914l63902k67160l0972L4203J4188M5862
34738a281274J40569L66437O65284O49524J54790k87454j79875R8545n8037l82754
$$ y = [141540, 310652, 137250, -200109, -447890, -515292, -510547, -603729, -716989, -516006, 22817, 314351, -127259, -936519, -1369985, -1286677, -1067477, -803325, -286365, 311903, 500018, 206294, -188945, -527660, -911756, -1102762, -641250, 321156, 991379, 925004, 506824, 316725, 511276, 910156, 1220375, 1143609, 705864, 407024, 557391, 658452, 96308, -734389, -828133, -52755, 636572, 572017, 122007, -131759, -172406, -212336, -253374, -275365, -318679, -216305, 191684, 525997, 256871, -305080, -247837, 516484, 959866, 428818, -433627, -752357, -635579, -713493, -1077395, -1344555, -1375527, -1341324, -1327136, -1281274, -1140705, -774268, -108984, 540540, 695330, 407876, 228001, 326546, 268509, -114245]
34728a14245k01694L14509L78353j08627m77885m32533k97216j78311J59931N55653
34718d02065N16921J23762J2561L44610N66547L10216j71882n38920o79527n02673
34708d20450n3967K30868M1766j95933N1040M23819J80598m87870o68757j92014
34698a090900J72209M6728o9807J63047L96839L62085K78782K31559l0109m06785
34688E3648l82646P2488L12210J4872l57206l72151j88442m1381J25375K60034
34678e03199J26404j30966l6358L74678M74685N0462l30895k40725K3080O6550
34668a26284l0910o7718n3457K7209K19093K67587p8181m30885k18060K51678
34658b39928J45353m22468m23326L51589Q31396L92968j64187r619M64297N24427
$$ y = [-114245, -315939, -1430, 376923, 268296, -209589, -642122, -939338, -1117649, -957718, -402065, 114856, 238618, 251179, 595789, 1162336, 1472552, 1300670, 761750, 82223, -420450, -474417, -243549, -201783, -397716, -346676, 77143, 257741, -230129, -898886, -1090900, -918691, -871963, -941770, -778723, -381884, -19799, 258983, 490542, 460433, 53648, -328998, -256510, 55700, 70572, -286634, -658785, -847227, -888608, -763233, -503199, -376795, -507761, -544119, -169441, 305244, 355706, 24811, -215914, -192834, -126284, -157194, -224912, -278369, -251160, -32067, 235520, 157339, -273546, -491606, -239928, -94575, -517043, -940369, -588780, 242616, 635584, 471397, 461778, 926075, 1450502]
34648A450502K30338q0446m83323q63954o04426K75466O60206j8700o92358l15572
34638d42267L96545K41544l72678k17103N22319N71965j81254n53576j51017J32244
34628e3278r1186p0240M71323O35483n1593o84266m44739J15490J54371r6233
34618a14868k3201J54897n9954l30421l8486N12242N89814M11725P96417J502866
34608C401031J225013l98382j901035j820443o20198Q7775k22144n25584J8677
34599g55290Q30825Q56028J25391l53225q7976K67495N385n31724m95134J44308
34589F083N30578J94908l07798l18880k3491K9297j01266N1348M03545L42729
34579H07053k32947o18759l18322K45060M15058J97243n122j24715l12423l82315
$$ y = [1450502, 1680840, 1600394, 1117071, 253117, -351309, -75843, 584363, 565663, -126695, -442267, -45722, 195822, -176856, -393959, 128360, 700325, 519071, -34505, -185522, -53278, -144464, -214704, 256619, 892102, 840509, 156243, -288496, -173006, -18635, -114868, -138069, 16828, -43126, -373547, -412033, 100209, 690023, 1101748, 1898165, 3401031, 4626044, 4227662, 2326627, 506184, -114014, -26239, -248383, -773967, -755290, 75535, 931563, 1056954, 703729, 615753, 883248, 888633, 356909, -138225, 6083, 536661, 731569, 423771, 104891, 81400, 110697, 9431, 60779, 464324, 807053, 574106, -44653, -362975, -117915, 297143, 494386, 489264, 364549, 52126, -330189]
34569c30189m4271M36351M84051J14477p1961J18525J85559j36269l68059j21544
34559B66670J92306P2994j68300M8297M69783L04834m67765r42258n99221j4396
34549h37056R3208j17986o6734K21062J88167k98270o73347m56759J21122M78023
34539a348570L98123J61862R4260K12573L19473K84738J57166N3198J0276k7328
34529C15771j04079j87606k37663k86882l58806l33164o7925K83523L12883o5399
34519g29347k91658J79651R79539J115488K88930o28181p47034k75797l59j05822
34509b14590j77046p3549l5603l7692J79413M24640K01915l40864m24140J44046
34499c53470N64480K63339k42754k33766J34449K91664K33633K87513L02417j11579
$$ y = [-330189, -374460, 61891, 545942, 660419, 588458, 706983, 892542, 756273, 388214, 266670, 458976, 531970, 363670, 411967, 881750, 1186584, 718819, -223439, -822660, -837056, -743848, -861834, -928568, -707506, -519339, -817609, -1490956, -1947715, -1826593, -1348570, -950447, -788585, -694325, -481752, -162279, 122459, 279625, 332823, 343099, 315771, 211692, 24086, -213577, -500459, -859265, -1192429, -1260354, -976831, -663948, -729347, -1021005, -841354, 138185, 1253673, 1542603, 914422, 167388, -108409, -108768, -214590, -391636, -465185, -500788, -538480, -359067, 65573, 267488, -73376, -497516, -353470, 211010, 474349, 231595, -2171, 132278, 423942, 657575, 945088, 1247505, 1135926]
34489A135926p32811q81111m02124J19540J79375r3357k53599n4899L67189N83349
34479c2522K52610l66316n40125j395N62052L94577k58371n24070j32846L37860
34469c08546L69626P3654j65092j31228J70260N04151M51564j39737p66585p35425
34459f77358m6029N49669M41657j55268m94130j42702M89465N35830k25003q34651
34449e58520k81439R12882J140497j3779j034003o55621L26309M73727o5522j65795
34439G8736J64611k0329o32286n70941K32687N41411p8213n18076p0369M30118
34429d42651J83566k45089j18308J69667L6915r2431L16109P07004L41897l06514
34419E50165l06961J40900J27939l51592m77119q0919J71330M4661O7766N17106
$$ y = [1135926, 403115, -477996, -880120, -760580, -581205, -674562, -928161, -983060, -615871, -32522, 220088, -146228, -686353, -687748, -125696, 268881, 10510, -513560, -646406, -308546, 61080, 134734, -30358, -161586, 8674, 512825, 964389, 824652, 58067, -677358, -723387, -173718, 267939, 112671, -381459, -524161, -34696, 501134, 276131, -558520, -839959, 72923, 1213420, 1199641, 165638, -489983, -163674, 310053, 244531, 78736, 243347, 223018, -409268, -980209, -747522, -206111, -284324, -802400, -872769, -442651, -259085, -504174, -622482, -452815, -415900, -508331, -192222, 514782, 856679, 550165, 243204, 384104, 512043, 160451, -316668, -397587, -226257, -181596, -113830, 403276]
34409D03276J033795J352033J513054J269341K22413j228179j965971j531413
34401A068349o77143k32141j38360m071R6643o2953k62953j40047K06255L79266
34391B32845K42951l4947k70745l05185k8754L35011K81894k78688o91512l63657
34381h80787L53930O20455K69020q6825o8443N340j73900l58016k50340n7375
34371f26941o7482n6515L18656P59875O06131j45487p15220n85487j25736Q3954
34361e54252O2513J68967M05363M69422L21266K29169K84845K50290o5856n24965
34351A046762p86619n99227n0179L67061J60238m79155o88518J4723R52119J044655
34341I81860K06247n80796n67955m8013K66460J54393q8461j75466q7339K2326
$$ y = [403276, 1437071, 2789104, 4302158, 5571499, 5793912, 4565733, 2599762, 1068349, 391206, 159065, 20705, 16634, 113277, 50324, -212629, -352676, -146421, 232845, 475796, 440849, 170104, -135081, -163835, 171176, 453070, 174382, -517130, -880787, -526857, 93598, 362618, 275793, 207350, 212690, 38790, -319226, -569566, -626941, -694423, -750938, -432282, 327593, 933724, 788237, 73017, -512470, -638206, -554252, -491739, -322772, 82591, 552013, 873279, 1102448, 1387293, 1637583, 1571727, 1046762, 260143, -339084, -389263, -22202, 138036, -341119, -1029637, -1014914, -62795, 981860, 1188107, 607311, 39356, -8657, 257803, 412196, 323735, 148269, 60930, 83256]
34331H3256J2804n6247N4746L74635M89970O9409m92740m84143N8688L06503j45850
34320B71031o40537m33212K04975M22046J9285l52333j57930L75094O66121M74093
34310H48633K9439l05565l49504j77582j5656m3944k24422l03040o3539L44888
34300b60292M38824k9038n86549m90310K49860P34998L45992l89993n64562j47366
34290f98436J48931L4502o1948J55608M09400M00973K25630N7184r8489j91933
34280C81422j14539J4119j8243q1557Q1099K36673p4320o28107o58768p3075L13794
34269f21502O0203k35466k96L98474L93929J47648O3037L267k83825n09959l53379
34258i37869j20815j56645j05006M00154Q09841M31929k40657j19471P01453R46019
$$ y = [83256, 96060, 39813, 94559, 469194, 959164, 1028573, 535833, 51690, 110378, 416881, 271031, -369506, -802718, -597743, -175697, -156412, -508745, -666675, -291581, 374540, 848633, 878072, 572507, 223003, 45421, 29765, -14179, -238601, -541641, -605180, -260292, 178532, 149494, -437055, -927365, -677505, 57493, 403485, 13492, -551070, -698436, -549505, -515003, -576951, -421343, -11943, 389030, 614660, 671844, 573355, 381422, 266883, 281002, 262759, 181202, 262301, 498974, 424654, -203453, -862221, -935296, -621502, -561299, -796765, -797061, -398587, -4658, 142990, 206027, 209294, -74531, -584490, -937869, -1058684, -1215329, -1320335, -920181, -110340, 321589, 80932, -38539, 662914, 1608933]
34248A608933O2662r76672j130986n90016j27260N6039K13841L31801J92116r3678
34238d53220j53698J16818M28627M58206J59072k12175k99740k464L45511L17571
34228G04508p4815l95720l18203P8716M98249O33975K68882m45820q40706l47252
34218b38186O29023R64563J94649q28661j022656m25158M3224q2968l39961k09189
34208a315320J50388L35579M00699O23589Q05426M51343k81764n05668J20530
34199G84802O33326M4053r92712q55161O37118J661494Q19362q70601j380279
34190D81402m06163N14607L52485k53966l74419j44247j56138l35399j99202K04847
34180c16193L47502N2002k79893k64975K9774K92295L38342K13069O0035m6611
$$ y = [1608933, 1671595, 694923, -436063, -1026079, -1153339, -1097300, -883459, -551658, -359542, -453220, -606918, -490100, -61473, 396733, 555805, 343630, 43890, 41426, 386937, 704508, 629693, 233973, -84230, -5514, 492735, 1126710, 1395592, 949772, 109066, -238186, 390837, 1355400, 1550049, 721388, -301268, -726426, -683202, -766170, -1106131, -1315320, -1164932, -829353, -428654, 194935, 1000361, 1451704, 1169940, 664272, 784802, 1418128, 1462181, 469469, -385692, 251426, 1912920, 2732282, 1861681, 481402, 75239, 589846, 942331, 688365, 313946, 169699, 13561, -321838, -521040, -316193, 31309, 83311, -196582, -461557, -431783, -139488, 198854, 411923, 471958, 425347]
34170D25347j41835k32490k08804j8096J71279J80108R3207O7647n409k79211
34160E1743m98683k65169K53228M40718J61338m1245J23250K14296j16429m57756
34150a34709l24215K8694R7610j1796Q0243K11246j7075l79417l15679P7079K13882
34139d74137R2005K27201N01179J73669o93226r66282j49219O95792N22418j33809
34129b04409j69637K67959K15869l20735l87781K07858N33130R8884l75100k12955
34119c46917J72568Q3583l52899n18358k40620J63568M16526M09001J29825j91266
34109b74989k10686Q227K9941j84504j28213L24924N40873J59765k03516L0984
34099I2806L61847M1150n72873n28735J61172N57510K93272k2568J8064N3573
$$ y = [425347, 283512, 51022, -157782, -175878, -4599, 175509, 268716, 336363, 330954, 51743, -446940, -712109, -458881, -18163, 143175, 101930, 225180, 439476, 323047, -134709, -458924, -430230, -332620, -344416, -264173, -52927, -70002, -449419, -765098, -688019, -474137, -382132, -154931, 346248, 519917, -173309, -1139591, -1288810, -593018, -70600, -204409, -374046, -106087, 109782, -210953, -598734, -390876, 142254, 241138, -133962, -346917, -174349, -90766, -443665, -962023, -1202643, -1039075, -622549, -213548, -83723, -274989, -485675, -477448, -447507, -632011, -760224, -435300, 105573, 265338, 61822, 92806, 454653, 495803, -77070, -605805, -444633, 112877, 406149, 383581, 401645, 455218]
34089D55218j83360l41520j82608p2483k78137m04672m6468M83141N89369K24147
34079B42627j86032l87533m41753l77012j07616K95155N22505L31848j17909l24494
34069e50214K3247N57305N50353j27631p26417n93247m5765K01202J01661J13224
34059d96282K46802R1316l01891l88779n2293K13062J59636J00295K10276K34560
34049A6702Q4671L2684J09386N00k63603k42857Q1020J84650m6918r2021J84058
34038D8272J93089k61153m72198j1535M71539L10471j45638k95811k76635l68541
34028h08140k06744M55269R02334M52661k88726l10980J63495J70009k28416o2001
34018B38761P15736R26269q446j122742j281496n95532N5337K13292M3109j41185
$$ y = [455218, 271858, -69662, -252270, -324753, -602890, -1007562, -1054030, -570889, 18480, 242627, 56595, -330938, -772691, -1149703, -1257319, -962164, -439659, -107811, -225720, -550214, -526967, 30338, 580691, 453060, -273357, -866604, -912369, -711167, -609506, -496282, -249480, -158164, -460055, -848834, -901127, -688065, -528429, -428134, -217858, 16702, 101373, 134057, 243443, 243943, -19660, -262517, -181497, 3153, -43765, -135786, 48272, 241361, -19792, -491990, -503525, -31986, 278485, 132847, -162964, -439599, -808140, -1014884, -559615, 342719, 795380, 506654, 195674, 359169, 529178, 300762, 238761, 954497, 1880766, 1872320, 749578, -531918, -1127450, -1072113, -858821, -815712, -956897]
34008i56897r1134K74691O47512N19972j31126o47938m44841K54255O76049L92404
33998D92947k27892m83803j88930J09984p8869m12720k08762L87221M95159p2830
33988a88495l98936M2022M17231j02054q39078n95957M22234R26278N00587k0029
33978A63803n9126L2865p6875j99858k60509m35651m81151P9118Q85692R16121
33968E64429M3170o18054l43532K29854K97629P2036Q8912J89685K432k19934
33958C06627n7016K65917K56744l9293k53622l35270l79405k06614K61799N66613
33948C86480K99717j68271k04487R1419R4484k97653n21093k49958J64134K71961
33938a33267Q9766o7969j9091J42194J73011o2812l78229m06339n6883L43501
$$ y = [-956897, -1048031, -773340, -125828, 394144, 263018, -384920, -829761, -575506, 100543, 492947, 265055, -218748, -407678, -297694, -376563, -789283, -998045, -610824, -115665, -188495, -587431, -545409, -128178, -230232, -1069310, -1665267, -1243033, -316755, 183832, 163803, 104677, 137542, 60667, -139191, -399700, -835351, -1316502, -1237384, -351692, 564429, 607599, -10455, -353987, -124133, 173496, 245532, 334444, 524129, 526561, 306627, 249611, 515528, 772272, 732979, 479357, 144087, -235318, -441932, -180133, 386480, 686197, 517926, 313439, 404858, 499342, 201689, -319404, -569362, -405228, -133267, -43501, -111470, -130561, 11633, 184644, 121832, -256397, -662736, -719619, -376118]
33928c76118M68983L18990K5818l30987n57541l88652N0720K34259n316j47978
33918g07822J77423N05790K60963k39419k43026K13768L63729m5434l85291j96771
33908b96090J35222R5217j78490k67744j80929j78102j85282P6185M93854O10449
33898A24290L07634J3255P7862K95511K83079O2763o6935p6251k04208m26667
$$ y = [-376118, 92865, 411855, 437673, 106686, -450855, -839507, -788787, -554528, -559844, -707822, -530399, -24609, 236354, -3065, -246091, -32323, 331406, 285972, -99319, -296090, -160868, -65651, -244141, -511885, -692814, -870916, -1056198, -980013, -486159, 124290, 431924, 445179, 523041, 818552, 1101631, 1164394, 1097459, 1021208, 817000, 390333]
$$ [...]
##END NTUPLES=NMR SPECTRUM
##END=
