##TITLE=31Pdec_E3e-3
 CDCl3, 24 sc
 15.6.2023
##JCAMPDX= 6.0         $$ Bruker NMR JCAMP-DX V2.0
##DATA TYPE= NMR SPECTRUM
##DATA CLASS= NTUPLES
##ORIGIN= UXNMR, Bruker Analytische Messtechnik GmbH
##OWNER= root
$$ XWIN-NMR		Version 3.5
$$ Thu Jun 15 09:20:51 2023 Russian Standard Time (UT+4h)  she@DPX200
##.OBSERVE FREQUENCY= 81.013821
##.OBSERVE NUCLEUS= ^31P
##.ACQUISITION MODE= SIMULTANEOUS
##.ACQUISITION SCHEME= undefined
##.AVERAGES= 24
##.DIGITISER RES= 16
##SPECTROMETER/DATA SYSTEM= spect
##.PULSE SEQUENCE= zgpg30
##.SOLVENT NAME= CDCl3
##.SHIFT REFERENCE= (INTERNAL, CDCl3, 0, 248.564)
##AUDIT TRAIL= $$ (NUMBER, WHEN, WHO, WHERE, WHAT)
$$ ##TITLE= Audit trail, XWIN-NMR		Version 3.5
$$ ##JCAMPDX= 5.01
$$ ##ORIGIN= Bruker BioSpin GmbH
$$ ##OWNER= she
$$ F:/spectra/data/she/nmr/P31/1/pdata/1/auditp.txt
$$ ##AUDIT TRAIL=  $$ (NUMBER, WHEN, WHO, WHERE, WHAT)
(   1,<2023-06-15 09:19:45.92 +0400>,<she>,<DPX200>,
      <created by zg, POWCHK disabled, PULCHK disabled
       configuration hash MD5:
       00 E9 B6 7A A2 85 ED C7 34 08 36 98 17 FE 4E 26
       data hash MD5: 32K
       9E 41 D2 85 15 AB 84 19 F3 D5 43 22 76 5F 08 8C>)
(   2,<2023-06-15 09:19:49.00 +0400>,<she>,<DPX200>,
      <Start of raw data processing
       efp BC_mod = 2 LB = 1 FT_mod = 6 PKNL = 1 PHC0 = -10703.29 PHC1 = 136.2848 SI = 64K 
       data hash MD5: 64K
       2B 25 82 C5 31 23 59 42 F7 C7 9B 16 A8 BE C0 64>)
(   3,<2023-06-15 09:20:06.71 +0400>,<she>,<DPX200>,
      <pk PHC0 = -3.413632 PHC1 = 0 
       data hash MD5: 64K
       EC 32 08 9E 96 88 66 42 FD 98 54 48 ED 73 FC 4F>)
(   4,<2023-06-15 09:20:10.07 +0400>,<she>,<DPX200>,
      <abs ABSG = 5 
       data hash MD5: 64K
       9D 4E F0 30 53 C9 48 45 D2 23 69 0E 7E A5 21 20>)
(   5,<2023-06-15 09:20:25.51 +0400>,<she>,<DPX200>,
      <abs ABSG = 5 
       data hash MD5: 64K
       48 AC B4 33 5D 60 D4 C5 C3 2A 08 07 33 1D 65 72>)
$$ ##END=
$$ 
$$ hash MD5
$$ 33 89 56 5E 76 29 69 15 ED 2A E7 2B 9F C0 F9 EF
##$RELAX= 
##$RELAX= 
##$RELAX= 
##$RELAX= 
##$RELAX= 
##$RELAX= 
##$RELAX= 
##$RELAX= 
##$RELAX= 
$$ Bruker specific parameters
$$ --------------------------
##$DU= <F:/spectra>
##$EXPNO= 1
##$NAME= <P31>
##$PROCNO= 1
##$TYPE= <nmr>
##$USER= <she>
##$AMP= (0..31)
100 100 100 100 100 100 100 100 100 100 100 100 100 100 100 100 100 100 
100 100 100 100 100 100 100 100 100 100 100 100 100 100 
##$AQSEQ= 0
##$AQ_mod= 1
##$AUNM= <au_zg>
##$AUTOPOS= <>
##$BF1= 81.014009
##$BF2= 200.13
##$BF3= 200.13
##$BF4= 200.13
##$BF5= 200.13
##$BF6= 200.13
##$BF7= 200.13
##$BF8= 200.13
##$BYTORDA= 1
##$CFDGTYP= 0
##$CFRGTYP= 5
##$CHEMSTR= <none>
##$CNST= (0..31)
1 1 145 1 1 1 1 1 1 1 1 1 1 1 1 1 1 1 1 1 1 1 1 1 1 1 1 1 1 1 1 1 
##$CPDPRG= <waltz16>
##$CPDPRG1= <>
##$CPDPRG2= <waltz16>
##$CPDPRG3= <>
##$CPDPRG4= <mlev>
##$CPDPRG5= <mlev>
##$CPDPRG6= <mlev>
##$CPDPRG7= <mlev>
##$CPDPRG8= <mlev>
##$CPDPRGB= <>
##$CPDPRGT= <>
##$D= (0..31)
0 1 0 0 0 0 0 0 0 0 0 0.03 2e-05 3e-06 0 0 0 0 0 0 0 0 0 0 0 0 0 0 0 0 
0 0 
$$ [...]
##$SUBNAM3= <"">
##$SUBNAM4= <"">
##$SUBNAM5= <"">
##$SUBNAM6= <"">
##$SUBNAM7= <"">
##$SUBNAM8= <"">
##$SUBNAM9= <"">
##$SW= 501.771253377433
##$SWIBOX= (0..15)
0 1 3 0 0 0 0 0 0 0 0 0 0 0 0 0 
##$SW_h= 40650.406504065
##$TD= 32768
##$TD0= 1
##$TE= 0
##$TE2= 300
##$TE3= 300
##$TEG= 300
##$TL= (0..7)
0 120 53 12 22 120 120 120 
##$TP= (0..7)
150 150 150 150 150 150 150 150 
##$TP07= 0
##$TPNAME0= <>
##$TPNAME1= <>
##$TPNAME2= <>
##$TPNAME3= <>
##$TPNAME4= <>
##$TPNAME5= <>
##$TPNAME6= <>
##$TPNAME7= <>
##$TPOAL= (0..7)
0.5 0.5 0.5 0.5 0.5 0.5 0.5 0.5 
##$TPOFFS= (0..7)
0 0 0 0 0 0 0 0 
##$TUNHIN= 0
##$TUNHOUT= 0
##$TUNXOUT= 0
##$USERA1= <user>
##$USERA2= <user>
##$USERA3= <user>
##$USERA4= <user>
##$USERA5= <user>
##$V9= 5
##$VALIST= <valist>
##$VCLIST= <CCCCCCCCCCCCCCC>
##$VD= 0
##$VDLIST= <DDDDDDDDDDDDDDD>
##$VPLIST= <PPPPPPPPPPPPPPP>
##$VTLIST= <TTTTTTTTTTTTTTT>
##$WBST= 1024
##$WBSW= 4
##$XGAIN= (0..3)
0 0 0 0 
##$XL= 0
##$YL= 0
##$YMAX_a= 7669
##$YMIN_a= -8040
##$ZGOPTNS= <>
##$ZL1= 120
##$ZL2= 120
##$ZL3= 120
##$ZL4= 120
##$ABSF1= 248.5645
##$ABSF2= -253.2056
##$ABSG= 5
##$ABSL= 3
##$ALPHA= 0
##$AQORDER= 0
##$ASSFAC= 0
##$ASSFACI= 0
##$ASSFACX= 0
##$ASSWID= 0
##$AUNMP= <proc_1d>
##$AZFE= 0.1
##$AZFW= 0.5
##$BCFW= 0
##$BC_mod= 2
##$BYTORDP= 0
##$COROFFS= 0
##$CY= -3
##$DATMOD= 1
##$DC= 0
##$DFILT= <>
##$DTYPP= 0
##$F1P= 0
##$F2P= 0
##$FCOR= 1
##$FTSIZE= 65536
##$FT_mod= 6
##$GAMMA= 0
##$GB= 0
##$INTBC= 1
##$INTSCL= 6.047779e-11
##$ISEN= 30
##$LB= 1
##$LEV0= 0
##$LPBIN= 0
##$MAXI= 10000
##$MC2= 0
##$MEAN= 0
##$ME_mod= 0
##$MI= 50
##$NCOEF= 0
##$NC_proc= -5
##$NLEV= 6
##$NOISF1= 182.463
##$NOISF2= 159.3651
##$NSP= 0
##$NTH_PI= 0
##$NZP= 0
##$OFFSET= 248.5645
##$PC= 4
##$PHC0= -10706.7
##$PHC1= 136.2848
##$PH_mod= 1
##$PKNL= yes
##$PPARMOD= 0
##$PSCAL= 0
##$PSIGN= 0
##$REVERSE= no
##$SF= 81.0140089999694
##$SI= 65536
##$SIGF1= 159.3651
##$SIGF2= -187.1042
##$SINO= 113.3802
##$SIOLD= 16384
##$SREGLST= <1H.CDCl3>
##$SSB= 0
##$STSI= 65536
##$STSR= 0
##$SW_p= 40650.406504065
##$SYMM= 0
##$S_DEV= 0
##$TDeff= 32768
##$TDoff= 0
##$TI= <>
##$TILT= no
##$TM1= 0
##$TM2= 0
##$TOPLEV= 0
##$USERP1= <user>
##$USERP2= <user>
##$USERP3= <user>
##$USERP4= <user>
##$USERP5= <user>
##$WDW= 1
##$XDIM= 65536
##$YMAX_p= 435268569
##$YMIN_p= -48608272
$$ End of Bruker specific parameters
$$ ---------------------------------
##NTUPLES= NMR SPECTRUM
##VAR_NAME=  FREQUENCY,     SPECTRUM/REAL,   SPECTRUM/IMAG
##SYMBOL=    X,             R,               I
##VAR_TYPE=  INDEPENDENT,   DEPENDENT,       DEPENDENT
##VAR_FORM=  AFFN,          ASDF,            ASDF
##VAR_DIM=   65536,         65536,           65536
##UNITS=     HZ,            ARBITRARY UNITS, ARBITRARY UNITS
##FACTOR=    0.620285442955139, 1,           1
##FIRST=     20137.2065510682, 0,            0
##LAST=      -20513.1999529968, 0,           0
##MIN=       -20513.1999529968, -48608272,   0
##MAX=       20137.2065510682, 435268569,    0
$$ Real data points
##PAGE= N=1
##DATA TABLE= (X++(R..R)), XYDATA
$$ [...]
$$ plain form
39731 510268 592579 394852 120374 79157 375673 709130 668555 253373 -158122 -372546
39721 -372546 -545033 -704992 -583474 -145231 147553 -40719 -375921 -335824 26243 221486
39711 221486 60483 -151941 -71684 349284 897105 1210866 997230 392715 -35191 85232
39701 85232 460897 554249 267900 -109983 -425314 -701103 -791240 -454253 203955 702371
39691 702371 647258 29370 -841653 -1471447 -1431049 -807722 -261574 -277140 -509214 -280022
39681 -280022 417324 903246 733540 120929 -566239 -1177354 -1536307 -1361762 -708370 -119495
39671 -119495 -46037 -330359 -479607 -285802 -9949 -49193 -495083 -963173 -932536 -378782
39661 -378782 99735 20030 -339904 -405201 -200695 -236531 -577254 -666005 -200180 406302
$$ packed form
39731E10268Q2311j97727k74478m1217K96516L33457m0575m15182m11495k14424
39721c72546j72487j59959J21518M38243K92784j88272l35202M0097L62067J95243
39711B21486j61003k12424Q0257M20968N47821L13761k13636o04515m27906J20423
39701H5232L75665R3352k86349l77883l15331k75789r0137L36987O58208M98416
39691G02371n5113o17888q71023o29794M0398O23327N46148j5566k32074K29192
39681b80022O97346M85922j69706o12611o87168o11115l58953J74545O53392N88875
39671a19495P3458k84322j49248J93805K75853l9244m45890m68090L0637N53754
39661c78782M78517p9705l59934o5297K04506l5836l40723q8751M65825O06482
$$ plain form
39651 406302 687062 757909 964731 1271277 1347025 1045780 545749 163321 129794 346316
39641 346316 348366 -167650 -791940 -823029 -285247 33435 -279141 -691927 -600075 -161759
39631 -161759 147026 248270 227436 -72619 -596402 -702877 -10032 763978 670276 -11550
39621 -11550 -161528 408349 659428 25325 -666032 -517288 72607 131714 -421391 -895802
39611 -895802 -1019713 -1120236 -1276941 -1166612 -793922 -600587 -696965 -706185 -593032 -879896
39601 -879896 -1611077 -1832210 -803217 762226 1478483 1046642 413807 292463 409773
39592 409773 352971 284743 416457 460787 142591 -235824 -283509 -197071 -387244 -707695
39582 -707695 -643741 -129530 364139 507847 412440 272322 138532 62271 91465 103433
$$ packed form
39651D06302K80760P0847K06822L06546P5748l01245n00031l82428l3527K16522
39641C46316K050n16016o24290l1089N37782L18682l12576m12786R1852M38316
39631a61759L08785J01244k0834l00055n23783j06475O92845P74010r3702o81826
39621a1550j49978N69877K51079o34103o91357J48744N89895N9107n53105m74411
39611h95802j23911j00523j56705J10329L72690J93335r6378r220J13153k86864
39601h79896p31181k21133J028993J565443P16257m31841o32835j21344J17310
39592D09773n6802o8228J31714M4330l18196l78415m7685Q6438j90173l20451
39582g07695O3954N14211M93669J43708r5407j40118j33790p6261K9194J1968
$$ plain form
39572 103433 -35855 -157135 41151 513989 871380 849222 506497 26781 -367017 -405211
39562 -405211 -52454 287875 243547 47700 194195 625185 815616 629739 465507 484645
39552 484645 375167 69593 13421 373376 596861 231674 -308498 -327564 165665 587501
39542 587501 647265 570843 597730 710829 819424 864871 760694 449657 -26060 -599280
39532 -599280 -1128178 -1220352 -510888 668141 1346649 1012922 252838 -117245 -106583 -174343
39522 -174343 -243950 86895 573048 486004 -196093 -639275 -439560 -257817 -748215 -1519385
39512 -1519385 -1718692 -1178106 -414582 149424 395434 235982 -235892 -497085 -146802
39503 -146802 348873 130612 -782851 -1398790 -1143251 -639685 -658675 -937347 -747811 -207899
$$ packed form
39572A03433j39288j21280J98286M72838L57391k2158l42725m79716l93798l8194
39562d05211L52757L40329m4328j95847J46495M30990J90431j85877j64232J9138
39552D84645j09478l05574n6172L59955K23485l65187n40172j9066M93229M21836
39542E87501N9764p6422K6887J13099J08595M5447j04177l11037m75717n73220
39532e99280n28898r2174P09464J179029O78508l33727p60084l70083J0662o7760
39522a74343o9607L30845M86153q7044o82097m43182J99715J81743m90398p71170
39512a519385j99307N40586P63524N64006K46010j59452m71874k61193L50283
39503a46802M95675k18261r13463o15939K55539N03566j8990k78672J89536N39912
$$ plain form
39493 -207899 -131187 -671305 -1016988 -633160 -18066 156044 -23646 -167905 -395131 -960751
39483 -960751 -1451998 -1195638 -368142 119150 -61857 -229529 138973 536725 243046 -517550
39473 -517550 -908234 -719457 -570069 -840588 -1039308 -552856 353289 754714 251350 -461263
39463 -461263 -413169 458778 1277534 1341077 883631 560580 561222 618040 628039 715217 738970
39452 738970 333175 -418288 -860417 -589838 8180 347056 401691 523971 798500 1013011
39442 1013011 1089005 1120145 1079152 873603 638865 604152 676979 510942 16276 -512665
39432 -512665 -810712 -864276 -684366 -232525 296836 496909 293330 151670 421694 736921
39422 736921 495491 -196519 -558345 -155541 573969 984558 985863 843516 598634 159385
$$ packed form
39493b07899P6712n40118l45683L83828O15094J74110j79690j44259k27226n65620
39483i60751m91247K56360Q27496M87292j81007j67672L68502L97752k93679p60596
39473e17550l90684J88777J49388k70519j98720M86452R06145M01425n03364p12613
39463d61263M8094Q71947Q18756O3543m57446l23051O42N6818R999Q7178K3753
39452G38970m05795p51463m42129K70579N98018L38876N4635J22280K74529K14511
39442A013011P5994L1140m0993k05549k34738l4713P2827j66037m94666n28941
39432e12665k98047n3564J79910M51841N29361K00073k03579j41660K70024L15227
39422G36921k41430o92010l61826M02804P29510M10589J305j42347k44882m39249
$$ plain form
39412 159385 -241784 -238162 42546 68521 -273498 -454471 -125218 306752 268474 -186398
39402 -186398 -585228 -734064 -740152 -557902 -45091 603959 979850 1022695 1028149 1070595 876268
39391 876268 361324 -141377 -357185 -401058 -458530 -477676 -379182 -259790 -163254 62620
39381 62620 429737 602591 342986 -39262 -43497 304647 462167 131807 -312102 -339241
39371 -339241 5681 170235 -131671 -514304 -465692 -70873 153954 57575 23387 256215
39361 256215 416787 271946 230803 722501 1374122 1438406 895452 490825 667486 1042582
39351 1042582 1060429 671985 202283 -67420 -39710 168781 262345 94188 -86117 -15856
39341 -15856 114726 19272 -67757 255685 742106 783949 464043 455056 809204 815077 301960
$$ packed form
39412A59385m01169L622K80708K5975l42019j80973L29253M31970l8278m54872
39402a86398l98830j48836o088J82250N12811O49050L75891M2845N454M2446j94327
39391H76268n14944n02701k15808m3873n7472j9146R8494J19392R6536K25874
39381F2620L67117J72854k59605l82248m235L48144J57520l30360m43909k7139
39371c39241L44922J64554l01906l82633M8612L94819K24827r6379l4188K32828
39361B56215J60572j44841m1143M91698O51621O4284n42954m04627J76661L75096
39351A042582J7847l88444m69702k69703K7710K08491R3564j68157j80305P0261
39341a5856J30582r5454q7029L23442M86421M1843l19906q987L54148N873n13117
$$ plain form
39330 301960 75199 601501 1221026 1267699 1069627 1106370 1031057 431656 -176298 -152179
39320 -152179 60662 -356836 -1116512 -1235983 -682214 -378282 -615632 -667985 -159583 296156
39310 296156 180963 -140863 -148631 90552 321482 557826 717934 438576 -280971 -785095
39300 -785095 -578861 157 329131 282389 75981 -212544 -515283 -570821 -327508 -191565
39290 -191565 -398282 -511690 -110600 369415 164856 -650537 -1267549 -1344835 -1334354 -1493718
39280 -1493718 -1370855 -657534 87067 138615 -360210 -663501 -490609 -227155 -140187 -14686
39270 -14686 307492 559483 474912 188829 -59297 -292758 -581140 -770064 -758324 -747460
39260 -747460 -833398 -664822 -20696 545786 319050 -440533 -733465 -252244 225216 108845
$$ packed form
39330C01960k26761N26302O19525M6673j98072L6743p5313n99401o07954K4119
39320a52179K12841m17498p59676j19471N53769L03932k37350n2353N08402M55739
39310B96156j15193l21826p768K39183K30930K36344J60108k79358p19547n04124
39300g85095K06234N79018L28974m6742k06408k88525l02739n5538K43313J35943
39290a91565k06717j13408M01090M80015k04559q15393o17012p7286J0481j59364
39280a493718J22863P13321P44601N1548m98825l03291J72892K63454Q6968J25501
39270a4686L22178K51991q4571k86083k48126k33461k88382j88924J1740J0864
39260g47460q5938J68576O44126N66482k26736p59583k92932M81221M77460j16371
$$ plain form
39250 108845 -151111 50120 456957 489347 249650 219871 305046 6691 -589760 -804458
39240 -804458 -399019 61765 60920 -202713 -225669 129830 607275 921655 983428 929005 966021
39229 966021 1030345 717726 -151715 -1057351 -1304955 -943986 -641184 -653283 -538154 -30284
39219 -30284 432730 400271 103642 11164 73881 -81526 -449876 -645078 -498423 -215235
39209 -215235 39671 316713 601504 705107 546776 299990 141323 46543 -38880 20789
39199 20789 431460 1158276 1841626 2058339 1668730 924571 238233 -162998 -344474 -456338
39189 -456338 -523641 -498788 -405591 -282144 -40331 413395 889702 972159 511435 -81838
39179 -81838 -234055 168729 730065 1035184 959351 546093 -71714 -547210 -481195 61729
$$ packed form
39250A08845k59956K01231M06837L2390k39697k9779Q5175k98355n96451k14698
39240h04458M05439M60784q45k63633k2956L55499M77445L14380O1773n4423L7016
39229I66021O4324l12619q69441r05636k47604L60969L02802j2099J15129N07870
39219c0284M63014l2459k96629r2478O2717j55407l68350j95202J46655K83188
39209b15235K54906K77042K84791J03603j58331k46786j58667r4780q5423N9669
39199B0789M10671P26816O83350K16713l89609p44159o86338m01231j81476j11864
39189d56338o7303K4853R3197J23447K41813M53726M76307Q2457m60724n93273
39179h1838j52217M02784N61336L05119p5833m13258o17807m75496O6015N42924
$$ plain form
39169 61729 480630 353440 -30636 -171157 -111543 -229045 -466610 -386075 4682 107368
39159 107368 -369700 -895877 -836573 -309514 38361 -149141 -672216 -1136747 -1269907 -988290
39149 -988290 -399852 300757 1010962 1648103 1915767 1506543 655609 62204 4965 -43448
39139 -43448 -567389 -1197702 -1260347 -818787 -544709 -682335 -774617 -464186 -7389 187111
39129 187111 107248 -8093 -79502 -216247 -471534 -725797 -778852 -541706 -180810 7007
39119 7007 -49556 -102465 20177 121927 -26115 -248802 -192863 134839 412842 512811 575783
39108 575783 604428 403818 10719 -220636 -142802 -95549 -415565 -898372 -1034337 -680325
39098 -680325 -239901 -150316 -345051 -322127 253793 1070468 1400184 894289 59535 -222609
$$ packed form
39169F1729M18901j27190l84076j40521N9614j17502k37565Q0535L90757J02686
39159A07368m77068n26177N9304N27059L47875j87502n23075m64531j33160K81617
39149i88290N88438P00609P10205O37141K67664m09224q50934n93405n7239m8413
39139d3448n23941o30313o2645M41560K74078j37626r2282L10431M56797J94500
39129A87111p9863j15341p1409j36745k55287k54263n3055K37146L60896J87817
39119G007n6563n2909J22642J01750j48042k22687N5939L27702K78003R9969O2972
39108E75783K8645k00610l93099k31355P7834M7253l20016m82807j35965L54012
39098f80325M40424Q9585j94735K2924N75920Q16675L29716n05895q34754k82144
$$ plain form
39088 -222609 341235 1115478 1214399 434441 -554855 -903688 -399643 406207 823454 680997
39078 680997 342150 187099 232938 250705 109254 -64353 -25009 299587 662920 735863
39068 735863 503562 247333 83488 -172218 -512211 -515327 7890 530756 508791 228769
39058 228769 272193 418828 4951 -716036 -656444 431605 1405731 1323133 663843 375091
39048 375091 527702 649919 691736 827043 817683 388418 -152535 -380463 -441492 -588405
39038 -588405 -501196 124552 730150 538085 -240058 -724010 -662047 -515862 -445067 -169962
39028 -169962 211581 214407 -159975 -376882 -275860 -237032 -365988 -308278 -2681 147837
39018 147837 22391 -18861 155594 244161 186776 332605 717773 859139 523886 82129
$$ packed form
39088b22609N63844P74243R8921p79958r89296l48833N04045Q05850M17247j42457
39078F80997l38847j55051M5839J7767j41451j73607L9344L24596L63333P2943
39068G35863k32301k56229j63845k55706l39993l116N23217N22866k1965k80022
39058B28769M3424J46635m13877p20987N9592J088049R74126q2598o59290k88752
39048C75091J52611J22217M1817J35307r360m29265n40953k27928o1029j46913
39038e88405Q7209O25748O05598j92065p78143m83952O1963J46185P0795K75105
39028a69962L81543K826l74382k16907J01022L8828j28956N7710L05597J50518
39018A47837j25446m1252J74455Q8567n7385J45829L85168J41366l35253m41757
$$ plain form
39008 82129 -143221 -267833 -366119 -234480 100450 243460 81103 -7753 147293 211454
38998 211454 53413 108554 616631 1073977 951505 509002 369375 598113 701156 359661
38988 359661 -229582 -665612 -747564 -614992 -567456 -675553 -672537 -426817 -290788 -575152
38978 -575152 -903258 -667596 11480 439919 372513 158235 -66861 -481658 -850608 -641242
38968 -641242 -27155 217977 74082 418843 1386034 1775523 871051 -237763 -199830 582102
38958 582102 710565 2929 -401637 35212 491882 137504 -741203 -1309623 -1204484 -652298
38948 -652298 -46554 297021 260617 8557 -195840 -283983 -336425 -320736 -102051 325509
38938 325509 792416 1079184 996127 509154 -100719 -424821 -390442 -274473 -182241 70273
$$ packed form
39008H2129k25350j24612r8286J31639L34930J43010j62357q8856J55046O4161
38998B11454j58041N5141N08077M57346j22472m42503j39627K28738J03043l41495
38988C59661n89243m36030q1952J32572M7536j08097L016K45720J36029k84364
38978e75152l28106K35662O79076M28439o7406k14278k25096m14797l68950K09366
38968f41242O14087K45132j43895L44761R67191L89489r04472j108814L7933P81932
38958E82102J28463p07636m04566M36849M56670l54378q78707n68420J05139N52186
38948f52298O05744L43575l6404k52060k04397q8143n2442J5689K18685M27560
38938C25509M66907K86768q3057m86973o09873l24102L4379J15969R2232K52514
$$ plain form
38928 70273 401784 340551 -198185 -542693 -184027 379228 333109 -246896 -575378 -355205
38918 -355205 -78615 -144494 -338587 -334679 -178941 -50051 76289 270248 391196 224548
38908 224548 -192794 -511321 -373246 186398 686642 706615 431299 436649 895087 1338965
38898 1338965 1338106 1022102 712777 453887 238726 311098 778895 1204129 1071515 502859
38888 502859 53412 -71960 -139000 -292745 -319932 -68553 255740 349079 186474 66969
38878 66969 323884 909562 1265690 867947 -13507 -469053 -82755 497748 473566 -31189
38868 -31189 -313939 -189779 -104654 -296899 -502818 -528764 -533065 -604123 -554191 -332761 -239119
38857 -239119 -479107 -810431 -876579 -683936 -509334 -454164 -305242 167847 888399 1482169
$$ packed form
38928G0273L31511o1233n38736l44508L58666N63255m6119n80005l28482K20173
38918c55205K76590o5879j94093L908J55738J28890J26340J93959J20948j66648
38908B24548m17342l18527J38075N59644N00244J9973k75316N350M58438M43878
38898A338965q59l16004l09325k58890k15161P2372M67797M25234j32614n68656
38888E02859m49447j25372o7040j53745k7187K51379L24293R3339j62605j19505
38878F6969K56915N85678L56128l97743q81454m55546L86298N80503k4182n04755
38868c1189k82750J24160Q5125j92245k05919k5946m301p1058M9932K21430R3642
38857b39119k39988l31324o6148J92643J74602N5170J48922M73089P20552N93770
$$ plain form
38847 1482169 1616604 1329945 969826 792907 735265 627344 475922 398358 400417 384953
38837 384953 313898 229054 169368 159562 189762 125080 -214718 -740911 -1004392 -638185 149923
38826 149923 716726 643289 139135 -250292 -248797 -46890 120951 392402 967619 1446417
38816 1446417 1034047 -271952 -1237706 -797448 427017 867407 167065 -417047 7167
38807 7167 653740 377224 -549317 -939844 -502733 -80077 -171174 -223458 321272 1039092
38797 1039092 1105883 456857 -189187 -347846 -313693 -553133 -935867 -949611 -541127 -248226
38787 -248226 -360870 -445698 -84670 334754 180972 -301958 -193114 738058 1577831 1442209
38777 1442209 547999 -221631 -404223 -264415 -288966 -669489 -1163098 -1362073 -1204374 -1086516
$$ packed form
38847A482169J34435k86659l60119j76919n7642j07921j51422p7564K059j5464
38837C84953p1055q4844n9686r806L0200o4682l39798n26193k63481L66207P88108
38826A49923N66803p3437n04154l89427J495K01907J67841K71451N75217M78798
38816A446417m12370j305999r65754M40258J224465M40390p00342n84112M24214
38807G167O46573k76516r26541l90527M37111M22656r1097n2284N44730P17820
38797A039092O6791o49026o46044j58659L4153k39440l82734j3744M08484K92901
38787b48226j12644q4828L61028M19424j53782m82930J08844R31172Q39773j35622
38777A442209q94210p69630j82592J39808k4551l80523m93609j98975J57699J17858
$$ plain form
38767 -1086516 -1211985 -1100593 -269112 825469 1236462 818949 277848 -29564 -404056
38758 -404056 -831217 -761612 -192257 66343 -299182 -498812 43728 688122 633124 154869
38748 154869 -31819 64984 54275 35779 241227 343614 21289 -271390 -3276 409184
38738 409184 228834 -318648 -379644 150479 549435 436832 137100 -53857 -164815 -156478
38728 -156478 62950 293164 320119 368460 668612 850718 478065 -110738 -296703 -244396
38718 -244396 -565887 -1115168 -1114909 -464184 47874 -47481 -334539 -334459 -133624 9123 45098
38707 45098 -33087 -197957 -174993 225912 597590 366413 -305462 -702783 -603901 -450934
38697 -450934 -491804 -487949 -320462 -162093 31197 488894 991122 973159 405952 -78889
$$ packed form
38767a086516j25469J11392Q31481J094581M10993m17513n41101l07412l74492
38758d04056m27161O9605N69355K58600l65525j99630N42540O44394n4998m78255
38748A54869j86688R6803j0709j8496K05448J02387l22325k92679K68114M12460
38738D09184j80350n47482o0996N30123L98956j12603k99732j90957j10958Q337
38728a56478K19428K30214K6955M8341L00152J82106l72653n88803j85965N2307
38718b44396l21491n49281K59O50725N12058r5355k87058Q0K00835J42747L5975
38707D5098p8185j64870K2964M00905L71678k31177o71875l97321R8882J52967
38697d50934m0870L855J67487J58369J93290M57697N02228j7963n67207m84841
$$ plain form
38687 -78889 -76400 184297 394182 503255 460653 262455 267146 760843 1235264 930110 117620
38676 117620 -118175 449931 784171 214550 -537542 -566364 -138146 -76656 -433822 -590471
38666 -590471 -302881 82871 267308 274580 205587 137057 175513 318138 375230 229865 12856
38655 12856 -113292 -118881 44465 451628 911987 986035 496465 -211975 -667049 -708322
38645 -708322 -469575 -199722 -170010 -467279 -802562 -798970 -512094 -373112 -584765 -876713
38635 -876713 -894603 -556005 -25060 402447 454793 200146 66532 234468 250013 -312189
38625 -312189 -1051263 -1182300 -600958 107257 563740 814518 764076 178739 -695339 -1240895
38615 -1240895 -1301443 -1268530 -1300086 -1143017 -797307 -626243 -672113 -552679 -172295 135789
$$ packed form
38687g8889K489K60697K09885J09073m2602j98198M691M93697M74421l05154q12490
38676A17620k35795N68106L34240n69621p52092k8822M28218O1490l57166j56649
38666e90471K87590L85752J84437P272o8993o8530L8456J42625N7092j45365k17009
38655A2856j26148n589J63346M07163M60359P4048m89570p08440m55074m1273
38645g08322K38747K69853K9712k97269l35283L592K86876J38982k11653k91948
38635h76713j7890L38598N30945M27507N2346k54647j33614J67936J5545n62202
38625c12189p39074j31037N81342P08215M56483K50778n0442n85337q74078n45556
38615a240895o0548L2913l1556J57069L45710J71064m5870J19434L80384L08084
$$ plain form
38605 135789 272972 474875 677795 570199 367180 656255 1303450 1456665 913826 509967
38595 509967 746679 1025910 788421 454859 528178 613571 174430 -414697 -470091 -164098
38585 -164098 -205364 -668433 -955663 -766819 -424615 -296882 -405630 -563834 -557622 -302976
38575 -302976 -33814 -88853 -341288 -237775 361380 865087 813545 566399 688578 1081490
38565 1081490 1235700 1035552 826746 887460 1194570 1513222 1476442 875828 90547 -163727
38555 -163727 238600 597902 358650 -177842 -453808 -454630 -468391 -495928 -368842 -84991
38545 -84991 369790 1117908 1917498 2091950 1428133 671171 555004 771511 538151 -178203
38535 -178203 -704896 -678761 -318685 167659 759848 1223518 1154365 551961 -72720 -279724
$$ packed form
38605A35789J37183K01903K02920j07596k03019K89075O47195J53215n42839m03859
38595E09967K36712K79231k37489l33562P3319Q5393m39141n89127n5394L05993
38585a64098m1266m63069k87230J88844L42204J27733j08748j58204O212K54646
38575c02976K69162n5039k52435J03513N99155N03707n1542k47146J22179L92912
38565A081490J54210k00148k08806O0714L07110L18652l6780o00614p85281k54274
38555a63727M02327L59302k39252n36492k75966q22j3761k7537J27086K83851
38545h4991M54781P48118P99590J74452o63817p56962j16167K16507k33360p16354
38535a78203n26693K6135L60076M86344N92189M63670o9153o02404o24681k07004
$$ plain form
38525 -279724 -111985 112232 182575 134280 131169 205356 129698 -268905 -701102 -666958 -165881
38514 -165881 270179 374126 487849 892318 1295611 1306369 965554 461465 -242337 -1094352
38504 -1094352 -1665536 -1607960 -1111781 -565446 -91521 261913 273342 -94455 -425452 -353533
38494 -353533 -62382 62046 -12740 -75793 -32196 142883 491476 859805 956697 837747
38484 837747 888397 1115269 1010823 410525 -127614 -171422 -22580 -60292 -127975 -51897
38474 -51897 -88542 -299100 -186326 394376 690409 200175 -337864 -29617 722495 897016
38464 897016 482789 299740 541239 663234 533291 539357 629443 368123 -31065 153089
38454 153089 838601 1052525 425812 -214880 -113625 445758 854694 1048546 1161386 1015443
$$ packed form
38525b79724J67739K24217P0343m8295l111P4187p5658l98603m32197L4144N01077
38514a65881M36060J03947J13723M04469M03293J0758l40815n04089p03802q52015
38504a094352n71184N7576M96179N46335M73925L53434J1429l67797l30997P1919
38494c53533K91151J24428p4786o3053M3597J75079L48593L68329R6892j18950
38484H37747N0650K26872j04446o00298n38139m3808J48842l7712o7683P6078
38474e1897l6645k10558J12774N80702K96033m90234n38039L08247P52112J74521
38464H97016m14227j83049K41499J21995j29943O066R0086k61320l99188J84154
38454A53089O85512K13924o26713o40692J01255N59383M08936J93852J12840j45943
$$ plain form
38444 1015443 528471 106966 89263 195081 18364 -265547 -177231 286857 590823 318970
38434 318970 -376022 -951254 -953595 -391987 270291 544902 351636 -25924 -299248 -335810
38424 -335810 -117830 198552 287970 -965 -380081 -444397 -147929 281277 697413 975378
38414 975378 827469 156874 -542755 -659633 -292611 -110230 -393623 -738741 -768933 -626302
38404 -626302 -602506 -720844 -860134 -918250 -697314 -155 965383 1602180 1552171 1065583
38394 1065583 606928 368919 320293 422954 565698 517328 206035 -96288 -86024 176152
38384 176152 353822 221246 -195797 -745572 -1199313 -1244751 -712072 118619 660740 629246
38374 629246 354078 313849 525743 682543 751274 974627 1262165 1136232 493758 -143958
$$ packed form
38444A015443m86972m21505j7703J05818j76717k83911Q8316M64088L03966k71853
38434C18970o94992n75232k341N61608O62278K74611j93266l77560k73324l6562
38424c35810K17980L16382Q9418k88935l79116o4316K96468M29206M16136K77965
38414I75378j47909o70595o99629j16878L67022J82381k83393l45118l0192J42631
38404f26302K3796j18338j39290n8116K20936O97159R65538O36797n0009m86588
38394A065583m58655k38009m8626J02661J42744m8370l11293l02323J0264K62176
38384A76152J77670j32576m17043n49775m53741m5438N32679Q30691N42121l1494
38374F29246k75168m0229K11894J56800O8731K23353K87538j25933o42474o37716
$$ plain form
38364 -143958 -491676 -988262 -1850425 -2261770 -1401856 123071 935039 783101 654760
38355 654760 1007421 1151569 687225 308742 576421 938874 727958 271649 234298 571096
38345 571096 905927 1273038 1686992 1625873 832919 86690 238828 916735 1111515 682848
38335 682848 305887 195493 -84302 -607014 -831699 -476760 77376 358532 217920 -292972
38325 -292972 -886825 -944267 -75456 1190233 1810310 1384925 502372 -42785 13999 406596
38315 406596 707478 692729 519602 428582 253680 -358211 -1162686 -1402097 -934457 -526126
38305 -526126 -603134 -557582 77938 636912 361735 -318761 -539046 -374604 -428231 -629209
38295 -629209 -558033 -446618 -694960 -881151 -480390 -86351 -548461 -1310913 -1141523 -237726
$$ packed form
38364a43958l47718m96586q62163m11345Q59914J524927Q11968j51938j28341
38355F54760L52661J44148m64344l78483K67679L62453k10916m56309l7351L36798
38345E71096L34831L67111M13954o1119p92954p46229J52138O77907J94780m28667
38335F82848l76961j10394k79795n22712k24685L54939N54136K81156j40612n10892
38325b92972n93853n7442Q68811J265689O20077m25385q82553n45157N6784L92597
38315D06596L00882j4749j73127r1020j74902o11891q04475k39411M67640M08331
38305e26126p7008M5552O35520N58974k75177o80496k20285J64442n3627k00978
38295f29209P1176J11415k48342j86191M00761L94039m62110p62452J69390R03797
$$ plain form
38285 -237726 62211 -418853 -469895 250378 554238 -146152 -743615 -282827 535366 641170
38275 641170 192840 -102178 -265001 -621669 -882291 -642137 -249268 -299157 -671205 -786464
38265 -786464 -489935 -103204 104839 83017 -61464 -46282 264921 433157 -71773 -898207
38255 -898207 -1123740 -672150 -450325 -794771 -880739 -188688 546865 583903 348594 470944
38245 470944 549561 -68587 -973380 -1257891 -912583 -625922 -587540 -480046 -333594 -403186
38235 -403186 -439914 -46167 422346 260440 -386373 -663151 -327014 -12409 -104470 -237204
38225 -237204 -110743 3940 -115506 -195964 7496 286769 418299 554130 824634 945566
38215 945566 603987 -23699 -466018 -489206 -193540 229697 577664 621763 299060 -121509
$$ packed form
38285b37726K99937m81064n1042P20273L03860p00390n97463M60788Q18193J05804
38275F41170m48330k95018j62823l56668k60622K40154L92869m9889l72048j15259
38265g86464K96529L86731K08043k1822j44481J5182L11203J68236n04930q26434
38255h98207k25533M51590K21825l44446q5968O92051P35553L7038k35309J22350
38245D70944P8617o18148r04793k84511L45308K86661L8382J07494J46452o9592
38235d03186l6728L93747M68513j61906o46813k76778L36137L14605r2061j32734
38225b37204J26461J14683j19446q0458K03460K79273J31530J35831K70504J20932
38215I45566l41579o27686m42319k3188K95666M23237L47967M4099l22703m20569
$$ plain form
38205 -121509 -282762 -149166 1011 8621 61736 355448 645312 395275 -536547 -1542696
38195 -1542696 -1810599 -1182777 -286960 187999 150245 7752 134046 554226 1005737 1156335
38185 1156335 847174 256844 -215536 -325745 -203945 -123479 -119354 23002 403658 799584
38175 799584 926180 794848 633467 511756 316352 141808 345134 965759 1412856 1135322
38165 1135322 394198 -85798 -65030 126998 284343 434069 341454 -284772 -1027869 -1085038
38155 -1085038 -548363 -398521 -869244 -900301 132132 1195086 1061043 129257 -336829
38146 -336829 -130582 -22957 -199996 -70577 524511 1074883 1337473 1490623 1395447 706978
38136 706978 -268287 -778736 -722774 -650272 -699405 -473099 31843 352644 454713 710931
$$ packed form
38205a21509j61253J33596J50177P610N3115K93712K89864k50037r31822j006149
38195a542696k67903O27822Q95817M74959l7754j42493J26294M20180M51511J50598
38185A156335l09161n90330m72380j10209J21800Q0466M125J42356L80656L95926
38175G99584J26596j31332j61381j21711j95404j74544K03326O20625M47097k77534
38165A135322p41124m79996K0768J92028J57345J49726r2615o26226p43097n7169
38155a085038N36675J49842m70723l1057J032433J062954j34043r31786m66086
38146c36829K06247J07625j77039J29419N95088N50372K62590J53150r5176o88469
38136G06978r75265n10449N5962P2502m9133K26306N04942L20801J02069K56218
$$ plain form
38126 710931 939740 522717 -370989 -751019 -269533 257521 79076 -653559 -1509865 -2280404
38116 -2280404 -2596027 -2045563 -1013469 -460517 -561715 -524870 -21671 322736 229190 315663
38106 315663 790380 842756 109866 -423948 54582 810017 777896 269705 267055 714081
38096 714081 786542 420191 329359 704815 1000864 970238 956056 1106808 1098973 746104 267702
38085 267702 -122536 -406512 -528160 -398425 -125849 97181 277535 524267 815685 1106408
38075 1106408 1443185 1722282 1620804 1075714 540812 427257 545452 433338 4025
38066 4025 -445463 -663935 -612893 -376329 -96425 137998 359111 465287 86691 -802284
38056 -802284 -1344030 -678242 651841 1135623 340387 -505674 -381308 146749 95191 -353578
$$ packed form
38126G10931K28809m17023q93706l80030M81486N27054j78445p32635q56306p70539
38116b280404l15623N50464J032094N52952j01198L6845N03199L44407r3546Q6473
38106C15663M74717N2376p32890n33814M78530P55435l2121n08191k650M47026
38096G14081P2461l66351r0832L75456K96049l0626j4182J50752p835l52869m78402
38085B67702l90238k83976j21648J29735K72576K23030J80354K46732K91418K90723
38075A106408L36777K79097j01478n45090n34902j13555J18195j12114m29313
38066D025m49488k18472N1042K36564K79904K34423K21113J06176l78596q88975
38056h02284n41746O65788J330083M83782p95236q46061J24366N28057n1558m48769
$$ plain form
38046 -353578 -381815 51970 341399 332839 361325 456254 331389 5518 -227858 -289761 -244526
38035 -244526 11863 477616 749296 525937 127945 20769 131159 119578 -11327 -75523
38025 -75523 -111816 -141369 91872 628515 958896 715887 263873 47414 -134776 -553964
38015 -553964 -790978 -368606 285586 391999 14713 -189542 -151142 -344602 -697869 -564479
38005 -564479 116568 544970 204320 -438544 -691540 -537432 -436538 -590333 -708699 -396477
37995 -396477 324157 875265 690716 -895 -329611 68867 537889 397846 -77128 -231719
37985 -231719 -60918 59703 241548 789662 1307863 1081150 305706 -29919 373659 676106
37975 676106 234062 -422156 -429248 199868 769098 923037 928340 1095794 1379965 1562215
$$ packed form
38046c53578k8237M33785K89429q560K8486R4929j24865l25871k33376o1903M5235
38035b44526K56389M65753K71680k23359l97992j07176J10390j1581j30905o4196
38025g5523l6293k9553K33241N36643L30381k43009m52014k16459j82190m19188
38015e53964k37014M22372O54192J06413l77286k04255L8400j93460l53267J33390
38005e64479O81047M28402l40650o42864k52996J54108J00894j53795j18366L12222
37995c96477P20634N51108j84549o91611l28716L98478M69022j40043m74974j54591
37985b31719J70801J20621J81845N48114N18201k26713p75444l35625M03578L02447
37975F76106m42044o56218p092O29116N69230J53939N303J67454K84171J82250
$$ plain form
37965 1562215 1534159 1321447 983993 593590 272794 162727 282821 455252 467700 307103
37955 307103 134772 60823 74569 141294 180753 12440 -434648 -898746 -1024016 -766044
37945 -766044 -307940 276980 914517 1258851 1037359 566560 394344 533795 637595 765951
37935 765951 1201981 1598888 1268839 414863 65836 526198 897838 532524 -41226 -163530
37925 -163530 -57888 -154761 -261547 -127069 -84302 -396445 -623253 -349633 56169 68163
37915 68163 -202879 -425184 -608688 -696276 -337125 341094 563103 152564 7761 572178
37905 572178 888377 178167 -688305 -558479 99036 100072 -408877 -397291 109486 207268
37895 207268 -95519 40900 509544 231988 -930789 -1779791 -1615268 -1102218 -894245
$$ packed form
37965A562215k8056k12712l37454l90403l20796j10067J20094J72431J2448j60597
37955C07103j72331p3949J3746O6725L9459j68313m47088m64098j25270K57972
37945g66044M58104N84920O37537L44334k21492m70799j72216J39451J03800J28356
37935G65951M36030L96907l30049q53976l49027M60362L71640l65314n73750j22304
37925a63530J05642r6873j06786J34478M2767l12143k26808K73620M05802J1994
37915F8163k71042k22305j83504q7588L59151O78219K22009m10539j44803N64417
37905E72178L16199p10210q66472J29826O57515J036n08949J1586N06777R7782
37895B07268l02787J36419M68644k77556j162777q49002J64523N13050K07973
$$ plain form
37886 -894245 -656699 2839 704843 991275 1004480 965241 708410 189545 -203047 -254798
37876 -254798 -273980 -489664 -618510 -336235 256008 845229 1183334 1055604 429902 -276308
37866 -276308 -521083 -290245 -28564 39705 81249 224636 430066 690760 912584 776772
37856 776772 225237 -174526 46673 450436 322302 -141822 -119635 515836 1057235 1135603
37846 1135603 1147621 1384051 1525450 1237946 661497 112669 -227269 -257621 -27428 153691
37836 153691 57516 -153978 -322984 -640918 -1097734 -1079197 -250691 620953 628984 113307
37826 113307 65306 472668 425661 -273976 -818484 -737720 -401613 -77528 415992 947390
37816 947390 1024981 738858 758203 1162292 1253877 784725 387209 485674 715321 735997
$$ packed form
37886h94245K37546O59538P02004K86432J3205l9239k56831n18865l92592n1751
37876b54798j9182k15684j28846K82275N92243N89221L38105j27730o25702p06210
37866b76308k44775K30838K61681O8269M1544J43387K05430K60694K21824j35812
37856G76772n51535l99763K21199M03763j28134m64124K2187O35471N41399P8368
37846A135603J2018K36430J41399k87504n76449n48828l39938l0352K30193J81119
37836A53691r6175k11494j69006l17934m56816J8537Q28506Q71644Q031n15677
37826A13307m8001M07362m7007o99637n44508Q0764L36107L24085M93520N31398
37816I47390P7591k86123J9345M04089R1585m69152l97516R8465K29647K0676
$$ plain form
37806 735997 706457 630412 157094 -603746 -966095 -742480 -554402 -707426 -697762 -275707
37796 -275707 -10402 -196790 -136796 720898 1687038 1724349 897995 145775 -13173 172770
37786 172770 355717 459540 492816 439376 294574 33908 -275609 -298978 235079 945701
37776 945701 1058099 436829 -157321 -85826 395115 657542 512481 177882 -137254 -285836
37766 -285836 -164468 83917 153280 39963 71727 325113 445655 259863 127068 377763
37756 377763 747467 706359 154125 -472783 -690639 -437368 -108823 -117859 -375358 -396396
37746 -396396 -33850 246643 101255 -108716 64278 353633 223010 -195258 -320597 -96986
37736 -96986 -17049 -246904 -393957 -138855 437677 1075986 1413880 1067654 164430 -506363
$$ packed form
37806G35997k9540p6045m73318p60840l62349K23615J88078j53024R664M22055
37796b75707K65305j86388N9994Q57694R66140L7311q26354p52220j58948J85943
37786A72770J82947J03823L3276n3440j44802k60666l09517k3369N34057P10622
37776I45701J12398o21270n94150P1495M80941K62427j45061l34599l15136j48582
37766b85836J21368K48385O9363j13317L1764K53386J20542j85792j32795K50695
37756C77763L69704m1108n52234o26908k17856K53271L28545r036k57499k1038
37746c96396L62546K80493j45388k09971J72994K89355j30623m18268j25339K23611
37736i6986P9937k29855j47053K55102N76532O38309L37894l46226r03224o70793
$$ plain form
37726 -506363 -448691 -175914 -319599 -540273 -186029 483176 782263 850190 1191495 1344490
37716 1344490 434958 -1076591 -1686848 -990708 -128914 96723 156935 525065 853898
37707 853898 912008 1095038 1450711 1337444 624561 144000 340866 509094 21360 -647665
37697 -647665 -818242 -648542 -569550 -445730 -6101 515837 782781 847435 792599 474042
37687 474042 9853 -127090 115405 164505 -262633 -730034 -875089 -878223 -837464 -496596
37677 -496596 42176 168518 -272073 -666924 -643412 -518771 -388989 226574 1308725 1905190
37667 1905190 1462542 731759 617522 880318 730489 70882 -581067 -893720 -821974 -378588
37657 -378588 174771 362593 131468 -33004 78055 67564 -284707 -585405 -508304 -245406
$$ packed form
37726e06363N7672K72777j43685k20674L54244O69205K99087O7927L41305J52995
37716A344490r09532j511549o10257O96140Q61794K25637O0212L68130L28833
37707H53898N8110J83030L55673j13267p12883m80561J96866J68228m87734o69025
37697f47665j70577J69700P8992J23820M39629N21938K66944O4654n4836l18557
37687D74042m64189j36943K42495M9100m27138m67401j45055l134M0759L40868
37677d96596N38772J26342m40591l94851K3512J24641J29782O15563J082151N96465
37667A905190m42648p30783j14237K62796j49829o59607o51949l12653P1746M43386
37657c78588N53359J87822k31125j64472J11059j0491l52271l00698P7101K62898
$$ plain form
37647 -245406 19857 393266 772220 830165 714251 902203 1177144 773775 -188402 -599621
37637 -599621 -122776 182508 -375552 -976276 -741554 -187506 -207519 -560211 -464330 30338
37627 30338 314275 292181 247019 111577 -285952 -660553 -657885 -408225 -156027 166449
37617 166449 526250 558186 222199 39558 226323 321268 107744 56812 366949 504165
37607 504165 273199 341229 997339 1408259 936351 227239 64240 56136 -504752 -1259853
37597 -1259853 -1333179 -683333 24698 386766 346183 -83696 -500978 -223448 626016 962081
37587 962081 342174 -232367 92009 687912 667917 363853 429778 458652 -197358 -1054078
37577 -1054078 -1280057 -1139197 -1326611 -1540852 -1099415 -395573 -324421 -706054 -656645 -165584
$$ packed form
37647b45406K65263L73409L78954N7945j15914J87952K74941m03369r62177m11219
37637e99621M76845L05284n58060o00724K34722N54048k0013l52692R5881M94668
37627C0338K83937k2094m5162j35442l97529l74601K668K49660K52198L22476
37617A66449L59801L1936l35987j82641J86765R4945k13524n0932L10137J37216
37607E04165k30966O8030O56110M10920m71908p09112j62999q104n60888p55101
37597a259853p3326O49846P08031L62068m0583m29879m17282K77530Q49464L36065
37587I62081o19907n74541L24376N95903j9995l04064O5925K8874o56010q56720
37577a054078k25979J40860j87414k14241M41437P03842P1152l81633M9409M91061
$$ plain form
37567 -165584 21508 -218212 -389408 -469554 -768970 -988921 -635701 -102666 -125896 -413486
37557 -413486 -47911 934822 1572152 1446818 1003144 540664 1916 -367935 -222428 145694
37547 145694 238400 281271 711407 1094702 724485 -14226 -150571 251033 324255 75958
37537 75958 360800 1178796 1493730 966160 456528 453357 342982 -256562 -668118 -325309
37527 -325309 236430 274057 -51519 -136471 76999 182816 -14987 -374189 -680468 -757632
37517 -757632 -562255 -298633 -172227 -33633 381850 918646 1131637 912974 569610 341625
37507 341625 266058 414917 800184 1118537 1043012 710965 539757 671521 947397 1230382
37497 1230382 1379231 1152643 548327 -17993 -247035 -335148 -442019 -249602 418204 1001109
$$ packed form
37567a65584J87092k39720j71196q0146k99416k19951L53220N33035k3230k87590
37557d13486L65575R82733O37330j25334m43674m62480n38748l69851J45507L68122
37547A45694R2706M2871M30136L83295l70217p38711j36345M01604P3222k48297
37537G5958K84842Q17996L14934n27570n09632l171j10375n99544m11556L42809
37527c25309N61739L7627l25576q4952K13470J05817j97803l59202l06279p7164
37517g57632J95377K63622J26406J38594M15483N36796K12991k18663l43364k27985
37507C41625p5567J48859L85267L18353p5525l32047j71208J31764K75876K82985
37497A230382J48849k26588o04316n66320k29042q8113j06871J92417O67806N82905
$$ plain form
37487 1001109 890786 369198 202044 567199 995106 1124436 957126 608674 293360
37478 293360 265994 360879 6285 -861221 -1428769 -1102612 -430336 -301678 -731440 -1079905
37468 -1079905 -997022 -511305 315426 1166292 1395600 813094 67817 -266579 -363899 -404779
37458 -404779 -18186 840593 1352802 1040093 647101 886415 1182330 727082 -68990 -369691
37448 -369691 -362947 -645067 -879922 -437861 238308 307759 65167 401375 1155844 1390532
37438 1390532 960565 488040 111159 -434388 -825442 -553357 -14665 38919 -222647 -198954
37428 -198954 -131508 -539696 -913009 -463766 282601 236771 -332662 -290039 346821 673811
37418 673811 860357 1839144 3128896 3072057 1489076 113046 -43528 117324 -239643
$$ packed form
37487A001109j10323n21588j67154L65155M27907J29330j67310l48452l15314
37478B93360k7366R4885l54594q67506n67548L26157O72276J28658m29762l48465
37468a079905Q2883M85717Q26731Q50866K29308n82506p45277l34396r7320m0880
37458d04779L86593Q58779N12209l12709l92992K39314K95915m55248p96072l00701
37448c69691O744k82120k34855M42061O76169O9451k42592L36208P54469K34688
37438A390532m29967m72525l76881n45547l91054K72085N38692N3584k61566K3693
37428a98954O7446m08188l73313M49243P46367m5830n69433M2623O36860L26990
37418F73811J86546R78787J289752n6839j582981j376030j56574J60852l56967
$$ plain form
37409 -239643 -519761 -87680 547165 790230 921149 1229866 1331866 1010920 696342 551791
37399 551791 142963 -493758 -556360 195686 865271 747937 288125 161123 296651 358935
37389 358935 399331 527905 600336 577701 578452 430021 -113132 -675036 -637750 -223860 -238478
37378 -238478 -711714 -858061 -460753 -165587 -233136 -141564 313604 615172 515098 426899
37368 426899 570769 676864 707471 891441 936447 276222 -785852 -1293513 -1096644 -920364
37358 -920364 -907189 -432097 431413 699138 137259 -230961 200719 726177 694596 550034
37348 550034 813189 1107274 933564 524165 273329 106153 -57211 30736 372074 563352
37338 563352 546505 737799 1136636 1156580 622243 85085 -92287 -107552 -22586 338660
$$ packed form
37409b39643k80118M32081O34845K43065J30919L08717J02000l20946l14578j44551
37399E51791m08828o36721o2602P52046O69585j17334m59812j27002J35528O2284
37389C58935M0396J28574P2431k2635P51j48431n43153n61904L7286M13890j4618
37378b38478m73236j46347L97308K95166o7549R1572M55168L01568j00074q8199
37368D26899J43870J06095L0607J83970M5006o60225j062074n07661J96869J76280
37358i20364J3175M75092Q63510K67725n61879l68220M31680N25458l1581j44562
37348E50034K63155K94085j73710m09399k50836j67176j63364Q7947L41338J91278
37338E63352j6847J91294L98837J9944n34337n37158j77372j5265Q4966L61246
$$ plain form
37328 338660 634069 195236 -784097 -1283248 -925020 -389308 -153833 79465 452301 576832
37318 576832 415458 462753 760004 793465 601363 827807 1421819 1504602 856310 308822
37308 308822 297491 259066 -125734 -328699 -61355 226654 359718 748347 1301236 1295264
37298 1295264 744914 562839 892181 711686 -299122 -974202 -531268 151175 41647
37289 41647 -504822 -685036 -602090 -672800 -654505 -254696 111278 69083 49339 511051 1113927
37278 1113927 1369770 1406465 1437758 1193093 499870 -232457 -633049 -817433 -842135 -492035
37268 -492035 36622 104858 -347053 -626231 -463595 -408567 -719465 -891708 -672527 -492392
37258 -492392 -482952 -146745 561740 921698 670549 455179 614305 635490 296289 187425
$$ packed form
37328C38660K95409m38833r79333m99151L58228N35712K35475K33298L72836J24531
37318E76832j61374M7295K97251L3461j92102K26444N94012Q2783o48292n47488
37308C08822j1331l8425l84800k02965K67344K88009J33064L88629N52889n972
37298A295264n50350j82075L29342j80495j010808o75080M42934O82443j09528
37289D1647n46469j80214Q2946p0710J8295L99809L65974m2195j9744M61712O02876
37278A113927K55843L6695L1293k44665o93223p32327m00592j84384k4702L50100
37268d92035N28657O8236m51911k79178J62636N5028l10898j72243K19181J80135
37258d92392R440L36207P08485L59958k51149k15370J59126K1185l39201j08864
$$ plain form
37248 187425 563179 792358 501904 188169 184992 112063 -178552 -226444 20052 -32674
37238 -32674 -418449 -381508 226870 591885 404858 359483 731228 852418 482498 253062
37228 253062 254110 -265176 -1212666 -1328226 -272330 601501 385425 -93111 6186 185470
37218 185470 -23177 18416 637976 916458 352714 -17695 615588 1378225 1244764 662896
37208 662896 426971 290174 -75114 -104420 423771 572131 -54697 -233970 867454 2057570
37198 2057570 2003216 1353311 1376945 1855049 2087872 2693029 4383398 5954741 5577850
37189 5577850 3491190 1575401 765004 557549 564098 841159 1018214 641633 163083
37180 163083 304350 773839 808591 568367 787252 1434912 1859583 1877231 1700415 1252257
$$ packed form
37248A87425L75754K29179k90454l13735l177p2929k90615m7892K46496n2726
37238c2674l85775L6941O08378L65015j87027m5375L71745J21190l69920k29436
37228B53062J048n19286r47490j15560J055896Q73831k16076m78536R9297J79284
37218A85470k08647M1593O19560K78482n63744l70409O33283P62637j33461n81868
37208F62896k35925j36797l65288k9306N28191J48360o26828j79273J101424J190116
37198B057570n4354o49905K3634M78104K32823O05157J690369J571343l76891
37189E577850k086660j915789q10397k07455O549K77061J77055l76581m78550
37180A63083J41267M69489L4752k40224K18885O47660M24671J7648j76816m48158
$$ plain form
37170 1252257 535293 158669 524202 1019002 920641 505957 401014 530049 590330 805822
37160 805822 1295598 1486776 1070740 709394 895281 1045602 667385 378304 705039 941064
37150 941064 388290 -315189 -379563 -331133 -897599 -1400196 -804131 390957 848454 403352
37140 403352 -36229 -77192 -14208 105924 367319 383113 -92007 -444872 -104086 432588
37130 432588 455972 269631 544108 1105518 1361195 1289934 1105665 656327 21290 -102663
37120 -102663 528415 1112916 1075231 917742 1009109 746425 -113824 -599237 -127219 339289
37110 339289 -21218 -377183 194470 937993 757326 142937 140177 461620 289718 2197
37100 2197 408692 1078878 1055743 529305 308946 343157 170943 81276 435002 616116
$$ packed form
37170A252257p16964l76624L65533M94800r8361m14684j04943J29035O0281K15492
37160H05822M89776J91178m16036l61346J85887J50321l78217k89081L26735K36025
37150I41064n52774p03479o4374M8430n66466n02597N96065J195088M57497m45102
37140D03352m39581m0963O2984J20132K61395J5794m75120l52865L40786N36674
37130D32588K3384j86341K74477N61410K55677p1261j84269m49338o35037j23953
37120a02663O31078N84501l7685j57489R1367k62684q60249m85413M72018M66508
37110C39289l60507l55965N71653P43523j80667o14389k760L21443j71902k87521
37100B197M06495O70186k3135n26438k20359L4211j72214q9667L53726J81114
$$ plain form
37090 616116 26889 -657993 -540545 33795 318555 535745 1102733 1476311 1120650 662714
37080 662714 771229 916075 548231 370883 1042212 1786937 1751036 1539637 1911430 2195146
37070 2195146 1598294 847957 870963 1062908 553149 -48105 103932 348823 -195731 -856380
37060 -856380 -700504 -325061 -526341 -550061 390411 1251858 893225 270099 691868 1286243
37050 1286243 615689 -468888 -195358 969242 1177074 382057 63920 446550 516524
37041 516524 281155 600835 1205950 1114691 598773 671556 1137655 1113034 842916 1068691
37031 1068691 1332562 839896 172104 236882 494473 150692 -69026 597066 1029995 94050
37021 94050 -952747 -431946 700568 484444 -604836 -724897 -63526 -160935 -771525
$$ packed form
37090F16116n89227o84882J17448N74340K84760K17190N66988L73578l55661m57936
37080F62714J08515J44846l67844j77348O71329P44725l5901k11399L71793K83716
37070B195146n96852p50337K3006J91945n09759o01254J52037K44891n44554o60649
37060h56380J55876L75443k01280k3720R40472Q61447l58633o23126M21769N94375
37050A286243o70554j084577K73530J164600K07832p95017l18137L82630O9974
37041E16524k35369L19680O05115r1259n15918P2783M66099k4621k70118K25775
37031A068691K63871m92666o67792O4778K57591l43781k19718O66092M32929r35945
37021I4050j046797N20801J132514k16124j089280j20061O61371r7409o10590
$$ plain form
37012 -771525 -459804 421648 366935 -304850 -31881 1036027 1510113 1512739 2088056 2613757
37002 2613757 1796251 533613 690620 1675731 1421328 177312 13550 979980 1142422
36993 1142422 226371 -87921 548953 730628 145933 -133191 -130109 -806002 -1594962 -1031758
36983 -1031758 355904 690299 -8800 -141049 338643 177451 -247527 480106 1681748
36974 1681748 1407186 105098 54820 1351137 1920160 1375542 1321461 1890870 1579588
36965 1579588 566329 591594 1404016 933807 -796800 -1547207 -893141 -760263 -1583768
36956 -1583768 -1580941 -359980 302450 -100149 12675 1080945 1643274 1378319 1723015
36947 1723015 2918119 3490703 3089005 2869507 2879948 2076218 946429 987789 1703582
$$ packed form
37012g71525L11721Q81452n4713o71785K72969J067908M74086K626N75317N25701
37002B613757q17506j262638J57007R85111k54403j244016j63762R66430J62442
36993A142422r16051l14292O36874J81675n84695k79124L082o75893p88960N63204
36983a031758J387662L34395o99099j32249M79692j61192m24978P27633J201642
36974A681748k74562j302088n0278J296317N69023n44618n4081N69409l11282
36965A579588j013259K5265Q12422m70209j730607p50407O54066J32878q23505
36956a583768K827J220961O62430m02599J12824J068270N62329k64955L44696
36947A723015J195104N72584m01698k19498J0441q03730j129789M1360P15793
$$ plain form
36938 1703582 1362580 439647 828705 2029755 1869384 642121 557201 1398396 962633
36929 962633 -395110 -96911 1807802 2644995 2050777 2290084 3488103 3356801 2058459
36920 2058459 2406054 4534765 5260197 3635775 2371586 2723372 2687136 1418444 878391
36911 878391 1852561 2608657 2542895 3007284 3799721 3116938 1516520 1477925 2688113 2456298
36901 2456298 991802 1180373 2895541 2968427 1195199 739650 2085533 2415169 1508918
36892 1508918 2128835 3898815 3259430 405731 -377633 1605326 2266251 460438 -149388
36883 -149388 1521204 1959400 257146 54379 2222878 2905719 1043376 472306 2271594
36874 2271594 2624282 690205 717218 3648706 4710282 2301660 1115694 3287916 4764103
$$ packed form
36938A703582l41002r22933L89058J201050j60371j227263q4920Q41195m35763
36929I62633j357743K98199J904713Q37193n94218K39307J198019j31302j298342
36920B058459L47595K128711P25432j624422j264189L51786l6236j268692n40053
36911H78391R74170P56096o5762M64389P92437o82783j600418l8595J210188k31815
36901B456298j464496J88571J715168P2886j773228m55549J345883L29636r06251
36892A508918O19917J769980o39385k853699p83364J982959O60925j805813o09826
36883a49388J670592M38196j702254k02767K168499O82841j862343n71070J799288
36874B271594L52688j934077K7013K931488J061576k408622j185966K172222J476187
$$ plain form
36865 4764103 3689213 3786817 5995700 5730352 2159060 929772 3719894 4726917 1762823
36856 1762823 635018 3769268 5161379 2044054 596520 4028472 6198383 3626642
36848 3626642 2307574 5509544 6841718 3189633 1961927 6935225 10045608 6661935
36840 6661935 5123858 10588370 14210198 10421269 9273116 17678491 24929054 22984147
36832 22984147 23528560 35847736 46795500 46135999 51457481 77990582 104860214 112734617
36824 112734617 138376377 234300298 370335322 435268569 364235998 220456964 116011340
36817 116011340 86016154 81837675 62310275 38728250 32419498 35585261 31067900
36810 31067900 21523137 18977792 21891745 20287154 14486693 13234042 17245814 18215078
$$ packed form
36865D764103j074890R7604K208883k65348l571292j229288K790122J007023k964094
36856A762823j127805L134250J392111l117325j447534L431952K169911k571741
36848C626642j319068L201970J332174l652085j227706M973298L110383l383673
36840F661935j538077N464512L621828l788929j148153Q405375P250563j944907
36832B2984147N44413J2319176J0947764o59501N321482K6533101K6869632P874403
36824A12734617K5641760R5923921J36035024O4933247p1032571j43779034j04445624
36817A16011340k9995186m178479j9527400k3582025o308752L165763m517361
36810C1067900r544763k545345K913953j604591n800461j252651M011772R69264
$$ plain form
36802 18215078 14054502 13028856 19205221 24603918 23089462 22575764 31921727 43523976
36794 43523976 45592186 46584231 64395559 91776640 104280014 113052500 170285119 289397668
36786 289397668 390854679 378138128 258017210 134967570 84147918 80772973 68137685
36779 68137685 41441990 29629387 34032781 31194387 17876834 12055315 16765986 17000390
36771 17000390 9477397 6492142 10761475 11630675 7000705 6658866 12291989 14375239
36763 14375239 10941312 10945448 16696833 20308570 20241523 24680543 34820894 40268271 35577421
36754 35577421 27719957 22831416 18283907 12233941 8927447 9641379 9035025 5035992
36746 5035992 2644720 4081967 4711104 2433886 1694500 4284908 5316620 2454944
$$ packed form
36802A8215078m160576j025646O176365N398697j514456n13698R345963J1602249
36794D3523976K068210R92045J7811328K7381081J2503374Q772486N7232619J19112549
36786B89397668J01457011j2716551j20120918j23049640n0819652l374945j2635288
36779F8137685k6695695j1812603M403394k838394j3317553n821519M710671K34404
36771A7000390p522993k985255M269333Q69200m629970l41839N633123K083250
36763A4375239l433927M136N751385L611737o7047M439020J0140351N447377m690850
36754C5577421p857464m888541m547509o049966l306494P13932o06354l999033
36746E035992k391272J437247O29137k277218p39386K590408J031712k861676
$$ plain form
36738 2454944 507499 2552075 4596461 3375190 1877007 2812532 3659138 2441633
36730 2441633 1863625 3619796 4759228 3524204 2908603 4821216 6492882 6180610 6744541
36721 6744541 10014463 13144208 14228607 16258643 21611980 27272442 29231737 27576952
36713 27576952 24144425 19285795 13893572 10538947 9695505 8546737 5880092 4217820
36705 4217820 4942453 5580325 4312112 3000187 3283207 3710474 3178493 3245602 4609747
36696 4609747 5125795 3682246 2339683 2441641 2358760 1177851 729289 1756763 1969238
36687 1969238 203314 -1255928 -785574 -126819 -732669 -1144427 -304043 201178 -485573
36678 -485573 -520720 926709 1660695 521787 -215723 1019102 2217986 1649685 977351
$$ packed form
36738B454944j947445K044576K044386j221271j498183R35525Q46606j217505
36730B441633n78008J756171J139432j235024o15601J912613J671666l12272N63931
36721F744541L269922L129745J084399K030036N353337N660462J959295j654785
36713B7576952l432527m858630n392223l354625q43442j148768k666645j662272
36705D217820P24633O37872j268213j311925K83020M27267n31981O7109J364145
36696D609747N16048j443549j342563J01958q2881j180909m48562J027474K12475
36687A969238j765924j459242M70354O58755o05850m11758Q40384N05221o86751
36678d85573l5147J447429P33986j138908p37510J234825J198884n68301o72334
$$ plain form
36669 977351 1762726 2373462 1342648 513115 1717931 3301372 3041340 1842593 1560018
36660 1560018 1695693 1129429 701331 1272082 1508337 279920 -936983 -578125 275229
36651 275229 93662 -380335 25310 559256 352995 362230 1236069 1527004 324674 -642785
36641 -642785 93310 1061841 516797 -513599 -405159 52547 -485853 -1103339 -419314
36632 -419314 607924 370413 -540183 -727122 -630532 -1271308 -1900777 -1391165 -543373 -621415
36622 -621415 -969196 -387151 503618 539667 284156 782724 1407674 1159092 767029 1264158
36612 1264158 1789721 1103557 56896 246471 1296714 1722400 1493166 1561944 1767521
36603 1767521 1323342 586325 397013 466370 189821 119379 857628 1515690 1099253 394466
$$ packed form
36669I77351P85375O10736j030814q29533J204816J583441k60032j198747k82575
36660A560018J35675n66264m28098N70751K36255j228417j216903L58858Q53354
36651B75229j81567m73997M05645N33946k06261R235Q73839K90935j202330r67459
36641f42785P36095R68531n45044j030396J08440M57706n38400o17486O84025
36632d19314J027238k37511r10596j86939R6590o40776o29469N09612Q47792p8042
36622f21415l47781N82045Q90769L6049k55511M98568O24950k48582l92063M97129
36612A264158N25563o86164j046661J89575J050243M25686k29234O8778K05577
36603A767521m44179p37017j89312O9357k76549p0442P38249O58062m16437p04787
$$ plain form
36593 394466 603481 1144409 783800 -1879 130465 958484 1164895 675143 572974 1070342
36583 1070342 1345176 1159297 1101739 1397971 1692939 1745262 1405425 440170 -784487 -1227293
36573 -1227293 -635897 -143213 -514872 -915709 -434217 360858 553083 418714 612955
36564 612955 892951 841726 810749 1025317 873848 178356 -52430 722909 1444400 1142260
36554 1142260 451892 250717 175542 -231532 -340976 227616 517308 -94327 -574342 -51223
36544 -51223 539547 200925 -241029 288575 1099348 1097317 785832 1058494 1341565 871136
36534 871136 518274 1297607 2243263 1856901 602527 -86893 -213537 -536877 -593361 346786
36524 346786 1298916 878543 -184008 -157962 759137 969543 322809 31651 200368 -124459
$$ packed form
36593C94466K09015N40928l60609p85679J32344Q28019K06411m89752j02169M97368
36583A070342K74834j85879n7558K96232K94968N2323l39837r65255j224657m42806
36573a227293N91396M92684l71659m00837M81492P95075J92225j34369J94241
36564F12955K79996n1225l0977K14568j51469o95492k30786P75339P21491l02140
36554A142260o90368k01175p5175m07074j09444N68592K89692o11635m80015N23119
36544e1223N90770l38622m41954N29604Q10773k031l11485K72662K83071m70429
36534H71136l52862P79333R45656l86362j254374o89420j26644l23340n6484R40147
36524C46786R52130m20373j062551K6046R17099K10406o46734k91158J68717l24827
$$ plain form
36514 -124459 -699017 -292453 903111 1362960 803221 504309 927418 1100983 624305
36505 624305 277535 284395 -147236 -1102555 -1507340 -919506 -262020 -278087 -597657 -750186
36495 -750186 -853766 -932632 -692556 -257386 -82613 -12700 493321 1164405 1126037 378416
36485 378416 -124047 17977 226696 160811 186304 438887 509020 297678 213147 329963
36475 329963 265922 28521 93235 533477 920365 1129741 1389407 1521476 1057684 176821
36465 176821 -360466 -327179 -273223 -542621 -790473 -606773 -8505 738936 1273882 1211381
36455 1211381 597460 109963 263058 670531 668964 328263 185305 318165 392496 323907
36445 323907 218035 -33478 -468980 -745979 -704599 -750092 -1067216 -1095530 -517214 -33753
$$ packed form
36514a24459n74558M06564J195564M59849n59739k98912M23109J73565m76678
36505F24305l46770O860m31631r55319m04785N87834O57486j6067l19570j52529
36495g50186j03580p8866K40076M35170J74773O9913N06021O71084l8368p47621
36485C78416n02463J42024K08719o5885K5493K52583P0133k11342q4531J16816
36475C29963o4041k37401O4714M40242L86888K09376K59666J32069m63792q80863
36465A76821n37287L3287N3956k69398k47852J83700N98268P47441N34946o2501
36455A211381o13921m87497J53095M07473j567l40701j42958J32860P4331o8589
36445C23907j05872k51513m35502k76999M1380m5493l17124k8314N78316M83461
$$ plain form
36435 -33753 -251936 -538199 -69710 652415 592074 -55711 -239012 151433 217092 -351281
36425 -351281 -871341 -869835 -604376 -353463 -98792 110128 250954 609009 1219584 1394569
36415 1394569 669726 -210449 -258491 229109 229416 -297066 -486262 -110161 230523 328244
36405 328244 542019 792537 599492 161751 237477 850237 1212832 1053085 945101 1177427
36395 1177427 1340149 1230145 1156293 1103710 567519 -455440 -1169466 -1036564 -431873 39000
36385 39000 240661 297759 283863 331526 543412 675759 396522 -109353 -301066 -37871
36375 -37871 340365 623651 861733 955893 728221 381734 320369 512667 548956 290733
36365 290733 -36387 -322775 -632762 -833046 -643767 -53284 654648 1188724 1331459 1013952
$$ packed form
36435c3753k18183k86263M68489P22125o0341o47785j83301L90445O5659n68373
36425c51281n20060J506K65459K50913K54671K08920J40826L58055O10575J74985
36415A394569p24843q80175m8042M87600L07n26482j89196L76101L40684R7721
36405C28244K13775K50518j93045m37741P5726O12760L62595j59747j07984K32326
36395A177427J62722j10004p3852n2583n36191j022959p14026J32902O04691M70873
36385C9000K01661N7098j3896M7663K11886J32347k79237n05875j91713K63195
36375c7871L78236K83286K38082R4160k27672l46487o1365J92298L6289k58223
36365B90733l27120k86388l09987k00284J89279N90483P07932N34076J42735l17507
$$ plain form
36355 1013952 567340 499666 749052 705953 292356 254043 869750 1271888 847582 411279
36345 411279 895233 1660140 1455228 508518 155214 634462 801711 110684 -561399 -419140
36335 -419140 126683 326206 140407 -68665 -177697 -214124 -179136 -219519 -469519 -610365
36325 -610365 -184119 556899 789573 283562 -247533 -214995 62701 4303 -343401 -496031
36315 -496031 -245596 237924 778740 1266716 1469406 1154323 465337 -81450 -139173 78841
36305 78841 153304 78267 167538 370645 228885 -286286 -516611 -124306 283373 148508
36295 148508 -78777 215438 677336 724075 760575 1413323 2168734 2238230 2183132 2976518
36285 2976518 4078544 4520809 5251185 7715563 10619699 11726796 13086004 19809600
$$ packed form
36355A013952m46612o7674K49386m3099m13597l8313O15707M02138m24306m36303
36345D11279M83954P64907k04912r46710l53304M79248J67249o91027o72083J42259
36335d19140N45823J99523j85799k09072j09032l6427L4988m0383k50000j40846
36325f10365M26246P41018K32674n06011n31095L2538K77696n8398l47704j52630
36315d96031K50435M83520N40816M87976K02690l15083o88986n46787n7723K18014
36305G8841P4463p5037Q9271K03107j41760n15171k30325L92305M07679j34865
36295A48508k27285K94215M61898M6739L6500O52748P55411O9496n5098P93386
36285B976518J102026M42265P30376K464378K904136J107097J359208O723596
$$ plain form
36277 19809600 31516111 39343331 35480395 23085396 12517845 9237759 9752552 8940221
36269 8940221 6664365 5738459 6795269 7833091 7803991 8720789 13561865 22025365 28898761
36260 28898761 28254587 20003861 10608022 5992833 5565482 5066095 3165610 2013802
36252 2013802 2461939 2616792 1396231 242577 382323 944145 859780 564045 729131
36243 729131 970155 789985 490247 388992 275224 146542 373851 798996 799402 450744
36233 450744 449930 795610 815383 527907 586577 849488 522949 -188292 -183985 582604 883738
36222 883738 249271 -368341 -327106 -143188 -197458 -109278 155903 23567 -406615 -269315
36212 -269315 449864 693520 176952 -81939 393634 718086 309243 -132119 -48812 -5698
$$ packed form
36277A9809600J1706511P827220l862936j2394999j0567551l280086N14793q12331
36269H940221k275856r25906J056810J037822k9100R16798M841076Q463500O873396
36260B8898761o44174q250726r395839m615189m27351m99387j900485j151808
36252B013802M48137J54853j220561j153654J39746N61822q4365k95735J65086
36243G29131K41024j80170k99738j01255j13768j28682K27309M25145M06l48658
36233D50744q14L45680J9773k87476N8670K62911l26539p11241M307P66589L01134
36222H83738o34467o17612M1235J83918n4270Q8180K65181j32336m30182J37300
36212b69315P19179K43656n16568k58891M75573L24452m08843m41362Q3307M3114
$$ plain form
36202 -5698 -428802 -689319 -312176 71943 -188014 -771909 -1197622 -1595401 -2025112 -2045753
36192 -2045753 -1581277 -1228740 -1197204 -983590 -527509 -492316 -919769 -901179 -178832 249229
36182 249229 -168548 -529908 310 860065 1161583 1019448 948053 906846 732698 602812
36172 602812 409750 -331315 -1364354 -1617267 -873416 -271734 -425236 -417596 403773 1054078
36162 1054078 541452 -392900 -554809 -250756 -455894 -884990 -518286 456290 789390
36153 789390 77928 -786527 -1038783 -823850 -542324 -323206 -238994 -369853 -575825 -631882
36143 -631882 -522074 -314844 7308 338412 436998 371389 523226 912259 1064838 792266
36133 792266 456299 208650 -256173 -843813 -843642 -113905 364985 -167074 -1058347 -1172512
$$ packed form
36202e698m23104k60517L77143L84119k59957n83895m25713l97779m29711k0641
36192b045753M64476L52537L1536K13614M56081L5193m27453J8590P22347M28061
36182B49229m17777l61360N30218Q59755L01518j42135p1395m1207j74148j29886
36172F02812j93062p41065j033039k52913P43851O01682j53502P640Q21369O50305
36162A054078n12626r34352j61909L04053k05138m29096L66704R74576L33100
36153G89390p11462q64455k52256K14933K81526K19118Q4212j30859k05972n6057
36143f31882J09808K07230L22152L31104R8586o5609J51837L89033J52579k72572
36133G92266l35967k47649m64823n87640J71P29737M78890n32059q91273j14165
$$ plain form
36123 -1172512 -465976 130150 33636 -455939 -716593 -414049 253290 651135 319215 -415122
36113 -415122 -832933 -800476 -745563 -738630 -450431 -38854 -51725 -284790 144598 1274564
36103 1274564 2007012 1777585 1343815 1351893 1327546 831324 440228 635092 736874 19346
36093 19346 -944228 -1133641 -631312 -279068 -313755 -341971 -263096 -268616 -189443 325507 1116234
36082 1116234 1600074 1424061 685191 -187776 -516791 153180 1338934 1920193 1477450
36073 1477450 747733 473255 511018 437226 267108 118484 -136464 -442223 -449073 -189826
36063 -189826 -161065 -445148 -553392 -373863 -313533 -260364 418975 1463003 1619553 582439
36053 582439 -295762 -14193 645261 628190 273995 334122 464040 -7255 -696486 -828974
$$ packed form
36123a172512P06536N96126r6514m89575k60654L02544O67339L97845l31920p34337
36113d15122m17811L2457N4913O933K88199M11577j2871k33065M29388J129966
36103A274564P32448k29427m33770Q078k4347m96222l91096J94864J01782p17528
36093A9346r63574j89413N02329L52244l4687k8216P8875n520P9173N14950P90727
36082A116234M83840j76013p38870q72967l29015O69971J185754N81259m42743
36073A477450p29717k74478L7763p3792j70118j48624k54948l05759o850K59247
36063a89826K8761k84083j08244J79529O0330N3169O79339J044028J56550j037114
36053E82439q78201K81569O59454j7071l54195O0127J29918m71295o89231j32488
$$ plain form
36043 -828974 -552586 -420324 -261687 287653 797420 707547 353016 258800 87319 -608211
36033 -608211 -1270686 -1160967 -665150 -581869 -704370 -363345 166374 125593 -289581 -272694
36023 -272694 116014 105289 -354982 -536448 -204760 142365 237697 292087 396766 524523
36013 524523 901751 1557550 1842452 1277044 483601 324296 552786 384297 -33455 54791
36003 54791 522242 494668 -144076 -625277 -651624 -675536 -765521 -401065 370177 663938
35993 663938 26732 -886527 -1264258 -1074562 -746879 -512083 -358734 -230854 -68377 103230
35983 103230 144010 74288 148272 374035 339033 -98303 -406469 -168460 227633 273422
35973 273422 189660 403635 695394 638641 409338 334920 124107 -543941 -1111280 -829424
$$ packed form
36043h28974K76388J32262J58637N49340N09767q9873l54531r4216j71481o95530
36033f08211o62475J09719M95817Q3281j22501L41025N29719m0781m15174J6887
36023b72694L88708j0725m60271j81466L31688L47125R5332N4390J04679J27757
36013E24523L77228O55799K84902n65408p93443j59305K28490j68489m17752Q8246
36003E4791M67451k7574o38744m81201k6347k3912q9985L64456P71242K93761
35993F63938o37206r13259l77731J89696L27683K34796J53349J27880J62477J71607
35983A03230M0780o9722P3984K25763l5002m37336l08166K38009L96093M5789
35973B73422q3762K13975K91759n6753k29303p4418k10813o68048n67339K81856
$$ plain form
35963 -829424 -23321 339661 80572 -182596 -216516 -331256 -507301 -376763 -17813 148159
35953 148159 172592 406451 633584 321524 -331652 -559816 -238275 -1036 -105214 -99593
35943 -99593 235571 462666 216428 -319780 -830759 -1187008 -1279793 -1090718 -931066 -1079230
35933 -1079230 -1245147 -951822 -350508 -67945 -320683 -733321 -941057 -872233 -598757 -390021
35923 -390021 -656804 -1323771 -1593396 -926988 94898 526268 282533 -71037 -325137
35914 -325137 -612639 -757795 -507814 -160250 -167205 -373846 -380912 -311147 -447505 -528920 -247685
35903 -247685 7062 -176589 -306645 219949 871809 725014 80524 43865 699910 1022552
35893 1022552 557239 -50698 -256434 -210616 -91646 119615 182383 -105129 -236627 350720
$$ packed form
35963h29424Q06103L62982k59089k63168l3920j14740j76045J30538L58950J65972
35953A48159K4433K33859K27133l12060o53176k28164L21541K37239j04178N621
35943i9593L35164K27095k46238n36208n10979l56249r2785J89075J59652j48164
35933a079230j65917K93325O01314K82563k52738m12638k07736O8824K73476K08736
35923c90021k66783o66967k69625O66408J021886M31370k43735l53570k54100
35914c25137k87502j45156K49981L47564o955k06641p066O9765j36358q1415K81235
35903b47685K54747j83651j30056N26594O51860j46795o44490l6659O56045L22642
35893A022552m65313o07937k05736M5818J18970K11261O2768k87512j31498N87347
$$ plain form
35883 350720 1124338 1096469 449563 258710 694843 872511 495505 218417 226082 -82732
35873 -82732 -699959 -739359 -11812 471097 98231 -477084 -623809 -673827 -954508 -1034006
35863 -1034006 -644776 -333477 -467568 -533748 -141978 170864 -101056 -490544 -369385 -2592
35853 -2592 789 -288684 -401479 -307388 -287696 -340741 -304578 -264663 -358398 -455783 -416395 -386521
35841 -386521 -545657 -833405 -1126175 -1383862 -1508456 -1396689 -1171832 -991217 -690747 -85905
35831 -85905 512068 668100 560688 674572 930165 895782 680069 702222 729593 187433
35821 187433 -650616 -914845 -572711 -395988 -459561 -48832 742349 830638 13507 -474477
35811 -474477 57466 656191 450471 95389 422198 875687 562032 -128820 -280259 -59857
$$ packed form
35883C50720P73618k7869o46906j90853M36133J77668l77006k77088P665l08814
35873h2732o17227l9400P27547M82909l72866n75315j46725n0018k80681p9498
35863a034006L89230L11299j34091o6180L91770L12842k71920l89488J21159L66793
35853b592L381k89473j12795R4091J9692n3045L6163L9915r3735r7385L9388K9874
35841c86521j59136k87748k92770k57687j24594J11767K24857J80615L00470O04842
35831h5905N97973J56032j07412J13884K55593l4383k15713K2153K7371n42160
35821A87433q38049k64229L42134J76723o3573M10729P91181Q8289q17131m87984
35811d74477N31943N98725k05720l55082L26809M53489l13655o90852j51439K20402
$$ plain form
35801 -59857 -220108 -563056 -278846 511368 859286 529008 266805 482193 673947 370488
35791 370488 -152451 -367601 -183041 79833 82500 -227401 -521248 -401181 36891 219985
35781 219985 -103647 -445516 -279563 203191 449213 341875 208554 256706 416513 598833
35771 598833 775468 891754 892218 730794 341136 -155306 -299944 171675 694461 420307
35761 420307 -522638 -1067427 -713010 -174963 -167960 -380646 -227675 140958 298470 383716
35751 383716 690269 892727 519493 -118518 -291386 22491 127695 -303072 -787064 -752904
35741 -752904 -220216 342073 505890 164503 -457012 -1018725 -1340639 -1391855 -1100992 -502712
35731 -502712 -30664 -152202 -604023 -571904 128728 662023 343791 -378671 -645558 -396867
$$ packed form
35801e9857j60251l42948K84210P90214L47918l30278k62203K15388J91754l03459
35791C70488n22939k15150J84560K62874K667l09901k93847J20067M38072J83094
35781B19985l23632l41869J65953M82754K46022j07338j33321M8152J59807J82320
35771E98833J76635J16286M64j61424l89658m96442j44638M71619N22786k74154
35761D20307r42945n44789L54417N38047P003k12686J52971L68633J57512Q5246
35751C83716L06553K02458l73234o38011j72868L13877J05204m30767m83992L4160
35741g52904N32688N62289J63817l41387o21515n61713l21914n1216K90863N98280
35731e02712M72048j21538m51821L2119P00632N33295l18232p22462k66887K48691
$$ plain form
35721 -396867 -229104 -367201 -465555 -331443 -250772 -507470 -942413 -1096895 -657663 210195
35711 210195 909523 928139 368881 -193017 -343856 -68029 516014 1179206 1399420 791653
35701 791653 -173259 -538319 -144351 152023 -170967 -511352 -207576 335561 306873 -246474
35691 -246474 -610810 -550267 -481715 -647625 -831204 -907210 -1068014 -1367572 -1482658 -1111284
35681 -1111284 -361393 367385 741683 709369 488902 366501 442623 592059 670410 674461
35671 674461 691093 760526 766995 454344 -265909 -961567 -990801 -398986 -77695 -613712
35661 -613712 -1413270 -1548662 -1051636 -612342 -381281 -50917 108099 -524503 -1583535
35652 -1583535 -1790566 -712554 548610 851570 318118 -299721 -688696 -852554 -663657
$$ packed form
35721c96867J67763j38097r8354J34112Q0671k56698m34943j54482M39232Q67858
35711B10195O99328J8616n59258n61898j50839K75827N84043O63192K20214o07767
35701G91653r64912l65060L93968K96374l22990l40385L03776N43137k8688n53347
35691b46474l64336O0543O8552j65910j83579p6006j60804k99558j15086L71374
35681a111284P49891P28778L74298l2314k20467j22401P6122J49436P8351M051
35671F74461J6632O9433O469l12651p20253o95658k9234N91815L21291n36017
35661f13712p99558j35392M97026M39294K31061L30364J59016o32602j059032
35652a583535k07031J078012J261164L02960n33452o17839l88975j63858J88897
$$ plain form
35643 -663657 -163763 211220 214604 171398 437144 917540 1335349 1463444 1016095 -378
35633 -378 -781709 -467923 479495 692657 -72305 -531800 60979 778335 681932 310417
35623 310417 448631 569024 -161978 -1169106 -1213361 -356015 202739 -12968 -331250 -285694
35613 -285694 -206881 -342806 -385997 -146639 36496 -145247 -480898 -548062 -249152 92173
35603 92173 109767 -91651 75208 852827 1484871 1053845 -98916 -702364 -403342 -179585
35593 -179585 -587622 -861487 -405187 78229 -104988 -338220 160366 886863 1012221 914140
35583 914140 1352638 1864308 1515360 706642 620503 1210679 1355068 827424 483472 491795
35573 491795 41415 -943531 -1385290 -828521 -215886 -258617 -309323 324358 1001150 679383
$$ packed form
35643f63657M99894L74983L384m3206K65746M80396M17809J28095m47349j016473
35633c78p81331L13786R47418K13162p64962m59495N92779P17356r6403l71515
35623C10417J38214J20393p31002j007128m4255Q57346N58754k15707l18282M5556
35613b85694P8813j35925m3191K39358J83135j81743l35651o7164K98910L41325
35603I2173J7594k01418J66859P77619O32044m31026j152761o03448K99022K23757
35593a79585m08037k73865M56300M83416j83217k33232M98586P26497J25358r8081
35583I14140M38498N11670l48948q08718q6139N90176J44389n27644l43952Q323
35573D91795m50380r84946m41759N56769O12635m2731n0706O33681O76792l21767
$$ plain form
35563 679383 -432426 -1108895 -690681 288088 936304 955397 723264 680620 748930 484902
35553 484902 -135859 -463619 -57117 557637 577202 68532 -254628 -171908 -88432 -152822
35543 -152822 -92256 57458 -101978 -522181 -626679 -244704 86418 -4912 -213836 -211677
35533 -211677 -201874 -466899 -839407 -981668 -848342 -590381 -268966 118018 511807 805565
35523 805565 862505 592923 184570 56881 320205 550032 444441 354599 678855 1100783
35513 1100783 1059864 666721 443354 429638 326896 273815 584580 892599 552537 -151988
35503 -151988 -248309 390517 806540 472695 8125 27925 276781 391177 596851 1028065
35493 1028065 1141048 510511 -378612 -781635 -646949 -356568 -19519 375536 554862
$$ packed form
35563F79383j111809o76469M18214R78769O48216J9093k32133m2644O8310k64028
35553D84902o20761l27760M06502O14754J9565n08670l23160Q2720Q3476o4390
35543a52822O0566J49714j59436m20203j04498L81975L31122r1330k08924K159
35533b11677R803k65025l72508j42261J33326K57961L21415L86984L93789K93758
35523H05565N6940k69582m08353j27689K63324K29827j05591q9842L24256M21928
35513A100783m0919l93143k23367j3716j02742n3081L10765L08019l40062p04525
35503a51988r6321O38826M16023l33845m64570J9800K48856J14396K05674M31214
35493A028065J12983o30537q89123m03023J34686K90381L37049L95055J79326
$$ plain form
35484 554862 340830 86943 148651 260807 38823 -234719 -15204 529433 678598 238019
35474 238019 -226374 -299426 -225155 -306399 -351083 -66110 371311 538782 375271 198742
35464 198742 203720 287002 376805 581789 875237 935537 555381 6862 -286361 -280267 -194082
35453 -194082 -30813 342222 718459 692786 323034 109797 201475 189105 -129844 -412017
35443 -412017 -469159 -631438 -996767 -1017658 -435687 11678 -416946 -1271737 -1557143 -1190236
35433 -1190236 -895628 -895035 -694787 -143886 249908 218333 137995 297791 438369 301158
35423 301158 77289 13115 2909 -149066 -373495 -455881 -303035 9070 286603 322565
35413 322565 106784 -155421 -355270 -584983 -788833 -691917 -318488 -92399 -69292 325969
$$ packed form
35484E54862k14032k53887O1708J12156k21984k73542K19515N44637J49165m40579
35474B38019m64393p3052P4271q1244m4684K84973M37421J67471j63511j76529
35464A98742M978Q3282Q9803K04984K93448O0300l80156n48519k93223O094Q6185
35453a94082J63269L73035L76237k5673l69752k13237R1678j2370l18949k82173
35443d12017n7142j62279l65329k0891N81971M47365m28624q54791k85406L66907
35433a190236K94608N93K00248N50901L93794l1575q0338J59796J40578j37211
35423C01158k23869o4174j0206j51975k24429q2386J52846L12105K77533L5962
35413C22565k15781k62205j99849k29713k03850R6916L73429K26089K3107L95261
$$ plain form
35403 325969 1256806 1834633 1315291 358833 115271 498523 495481 -76947 -349107 97521
35393 97521 677445 887837 886396 799846 473298 141434 351736 920338 933002 151996
35383 151996 -510110 -354803 146026 259877 51383 -36422 34370 113564 293123 580869
35373 580869 620633 204050 -346829 -645843 -655393 -404110 142375 669131 609226 -5841
35363 -5841 -414103 -197040 153160 123429 -46477 32218 165313 23083 -222295 -286198
35353 -286198 -326864 -552471 -706223 -491297 -113709 118272 337977 734997 1019753 846587
35343 846587 446877 274296 291575 157268 -113510 -216062 -106826 15714 150485 455138
35333 455138 849289 1046943 942497 679267 395456 107559 -236166 -685015 -1107958 -1091313
$$ packed form
35403C25969R30837N77827n19342r56458k43562L83252l042n72428k72160M46628
35393I7521N79924K10392j441q6550l26548l31864K10302N68602J2664p81006
35383A51996o62106J55307N00829J13851k08494q7805P0792P9194J79559K87746
35373E80869L9764m16583n50879k99014r550K51283N46485N26756n9905o15067
35363e841m08262K17063L50200k9731j69906P8695J33095j42230k45378o3903
35353b86198m0666k25607j53752K14926L77588K31981K19705L97020K84756j73166
35343H46587l99710j72581J7279j34307k70778j02552J09236J22540J34771L04653
35333D55138L94151J97654j04446k63230k83811k87897l43725m48849m22943J6645
$$ plain form
35323 -1091313 -357789 674896 1208997 1042882 714615 543645 194465 -513955 -1081561
35314 -1081561 -1103251 -936590 -999355 -980618 -468689 124617 120576 -246744 -114004 615530
35304 615530 1012183 418804 -649258 -1173323 -775902 36047 497692 282500 -279164
35295 -279164 -593150 -438796 -107546 116539 297913 491124 445902 68680 -154493 246835
35285 246835 876475 827695 -79938 -973036 -1013634 -380494 115532 102269 -23313 233080
35275 233080 766601 1002828 631599 8857 -277553 -108388 106425 15130 -285136 -485579
35265 -485579 -448535 -250970 -41694 36022 -61123 -171642 -62780 273424 601574 740399
35255 740399 710673 594632 463925 444750 599780 715775 466429 -159569 -819274 -1225566
$$ packed form
35323a091313P33524J032685N34101j66115l28267j70970l49180p08420n67606
35314a081561k1690J66661o2765J8737N11929N93306m041l67320J32740P29534
35304F15530L96653n93379j068062n24065L97421Q11949M61645k15192n61664
35295b79164l13986J54354L31250K24085J81374J93211m5222l77222k23173M01328
35285B46835O29640m8780r07633q93098m0598O33140M96026j3263j25582K56393
35275B33080N33521K36227l71229o22742k86410J69165K14813r1295l00266k00443
35265d85579L7044J97565K09276P7716r7145j10519J08862L36204L28150J38825
35255G40399k9726j16041j30707j9175J55030J15995k49346o25998o59705m06292
$$ plain form
35245 -1225566 -1360748 -1285165 -1009611 -589282 -111759 388068 775906 717032 93481 -581534
35235 -581534 -617884 -1266 629727 817600 631175 235832 -300254 -725771 -735233 -519942
35225 -519942 -630995 -1126883 -1414490 -1144512 -709507 -582866 -680507 -700430 -647023 -668507
35215 -668507 -717426 -681240 -600655 -564316 -611252 -788813 -1015032 -938401 -358432 295794 452803
35204 452803 288781 456406 950661 1064473 605368 289647 611772 1105597 1133076 740012
35194 740012 338645 136554 205264 525989 720437 383895 -134773 -69156 470834 508194
35184 508194 -193778 -632017 -184080 398224 339132 107492 417805 903343 827003 355420
35174 355420 77527 -91652 -486104 -764852 -475649 -35213 -104578 -435743 -347683 89793
$$ packed form
35245a225566j35182P5583K75554M20329M77523M99827L87838n8874o23551o75015
35235e81534l6350O16618O30993J87873j86425l95343n36086m25517r462K15291
35225e19942j11053m95888k87607K69978M35005J26641r7641j9923N3407k1484
35215f68507m8919L6186Q0585L6339m6936j77561k26219P6631N79969O54226J57009
35204D52803j64022J67625M94255J13812m59105l15721L22125M93825K7479l93064
35194G40012m01367k02091O8710L20725J94448l36542n18668O5617N39990L7360
35184E08194p01972m38239M47937N82304n9092k31640L10313M85538p6340m71583
35174C55420k77893j69179l94452k78748K89203M40436o9365l31165Q8060M37476
$$ plain form
35164 89793 342601 413799 532188 350283 -398326 -913997 -293935 851913 1091902 283889
35154 283889 -359102 -220973 93182 142446 262882 543443 482595 44055 -101811 202075
35144 202075 231608 -309645 -660356 -242446 386205 429929 -61120 -574401 -904450 -984121
35134 -984121 -593762 170283 654748 424968 -121563 -346873 -187799 -22714 -115559 -495577
35124 -495577 -990116 -1135645 -521487 527199 1109247 865011 424613 451114 783792 902122
35114 902122 718570 459015 177929 -152381 -394492 -474726 -569964 -766351 -870430 -835488
35104 -835488 -953541 -1270243 -1255109 -542579 340983 546623 21710 -450019 -272289 319762
35094 319762 672037 475476 40476 -78461 270167 577931 236544 -633152 -1197378 -879706
$$ packed form
35164H9793K52808P1198J18389j81905p48609n15671O20062J145848K39989q08013
35154B83889o42991J38129L14155M9264J20436K80561o0848m38540j45866L03886
35144B02075K9533n41253l50711M17910O28651M3724m91049n13281l30049p9671
35134i84121L90359P64045M84465k29780n46531k25310J59074J65085r2845l80018
35124d95577m94539j45529O14158J048686N82048k44236m40398K6501L32678J18330
35114I02122j83552k59555k81086l30310k42111q0234r5238j96387j04079L4942
35104h35488j18053l16702J5134P12530Q83562K05640n24913m71729J77730N92051
35094C19762L52275j96561m35000j18937L48628L07764l41387q69696n64226L17672
$$ plain form
35084 -879706 -47020 456379 247393 -300260 -525080 -94731 699219 1174881 941860 359286
35074 359286 82366 187783 136434 -328629 -713343 -447020 338392 992515 1034085 415461
35064 415461 -570478 -1321243 -1174250 -90985 1042562 1245017 561335 -12128 250754
35055 250754 1029562 1520338 1409691 990438 537629 18703 -532049 -774318 -489751 -5807
35045 -5807 178809 76691 117511 415585 602538 459059 210128 19531 -281336 -685472
35035 -685472 -791115 -510300 -451445 -1014736 -1574768 -1286685 -376593 162236 -38137 -452364
35025 -452364 -694916 -942941 -1218581 -1072412 -291076 675520 1278274 1400421 1155906 646562
35015 646562 107882 -147792 -103189 18449 198378 532733 723279 309362 -488652 -847206
$$ packed form
35084h79706Q32686N03399k08986n47653k24820M30349P93950M75662k33021n82574
35074C59286k76920J05417n1349m65063l84714K66323P85412O54123M1570o18624
35064D15461r85939p50765J46993J083265J133547K02455o83682n73463K62882
35055B50754P78808M90776j10647m19253m52809n18926n50752k42269K84567M83944
35045e807J84616j02118M0820K98074J86953j43479k48931j90597l00867m04136
35035f85472j05643K80815N8855n63291n60032K88083R10092N38829k00373m14227
35025d52364k42552k48025k75640J46169P81336R66596O02754J22147k44515n09344
35015F46562n38680k55674M4603J21638J79929L34355J90546m13917p98014l58554
$$ plain form
35005 -847206 -479334 -36797 -91922 -366733 -350649 -108099 -44840 -330764 -908554 -1616127
34995 -1616127 -1995555 -1519232 -383164 445968 371590 -159896 -501937 -698018 -1007618
34986 -1007618 -1165020 -814315 -229138 111394 297118 646215 948035 800410 420820
34977 420820 332919 447735 265793 -137641 -173281 242205 563288 576495 652157 875493
34967 875493 759857 135580 -428070 -488117 -342236 -324484 -137789 508377 1126450 1047567
34957 1047567 467379 155628 279808 254085 -225514 -691165 -646441 -237341 121076 361681
34947 361681 644622 905055 905829 612341 211356 -158410 -439688 -518033 -339017 -111467
34937 -111467 -82588 -110574 191355 789649 1075308 634458 -85914 -250537 309884 883492
$$ packed form
35005h47206L67872M42537n5125k74811J6084K42550O3259k85924n77790p07573
34995a616127l79428M76323J136068Q29132p4378n31486l42041j96081l09600
34986a007618j57402L50705N85177L40532J85724L49097L01820j47625l79590
34977D20820q7901J14816j81942m03434l5640M15486L21083J3207P5662K23336
34967H75493j15636o24277n63650o0047J45881J7752J86695O46166O18073p8883
34957A047567n80188l11751J24180k5723m79599m65651M4724M09100L58417K40605
34947C61681K82941K60433P74k93488m00985l69766k81278p8345J79016K27550
34937a11467K8879k7986L01929N98294K85659m40850p20372j64623N60421N73608
$$ plain form
34927 883492 788265 194347 -173656 16468 357173 338093 60613 68258 553720 1058653
34917 1058653 1070594 639486 180211 -97954 -238511 -199306 93698 408957 384136 68803
34907 68803 -162918 -289286 -680176 -1298001 -1476932 -867490 -69919 151300 -147335 -400386
34897 -400386 -431076 -432707 -361815 -29852 350246 351675 17201 -197983 -117461 34824 121153
34886 121153 158970 -13444 -554951 -1146262 -1296088 -1108912 -1124913 -1379678 -1299060 -640551
34876 -640551 117593 505638 586977 585991 575576 691139 1049290 1307485 976036 332178
34866 332178 242267 814045 1109160 633679 172748 438402 768068 185491 -855791 -991356
34856 -991356 10207 876440 625284 -224280 -569858 -152710 381685 455399 168469 27791
$$ packed form
34927H83492r5227n93918l68003J90124L40705j9080k77480P645M85462N04933
34917A058653J1941m31108m59275k78165j40557L9205K93004L15259k4821l15333
34907F8803k31721j26368l90890o17825j78931O09442P97571K21219k98635k53051
34897d00386l0690j631P0892L31963L80098J429l34474k15184Q0522J52285Q6329
34886A21153L7817j72414n41507n91311j49826J87176j6001k54765Q0618O58509
34876f40551P58144L88045Q1339r86j0415J15563L58151K58195l31449o43858
34866C32178q9911N71778K95115m75481m60931K65654L29666n82577j041282j35565
34856i91356J001563Q66233k51156q49564l45578M17148N34395P3714k86930j40678
$$ plain form
34846 27791 277278 575341 433347 -61930 -300262 -54364 127946 -214273 -682385 -676823
34836 -676823 -429536 -612442 -1121376 -1115737 -312432 574406 893583 829014 795682 717048
34826 717048 356207 -119145 -385165 -447044 -463730 -366254 -32038 399236 721550 925594
34816 925594 961077 586447 -112703 -417222 187568 1081519 1147105 312021 -300673 83046
34806 83046 943870 1406290 1401858 1334315 1182609 722643 288682 420525 830019 604254
34796 604254 -400953 -1183048 -963040 -241313 20140 -276249 -469524 -211610 209701
34787 209701 445580 418623 169171 -142495 -155349 309783 855523 946459 654609 477534
34777 477534 515706 436659 232472 292314 567431 411815 -372946 -985853 -648124 314607
$$ packed form
34846B7791K49487K98063j41994m95277k38332K45898J82310l42219m68112N562
34836f76823K47287j82906n08934N639Q03305Q86838L19177o4569l3332p8634
34826G17048l60841m75352k66020o1879j6686R7476L34216M31274L22314K04044
34816I25594L5483l74630o99150l04519O04790Q93951O5586q35084o12694L83719
34806H3046Q60824M62420m432o7543j51706m59966m33961J31843M09494k25765
34796F04254j005207p82095K20008P21727K61453k96389j93275K57914M21311
34787B09701K35879k6957k49452l11666j2854M65132N45740R0936k91850j77075
34777D77534L8172p9047k04187N9842K75117j55616p84761o12907L37729R62731
$$ plain form
34767 314607 993655 1110937 1051026 948686 522768 -178835 -599423 -478482 -282954 -489934
34757 -489934 -839935 -720178 -54311 622157 884707 809228 620216 356359 58668 -48650
34747 -48650 128557 276908 78474 -224043 -89542 491655 892794 724104 362703 316066
34737 316066 439396 217931 -400916 -921424 -967438 -642669 -236270 109640 424238 828723
34727 828723 1390320 1872569 1793155 1003655 37542 -457728 -474601 -455527 -525757 -395548
34717 -395548 58062 601610 1008793 1160634 854956 58135 -666622 -585438 237890 926950
34707 926950 857329 225044 -513113 -1136643 -1423597 -1085039 -288686 281099 243604 -36794
34697 -36794 -101035 7866 77661 98257 -41279 -624619 -1439729 -1665303 -996308 -279117
$$ packed form
34767C14607O79048J17282n9911j02340m25918p01603m20588J20941J95528k06980
34757d89934l50001J19757O65867O76468K62550p5479j89012k63857k97691j07318
34747d8650J77207J48351j98434l02517J34501N81197M01139j68690l61401m6637
34737C16066J23330k21465o18847n20508m6014L24769M06399L45910L14598M04485
34727H28723N61597M82249p9414p89500r66113m95270j6873J9074p0230J30209
34717c95548M53610N43548M07183J51841l05678p96821p24757Q1184Q23328O89060
34707I26950o9621o32285p38157o23530k86954L38558P96353N69785l7495k80398
34697c6794o4241J08901O9795K0596j39536n83340q15110k25574O68995P17191
$$ plain form
34687 -279117 -314205 -599474 -197567 562141 412435 -860650 -1916244 -1683739 -726631
34678 -726631 -214769 -278822 -165803 380610 765347 567339 195976 220641 508354 483436
34668 483436 52219 -235022 -19533 310218 189773 -287090 -521960 -291407 -36640 -211689
34658 -211689 -692780 -983040 -784580 -255816 161345 159820 -56199 70102 697681 1212595
34648 1212595 990025 313121 -29309 89673 95733 -177301 -208906 157186 275660 -218837
34638 -218837 -680366 -435366 140354 243447 -155783 -477004 -506773 -455417 -328458 -3474
34628 -3474 253605 82228 -276061 -261898 102265 268042 67339 -108279 -27478 156202
34618 156202 436440 999831 1588922 1523626 680676 -108438 -31661 721328 1306383 1245998
$$ packed form
34687b79117l5088k85269M01907P59708j49706j273085j055594K32505R57108
34678g26631N11862o4053J13019N46413L84737j98008l71363K4665K87713k4918
34668D83436m31217k87241K15489L29751j20445m76863k34870K30553K54767j75049
34658b11689m81091k90260J98460N28764M17161j525k16019J26301O27579N14914
34648A212595k22570o76904l42430J18982O060k73034l1605L66092J18474m94497
34638b18837m61529K45000N75720J03093l99230l21221k9769N1356J26959L24984
34628c474K57079j71377l58289J4163L64163J65777k00703j75618Q0801J83680
34618A56202K80238N63391N89091o5296q42950p89114P6777P52989N85055o0385
$$ plain form
34608 1245998 752996 258224 -9140 -14898 219503 624910 1004644 1069139 701464 183049
34598 183049 -71215 -54979 -120884 -266163 34989 910284 1518781 1078934 142250 6209
34588 6209 929786 1781169 1599865 725514 80176 18812 310291 705432 1029782 1075240
34578 1075240 826281 535375 291857 -135631 -734636 -965215 -481631 230818 453974
34569 453974 179867 -95515 -258962 -579553 -935797 -807926 -168778 309940 220575 -15363
34559 -15363 74407 227594 -17990 -446580 -510524 -289961 -324285 -560588 -339349 388233
34549 388233 715419 146228 -462962 -106868 753927 760655 -350628 -1340533 -1204864 -430748
34539 -430748 -114724 -506028 -961609 -922639 -414694 190204 495442 307418 -159533 -424769
$$ packed form
34608A245998m93002m94772k67364n758K34401M05407L79734O4495l67675n18415
34598A83049k54264J6236o5905j45279L01152Q75295O08497m39847r36684j36041
34588F209R23577Q51383j81304q74351o45338o1364K91479L95141L24350M5458
34578A075240k48959k90906k43518m27488n99005k30579M83584P12449K23156
34569D53974k74107k75382j63447l20591l56244J27871O39148M78718q9365k35938
34559a5363Q9770J53187k45584m28590o3944K20563l4324k36303K21239P27582
34549C88233L27186n69191o09190L56094Q60795O728j111283r89905J35669P74116
34539d30748L16024l91304m55581L8970N07945O04898L05238j88024m66951k65236
$$ plain form
34529 -424769 -270783 40278 194285 195529 169875 130492 130897 306294 550157 526189 243600
34518 243600 188250 555828 810681 456211 -157768 -332171 -12055 286897 323499 321842
34508 321842 436686 561942 625500 638610 515430 218943 -37966 -107490 -231082 -624348
34498 -624348 -959126 -777792 -262488 -48689 -376482 -931727 -1390409 -1576419 -1242196 -345943
34488 -345943 522391 651521 132516 -347455 -556383 -814521 -1066320 -767185 82990 663513
34478 663513 491570 119889 212896 586789 710941 598815 581436 610102 409801 65940
34468 65940 -89400 -5938 107447 166893 200110 125033 -120895 -407571 -638248 -893818
34458 -893818 -1085253 -828969 -58768 604704 598883 233455 204277 551861 737661 573569
$$ packed form
34529d24769J53986L11061J54007J244k5654l9383M05J75397K43863k3968k82589
34518B43600n5350L67578K54853l54470o13979j74403L20116K98952L6602j657
34508C21842J14844J25256O3558J3110j23180k96487k56909o9524j23592l93266
34498f24348l34778J81334N15304K13799l27793n55245m58682j86010L34223Q96253
34488c45943Q68334J29130n19005m79971k08928k58138k51799K99135Q50175N80523
34478F63513j71943l71681R3007L73893J24152j12126j7379K8666k00301l43861
34468F5940j55340Q3462J13385N9446L3217p5077k45928k86676k30677k55570
34458h93818j91435K56284P70201O63472n821l65428k9178L47584J85800j64092
$$ plain form
34448 573569 363828 197065 -126659 -393865 -26713 881653 1346455 786327 -90354 -297944
34438 -297944 30433 -3604 -630745 -1174707 -1204795 -1124675 -1400485 -1840535 -1974396 -1682463
34428 -1682463 -1120511 -423021 162792 217842 -342042 -967170 -1106522 -905835 -837409 -890995
34418 -890995 -703797 -326206 -167079 -169041 232526 1115263 1705731 1401129 633169 241376
34408 241376 371464 511150 372566 209004 320622 660140 950103 933898 536225 -28111
34398 -28111 -370291 -318522 -100597 -11514 -65606 -132588 -216745 -390085 -606740 -771603 -853103
34387 -853103 -815831 -655459 -584225 -848116 -1217337 -1080976 -306501 427141 493456 84565
34377 84565 -279825 -526993 -773333 -753231 -226540 355709 381987 91550 226891 750398
$$ packed form
34448E73569k09741j66763l23724k67206L67152R08366M64802n60128q76681k07590
34438b97944L28377l4037o27141n43962l0088Q0120k75810m40050j33861K91933
34428a682463N61952O97490N85813N5050n59884o25128j39352K00687O8426n3586
34418h90995J87198L77591J59127j962M01567Q82737N90468l04602p67960l91793
34408B41376J30088J39686j38584j63562J11618L39518K89963j6205l97673n64336
34398b8111l42180N1769K17925Q9083n4092o6982q4157j73340k16655j64863q1500
34387h53103L7272J60372P1234k63891l69221J36361P74475P33642O6315m08891
34377H4565l64390k47168k46340K0102N26691N82249K6278k90437J35341N23507
$$ plain form
34367 750398 810450 120743 -504785 -347603 214088 376878 28939 -340149 -459896 -452360
34357 -452360 -384064 -157233 165283 304792 133127 -112056 -95031 197038 395969 181214
34347 181214 -261685 -371473 117429 805535 1084049 795948 249081 -247565 -580919 -696190
34337 -696190 -587961 -407822 -337676 -378567 -442544 -559646 -794251 -1065246 -1244213 -1298308
34327 -1298308 -1163541 -698780 -4257 465615 415756 110053 -51227 -83494 -179125 -213683
34317 -213683 23674 315380 243288 -181311 -550223 -592939 -299498 263001 817523 845078
34307 845078 238487 -267803 47510 816295 1045085 491992 -169885 -465727 -558794 -527102
34297 -527102 -68403 776043 1292368 912813 -25480 -640114 -395359 469555 1192714 1183187
$$ packed form
34367G50398O0052o89707o25528J57182N61691J62790l47939l69088j19747P536
34357d52360O8296K26831L22516J39509j71665k45183J7025K92069J98931k14755
34347A81214m42899j09788M88902O88106K78514k88101n46867m96646l33354j15271
34337f96190J08229J80139P0146m0891o3977j17102k34605k70995j78967n4095
34327a298308J34767M64761O94523M69872m9859l05703j61280l2267r5631l4558
34317b13683K37357K91706p2092m24599l68912m2716K93441N62499N54522K7555
34307H45078o06591n06290L15313P68785K28790n53093o61877k95842r3067L1692
34297e27102M58699Q44446N16325l79555r38293o14634K44755Q64914P23159r527
$$ plain form
34287 1183187 630298 239762 225727 50868 -504910 -740343 -188076 359009 4721 -670585
34277 -670585 -468782 400360 628499 -14677 -383813 60580 542834 558296 629993 982038
34267 982038 942327 331418 45680 482772 734435 226501 -173483 263924 726730 306579
34257 306579 -284122 81856 890825 745478 -325936 -872442 -167896 958254 1433086
34248 1433086 1036457 187944 -505754 -531867 24480 431746 316327 279094 859550 1487679
34238 1487679 1334207 613118 40344 -404153 -998269 -1128334 -52445 1502176 2018460
34229 2018460 1382404 901392 1091290 1041713 308215 -165034 294202 871771 627530 -5020
34219 -5020 -87821 254013 178775 -454817 -974455 -952557 -618077 -346217 -309638 -509551 -699032
$$ packed form
34287A183187n52889l90536j4035j74859n55778k35433N52267N47085l54288o75306
34277f70585K01803Q69142K28139o43176l69136M44393M82254J5462P1697L52045
34267I82038l9711o10909k85738M37092K51663n07934l99984M37407M62806m20151
34257C06579n90701L65978Q08969j45347j071414n46506P04546J126150M74832
34248A433086l96629q48513o93698k6113N56347M07266j15419l7233N80456O28129
34238A487679j53472p21089n72774m44497n94116j30065J075889J554621N16284
34229B018460o36056m81012J89898m9577p33498m73249M59236N77569k44241o32550
34219e020q2801L41834p5238o33592n19638K1898L34480K71860L6579j99913j89481
$$ plain form
34208 -699032 -438108 353667 1063167 1020134 357445 -144868 -9566 483913 772373 622070
34198 622070 201543 -228933 -538684 -686235 -604741 -258784 192340 462581 466231 428655
34188 428655 564905 822206 1046536 1150755 970669 316752 -545576 -858895 -258215 630078
34178 630078 977178 827546 776681 864162 592607 -33186 -344255 -35141 392386 464644
34168 464644 364197 410889 481077 314763 -26669 -334310 -530738 -543596 -283638 46590
34158 46590 57037 -192294 -148900 339567 625968 212960 -370399 -252943 504432 971799
34148 971799 600608 -179984 -672375 -716802 -621616 -659558 -870426 -1158294 -1365892 -1329448
34138 -1329448 -1010479 -576687 -296227 -331389 -605906 -842952 -772824 -372067 104656 372258
$$ packed form
34208f99032K60924P91775P09500m3033o62689n02313J35302M93479K88460j50303
34198F22070m20527m30476l09751j47551Q1494L45957M51124K70241L650l7576
34188D28655J36250K57301K24330J04219j80086o53917q62328l13319O00680Q88293
34178F30078L47100j49632n0865Q7481k71555o25793l11069L09114M27527P2258
34168D64644j00447M6692P0188j66314l41432l07641j96428j2858K59958L30228
34158D6590J0447k49331M3394M88467K86401m13008n83359J17456P57375M67367
34148I71799l71191p80592m92391m4427R5186l7942k10868k87868k07598L6444
34138a329448L18969M33792K80460l5162k74517k37046P0128M00757M76723K67602
$$ plain form
34128 372258 382080 301673 260876 214924 99254 29321 212155 643397 1016724 1017673 630535
34117 630535 87381 -362232 -511712 -204115 453976 968133 865536 251942 -314507 -518011
34107 -518011 -542065 -607483 -654907 -640780 -763108 -1114755 -1378787 -1166716 -526165 87919
34097 87919 258905 -37302 -374095 -206132 478466 936570 529421 -297621 -537244 -118284
34087 -118284 -9113 -575723 -857885 -137405 702366 408999 -673071 -1081311 -421490
34078 -421490 160474 -195601 -866599 -811376 -59040 441180 82801 -739764 -1140580 -709520
34068 -709520 42069 274862 -120482 -376217 54930 709113 841540 509110 309417 373065
34058 373065 347796 197635 254597 525992 660194 606743 649328 778166 704399 530482
$$ packed form
34128C72258R822q0407m0797m5952j15670o9933J82834M31242L73327R49l87138
34117F30535n43154m49613j49480L07597O58091N14157j02597o13594n66449k03504
34107e18011k4054o5418m7424J4127j22328l51647k64032K12071O40551O14084
34097H7919J70986k96207l36793J67963O84598M58104m07149q27042k39623M18960
34087a18284J09171n66610k82162P20480Q39771k93367j082070m08240O59821
34078d21490N81964l56075o70998N5223P52336N00220l58379q22565m00816M31060
34068g09520P51589K32793l95344k55735M31147O54183J32427l32430j99693O3648
34058C73065k5269j50161N6962K71395J34202n3451M2585J28838p3767j73917
$$ plain form
34048 530482 701570 1178852 1344210 911725 317532 -2565 -150741 -352931 -522514 -498040
34038 -498040 -330067 -153871 -87133 -273024 -657916 -813709 -466255 -79813 -301926 -917661
34028 -917661 -1078995 -555219 43058 342512 626888 982761 937321 338604 -203087 -230397
34018 -230397 -122237 -387246 -878151 -1181648 -1244707 -1168757 -906302 -580308 -564569 -828537
34008 -828537 -775204 -180635 319903 218000 -23296 218842 630806 491019 -87786 -309082
33998 -309082 76824 478259 392674 -16145 -339394 -408179 -262715 -23222 123880 73461
33988 73461 -47133 -58228 23991 103113 217082 406001 494804 241098 -363932 -1052236
33978 -1052236 -1418054 -1109148 -190181 631482 567358 -286384 -957903 -785760 -151840 226369
$$ packed form
34048E30482J71088M77282J65358m32485n94193l20097j48176k02190j69583K4474
34038d98040J67973J76196O6738j85891l84892j55793L47454L86442k22113o15735
34028i17661j61334N23776N98277K99454K84376L55873m5440n98717n41691k7310
34018b30397J08160k65009m90905l03497o3059P5950K62455L25994J5739k63968
34008h28537N3333N94569N00538j01903k41296K42138M11964j39787n78805k21296
33998c09082L85906M01435q5585m08819l23249o8785J45464K39493J47102n0419
33988G3461j20594j1095Q2219P9122J13969J88919Q8803k53706o05030o88304
33978a052236l65818L08906R18967Q21663o4124q53742o71519J72143O33920L78209
$$ plain form
33968 226369 231090 191263 266650 455917 821798 1215002 1148316 486097 -94654 47593
33958 47593 507234 388185 -296848 -583232 32207 879701 1085508 670542 286318 234104
33948 234104 213854 -63618 -421102 -503878 -323147 -275226 -601599 -1049287 -1229547 -1132261
33938 -1132261 -1019076 -955826 -822667 -697455 -771308 -902867 -778127 -549712 -694991 -1088935
33928 -1088935 -937484 4856 852477 792111 286697 349639 1010886 1328077 798062 -2445
33918 -2445 -277031 65198 527905 685892 520618 279220 133018 -11864 -290136 -526725
33908 -526725 -416193 -100698 -140785 -701208 -1194578 -1052240 -463580 17876 241271 412450
33898 412450 596283 711825 785394 814393 627378 251330 122381 508412 998073 1002529
$$ packed form
33968B26369M721l9827P5387J89267L65881L93204o6686o62219n80751J42247
33958D7593M59641j19049o85033k86384O15439Q47494K05807m14966l84224n2214
33948B34104k0250k77472l57484q2776J80731M7921l26373m47688j80260R7286
33938a132261J13185O3250J33159J25212p3853j31559J24740K28415j45279l93944
33928a088935J51451R42340Q47621o0366n05414O2942O61247L17191n30015q00507
33918b445k74586L42229M62707J57987j65274k41398j46202j44882k78272k36589
33908e26725J10532L15495m0087n60423m93370J42338N88660M81456K23395J71179
33898D12450J83833J15542P3569K8999j87015l76048j28949L86031M89661M456
$$ plain form
33888 1002529 512884 -55243 -478501 -741681 -753428 -555934 -539069 -914800 -1229534 -934202
33878 -934202 -199915 364864 549342 539675 383087 97225 52328 521774 1016728 790586
33868 790586 -89634 -851586 -1086863 -1018032 -809515 -384683 68928 148637 -139482 -432190
33858 -432190 -671461 -1065937 -1455882 -1458021 -1218453 -1238891 -1456647 -1341953 -946159 -920529
33848 -920529 -1346712 -1507858 -1069867 -532317 -192398 332460 1103976 1401042 875114 248289
33838 248289 158746 176433 -239385 -644164 -435134 -63539 -316964 -900857 -899044 -342843
$$ packed form
33888A002529m89645n68127m23258k63180j1747J97494J6865l75731l14734K95332
33878i34202P34287N64779J84478r667j56588k85862m4897M69446M94954k26142
33868G90586q80220p61952k35277O8831K08517M24832M53611P9709k88119k92708
33858d32190k39271l94476l89945k139K39568k0438k17756J14694L95794K5630
33848i20529m26183j61146M37991N37550L39919N24858P71516K97066n25928o26825
33838B48289q9543J7687m15818m04779K09030L71595k53425n83893J813N56201
$$ [...]
##END NTUPLES=NMR SPECTRUM
##END=
