##TITLE=31Pdec_E3e-2
 aceton-d6, 24 sc
 15.6.2023
##JCAMPDX= 6.0         $$ Bruker NMR JCAMP-DX V2.0
##DATA TYPE= NMR SPECTRUM
##DATA CLASS= NTUPLES
##ORIGIN= UXNMR, Bruker Analytische Messtechnik GmbH
##OWNER= root
$$ XWIN-NMR		Version 3.5
$$ Thu Jun 15 11:06:42 2023 Russian Standard Time (UT+4h)  she@DPX200
##.OBSERVE FREQUENCY= 81.013821
##.OBSERVE NUCLEUS= ^31P
##.ACQUISITION MODE= SIMULTANEOUS
##.ACQUISITION SCHEME= undefined
##.AVERAGES= 24
##.DIGITISER RES= 16
##SPECTROMETER/DATA SYSTEM= spect
##.PULSE SEQUENCE= zgpg30
##.SOLVENT NAME= Acetone
##.SHIFT REFERENCE= (INTERNAL, Acetone, 0, 248.564)
##AUDIT TRAIL= $$ (NUMBER, WHEN, WHO, WHERE, WHAT)
$$ ##TITLE= Audit trail, XWIN-NMR		Version 3.5
$$ ##JCAMPDX= 5.01
$$ ##ORIGIN= Bruker BioSpin GmbH
$$ ##OWNER= she
$$ F:/spectra/data/she/nmr/P31/1/pdata/1/auditp.txt
$$ ##AUDIT TRAIL=  $$ (NUMBER, WHEN, WHO, WHERE, WHAT)
(   1,<2023-06-15 11:05:22.53 +0400>,<she>,<DPX200>,
      <created by zg, POWCHK disabled, PULCHK disabled
       configuration hash MD5:
       00 E9 B6 7A A2 85 ED C7 34 08 36 98 17 FE 4E 26
       data hash MD5: 32K
       69 E8 49 39 0A 16 E7 FF 61 F7 88 5E 39 F9 77 F7>)
(   2,<2023-06-15 11:05:25.18 +0400>,<she>,<DPX200>,
      <Start of raw data processing
       efp BC_mod = 2 LB = 1 FT_mod = 6 PKNL = 1 PHC0 = -10704.19 PHC1 = 136.2848 SI = 64K 
       data hash MD5: 64K
       27 D1 B9 FD 33 E7 4D 68 65 93 7C 96 7A 1B 01 32>)
(   3,<2023-06-15 11:05:45.45 +0400>,<she>,<DPX200>,
      <pk PHC0 = -15.07725 PHC1 = 0 
       data hash MD5: 64K
       5E 19 42 9A 87 DD 5B 55 2A 8B 3A 18 8E EC 7B BA>)
$$ ##END=
$$ 
$$ hash MD5
$$ 90 D2 F7 37 61 64 FC 8E 03 C2 E0 00 41 9F A9 05
##$RELAX= 
##$RELAX= 
##$RELAX= 
##$RELAX= 
##$RELAX= 
##$RELAX= 
##$RELAX= 
##$RELAX= 
##$RELAX= 
$$ Bruker specific parameters
$$ --------------------------
##$DU= <F:/spectra>
##$EXPNO= 1
##$NAME= <P31>
##$PROCNO= 1
##$TYPE= <nmr>
##$USER= <she>
##$AMP= (0..31)
100 100 100 100 100 100 100 100 100 100 100 100 100 100 100 100 100 100 
100 100 100 100 100 100 100 100 100 100 100 100 100 100 
##$AQSEQ= 0
##$AQ_mod= 1
##$AUNM= <au_zg>
##$AUTOPOS= <>
##$BF1= 81.014009
##$BF2= 200.13
##$BF3= 200.13
##$BF4= 200.13
##$BF5= 200.13
##$BF6= 200.13
##$BF7= 200.13
##$BF8= 200.13
##$BYTORDA= 1
##$CFDGTYP= 0
##$CFRGTYP= 5
##$CHEMSTR= <none>
##$CNST= (0..31)
1 1 145 1 1 1 1 1 1 1 1 1 1 1 1 1 1 1 1 1 1 1 1 1 1 1 1 1 1 1 1 1 
##$CPDPRG= <waltz16>
##$CPDPRG1= <>
##$CPDPRG2= <waltz16>
##$CPDPRG3= <>
##$CPDPRG4= <mlev>
##$CPDPRG5= <mlev>
##$CPDPRG6= <mlev>
##$CPDPRG7= <mlev>
##$CPDPRG8= <mlev>
##$CPDPRGB= <>
##$CPDPRGT= <>
##$D= (0..31)
0 1 0 0 0 0 0 0 0 0 0 0.03 2e-05 3e-06 0 0 0 0 0 0 0 0 0 0 0 0 0 0 0 0 
0 0 
##$DATE= 1686812722
##$DBL= (0..7)
120 120 120 11 120 120 24 19 
##$DBP= (0..7)
150 150 150 150 150 150 150 150 
##$DBP07= 0
##$DBPNAM0= <>
##$DBPNAM1= <>
##$DBPNAM2= <>
##$DBPNAM3= <>
##$DBPNAM4= <>
##$DBPNAM5= <>
##$DBPNAM6= <>
##$DBPNAM7= <>
##$DBPOAL= (0..7)
0.5 0.5 0.5 0.5 0.5 0.5 0.5 0.5 
##$DBPOFFS= (0..7)
$$ [...]
##$SUBNAM2= <"">
##$SUBNAM3= <"">
##$SUBNAM4= <"">
##$SUBNAM5= <"">
##$SUBNAM6= <"">
##$SUBNAM7= <"">
##$SUBNAM8= <"">
##$SUBNAM9= <"">
##$SW= 501.771253377433
##$SWIBOX= (0..15)
0 1 3 0 0 0 0 0 0 0 0 0 0 0 0 0 
##$SW_h= 40650.406504065
##$TD= 32768
##$TD0= 1
##$TE= 0
##$TE2= 300
##$TE3= 300
##$TEG= 300
##$TL= (0..7)
0 120 53 12 22 120 120 120 
##$TP= (0..7)
150 150 150 150 150 150 150 150 
##$TP07= 0
##$TPNAME0= <>
##$TPNAME1= <>
##$TPNAME2= <>
##$TPNAME3= <>
##$TPNAME4= <>
##$TPNAME5= <>
##$TPNAME6= <>
##$TPNAME7= <>
##$TPOAL= (0..7)
0.5 0.5 0.5 0.5 0.5 0.5 0.5 0.5 
##$TPOFFS= (0..7)
0 0 0 0 0 0 0 0 
##$TUNHIN= 0
##$TUNHOUT= 0
##$TUNXOUT= 0
##$USERA1= <user>
##$USERA2= <user>
##$USERA3= <user>
##$USERA4= <user>
##$USERA5= <user>
##$V9= 5
##$VALIST= <valist>
##$VCLIST= <CCCCCCCCCCCCCCC>
##$VD= 0
##$VDLIST= <DDDDDDDDDDDDDDD>
##$VPLIST= <PPPPPPPPPPPPPPP>
##$VTLIST= <TTTTTTTTTTTTTTT>
##$WBST= 1024
##$WBSW= 4
##$XGAIN= (0..3)
0 0 0 0 
##$XL= 0
##$YL= 0
##$YMAX_a= 10061
##$YMIN_a= -9869
##$ZGOPTNS= <>
##$ZL1= 120
##$ZL2= 120
##$ZL3= 120
##$ZL4= 120
##$ABSF1= 0
##$ABSF2= 0
##$ABSG= 0
##$ABSL= 0
##$ALPHA= 0
##$AQORDER= 0
##$ASSFAC= 0
##$ASSFACI= 0
##$ASSFACX= 0
##$ASSWID= 0
##$AUNMP= <proc_1d>
##$AZFE= 0.1
##$AZFW= 0.5
##$BCFW= 0
##$BC_mod= 2
##$BYTORDP= 0
##$COROFFS= 0
##$CY= -3
##$DATMOD= 1
##$DC= 0
##$DFILT= <>
##$DTYPP= 0
##$F1P= 0
##$F2P= 0
##$FCOR= 1
##$FTSIZE= 65536
##$FT_mod= 6
##$GAMMA= 0
##$GB= 0
##$INTBC= 1
##$INTSCL= 6.047779e-11
##$ISEN= 30
##$LB= 1
##$LEV0= 0
##$LPBIN= 0
##$MAXI= 10000
##$MC2= 0
##$MEAN= 0
##$ME_mod= 0
##$MI= 50
##$NCOEF= 0
##$NC_proc= -5
##$NLEV= 6
##$NOISF1= 182.463
##$NOISF2= 159.3651
##$NSP= 0
##$NTH_PI= 0
##$NZP= 0
##$OFFSET= 248.5645
##$PC= 4
##$PHC0= -10719.27
##$PHC1= 136.2848
##$PH_mod= 1
##$PKNL= yes
##$PPARMOD= 0
##$PSCAL= 0
##$PSIGN= 0
##$REVERSE= no
##$SF= 81.0140089999694
##$SI= 65536
##$SIGF1= 159.3651
##$SIGF2= -187.1042
##$SINO= 113.3802
##$SIOLD= 16384
##$SREGLST= <1H.CDCl3>
##$SSB= 0
##$STSI= 65536
##$STSR= 0
##$SW_p= 40650.406504065
##$SYMM= 0
##$S_DEV= 0
##$TDeff= 32768
##$TDoff= 0
##$TI= <>
##$TILT= no
##$TM1= 0
##$TM2= 0
##$TOPLEV= 0
##$USERP1= <user>
##$USERP2= <user>
##$USERP3= <user>
##$USERP4= <user>
##$USERP5= <user>
##$WDW= 1
##$XDIM= 65536
##$YMAX_p= 541766663
##$YMIN_p= -196619954
$$ End of Bruker specific parameters
$$ ---------------------------------
##NTUPLES= NMR SPECTRUM
##VAR_NAME=  FREQUENCY,     SPECTRUM/REAL,   SPECTRUM/IMAG
##SYMBOL=    X,             R,               I
##VAR_TYPE=  INDEPENDENT,   DEPENDENT,       DEPENDENT
##VAR_FORM=  AFFN,          ASDF,            ASDF
##VAR_DIM=   65536,         65536,           65536
##UNITS=     HZ,            ARBITRARY UNITS, ARBITRARY UNITS
##FACTOR=    0.620285442955139, 1,           1
##FIRST=     20137.2065510682, 0,            0
##LAST=      -20513.1999529968, 0,           0
##MIN=       -20513.1999529968, -196619954,  0
##MAX=       20137.2065510682, 541766663,    0
$$ Real data points
##PAGE= N=1
##DATA TABLE= (X++(R..R)), XYDATA
$$ [...]
39663E77656K1259k36501o1025K41266O0177o27538j052472n81277M12824R35157
$$ 577656 598915 362414 301389 542655 602832 -24706 -1077178 -1658455 -1245631 -310474
39653c10474N23369k83978o56167m01008j3111J07431J74367N40299R35927O98692
$$ -310474 212895 -71083 -727250 -1128258 -1141369 -1033938 -859571 -319272 616655 1315347
39643A315347j71861p81670n18826P5541J65350j34159j39123J33060O5342l06613
$$ 1315347 1143486 361816 -157010 -81469 83881 -50278 -189401 -56341 9001 -297612
39633b97612k47915L10729M70619j61187p37422n22975k8036P068r3071L29766
$$ -297612 -545527 -234798 235821 74634 -662788 -1185763 -1213799 -1206731 -1299802 -970036
39623i70036Q91106O93987j08902m62594m3493L39343R4835l53226l90488p1851
$$ -970036 -78930 615057 506155 43561 68 339411 434246 81020 -309468 -381319
39613c81319J64164Q7728k47319n70815m48929K40970Q68847O71112j46981n87429
$$ -381319 -217155 -129427 -376746 -947561 -1396490 -1155520 -286673 384439 237458 -349971
39603c49971k42424K18009J59555j47316j48932J26013K81543J71909r7855m00843
$$ -349971 -592395 -374386 -214831 -362147 -511079 -385066 -103523 68386 -29469 -430312
39593d30312n13700k29299K08722K78391J8127N8831M97605N25352k46317q77499
$$ -430312 -944012 -1173311 -964589 -686198 -668071 -609240 -111635 413717 167400 -710099
39583g10099l98101N92276P13344j26897o34371j12227N91978M57266l20027q44767
$$ -710099 -1108200 -515924 197420 70523 -563848 -676075 -84097 373169 53142 -791625
39573g91625p77845m65966k09247J8494K62495M40880N11250N38568N66022N14759
$$ -791625 -1569470 -2035436 -2244683 -2226189 -1963694 -1522814 -1011564 -472996 93026 607785
39563F07785K33825k95927p51851o46300N1380O47917M68134k30612n57288j89459
$$ 607785 841610 545683 -206168 -852468 -801088 -153171 314963 84351 -472937 -662396
39553f62396K78468L09531J33265J55547K24562J7336k38488q2239L19552L08562
$$ -662396 -383928 -74397 58868 214415 438977 456313 217825 135586 455138 763700
39543G63700k26504n68485j78443M97081O23430J02165l63048k58992J28009K42149
$$ 763700 537196 -31289 -209732 287349 910779 1012944 649896 390904 518913 761062
39533G61062L9743r3353l1876q4326m18174p15013o31806k99062m5343J22732
$$ 761062 800805 707452 675576 591250 173076 -541937 -1173743 -1472805 -1518148 -1395416
39523a395416L65052N30163L41956j9967r7441O3879o2600n25036o39401m5436
$$ -1395416 -1030364 -500201 -158245 -178212 -275653 -211774 -274374 -799410 -1438811 -1484247
39513a484247O27261O66635K92159J22848J27397r2558l38709r8632L56067J93655
$$ -1484247 -856986 -190351 101808 224656 352053 259495 -79214 -177846 178221 371876
39503C71876n57588q50944k20337M39164K58124k95511k75980K22420L57798j7214
$$ 371876 -185712 -1036656 -1256993 -817829 -559705 -855216 -1131196 -908776 -550978 -568192
39493e68192k09509P5729K74375m7689m75876l96424J08510M23050K16647k24476
$$ -568192 -777701 -701972 -427597 -475286 -951162 -1347586 -1239076 -816026 -599379 -823855
39483h23855l99803j25363L33051N77615M93272K86874J36958J1196r1451j0950
$$ -823855 -1223658 -1349021 -1015970 -438355 54917 341791 478749 489945 398494 387544
39473C87544K41018L07503k3442m01601l91129j54481j77002m51236m90512j30726
$$ 387544 628562 936065 912623 511022 119893 -34588 -211590 -662826 -1153338 -1284064
39463a284064K35475K95956J82272Q5685q895o7039N2336K32647J23352k94495
$$ -1284064 -1048589 -752633 -570361 -484676 -493571 -560610 -508274 -275627 -152275 -446770
39453d46770o02709n74602m30774k77792J34409P62725R67164L83441l58356m10688
$$ -446770 -1049479 -1624081 -2054855 -2332647 -2198238 -1435513 -468349 -84908 -443264 -853952
39443h53952J09060L79609J34677o4384J60898M19975K42228j74864l22049j80895
$$ -853952 -744892 -365283 -230606 -294990 -134092 285883 528111 353247 31198 -149697
39433a49697j88785m53781m76393J06222Q06210P68923n9336p52466o05730k9104
$$ -149697 -338482 -792263 -1268656 -1162434 -356224 412699 353363 -399103 -1004833 -1033937
39423a033937J83392L0830P3314L04234J41571m34315o46481j16917N03582N38168
$$ -1033937 -850545 -819715 -746401 -442167 -300596 -734911 -1381392 -1498309 -994727 -456559
39413d56559K18748Q2359N3330k04501m82526l16046J66214L59112O3459k85507
$$ -456559 -237811 -155452 -102122 -306623 -789149 -1105195 -938981 -579869 -516410 -801917
39403h01917k52209J25560M72262M36878J9166l26908j48167L58748N49798K92101
$$ -801917 -1054126 -928566 -456304 -19426 -260 -327168 -475335 -116587 433211 725312
39393G25312J36138L05335K53659l17124p65169n06789k3279n3897l70281k79212
$$ 725312 861450 1166785 1420444 1103320 338151 -168638 -191917 -245814 -616095 -895307
39383h95307J31202K45857N8257K6198P9483j62981m05168m2238N89440N25110
$$ -895307 -764105 -518248 -459991 -433793 -354310 -517291 -922459 -964697 -375257 149853
39373A49853k20196n61663o9231L93903J35184l48700l47228j2856J45076J26421
$$ 149853 -70343 -632006 -701237 -307334 -172150 -520850 -868078 -880934 -735858 -609437
39363f09437K12722M02408N29451N13124K28168l69098q26707n52856K28336N93037
$$ -609437 -396715 5693 535144 1048268 1276436 907338 80631 -472225 -243889 349148
39353C49148K15448k22605j90557k5094r3170j08795J63144L03930j6851l61517
$$ 349148 564596 341991 151434 126340 33170 -75625 87519 391449 374598 13081
39343A3081k42939O0135O1174q8227J7170K50843K18337l6558j76702j28680j1025
$$ 13081 -229858 -169723 -108549 -196776 -179606 71237 289574 253016 76314 -52366 -63391
39332f3391J72499L46520K48895j00706k57619p4660l6649m02969o12141j66504
$$ -63391 109108 455628 704523 603817 346198 271538 234889 -168080 -780221 -946725
39322i46725M34108L96558j29765l10692J18280N84758N52199O6214m86344p06832
$$ -946725 -512617 -116059 -245824 -556516 -438236 146522 698721 764935 278591 -428241
39312d28241m10310J10182K68760m8012k60079J0062L10644J32971j93965m9039
$$ -428241 -838551 -728369 -459609 -507621 -767700 -757638 -446994 -314023 -507988 -557027
39302e57027M30552N77821K33819j26704j52775Q1916L70204M49376K4401p53724
$$ -557027 -126475 451346 685165 558461 405686 487602 857806 1307182 1331583 577859
39292E77859j113471n69913K49147L40897l00013p30232l87911K79198N42785
$$ 577859 -535612 -1105525 -856378 -515481 -815494 -1545726 -1933637 -1654439 -1111654
39283a111654K33836k10866k18096L58159R36594P16061k87619j102410j001973
$$ -1111654 -877818 -1088684 -1306780 -948621 -12027 704034 416415 -685995 -1687968
39274a687968l55290J15569L22863M85963M26963l5411m45357k64972K71043N70418
$$ -1687968 -2043258 -1927689 -1604826 -1118863 -691900 -727311 -1172668 -1437640 -1166597 -596179
39264e96179N67405M87140K14297k85532m34101J12081N78918J28719o57567o02519
$$ -596179 -28774 458366 672663 387131 -46970 65111 644029 772748 115181 -487338
39254d87338J21422L00422k23012l31484L31812O79232L7979o79835m15384M84362
$$ -487338 -365916 -65494 -288506 -619990 -288178 391054 429033 -250802 -666186 -181824
39244a81824R44036O11729p1155o41412q50429o10123j71939L1347k4528R706
$$ -181824 762212 1373941 1302786 661374 -189055 -799178 -971117 -939770 -964298 -954592
39234i54592J30295m4377m30138m09644J14822M18225R3665k84363j21008K85272
$$ -954592 -824297 -868674 -1298812 -1708456 -1593634 -1175409 -1081744 -1366107 -1487115 -1201843
39224a201843L47765J12861r018K5845j7702j59986k39929k06603j06251q174
$$ -1201843 -854078 -741217 -750235 -724390 -742092 -902078 -1142007 -1348610 -1454861 -1463035
39214a463035l3412j41948L9363O75131J143832P35721j46264m03795Q6648K84455
$$ -1463035 -1496447 -1638395 -1599032 -923901 219931 955652 809388 405593 492241 776696
39204G76696k94794q08252n10262J35709M10509M16767M65341L00952k19141m85244
$$ 776696 481902 -326350 -836612 -700903 -290394 126373 591714 892666 673525 188281
39194A88281p7773L53702P3980n13881n79228k13471o0240j02969J05309L88518
$$ 188281 110508 464210 538190 24309 -554919 -768390 -828630 -931599 -826290 -437772
39184d37772K26284j72550j66062J11805n9238o20228o63846J06247Q44742P97394
$$ -437772 -211488 -384038 -550100 -438295 -497533 -1117761 -1781607 -1675360 -830618 -33224
39174c3224K34944j88366k97759k39450n2713J90014K50074P9028l1047Q8499
$$ -33224 201720 13354 -284405 -523855 -576568 -386554 -136480 -57452 -88499 0
39164@K09996J41274P7098K19061L43555J20789l00218m08226k8210M09085M15291
$$ 0 209996 351270 428368 647429 990984 1111773 811555 403329 375119 784204 1199495
39153A199495M7529k45084k59590k13465k50412j56851J79200L74223N4468m65912
$$ 1199495 1247024 1001940 742350 528885 278473 121622 300822 675045 729513 263601
39143B63601n43804j37117J93283J70112O1332K1183j39608l75636l04464O7292
$$ 263601 -280203 -417320 -224037 -53925 7407 28590 -111018 -486654 -791118 -723826
39133g23826K05802n2856j75090J14952K91937m0057l87824j98184J78721J14371
$$ -723826 -518024 -570880 -745970 -631018 -339081 -379138 -766962 -965146 -786425 -672054
39123f72054k12267j63440K86538O17517O29919N02314K21074l00090p04855n38222
$$ -672054 -884321 -1047761 -761223 -143706 486213 988527 1209601 909511 204656 -333566
39113c33566j8117K08395J9053j03273Q8438K75655J15096l49717q02980q49138
$$ -333566 -351683 -143288 -124235 -227508 -139070 136585 251681 -98036 -901016 -1750154
39103a750154k76400N21159P23718J50213k98133J04114O92637L67161n96469
$$ -1750154 -2026554 -1505395 -781677 -631464 -929597 -825483 -132846 234315 -362154
39094c62154q40454k038O98115K79542o05466o98447J47141R42850Q96791K06827
$$ -362154 -1202608 -1204646 -506531 -226989 -832455 -1530902 -1383761 -440911 455880 662707
39084F62707l70623l97217j41384j22444l21270j70391M63512P90103J71742p23322
$$ 662707 292084 -105133 -246517 -368961 -690231 -860622 -397110 392993 564735 -158587
39074a58587p05477J86842P16556K82623l16677k79502L2107p5223m19612l61324
$$ -158587 -864064 -677222 39334 321957 5280 -274222 -242115 -317338 -736950 -1098274
39064a098274P3395L01473J73320J06053K74802L23000N435l80657m41695k25275
$$ -1098274 -1024879 -723406 -550086 -444033 -169231 153769 159204 -221453 -663148 -888423
39054h88423k3411J43137M58283P58291N16979l33347r53858n43617M34104P15598
$$ -888423 -911834 -768697 -310414 447877 964856 631509 -322349 -865966 -431862 283736
39044B83736J2188n41000j07029N74696M06919l02229l88185K64728N99335J22467
$$ 283736 295924 -245076 -352105 222591 629510 327281 -60904 203824 803159 925626
39034I25626m27761l98427j46067j86882k95453m9817L53357M40634K09078J5898
$$ 925626 497865 99438 -46629 -233511 -528964 -578781 -225424 215210 424288 440186
39024D40186P842O1896O3838m6110k75857m30604k44248J68262L28013N3179k51931
$$ 440186 448028 509924 573762 527652 251795 -178809 -423057 -254795 73218 126397 -125534
39013a25534j96123M9315P1680j72103l29376j00946M11835P14231L48116m73571
$$ -125534 -321657 -272342 -200662 -372765 -702141 -803087 -391252 322979 671095 197524
39003A97524q68853l31915M50580M34063l01988o94327k83249K63316L70322L14904
$$ 197524 -671329 -1003244 -552664 -118601 -420589 -1114916 -1398165 -1134849 -764527 -449623
38993d49623L93142K98262q9460j76588L35254O77028J20733p49951q39364j77138
$$ -449623 -56481 241781 152321 -24267 310987 988015 1108748 358797 -480567 -657705
38983f57705K41752J102l35911k90178j8971K43763M84865N27544R6635n23008
$$ -657705 -415953 -414851 -750762 -1040940 -1059911 -816148 -331283 196261 292896 -230112
38973b30112n58361K08873R79361Q65144m2818q26006p68981m8367N18783L55208
$$ -230112 -788473 -579600 399761 1264905 1222087 396081 -372900 -421267 97516 452724
38963D52724k35467m62386j29918Q4887k72418n92316j16580O95643O69966k74420
$$ 452724 217257 -245129 -375047 -290160 -562578 -1154894 -1271474 -575831 94135 -180285
38953a80285q61034l10241M93842L29805n62391q65660o2382R26600J040504L58167
$$ -180285 -1041319 -1351560 -857718 -527913 -1090304 -1955964 -2018346 -1091746 -51242 306925
38943C06925k10928j29799K55054L19119n1394m39123n11701l64240j93448M3054
$$ 306925 95997 -33802 221252 540371 488977 49854 -461847 -826087 -1019535 -976481
38933i76481L91435O00467M52052K07228K31615K95780j22168q15269q85440q5470
$$ -976481 -585046 15421 467473 674701 906316 1202096 1079928 264659 -620781 -706251
38923g06251O10758L07407n47467q82040n20772j47541k3587K89593Q88505J136687
$$ -706251 -95493 211914 -335553 -1217593 -1738365 -1885906 -1909493 -1619900 -731395 405292
38913D05292O43211q1705l77056k97523k85057m10399m23100k58831n3289J44735
$$ 405292 1048503 966798 589742 292219 7162 -403237 -826337 -1085168 -1138457 -993722
38903i93722L21219L65260K82998K79605L49019J53384l26639m91476k7056L61548
$$ -993722 -672503 -307243 -24245 255360 604379 757763 431124 -60352 -87408 274140
38893B74140q5921q37029o98896L06007Q51318L20695k60932Q8475P23148M39053
$$ 274140 188219 -648810 -1347706 -1041699 -190381 130314 -130618 -42143 681005 1120058
38883A120058n44626q47188P659Q72551N66480n86608j259514p67319K44932O99914
$$ 1120058 575432 -271756 -264097 608454 1174934 588326 -671188 -1438507 -1193575 -493661
38873d93661L47463r7081k5276K36658K9449m93366n12621J46373O52805M20784
$$ -493661 -146198 -243279 -268555 -31897 -2448 -495814 -1008435 -862062 -209257 211527
38863B11527o0899j52560o2814k12398k82192J68397O44485L65450l28811l86793
$$ 211527 150628 -1932 -64746 -277144 -559336 -390939 253546 618996 290185 -96608
38853i6608K32164M55394j39465o50033l36330K76236L58645k4136l25584m22121
$$ -96608 135556 590950 451485 -198548 -534878 -258642 100003 75867 -249717 -671838
38843f71838m40538k63742J32006L33139J09993p0699K16822N59782L53225j54073
$$ -671838 -1112376 -1376118 -1244112 -910973 -800980 -871679 -654857 -95075 258150 104077
38833A04077k63199P020L2696k57127k58061J79420L84302m2403n12607l31703
$$ 104077 -159122 -152102 -119406 -376533 -634594 -455174 -70872 -113275 -625882 -957585
38823i57585K42794M25163P8987j58030J27266N51161N15848j2559n51291p04864
$$ -957585 -714791 -289628 -210641 -368671 -241405 309756 825604 813045 261754 -443110
38813d43110m70484p2864K34295K51219p401k20360r9702J48664M3645l98763
$$ -443110 -913594 -986458 -752163 -500944 -508345 -728705 -828407 -679743 -636098 -1034861
38803a034861n46054n4305N60015O76430M77018M93338N83896J70712o17826r33968
$$ -1034861 -1580915 -1635220 -1075205 -398775 78243 571581 1155477 1326189 708363 -225605
38793b25605m84786J7348n397j72428O7984M83591M97438J19803j74321j88371
$$ -225605 -710391 -693043 -698440 -870868 -802884 -319293 178145 297948 123627 -64744
38783f4744p4720Q0553K21909R9212l88138p80201n18477K43581P50753N53911
$$ -64744 -139464 -58911 162998 262210 -125928 -906129 -1424606 -1181025 -430272 123639
38773A23639n8633n09640m93519j24096K09762J85648p0943r5178K62785N76299
$$ 123639 65006 -444634 -938153 -1062249 -852487 -666839 -737782 -832960 -570175 6124
38763F124M86538K46306K31774K71981q054m57371o17914m85824m18368l99891
$$ 6124 492662 738968 970742 1242723 1234669 777298 159384 -326440 -744808 -1144699
38753a144699q6735M23890N66912J76339k42016k87324j51665j15947q4710R6352
$$ -1144699 -1231434 -807544 -240632 -64293 -306309 -593633 -745298 -861245 -945955 -849603
38743h49603K88408L01452J54076q9801l92506n30042k41213K62446M12687Q9764
$$ -849603 -561195 -259743 -105667 -195468 -587974 -1118016 -1359229 -1096783 -684096 -594332
38733e94332k07052j91931j63876k31812Q4965Q96939J282350M61958q13701j065224
$$ -594332 -801384 -993315 -1157191 -1389003 -1304038 -407099 875251 1337209 523508 -541716
38723e41716j07923P43874N63281r8046l30035j69621j79283l61745k52002K00164
$$ -541716 -649639 94235 657516 559470 229435 59814 -119469 -481214 -733216 -533052
38713e33052N28464M72327K61481J35539K0691j74795k73139o4285L21171M90620
$$ -533052 -4588 467739 729220 864759 885450 710655 437516 373231 694402 1185022
38703A185022K35836k31941n50920o20414o02339n47135k82544J87977M62772
$$ 1185022 1420858 1188917 637997 17583 -584756 -1131891 -1414435 -1226458 -763686
38694g63686K42008j49755j69015J41300K67967R6186K8857J67142J12324j66198
$$ -763686 -521678 -671433 -840448 -699148 -431181 -334995 -306138 -138996 -26672 -192870
38684a92870q2444M65002N77625k83306j145412p72904M31131R62250L96050k44258
$$ -192870 -275314 189688 767313 484007 -661405 -1434309 -1003178 -40928 355122 110864
38674A10864k69300j34145k36779k25079K3085m0224m57572l31259O28454J255285
$$ 110864 -158436 -292581 -529360 -754439 -731354 -771578 -1229150 -1560409 -931955 323330
38664C23330O50217k85079k82508K26427j7394q09635p93121J77290P44070K83357
$$ 323330 973547 688468 405960 632387 614993 -194642 -987763 -810473 -66403 216954
38654B16954k19552l316K57911j60691o80936m26343L17137O52928M71693L31208
$$ 216954 -2598 -5914 251997 91306 -589630 -1015973 -698836 -45908 425785 756993
38644G56993L38442Q0298m78038q11842o02132j33066J75713K65677L37486M43110
$$ 756993 1095435 1175733 697695 -114147 -716279 -849345 -673632 -407955 -70469 372641
38634C72641L45966j19704n92915m41436K77758N70496j89836j113965q65840
$$ 372641 718607 598903 5988 -435448 -157690 412806 222970 -890995 -1756835
38625a756835L38782R64138M45192p5498K77865P56114M29489j97569j63940K49596
$$ -1756835 -1418053 -453915 -8723 -84221 193644 949758 1379247 1181678 1017738 1267334
38615A267334J11302m58106n37224o1396J03209l02212n49218k38722Q7397m3732
$$ 1267334 1378636 920530 383306 321910 425119 122907 -426311 -665033 -577636 -621368
38605f21368l14266k80064m9593O6688M0126l2381j24401j39714J0460J23626
$$ -621368 -935634 -1215698 -1265291 -1198603 -1158477 -1190858 -1315259 -1454973 -1444513 -1320887
38595a320887l5275j91049J49838Q23439J065407N73166j11194m36183m27405
$$ -1320887 -1356162 -1547211 -1397373 -573934 491473 1064639 953445 517262 89857
38586H9857k53751J17018N35671N72420J55216k36146l22130l89355n87688n36404
$$ 89857 -163894 -46876 488795 1061215 1216431 980285 658155 268800 -318888 -855292
38576h55292q9503J79996j32665m99168l00548J04260J5707l14777n2367P30591
$$ -855292 -944795 -764799 -897464 -1396632 -1697180 -1592920 -1577213 -1891990 -1944357 -1213766
38566a213766J009297L78877l13391k60350K11060L44204R6276l9181Q3747J87748
$$ -1213766 -204469 174408 -138983 -399333 -188273 155931 252207 213026 296773 484521
38556D84521J37264J6227k10538n83199p69254l46221M66516Q50503L79415l85182
$$ 484521 621785 638012 427474 -155725 -924979 -1271200 -804684 45819 425234 40052
38546D0052n66551k9761N18598M13753k20862o61816m14711K34352N45975J85288
$$ 40052 -526499 -556260 -37662 376091 155229 -506587 -921298 -686946 -140971 44317
38536D4317m01927n77989k84187M7756K06799L84174O23457O00212J86127k07779
$$ 44317 -357610 -935599 -1219786 -1172030 -965231 -581057 42400 642612 828739 620960
38526F20960k11889o6158j72849l76633k31345J83016L03686n8514m44107m12220
$$ 620960 409071 342913 170064 -206569 -437914 -254898 48788 -9726 -453833 -866053
38516h66053l0181L85902N87550L89789j69721n81094l13900L30794M27897k50199
$$ -866053 -896234 -510332 77218 467007 297286 -283808 -597708 -266914 160983 -89216
38506h9216p84630m26409K93196M33211P4314l567K59921J61974l88622n34671
$$ -89216 -873846 -1300255 -1007059 -573848 -499534 -503101 -243180 -81206 -469828 -1004499
38496a004499J13196O55915J99174o81816o77016L34224J057966O11638k76707
$$ -1004499 -891303 -235388 -36214 -718030 -1395046 -1060822 -2856 608782 332075
38487C32075l73969L40608P68847K81040n22209p41297k75279L00476N19178L22788
$$ 332075 -41894 298714 1067561 1348601 826392 85095 -190184 110292 629470 952258
38477I52258j09360m43233l26959J72229M58967J24404m28883n19672j52980Q8211
$$ 952258 842898 399665 72706 244935 703902 828306 399423 -120249 -273229 -185018
38467a85018j6764j25616n3784k6900j12896n8578J24913N9891k65762l15359
$$ -185018 -201782 -327398 -381182 -408082 -520978 -579556 -454643 -394752 -660514 -975873
38457i75873J11546M51948K71389k7626O9188L00944J21924l37631n01522k72532
$$ -975873 -864327 -412379 -140990 -168616 -99428 201516 323440 -14191 -515713 -788245
38447g88245o0592n1191n7017L27J1258J8829J56381L05010K43175N9393J7267
$$ -788245 -848837 -900028 -957045 -956718 -945460 -926631 -770250 -465240 -222065 -162672 -145405
38436a45405J12208J40987P8055J8194o9164j58117p427L75583M41710j51593
$$ -145405 -33197 107790 185845 204039 134875 -23242 -30669 344914 786624 635031
38426F35031q02582o77181O4823N33865M51566L51589M60052L35976j64618m74720
$$ 635031 -167551 -844732 -779909 -246044 205522 557111 1017163 1353139 1188521 713801
38416G13801k57207Q920j46580m25827l43290j5926J64826J88422K09451Q7720
$$ 713801 456594 465514 318934 -106893 -450183 -466109 -301283 -112861 96590 184310
38406A84310k73537m71769j25285L78969L23313k46598n23918r7326M91783N47128
$$ 184310 -89227 -560996 -686281 -307312 16001 -230597 -754515 -851841 -360058 187070
38396A87070Q6893l68523n05035l64856m7871L29956M87529K06824k36857k43440
$$ 187070 273963 -94560 -599595 -964451 -1012322 -682366 -194837 11987 -224870 -468310
38386d68310L32654Q67341P04691p243n65320o44690n31866m52560k14166K76336
$$ -468310 -135656 731685 1436376 1429133 863813 219123 -312743 -765303 -979469 -703133
38376g03133O24692M62600K6222j89924j29062r8367j72752j48528k7948o0360
$$ -703133 -78441 384159 410381 220457 91395 -6972 -179724 -328252 -356200 -416560
38366d16560k32121j59425L15697P55124O28598K3425m24073l02675P3452P1385
$$ -416560 -648681 -808106 -492409 262715 891313 914738 490665 187990 261442 332827
38356C32827m32566q60031o71159o3974L48060L82333L75594M82237M27092Q1820
$$ 332827 -99739 -959770 -1630929 -1694903 -1346843 -964510 -588916 -106679 320413 402233
38346D02233k41975l07504k73022k41120j6392L53022L62288j51085n30347j98258
$$ 402233 160258 -147246 -420268 -661388 -677780 -324758 37530 -113555 -643902 -842160
38336h42160M37050O12076L16585P2206r924j69171l03026j58517K6629r0500
$$ -842160 -405110 206966 523551 595757 585833 416662 113636 -44881 -18252 -108752
38326a08752j78364K30137O39092J46117r38939j246405l36826O32136O33872
$$ -108752 -287116 -56979 582113 728230 -210709 -1457114 -1793940 -1161804 -527932
38317e27932O8832k22015k06789j95504k3450M24715N87600N9725m97980k47357
$$ -527932 -459100 -681115 -887904 -1083408 -1106858 -682143 -94543 -34818 -532798 -780155
38307g80155M44941N37194l7269l42169k8440J64900k24583n32660p2218O66657
$$ -780155 -335214 201980 164711 -177458 -205898 -40998 -265581 -798241 -870459 -203802
38297b03802P08959O7632l24014m8681K58022J6475l82088k86097R5453K2403
$$ -203802 505157 572789 248775 200094 458116 474591 92503 -193594 -98141 -75738
38287g5738n09768o52480r336O83218N97487l4450l73376j83652M6029j1499j47714
$$ -75738 -585506 -1237986 -1247322 -564104 33383 -1067 -374443 -558095 -512066 -523565 -671279
38276f71279j03500R1873L11081M64055M29029J79799n7623q8001q4080k99884
$$ -671279 -774779 -682906 -371825 92230 521259 701058 643435 555434 471354 171470
38266A71470n91115o23983m23414k64198j36190J86340O10169P63060N63965L06444
$$ 171470 -419645 -1043628 -1467042 -1731240 -1867430 -1681090 -1070921 -307861 256104 562548
38256E62548J79627J06941J8927q6465k53069l84531j81552L14931M58679j26544
$$ 562548 742175 849116 868043 781578 528509 143978 -37574 277357 736036 609492
38246F09492p50905n07040L44489P18199K81464k54855l79013l21462k71588l7431
$$ 609492 -141413 -648453 -303964 414235 695699 440844 61831 -259631 -531219 -568650
38236e68650L00957L04496o043p8675J99784L01886L5681j57861j06937j78739
$$ -568650 -267693 36803 30760 -47915 151869 453755 489436 331575 224638 45899
38226D5899l90109k36689K64948L92248l3538k78361l3009K8271l76950m18469
$$ 45899 -344210 -580899 -315951 76297 42759 -235602 -268611 -240340 -617290 -1035759
38216a035759L58149R68865M69221m72285o40916j31170P3779k32479m45614l45411
$$ -1035759 -677610 291255 760476 288191 -352725 -483895 -410116 -642595 -1088209 -1433620
38206a433620j94157J8648L94856N23445O0328m21622j76870M41594N12944N9599
$$ -1433620 -1627777 -1609129 -1214273 -690828 -630500 -1052122 -1228992 -787398 -274454 -214855
38196b14855j11320J11372L2255m76448o70563k11042K81840K64162J1624l509
$$ -214855 -326175 -214803 -182548 -658996 -1329559 -1540601 -1258761 -994599 -982975 -986484
38186i86484K07649L84591L78597R5883m14150p32204m64171R8719K84397L1780
$$ -986484 -778835 -394244 -15647 80236 -333914 -1066118 -1530289 -1431570 -1147173 -1115393
38176a115393m1042L62312P74668O89121J89511l13141n32789l91050n5293O7989
$$ -1115393 -1156435 -794123 -19455 669666 859177 546036 13247 -377803 -433096 -365107
38166c65107k13365m66106j49515N05727P02233J93364l80055m02417k2110K18531
$$ -365107 -578472 -1044578 -1194093 -688366 13867 207231 -172824 -575241 -597351 -378820
38156c78820R6005j60651k10315M2184L14377K44377p9269j57803J53289L37065
$$ -378820 -282815 -443466 -653781 -611597 -297220 -52843 -132112 -289915 -136626 200439
38146B00439K4876l64133l06404k1378R828p8699R2268L08778J69197k7724K19538
$$ 200439 225315 -138818 -445222 -466600 -456772 -535471 -443203 -134425 34772 7048 226586
38135B26586N24891J37693o15654o48030J06817N03107L639n52071m22394n1327
$$ 226586 751477 889170 273516 -374514 -267697 235410 239049 -313022 -735416 -786743
38125g86743r0026l21110k40960O9308K84937L81566L23796r3764o11097m76291
$$ -786743 -876769 -1197879 -1438839 -1369531 -1084594 -703028 -379232 -472996 -1084093 -1560384
38115a560384L90370R83630O00697j22101k81437o6377j79240n38472n45505k04796
$$ -1560384 -1170014 -186384 414313 292212 10775 -55602 -234842 -773314 -1318819 -1523615
38105a523615j083M7537K90199N97471M92260J8081l07728l12020k11758P032
$$ -1523615 -1524698 -1477161 -1186962 -589491 -97231 -79150 -386878 -698898 -910656 -903624
38095i03624M63509P53111L26899m81632o94627j02208M13416K20420k17949k40923
$$ -903624 -440115 312996 639895 158263 -536364 -638572 -225156 -4736 -222685 -463608
38085d63608O447K3365j49691j10891J62551L29804K58202J06282m0782k10175
$$ -463608 -457161 -433796 -583487 -694378 -531827 -202023 56179 162461 121679 -88496
38075h8496k98154j50494J41246L00461J90090j22111n02185p22023m77048K07392
$$ -88496 -386650 -537144 -395898 -95437 94653 -27458 -529643 -1251666 -1728714 -1521322
38065a521322P12854M34418l39505o44751q9601N97371N78532M2312j68588J91890
$$ -1521322 -808468 -374050 -713555 -1358306 -1447907 -850536 -272004 -229692 -398280 -206390
38055b06390N17419L48141Q944j4270J42191R417l96808n65064k77787N6852K9860
$$ -206390 311029 659170 668114 653844 796035 805452 408644 -156420 -434207 -377355 -347495
38044c47495j81206j61287M3168J5145k71132k78685K57359P44846M75233k80580
$$ -347495 -528701 -689988 -646820 -631675 -902807 -1181492 -924133 -179287 295946 15366
38034A5366n69671j61976R6588l40692p43543k03109Q21253J027027J82707n13732
$$ 15366 -554305 -716281 -619693 -960385 -1703928 -1907037 -1085784 -58757 123950 -389782
38024c89782j85489N53186O56512J30170k22865p8291J09889p8611n00433p33481
$$ -389782 -575271 -22085 634427 764597 541732 463441 573330 494719 -5714 -739195
38014g39195n32066j0775M17479M01580J02182M3873L40209M28283r9195p64193
$$ -739195 -1271261 -1282036 -864557 -462977 -360795 -316922 23287 451570 352375 -411818
38004d11818p90851j82172L30603L12887P2483N2405K40810L37989K02360n3092
$$ -411818 -1202669 -1384841 -1054238 -741351 -668868 -616463 -375653 -37664 164696 111604
37994A11604k65563l88879m55513l98554l2154O13170J050351P96767P4938l87463
$$ 111604 -153959 -542838 -998351 -1396905 -1429059 -815889 234462 1031229 1106167 718704
37984G18704l25127j78260k31943j73323J59609K81497j31264n34661l18746J63659
$$ 718704 393577 215317 -16626 -189949 -30340 251157 119893 -414768 -733514 -569855
37974e69855J58424k53336l37445O4224L45698J59409j38615j48850R3573L80200
$$ -569855 -411431 -664767 -1002212 -937988 -592290 -432881 -571496 -720346 -626773 -246573
37964b46573N34302L27640k92266q77843q69482l04974K81662N63458N69864L33968
$$ -246573 287729 615369 323103 -554740 -1424222 -1729196 -1447534 -884076 -314212 19756
37954A9756m3442j72054J52307M38403J49729l59777l66757j5706m7743m08775
$$ 19756 -23686 -195740 -43433 394970 544699 184922 -181835 -197541 -245284 -654059
37944f54059k93521L21650M59010j63089m75949J97105Q73550L85827p18556r34416
$$ -654059 -947580 -625930 -166920 -330009 -805958 -608853 264697 650524 -68032 -1002448
37934a002448k937Q24258O36735o0224l29020n5125J99716J32896N786J10209
$$ -1002448 -1005385 -181127 455608 395384 66364 11239 210955 343851 349637 459846
37924D59846K83953J34958l45938o60112m29865P5102L23707K53941K10352K54514
$$ 459846 743799 878757 532819 -127293 -557158 -482056 -158349 95592 305944 560458
37914E60458N6794m51569q06776o03284j9723M35980M68261J69000j41446j99371
$$ 560458 617252 165683 -641093 -1244377 -1264100 -828120 -359859 -190859 -332305 -531676
37904e31676q1086j11563l14515k35735L24127P53701M00823l71630o26268j80379
$$ -531676 -612762 -724325 -1038840 -1274575 -950448 -196747 204076 -167554 -793822 -974201
37894i74201L00293M34420M64058M60350J50935l11008l53462L476P4520k83818
$$ -974201 -673908 -239488 224570 684920 835855 524847 171385 174861 249381 -34437
37884c4437l79822M4688L01377J3701j77677J57852L42422k14790q37203o03060
$$ -34437 -414259 -369571 -68194 -54493 -232170 -74318 268104 53314 -783889 -1386949
37874a386949J89109O14997N55378M65221K78668k85146p44253m16681K80120
$$ -1386949 -1197840 -582843 -27465 437756 716424 431278 -312975 -729656 -449536
37865d49536L19625k51091l66615K54232O24681J36233m63623l15737K41298L24677
$$ -449536 -129911 -381002 -747617 -493385 131296 267529 -196094 -511831 -270533 54144
37855E4144j48961n10020l86488n6746J32555J98340L17707M83228M86804J98349
$$ 54144 -94817 -604837 -991325 -1048071 -915516 -717176 -399469 83759 570563 768912
37845G68912j95246l31476j15742J29164J03897o1001p1157M4003L0079j31778
$$ 768912 573666 242190 126448 255612 359509 298508 227351 271354 301433 169655
37835A69655k17398j53568q2566n6990J8758J43743J89258J10893k8237j94323
$$ 169655 -47743 -201311 -283877 -340867 -322109 -178366 10892 121785 93548 -100775
37825a00775l30887k81654k1243J65967L7663k00035j72530R3885K60635K41411
$$ -100775 -431662 -713316 -734559 -568592 -530929 -730964 -903494 -809609 -548974 -307563
37815c07563K49918L19263K34127p827j16147j0812J5745j75962k79206m5859
$$ -307563 -57645 261618 495745 487918 371771 360959 376704 200742 -78464 -124323
37805a24323K38939J42910k50758m55314k94628j24245k51989m62323l48497Q0991
$$ -124323 114616 257526 6768 -448546 -743174 -867419 -1119408 -1581731 -1930228 -1849237
37795a849237M34748N04445M55577M15323K53808m1091j49176R2953L02208P3096
$$ -1849237 -1414489 -910044 -454467 -39144 214664 173573 24397 117350 419558 492654
37785D92654l55863m46098j64945R2732J86319J87903j32109r15960j397949n62208
$$ 492654 136791 -309307 -474252 -381520 -195201 -7298 -139407 -1055367 -2453316 -3015524
37775c015524J147251J906927Q59246o38469q74036K953N80096K82872k41435
$$ -3015524 -1868273 38654 897900 259431 -614605 -611652 -31556 251316 9881
37766I881m09867k65304M9492M04260L95077j73178o62413l40915M10653N83564
$$ 9881 -399986 -665290 -615798 -211538 183539 10361 -652052 -992967 -582314 1250
37756A250R8650j90318k1403n0570m61290m93054J68734O75969L74520j10471
$$ 1250 99900 -90418 -111821 -162391 -623681 -1116735 -948001 -272032 102488 -7983
37746g983K5061M09753K10399m16301o26182k68396M8543P8091J54087L27773
$$ -7983 17078 426831 637230 220929 -405253 -673649 -625106 -547015 -392928 -65155
37736f5155K08180k12436l91575j21061J32637M5659o9264O6750J59520o4573
$$ -65155 143025 -69411 -460986 -582047 -449410 -403751 -473015 -406265 -246745 -311318
37726c11318k65204n1367K90937K71438O7491J91490M81569K67322m25116p11235
$$ -311318 -576522 -627889 -336952 -65514 1977 193467 675036 942358 517242 -193993
37716a93993j93221L24783J716p74873r69565l44101L98674O82430N46940J77429
$$ -193993 -387214 -62431 -60715 -835588 -1805153 -2149254 -1750580 -1068150 -521210 -343781
37706c43781l18754o15904l44692K51129M26434n2162n23456l45005K68505O44112
$$ -343781 -662535 -1278439 -1623131 -1372002 -945568 -997730 -1521186 -1866191 -1597686 -953574
37696i53574N10400J24454j68962k01531k3417J01976m3209k63335j44026K88948
$$ -953574 -443174 -318720 -487682 -689213 -712630 -610654 -653863 -917198 -1061224 -772276
37686g72276N13902K72796p1947j61286j28557j66952j15920J22391K24354k8637
$$ -772276 -258374 14422 -57525 -218811 -347368 -514320 -630240 -507849 -283495 -312132
37676c12132k76989j34428J60827J66531m1385j14161o4153o8947L2029L87466
$$ -312132 -589121 -723549 -562722 -396191 -437576 -551737 -615890 -684837 -652808 -265342
37666b65342N70371J18436n46157n48104J31913N80322K68830k99435m49953j72654
$$ -265342 305029 423465 -122692 -670796 -538883 41439 310269 10834 -439119 -611773
37656f11773J63767L60179L49325P4497l00927m25399k26059k0493j6494o1489
$$ -611773 -448006 -87827 261498 335995 35068 -390331 -616390 -636883 -653377 -714866
37646g14866k2195j2483p5209l0806J67176K92684K37601J70820J52047M403k47594
$$ -714866 -737061 -749544 -824753 -855559 -688383 -395699 -158098 12722 164769 169172 -78422
37635g8422k81847o6618m4978l90436n84898k11034K91919K70341r1604p7452
$$ -78422 -360269 -426887 -471865 -862301 -1447199 -1658233 -1366314 -1095973 -1187577 -1265029
37625a265029L78434N82402J96722k57114k31408J12520L20959L04532J93922
$$ -1265029 -886595 -304193 -107471 -364585 -595993 -483473 -162514 142018 335940
37616C35940n3327m43973o38449l42208J66161L73602K70600K43583L20517J42202
$$ 335940 282613 -161360 -799809 -1142017 -975856 -602254 -331654 -88071 232446 374648
37606C74648k55759l18017R9095L22517j30050o81278m89968K52032N83070J73161
$$ 374648 118889 -199128 -100033 222484 92434 -588844 -1078812 -826780 -243710 -70549
37596g0549l25382l61004j53312o5638R483K53899M23834K00358k62782n18043
$$ -70549 -395931 -756935 -910247 -975885 -966402 -712503 -288669 -88311 -351093 -869136
37586h69136l61097N2327M20289M58383J09632k67312k29673J11415J90871j24645
$$ -869136 -1230233 -1177906 -757617 -299234 -189602 -456914 -686587 -575172 -384301 -508946
37576e08946k83234L3402L25052Q5730l30103k87970R8391K54277J61746K67981
$$ -508946 -792180 -758778 -433726 -347996 -678099 -966069 -867678 -613401 -451655 -183674
37566a83674N23558L98587r2465k67167Q2371K60496j88984o64594m62407N0185
$$ -183674 339884 738471 646006 378839 461210 721706 532722 -131872 -594279 -544094
37556e44094K7045m59847n50591m1440K80518j5104k51988J80628O78673L41055
$$ -544094 -517049 -976896 -1527487 -1568927 -1288409 -1303513 -1555501 -1374873 -696200 -355145
37546c55145m38707m18679N26417J070350M14342m84602l79940M25351O81392
$$ -355145 -793852 -1212531 -686114 384236 798578 313976 -65964 359387 1040779
37537A040779R2783m64313l97921k3269K65040M71491N00146O5017o22966q47314
$$ 1040779 1133562 669249 271328 248059 513099 984590 1484736 1549753 926787 79473
37527G9473l97554P2155K4825k45099k42034l0246N9997K0290M6170J70707L09898
$$ 79473 -318081 -245926 -221101 -466200 -708234 -738480 -678483 -658193 -612023 -441316 -131418
37516a31418L79035K33996j27325k93256Q3116N32437K33295o65853j047539m12914
$$ -131418 247617 481613 354288 61032 144148 676585 909880 244027 -803512 -1216426
37506a216426M16766N77939K58807J2096j51219l46816k89708J15329L46905R8064
$$ -1216426 -799660 -221721 37086 49182 -102037 -448853 -738561 -623232 -276327 -178263
37496a78263j52074l2980L1920k55239l29420J75638M99047m4924p29180n07875
$$ -178263 -330337 -363317 -331397 -586636 -916056 -740418 -241371 -286295 -1015475 -1523350
37486a523350K25027L37237r6954l2958O52578J003354O46367J99067l1461l90864
$$ -1523350 -1298323 -961086 -1058040 -1090998 -438420 564934 1211301 1410368 1378907 988043
37476I88043p79152n63469J25140K91483l24365p45023l45287J85288Q0205l13894
$$ 988043 208891 -354578 -229438 62045 -262320 -1007343 -1352630 -1167342 -1087137 -1401031
37466a401031k95406Q2019L85436N92057P88165O72061P8276m67506m06347m305
$$ -1401031 -1696437 -1614418 -1228982 -636925 151240 823301 901577 434071 27724 23419
37456B3419P7206k19788l90232k09331M4196J34448J41749J65303J36603J9222
$$ 23419 100625 -119163 -509395 -718726 -674530 -540082 -398333 -233030 -96427 -77205
37446g7205o7941m7423m5255k01993l64691j67128M42703R20201O87769o8259
$$ -77205 -145146 -192569 -237824 -439817 -804508 -971636 -528933 391268 1079037 1010778
37436A010778n85298n56621m43717n75323n72536q9492M66258N38730K70608J18067
$$ 1010778 425480 -131141 -574858 -1150181 -1722717 -1812209 -1345951 -807221 -536613 -418546
37426d18546O3459r5178r7220L28222P02986L78955l40594n50488q6327L52750
$$ -418546 -355087 -450265 -547485 -219263 483723 862678 522084 -28404 -114731 238019
37416B38019L38540J00853j66966m90206n89821j00932N72627N20268l41784j008601
$$ 238019 576559 677412 510446 20240 -569581 -670513 -97886 422382 80598 -928003
37406i28003p25515J12941O58413N82608J35732k23738j14769L63043N29108j7345
$$ -928003 -1653518 -1540577 -882164 -299556 -163824 -387562 -502331 -139288 389820 372475
37396C72475n94702k72182O24317Q26748O090p26351m93094J80970L65480M3566
$$ 372475 -222227 -494409 129908 956656 962746 236395 -256699 -75729 289751 333317
37386C33317j78516p2886R8693J08705l6578j87451j38129J27154K67796K5178
$$ 333317 154801 81915 180608 289313 252735 65284 -72845 54309 322105 347283
37376C47283k79137j83717J20218P4017k91285m15431j59538P3878J28673K05340
$$ 347283 68146 -115571 4647 78664 -212621 -628052 -787590 -713712 -585039 -379699
37366c79699K29583m3302l38355j75938J73065J8701n15318o60525l62380k70316
$$ -379699 -150116 -193418 -531773 -707711 -534646 -515945 -1031263 -1691788 -2054168 -2324484
37356b324484l70095L637O61233N89627j70548k86506O38897J217138N11661m12167
$$ -2324484 -2694579 -2690942 -2029709 -1440082 -1610630 -1897136 -1258239 -41101 470560 58393
37346E8393k97821L00642J61207n45400p60268l27797O6562J96557L30789M05801
$$ 58393 -239428 61214 222421 -322979 -1083247 -1411044 -1344482 -1147925 -817136 -411335
37336d11335K08025j5980m217m7943l28574l34739K01373N37202R4216l71002
$$ -411335 -203310 -219290 -223507 -271450 -600024 -934763 -733390 -196188 -101972 -472974
37326d72974N3416P95423O88378p1084l30762K9227O4414m30823o38142l02798
$$ -472974 -419558 375865 1064243 993159 662397 691624 756038 325215 -312927 -615725
37316f15725j10520k17746J43414J079636J381521K64445j226796j491516m44047
$$ -615725 -726245 -943991 -800577 279059 1660580 1925025 698229 -793287 -1237334
37307a237334N65430N77484j4741k87959L4168M42609M08203m252l49403m28067
$$ -1237334 -671904 -94420 -109161 -397120 -362952 79657 487860 483608 134205 -293862
37297b93862l99038l13863q659L80108L23601k96854p65672m25010L82008Q22153
$$ -293862 -692900 -1006763 -1015422 -635314 -311713 -608567 -1374239 -1799249 -1417241 -595088
37287e95088P02889M66296L11489K9679l86032o29216n88924m38995k44280L2363
$$ -595088 107801 574097 885586 915265 529233 -99983 -688907 -1127902 -1372182 -1339819
37277a339819K06399P8617j04907N6155M26946N12767K76766J50593K18656Q7901
$$ -1339819 -1133420 -1054803 -1159710 -1103555 -676609 -163842 112924 263517 482173 570074
37267E70074k98490m30165r1578K06138O2741j30000J11124M54581K44792l65188
$$ 570074 271584 -158581 -250159 -44021 18720 -111280 -156 454425 699217 334029
37257C34029n53064j01898K34591q3171n04979k47223M32896N61103j01738p07578
$$ 334029 -219035 -320933 -86342 -169513 -674492 -921715 -488819 72284 -29454 -737032
37247g37032n61201j6898K06155L4122j08166l6457J10638K44527L27274K49807
$$ -737032 -1298233 -1315131 -1108976 -1074854 -1183020 -1219477 -1108839 -864312 -537038 -287231
37237b87231R6921K11327N94065O66722J31625m21915m07020k02794m10569o72693
$$ -287231 -190310 21017 615082 1281804 1413429 991514 584494 381700 -28869 -701562
37227g01562k90370L73024L47387k71331m25971J14125M25896R0106j75657P5493
$$ -701562 -991932 -618908 -271521 -542852 -968823 -854698 -428802 -338696 -514353 -438860
37217d38860K67145j9282k96584j97490j35849l26668k48711K51976M48806P0678
$$ -438860 -171715 -190997 -487581 -685071 -820920 -1147588 -1396299 -1144323 -695517 -624839
37207f24839k0111O10316R17558N2286r81625p44416L64399P60356Q7661n47358
$$ -624839 -644950 -34634 882924 935210 -46415 -790831 -426432 333924 421585 -125773
37197a25773n06385k97496k99720j63582K45982M25727J46697p7495J47971M40881
$$ -125773 -632158 -929654 -1229374 -1392956 -1146974 -721247 -574550 -652045 -504074 -63193
37187f3193K66474k55745n55908l42970J50705N03153N06878K76300M742k95740
$$ -63193 203281 -52464 -608372 -951342 -800637 -297484 209394 485694 490436 194696
37177A94696o33233p01776j36010P86159J174295N68559m02464p49474k63068
$$ 194696 -438537 -1140313 -1276323 -490164 684131 1252690 850226 100752 -162316
37168a62316L72065M39718n0142m04611m6358O56711O61556l19171j124540o01605
$$ -162316 209749 649467 599325 194714 148356 805067 1466623 1147452 22912 -578693
37158e78693O45579J006921J76957n42374l38978P0349q1157l86246k14621J88238
$$ -578693 66886 1073807 1250764 708390 369412 439761 358604 -27642 -242263 -54025
37148e4025L36618L53358M30959K50017l13866o30726k09314M65379O35919K47775
$$ -54025 282593 635951 1066910 1316927 1003061 372335 163021 628400 1264319 1512094
37138A512094k83565o51216n89108L4810O74476M99190l08486o33609j70109J24792
$$ 1512094 1228529 577313 -11795 23015 697491 1196681 888195 254586 84477 209269
37128B09269j80069j53532P29979J400335Q97493L6557P8998P53434R26727M18939
$$ 209269 29200 -124332 605647 2005982 2903475 2940032 3019030 3772464 4699191 5118130
37118E118130j32705n13009q35764q62083n05833l64488p51830r55087m31212
$$ 5118130 4985425 4472416 3636652 2774569 2268736 1904248 1152418 197331 -233881
37109b33881J38728M2485j82916J58102N36141K21179k52042o1277L35264Q9302
$$ -233881 -95153 -52668 -235584 -77482 458659 679838 427796 366519 701783 791085
37099G91085l93941k31201K76743L05243Q3879K28193K66111m46835j071358m34676
$$ 791085 397144 165943 442686 747929 831808 1060001 1326112 879277 -192081 -626757
37089f26757P39175P36393l91135r76525m32815J76439K05515J48407K02107q2298
$$ -626757 112418 848811 457676 -518849 -951664 -775225 -569710 -421303 -219196 -301494
37079c01494n17691l10327M17951O68582K75824Q0062K93953K29901k11332l21180
$$ -301494 -819185 -1129512 -711561 -42979 232845 312907 606860 836761 625429 304249
37069C04249k7186m1628l78467k46814L42619M09755k23809m99444J02156P33419
$$ 304249 277063 235435 -143032 -389846 -47227 362528 138719 -360725 -258569 474850
37059D74850O13956N3609m01104o97907p74163m06500J15189J84257o0370P8744
$$ 474850 1088806 1142415 741311 43404 -730759 -1137259 -1022070 -837813 -898183 -819439
37049h19439N22268M47013k27324o23848l61492R2J45387L83950O50133M02543
$$ -819439 -297171 149842 -77482 -701330 -1062822 -1062730 -917343 -533393 116740 519283
37039E19283k20178l97039l9548N3925k79746k34536L98703O86200J21889m85568
$$ 519283 299105 -97934 -137482 -83557 -363303 -597839 -199136 487064 608953 123385
37029A23385l44522J58824K93556P7802j03687k37587m44769n49932l47868N5390
$$ 123385 -221137 -62313 231243 309045 205358 -32229 -476998 -1026930 -1374798 -1319408
37019a319408L68947L13164j91971o93254m49770M81548R86468M18557l39502
$$ -1319408 -950461 -637297 -829268 -1522522 -1972292 -1490744 -504276 -85719 -425221
37010d25221k57490K32404K00128o9840J71759M52969r0511q00351l65453P68313
$$ -425221 -682711 -450307 -250179 -320019 -148260 304709 214198 -586153 -951606 -183293
37000a83293R15117p2660o30292j43144K90727K4073k05181N7263K02082m7705
$$ -183293 731824 659164 28872 -114272 176455 200528 -4653 52610 254692 206987
36990B06987j03116J76085J78715r4107Q3160O12496N15443k72720o70563l10906
$$ 206987 103871 279956 458671 364564 447724 1060220 1575663 1302943 632380 321474
36980C21474N84m5322J55307N70158L43558m62983p11064j63801J47389j00251
$$ 321474 322058 276736 432043 1002201 1345759 882776 171712 7911 155300 55049
36970E5049n4181L85864J72646p71105j048513j50886O00897L03212j97094q6232
$$ 55049 868 386732 559378 -211727 -1260240 -1411126 -810229 -507017 -704111 -790343
36960g90343J09310p2013m7403M29108N48615K6146k08552K45674M74022M4760
$$ -790343 -681033 -753046 -800449 -371341 177274 203420 -5132 240542 714564 759324
36950G59324j27979L67798M98690k78430q75608n01510n2867l57448o27234r788
$$ 759324 631345 999143 1497833 1219403 343795 -157715 -210582 -568030 -1195264 -1205052
36940a205052P34878N05785l34321o90369l37582K12238N79768N28346J4980l32507
$$ -1205052 -470174 35611 -298710 -989079 -1326661 -1114423 -534655 -6309 8671 -323836
36930c23836J28315P43610L30084o73477o61962L46799N82999l67894p78365R9212
$$ -323836 -195521 548089 878173 204696 -457266 -110467 472532 104638 -673727 -574515
36920e74515O75627k5298n64758K26970J082623N91828l95167n20966k22566l88544
$$ -574515 101112 75814 -488944 -261974 820649 1412477 1017310 496344 273778 -114766
36910a14766m35046L25558R38830L92482m26507k65922K76054k9770p62254o96963
$$ -114766 -549812 -224254 714576 1107058 680551 414629 690683 660913 -101341 -798304
36900g98304J0171K86395K7368p4146Q8768J80839K80912M91105M57892J51852
$$ -798304 -788133 -501738 -474370 -548516 -459748 -278909 2003 493108 951000 1102852
36890A102852J34287L24540j68354j205212j246396J49844J211091O23930m06524
$$ 1102852 1237139 1561679 1393325 188113 -1058283 -908439 302652 926582 520058
36881E20058k72323N03096N38427l7394k56280j49568k20844j17949N87353J206061
$$ 520058 247735 750831 1289258 1251864 995584 846016 625172 507223 1094576 2300637
36871B300637R37337K27674p6657n9181j87320l85369n27462q24007j030237m89183
$$ 2300637 3237974 3465648 3388991 3329810 3142490 2757121 2229659 1405652 375415 -113768
36861a13768M76683O72928L4050j78999L36176M17843k24313l99439J42274J10591
$$ -113768 362915 1035843 1069893 890894 1227070 1644913 1420600 1021161 1163435 1274026
36851A274026o51345n27128P68741J223774N319r12991j82531O67330J91886n03522
$$ 1274026 622681 95553 864294 2088068 2093387 1180396 997865 1665195 1857081 1353559
36841A353559k05002J64661k36795l19734N16897P43321m06545j070586m363J008570
$$ 1353559 1148557 1313218 1076423 756689 1273586 2016907 1610362 539776 535413 1543983
36831A543983L18948p23682m91691N9029k34312k60476Q28610J366002K09735
$$ 1543983 1862931 1139249 647558 706587 472275 211799 1040409 2406411 2616146
36822B616146p40596Q6593R01170q0988j136020k22202J100404M90628r56284
$$ 2616146 1875550 1962143 2863313 2782325 1646305 1424103 2524507 3015135 2058851
36813B058851r08861Q9414K17700j25401J94472L03956o54004j101990J31319
$$ 2058851 1149990 1239404 1457104 1331703 1526175 1830131 1176127 74137 205456
36804B05456J091232R5571r19510P8093J282743L98609j016336n44791O14329
$$ 205456 1296688 1392259 472749 550842 1833585 2232194 1215858 671067 1285396
36795A285396K84399l93853M73338J448952N24216p72932k63437O98965J09072
$$ 1285396 1569795 1175942 1649280 3098232 3622448 2849516 2586079 3285044 3394116
36786C394116o39753K07280R42465j13164q54577M79683J362571k28023j417886
$$ 3394116 2754363 2961643 3904108 3790944 2936367 3416050 4778621 4550598 3132712
36777C132712K23714J702828L03246q89587R84531K553083O57977j072544Q93177
$$ 3132712 3356426 5059254 5362500 4472913 5457444 8010527 8668504 7595960 8489137
36768H489137K814055J021933l38205K661369N285345L071319J307073N226120
$$ 8489137 11303192 12325125 11986920 14648289 19933634 23004953 24312026 29538146
36760B9538146R434590Q679269R248252J6261821K1019996J7064293J5753592
$$ 29538146 38972736 47652005 56900257 73162078 94182074 111246367 126999959
36753A26999959K6187133L5322745L4288297M5986389Q6846483J14846904P1288753
$$ 126999959 153187092 188509837 222798134 268784523 355631006 470477910 541766663
36746E41766663k1689794o7021676k1668281L6578311J4546465o8806281j17212526
$$ 541766663 520076869 453055193 431386912 467965223 482511688 413705407 296492881
36739B96492881r1272614m3236618k5524560k8529925k2854150j0868710q972199
$$ 296492881 205220267 161983649 136459089 107929164 85075014 74206304 65234105
36732F5234105j3027933j0000108l300854l283809o836964n224614r94157j306279
$$ 65234105 52206172 42206064 38905210 35621401 28784437 23559823 22565666 21259387
36724B1259387l737780k246476P29936j11960k388641j422139M43555q00179k464894
$$ 21259387 17521607 15275131 16005067 15893107 13504466 12082327 12525882 11725703 9260809
36715I260809p48381J349260j87779k418580j042235J456544Q01888j038501k03633
$$ 9260809 8512428 9861688 9673909 7255329 6213094 7669638 8471526 7433025 7229392
36706G229392J428539K70649j619892m33835J941021J421446o15504n6211K330523
$$ 7229392 8657931 8928580 7308688 6874853 8815874 10237320 9621816 9565605 11896128
36697A1896128K642091J025488Q42185K327436K894284K506093L404885N326900
$$ 11896128 14538219 15563707 16405892 18733328 21627612 24133705 27538590 32865490
36689C2865490N696934M003206K034312M49743j462143l424636m546295n105280
$$ 32865490 38562424 42565630 44599942 45049685 43587542 40162906 35616611 30511331
36681C0511331n539700n058416l438166k327404k566097k435660q69769J56151
$$ 30511331 24971631 19913215 16475049 14147645 11581548 9145888 8276119 8432270
36673H432270r57056k289381j595623r1070M7121m76876J7508P10650Q1021q39039
$$ 8432270 7475214 5185833 3590210 3499140 3546261 3069385 3086893 3797543 3878564 3039525
36663C039525l55025N65872J28678q49894n55860L88200K84515l66815q8015N23707
$$ 3039525 2684500 3250372 3379050 2529156 1973296 2361496 2646011 2279196 2191181 2714888
36653B714888M9562q10946n77782P3400k85467q46839o7200J119600P71376m83240
$$ 2714888 2764450 1953504 1375722 1449122 1163655 316816 249616 1369216 2140592 1657352
36643A657352n45400M02305M63489l84649m75887K61803L12825m01412m44886
$$ 1657352 1111952 1514257 1977746 1593097 1117210 1379013 1691838 1290426 845540
36634H45540K83455L81132l39699n24017J94660O64754M05985K24239M56692N01792
$$ 845540 1128995 1510127 1170428 646411 841071 1505825 1911810 2136049 2592741 3094533
36624C094533K41271K17638L42648J1954n41061n12137k7146N2472l58107n95080
$$ 3094533 3335804 3553442 3896090 3908044 3366983 2854846 2827700 2880172 2522065 1926985
36614A926985n12963m37169k31680L09305O07842J33647m40535k23638L44099
$$ 1926985 1414022 976853 745173 1054478 1662320 1795967 1355432 1131794 1475893
36605A475893K79146k32981l31679q0786j20726k94533q1645J48409k11849o31132
$$ 1475893 1755039 1522058 1190379 1109593 988867 694334 612689 761098 549249 -81883
36595h1883k09216O44305P84645J86240k11065j53039j80632l87431l68461j64196
$$ -81883 -291099 353206 1137851 1324091 1113026 959987 779355 391924 23463 -140733
36585a40733j20823j11555J14956K70967J49372K50937P91725Q96590l6740j000524
$$ -140733 -261556 -373111 -258155 12812 162184 413121 1204846 2101436 2064696 1064172
36575A064172p50563K28032N56297J10723j48708K1381J8734k65640l47322j71867
$$ 1064172 313609 541641 1097938 1208661 1059953 1081334 1100068 834428 487106 315239
36565C15239j00496j32493q7388j47842l66080k34351L90738P08751K44410k19486
$$ 315239 214743 82250 -5138 -152980 -519060 -753411 -362673 346078 590488 371002
36555C71002o603K01160l09593p96853l35047M40274M31009R370J96694P23911
$$ 371002 364399 565559 255966 -540887 -875934 -435660 -4651 4719 201413 925324
36545I25324O36731J42629J12184L39165L7796m62126k66938L01112K12584l91695
$$ 925324 1562055 1704684 1816868 2156033 2193829 1731703 1464765 1765877 1978461 1586766
36535A586766n41978k56276k89268m62447m6005N27568K13843n96763n11195M49599
$$ 1586766 1044788 788512 499244 36797 -9208 518360 732203 135440 -375755 73844
36525G3844Q00227P7565m96647j48189L81316L40718K9641j21890k31196l09527
$$ 73844 874071 951636 454989 306800 688116 1028834 1058475 936585 705389 395862
36515C95862p8120K71336J98698j54197j36273J66347L0954n03051n72442L7609
$$ 395862 317742 589078 787776 633579 497306 663653 694607 191556 -380886 -343277
36505c43277N51322M99486K40855N8138j66748k71692Q9056N66417M14915k53692
$$ -343277 208045 707531 948386 1006524 839776 568084 657140 1223557 1638472 1384780
36495A384780n83672l68320k16724l14695k01989J38078J58873j47137j78584
$$ 1384780 801108 432788 216064 -98631 -300620 -162542 -3669 -150806 -329390
36486c29390J10943J24735j81029j94065J13555O0461m16357n39680q8414K00251
$$ -329390 -218447 -93712 -274741 -468806 -355251 -294790 -711147 -1250827 -1339241 -1138990
36476a138990j0686r7821K58836M08211o8833n00533j69513N66469Q66017N35651
$$ -1138990 -1149676 -1247497 -988661 -580450 -649283 -1149816 -1319329 -752860 113157 648808
36466F48808K5227k62710k62824j80090l03244n67882m21099L68244J022957O66682
$$ 648808 674035 411325 148501 -31589 -334833 -902715 -1323814 -955570 67387 734069
36456G34069k80433n84208n045M50324J81787k13335j10242K00823K03827l6092
$$ 734069 453636 -130572 -135617 314707 496494 283159 172917 373740 577567 541475
36446E41475k30481l65694m21940j65933L95466Q12871P32932K75872k44038n88004
$$ 541475 310994 -54700 -476640 -642573 -247107 565764 1298696 1574568 1330530 742526
36436G42526n74000k30483O5999L8504n2731J06591K53613L1455k25059J4683
$$ 742526 168526 -61957 4042 42546 -10185 96406 350019 381474 156415 171098
36426A71098M75671M85613J71197K29324O08042N08822k25725p84289o50970k47479
$$ 171098 646769 1132382 1303579 1532903 2140945 2649767 2424042 1639753 988783 741304
36416G41304n7405K9960K04080L01048J80636l5075k49860m18164l27210P2006
$$ 741304 683899 713859 917939 1218987 1399623 1364548 1114688 696524 369314 441320
36406D41320K80057j23882o93043p22387l56059j84904q8748L97688Q55628M54945
$$ 441320 721377 597495 -95548 -817935 -1173994 -1358898 -1447646 -1049958 -194330 260615
36396B60615m54249o49495R484M06485J33228O3634N62840P23601Q2439m02406
$$ 260615 -193634 -843129 -833645 -427160 -293932 -230298 332542 1056143 1138582 736176
36386G36176k2518L56290k29412j118946j039911p9265O01046N31236K61593J82779
$$ 736176 713658 1069948 840536 -278410 -1318321 -1397586 -796540 -265304 -3711 179068
36376A79068N5920k81431n12592k93226K82958P20944N24540k45126q03245m55917
$$ 179068 234988 -46443 -559035 -852261 -569303 151641 676181 431055 -372190 -828107
36366h28107L98152O86955J76185k18200J07837N39690L19452k53676m15195j51737
$$ -828107 -429955 257000 433185 214985 322822 862512 1181964 928288 513093 361356
36356C61356m5210k55604l91402k24545O3754K77321L97939M30789L66299K35752
$$ 361356 316146 60542 -330860 -555405 -491651 -214330 183609 614398 980697 1216449
36346A216449L2489k67363m89123l32564J65324N11378L15584k27672n82118m38165
$$ 1216449 1248938 981575 492452 159888 325212 836590 1152174 924502 342384 -95781
36336i5781M1182L88037K43205k31328m47763j11592L42784L35999p6531m00427
$$ -95781 -54599 333438 576643 345315 -102448 -214040 128744 464743 388212 -12215
36326a2215m13398k14824J38453M92601M14219j97314o37162k81640L83193M72688
$$ -12215 -425613 -640437 -501984 -9383 404836 207522 -429640 -711280 -328087 144601
36316A44601R4546J0706K21483R9836k44556r9350L62914J93965n51312o72312
$$ 144601 239147 249853 471336 571172 326616 227266 590180 784145 232833 -439479
36306d39479J37180O41554R2690n65761l65275J77232K19667L5691J64611K14088
$$ -439479 -302299 339255 431945 -133816 -499091 -321859 -102192 -66501 98110 312198
36296C12198k45040n32361M8876P39899L72523o63651r50296k16165M33053L59695
$$ 312198 67158 -465203 -416327 323572 696095 32444 -917852 -1134017 -700964 -341269
36286c41269J21494K18069L06602L2034k75122j84768J52550L04890J66471j8325
$$ -341269 -219775 -1706 304896 336930 61808 -122960 29590 334480 500951 482626
36276D82626m4004r39j64535n68594p62135l25124L95476O10652K38067K3763
$$ 482626 438622 437683 273148 -295446 -1057581 -1382705 -987229 -376577 -138510 -114747
36266a14747K97470M55959J12789j60317Q9947K73881j98216p25658m25217L73409
$$ -114747 182723 638682 751471 591154 681101 954982 756766 31108 -394109 -20700
36256b0700O57762L05640N682l7904j87525m21359m11015l33688n18104n29495
$$ -20700 637062 942702 948384 910480 722955 301596 -109419 -443107 -961211 -1490706
36246a490706K06355J089275R87921J00656k61381J92198L57175k18423n25080
$$ -1490706 -1284351 -195076 792845 893501 632120 824318 1181493 963070 437990
36237D37990M2273N20784K7558o94419n23767K09454L76437j10914l28482J15842
$$ 437990 480263 1001047 1028605 334186 -189581 19873 396310 285396 -43086 72756
36227G2756O19397N77065O0851m63189n87632k41953J65266J51909r9375N8532
$$ 72756 692153 1269218 1330069 866880 279248 37295 202561 354470 255095 313627
36217C13627N74959N55926k55942q10869l44495K91400j7751p53669n90883L88672
$$ 313627 888586 1444512 1188570 377701 33206 324606 306855 -446814 -1037697 -649025
36207f49025Q26467K71048k77365j33125J78949J46090J01633L04008K95122j70610
$$ -649025 177442 448490 171125 38000 216949 363039 464672 768680 1063802 893192
36197H93192m83151j59184K95866K08077k14380l37014q8149J60596K77332L23746
$$ 893192 410041 250857 546723 754800 540420 203406 115257 275853 553185 876931
36187H76931J83285j90068m33708k06555K52239M17310J44786k75238n23981m52646
$$ 876931 1060216 870148 436440 229885 482124 899434 1044220 768982 245001 -207645
36177b07645j03953K61924L84881L29619L09269K44400m2003k96928j59774P2700
$$ -207645 -311598 -49674 335207 664826 974095 1218495 1176492 879564 719790 792490
36167G92490j61230n68295l21292M07174M90844k35120m92926L50590J094809
$$ 792490 631260 62965 -258327 148847 639691 404571 -88355 262235 1357044
36158A357044N70546n30522q60532m23207j11970q4257R6289L41420K98720K04059
$$ 1357044 1927590 1397068 536536 113329 1359 -82898 13391 354811 653531 857590
36148H57590L83287M53931L4679l71028j84857K37218L38736K95245L07787k1927
$$ 857590 1240877 1694808 1729487 1358459 1173602 1410820 1749556 2044801 2352588 2330661
36138B330661o43568o05800K76540P41041K55120J27443J020251J472951P56739
$$ 2330661 1687093 1081293 1357833 2098874 2353994 2481437 3501688 4974639 5731378
36129E731378P46361K506045L712642K623746J694298L235878M704513L772307
$$ 5731378 6477739 8983784 12696426 15320172 17014470 20250348 24954861 28727168
36121B8727168M869187J2814665K1416104J8008091J096270j5366620j8768083
$$ 28727168 33596355 46411020 67827124 85835215 86931485 71564865 52796782
36114E2796782j1017025j086526O841827J1326273P971461m395926j6441811j7251639
$$ 52796782 41779757 40693231 47535058 58861331 66832792 62436866 45995055 28743416
36106B8743416q717962k294758k719410m024184j717732O17547o13587k594998
$$ 28743416 20025454 17730696 15011286 10987102 9269370 9886917 9273330 6678332
36098F678332j847355j89905n50425j566210p00314R05269P93175l81552n11112
$$ 6678332 4830977 4641072 4090647 2524437 1824123 2729392 3522567 3141015 2629903
36089B629903P9381k15186r94342p77406J45139M37323J47103J40146K10576k16138
$$ 2629903 2709284 2494098 1499756 722350 867489 1304812 1451915 1592061 1802637 1586499
36079A586499n85178k66583Q484m90577q66972j04617R25107P95230j22354m57613
$$ 1586499 1001321 734738 743222 252645 -614327 -718944 206163 1001393 879039 421426
36069D21426j60342k03724o07687n18866J00656M10218J34882j65756j24808J07014
$$ 421426 261084 57360 -550327 -1069193 -968537 -558319 -423437 -589193 -714001 -606987
36059f06987L71604N78069N17511J62489j79524l42520m22013k78749K81856P46476
$$ -606987 -235383 342686 860197 1022686 843162 500642 78629 -200120 81736 828212
36049H28212L84104l74605l62703L24783L43720n20443q25249p568N10150j87911
$$ 828212 1212316 837711 475008 799791 1143511 623068 -202181 -209749 300401 112490
36039A12490q28228j70781Q19199O89503q6216k13370J34383m189l92716j66796
$$ 112490 -715738 -886519 -67320 622183 535967 322597 456980 452791 60075 -106721
36029a06721L48552J84476m58248o03013k48931j63595l18890n0957N03892N63186
$$ -106721 241831 426307 -31941 -634954 -883885 -1047480 -1366370 -1417327 -913435 -350249
36019c50249J07218j43161k670P0861k1330M1439K28392K56610K36848L87746
$$ -350249 -243031 -386192 -388862 -318001 -339331 -297892 -69500 187110 423958 811704
36009H11704M34614J03777j98589l6087J87845j22840o92211q23949m86682j31248
$$ 811704 1246318 1350095 1151506 1115419 1303264 1180424 488213 -335736 -822418 -953666
35999i53666J17938L15378K52084q7853j97270J11888K18903k16548m94704o0558
$$ -953666 -835728 -520350 -268266 -356119 -553389 -441501 -222598 -439146 -933850 -994408
35989i94408M36733K70603n7634K23810P13307N80726M1407j57392o9720j45993
$$ -994408 -557675 -287072 -344706 -120896 592411 1173137 1214544 1057152 987432 841439
35979H41439j56238K26446M33113r0422o28573k46135N14786M69605k07615l86315
$$ 841439 685201 911647 1344760 1254338 625765 379630 894416 1364021 1156406 770091
35969G70091J1199J4566n79746r29765o26316r4676L99601Q76822R25277J56617
$$ 770091 781290 795856 216110 -713655 -1339971 -1434647 -1035046 -158224 767053 923670
35959I23670p40385o85130J43965N76131K43686j42347j97538k47623l30621o9804
$$ 923670 183285 -501845 -357880 218251 461937 319590 122052 -125571 -456192 -525996
35949e25996M02948N23840L09885K51787K86437n5767o02915p19018l90218j07094
$$ -525996 -123048 400792 710677 962464 1248901 1193134 590219 -128799 -519017 -626111
35939f26111Q2979L47861K96508l49304p58554o9557R48795Q79394m3754l49169
$$ -626111 -543132 -195271 101237 -248067 -1006621 -1076178 -127383 752011 708257 359088
35929C59088J80651L31456k24528m19954J05431L27290k06431n33337p2501L72717
$$ 359088 539739 871195 646667 226713 332144 659434 453003 -80334 -152835 219882
35919B19882J63685j25588k561J2342m15031o19915j98839J41701j13113k96626
$$ 219882 383567 257979 255418 267760 -147271 -767186 -966025 -824324 -937437 -1234063
35909a234063J89615P09942M72554j58224m07856l25664l19401k04321L13908
$$ -1234063 -1044448 -334506 138048 -20176 -428032 -753696 -1073097 -1277418 -963510
35900i63510Q14078P34172K98600Q7880J20225N0980j41394k89869m38210n65761
$$ -963510 -149432 584740 883340 971220 1091445 1142425 1001031 711162 272952 -292809
35890b92809l76634J23253L48655j9346m17479k23421K59362K75468k53514o74629
$$ -292809 -669443 -546190 -197535 -216881 -634360 -857781 -598419 -322951 -576465 -1251094
35880a251094m88461J67641P76842Q79703M25605j22535k47168r321R2056j10291
$$ -1251094 -1739555 -1571914 -795072 84631 510236 387701 140533 131212 223268 112977
35870A12977k85971k38460j51135j09844M7680K75675K86244J09447J09252L07497
$$ 112977 -172994 -411454 -562589 -672433 -624753 -349078 -62834 46613 155865 463362
35860D63362K98122j7522k36899j64141p8631j20443n7408J34695J16212j61826
$$ 463362 761484 743962 507063 342922 264291 143848 86440 221135 337347 175521
35850A75521k85859r9627L3753p1042r7715J30383K97970J78879J2568K6225Q7363
$$ 175521 -110338 -209965 -176212 -247254 -344969 -214586 83384 262263 274831 301056 388419
35839C88419N6561O046o9750k77677m71935l83737j26255k6969j7645J78948L77060
$$ 388419 444980 451026 381276 103599 -368336 -752073 -878328 -905297 -922942 -743994 -366934
35828c66934K00075j07503j8720K48022N8776l59076j65321N06969N44952k73273
$$ -366934 -166859 -274362 -293082 -45060 13716 -345360 -510681 -3712 541240 267967
35818B67967p53281j58381O44966O08267l3865m79375n67485m85073j25728M58843
$$ 267967 -485314 -643695 1271 609538 575673 96298 -471187 -956260 -1081988 -623145
35808f23145O97139L21353j03373r8115j8309k68909n05339k89763J19474K75919
$$ -623145 73994 395347 291974 193859 175550 -93359 -598698 -888461 -768987 -493068
35798d93068K22955J19992j23737l39647l1847O23328O22844l19462j022757n13338
$$ -493068 -270113 -150121 -273858 -613505 -645352 -22024 600820 281358 -741399 -1254737
35788a254737M38944N08860k02937n49271j71368K46571K79740K11500K50400
$$ -1254737 -815793 -306933 -509870 -1059141 -1230509 -983938 -704198 -492698 -242298
35779b42298K13339L4649p5651j0273J42219K84369K80714L343l32557k90673
$$ -242298 -28959 5690 -69961 -80234 61985 346354 627068 630411 297854 7181
35769G181P0291J55471j95966l86824q8655J97186J00044L9820K92818L00425
$$ 7181 77472 232943 36977 -349847 -438502 -241316 -141272 -101452 191366 491791
35759D91791k76702o75181j68767O56578Q07419M03398K07009K32014j5206l91353
$$ 491791 215089 -460092 -628859 27719 835138 1238536 1445545 1677559 1662353 1271000
35749A271000m01134k39144l80827m97064L107O56245M82504l30806o26288j37371
$$ 1271000 869866 630722 249895 -247169 -244062 412183 894687 563881 -62407 -199778
35739a99778J86368j47656m82088l07902n6639j26281j52934J81702M66373K81602
$$ -199778 -13410 -161066 -643154 -951056 -1007695 -1133976 -1286910 -1105208 -638835 -357233
35729c57233m8899P837L80550N76371L40867j67631n78013n43281r6748K22751
$$ -357233 -406132 -398295 -17745 558626 899493 731862 153849 -389432 -486180 -263429
35719b63429J2094l13715n0981O44632Q63714K69053m53009o71725n75597n20061
$$ -263429 -251335 -565050 -616031 28601 892315 1161368 708359 36634 -538963 -1059024
35709a059024l46228J36954N63481M94110J19709n2582N2290J30985R5380J21621
$$ -1059024 -1405252 -1268298 -704817 -210707 -90998 -143580 -91290 39695 135075 256696
35699B56696K07089J40811o6969j20959P3453J65752j77515p30250q99220m57179
$$ 256696 463785 604596 537627 416668 490121 655873 478358 -251892 -1151112 -1608291
35689a608291J68968M53714L74328K30214J01004j09083k27258L0525M22713L19658
$$ -1608291 -1439323 -985609 -611281 -381067 -280063 -389146 -616404 -585879 -163166 156492
35679A56492l06108o42091j72929N04406N32312L099l15172j44048R6584Q2878
$$ 156492 -149616 -791707 -964636 -460230 72082 75181 -239991 -384039 -287455 -204577
35669b04577o0852j63128j95493o4967K82057N47223L57727j09242k41599J83403
$$ -204577 -265429 -428557 -624050 -689017 -406960 140263 497990 388748 147149 330552
35659C30552O84602O84356J17241o13771r94256p14716L4634N67208L42067l43583
$$ 330552 1015154 1699510 1816751 1202980 208724 -505992 -471358 95850 437917 94334
35649I4334o31816j56833M95890N30861j06659p20790o81282o9283M88629N20947
$$ 94334 -537482 -694315 -198425 332436 225777 -495013 -1176295 -1245578 -756949 -236002
35639b36002J49121j78762k30596j01707P6726K37590K34064m2126l63220l51914
$$ -236002 -86881 -265643 -496239 -597946 -521220 -283630 -49566 -91692 -454912 -806826
35629h06826l3262J74299Q7664m0230k9485p002j9028O6861J45629l6159k24670
$$ -806826 -840088 -665789 -578125 -618355 -647840 -654842 -673870 -607009 -461380 -497539 -722209
35618g22209J58621R02168R49617k3041q56789n07883L67145M00179m71159j060539
$$ -722209 -563588 338580 1288197 1265156 408367 -99516 267629 667808 196649 -863890
35608h63890p09564N2566N42186O63526N53598K71651j8857j24079j21439j58054
$$ -863890 -1573454 -1520888 -978702 -315176 238422 510073 491216 367137 245698 87644
35598H7644r8166J50960K30492j54576n91580n13810j29510m7073k27655j49965
$$ 87644 -10522 140438 370930 216354 -375226 -889036 -1018546 -1065619 -1293274 -1443239
35588a443239J83334L10326K41899L71413N28159J49742n60155p05352j02682
$$ -1443239 -1259905 -949579 -707680 -336267 191892 341634 -218521 -923873 -1026555
35579a026555M08932L17878Q9625J36492J56327l5846O204M37118N62448p4954
$$ -1026555 -617623 -299745 -210120 -73628 82699 46853 53057 490175 1052623 977669
35569I77669p83226o78154J5948L97517J85500j61049l04776l08915k41800q8932
$$ 977669 194443 -483711 -467763 -70246 115254 -45795 -350571 -659486 -901286 -990218
35559i90218N3717J14676K04041L27779K54614n343j3846L66536N25519j4287
$$ -990218 -936501 -821825 -617784 -290005 -35391 -40734 -54580 311956 837475 823188
35549H23188o77034n38546K93918Q03996N01003m0736j66337L9341J46704L2404
$$ 823188 146154 -392392 -98474 705522 1206525 1165789 999452 1038793 1185497 1217901
35539A217901j58784k93325k35523J00170M64264L80760k14848p56557p32041
$$ 1217901 1059117 765792 530269 630439 1094703 1475463 1260615 504058 -227983
35530b27983l01590N0217J85293K56743K32012l2782l44445l23137k9424P2349
$$ -227983 -529573 -479356 -294063 -37320 194692 161910 -182535 -505672 -535096 -462747
35520d62747j10242j10466K59819M67607J18077k63230M501N64910M61220l37961
$$ -462747 -572989 -683455 -423636 43971 162048 -101182 -96681 468229 929449 591488
35510E91488p85348l02170M03366M54748k3605l80569m21544k97196K3230M62036
$$ 591488 -193860 -496030 -92664 362084 338479 -42090 -463634 -760830 -737600 -275564
35500b75564M95140j08451n97499j69423O84569P50985r0155o80427l47791K02738
$$ -275564 219576 111125 -486374 -655797 28772 779757 689602 9175 -338616 -135878
35490a35878J68533j26528M3488N33357N72119m5268p02285p91750l11135L10876
$$ -135878 32655 -93873 -50385 482972 1055091 1009823 307538 -484212 -795347 -484471
35480d84471O16059M03078j06718m50280m39541l30270l20648j97400K04270N11929
$$ -484471 131588 534666 427948 -22332 -461873 -792143 -1112791 -1310191 -1105921 -593992
35470e93992K92444j61468j31989M08359O14766j7423p93090o86955K24645Q38016
$$ -593992 -301548 -463016 -595005 -186646 428120 410697 -382393 -1069348 -844703 -6687
35460f687N12659j55163l12757m4129l5424l80368m58175j4659L64957J72525
$$ -6687 505972 350809 38052 -6077 -41501 -421869 -880044 -894703 -529746 -357221
35450c57221k18250j56255K76998M48384J58910j47933j27753N4023J29728R3667
$$ -357221 -575471 -731726 -454728 -6344 152566 4633 -123120 -69097 60631 154298
35440A54298K8424o1256j13844l9957K2738j48329l64351j30409N36492Q96396
$$ 154298 182722 121466 7622 -32335 -9597 -157926 -522277 -652686 -116194 780202
35430G80202M93197q3994m5373L24892O0301q65918j257619m15640O90397P14804
$$ 780202 1273399 1189405 1144032 1468924 1529225 663307 -594312 -1009952 -319555 395249
35420C95249j59873n96083j50158K01418k05895o10198j30818O95147P02995o9992
$$ 395249 235376 -360707 -510865 -309447 -515342 -1125540 -1256358 -561211 141784 71792
35410G1792m79220o4118L73201J65758k44455j76537K28593L94568K14614n155
$$ 71792 -407428 -471546 -98345 67413 -177042 -353579 -124986 269582 484196 479041
35400D79041j40729k69540l41629k60162j06820K3213J87398L41077K24637j89363
$$ 479041 338312 68772 -272857 -533019 -639839 -616626 -429228 -88151 136486 -52877
35390e2877m63326k77613M9932L7732k19647k40222Q0881L53181K93051O9829
$$ -52877 -516203 -793816 -743884 -706152 -925799 -1166021 -1085140 -731959 -438908 -369079
35380c69079J3724K07704M04780K78888j72857m97892k77172K78679N66700M20191
$$ -369079 -355355 -147651 257129 536017 363160 -134732 -411904 -133225 433475 853666
35370H53666K22365J32193j75693p51597j006362n51957J27422L44533J08492
$$ 853666 1076031 1208224 1032531 280934 -725428 -1277385 -1149963 -805430 -696938
35361f96938j23872j61243m9539K26786M87980K62827m55014q18064k02668P19501
$$ -696938 -820810 -982053 -1031592 -804806 -316826 -53999 -509013 -1327077 -1529745 -810244
35351h10244P89680l4294p18148o33737j54253J97613L62581L79281J37999k41088
$$ -810244 -20564 -54858 -773006 -1406743 -1560996 -1363383 -1000802 -621521 -483522 -724610
35341g24610l23903O4883N38458O21629K93377o3726j12968P6226R8977k25153
$$ -724610 -1048513 -983630 -445172 176457 469834 406108 293140 369366 468343 243190
35331B43190m37428m8P24742P33642j40138q09610m98053J02230Q760m63347l37819
$$ 243190 -194238 -194286 530456 1264098 1123960 314350 -183703 -81473 -72713 -536060 -873879
35320h73879L25243N71312J68736j03931J70364M45401K15492k14168k71588J27337
$$ -873879 -548636 22676 191412 87481 257845 703246 918738 704570 432982 560319
35310E60319N80050N99261K7260o51284o57771N4703N60786K42631k86416k46205
$$ 560319 1140369 1739630 1766890 1115606 457835 512538 1073324 1315955 1029539 783334
35300G83334R518k39207o33741l29546L88756M81428q0332l52606j29860j34727
$$ 783334 792852 553645 -80096 -409642 -20886 460542 380210 27604 -102256 -236983
35290b36983m49546k93109M03925P15983L85266K72033O52734N88851l05410r31799
$$ -236983 -686529 -979638 -575713 140270 525536 797569 1450303 2039154 1733744 801945
35280H01945m69095K35711J06134m52663m52851j7968O3498j84118j08971L16958
$$ 801945 332850 568561 674695 222032 -230819 -248787 -185289 -369407 -478378 -161420
35270a61420N13648L19700J05419K3809j17686l57476n06417m48561j73866K32102
$$ -161420 352228 671928 777347 801156 683470 325994 -180423 -628984 -802850 -570748
35260e70748M26042R6954l88395k73685M03284P11299K65028j67067k1801J10964
$$ -570748 -144706 -47752 -436147 -709832 -306548 404751 669779 502712 480911 591875
35250E91875l18845o68496j95546M93809L13913n04930p37740k6349P16882O92112
$$ 591875 273030 -395466 -591012 -97203 216710 -288220 -1025960 -1052309 -335427 356685
35240C56685N0888o14572q27377l47097N48213J022032N82904j73934l84240j43991
$$ 356685 407573 -206999 -1034376 -1381473 -833260 188772 771676 597742 213502 69511
35230F9511j18138k69129k579N70294O21894l8900o05851n06399j14916O1971
$$ 69511 -48627 -317756 -320335 249959 871853 832953 227102 -279297 -394213 -332242
35220c32242J09784K40288K99188J69419R5424J82053P2238m31012q56545o78181
$$ -332242 -222458 17830 317018 486437 581861 763914 836152 405140 -451405 -1129586
35210a129586j26067J28655p2502k38226k3907K82501K24942j62325m07051k12125
$$ -1129586 -1255653 -1126998 -1199500 -1437726 -1461633 -1179132 -954190 -1116515 -1523566 -1735691
35200a735691K05874M21369K80760j1202j66518n6355K23851M00637K38780j42937
$$ -1735691 -1529817 -1108448 -827688 -838890 -1005408 -1061763 -837912 -437275 -198495 -341432
35190c41432l12188o3850K66382K85171J06791O0017O3829j80928n27120n21179
$$ -341432 -653620 -717470 -451088 -165917 -59126 891 64720 -116208 -643328 -1164507
35180a164507j60228J18441J87484K82561L03695j08782o68044n39266L21449
$$ -1164507 -1324735 -1206294 -1018810 -736249 -432554 -541336 -1209380 -1748646 -1427197
35171a427197Q58068M61608p5199J36657O41594M44326l38086o92074k77383K41303
$$ -1427197 -569129 -107521 -182720 -46063 595531 1039857 701771 9697 -267686 -26383
35161b6383L57438K85849K58164P2722l56693o02840k78208L29051N34327R2172
$$ -26383 331055 616904 875068 947790 591097 -11743 -289951 39100 573427 665599
35151F65599m87277n40053o2365L02463J67650m9624J65663N06742K65427m88344
$$ 665599 178322 -361731 -424096 -121633 46017 -3607 162056 668798 934225 445881
35141D45881r22732o64345j97302P9588L26497N57392L89751j06949k25719K19254
$$ 445881 -476851 -1141196 -1338498 -1258910 -932413 -375021 14730 -92219 -317938 -98684
35131i8684M56218N1363l14394p8365J76185j60945n13016j36945M53965L65544
$$ -98684 357534 408897 94503 16138 192323 31378 -481638 -618583 -164618 200926
35121B00926m0408J90260P69329N50001m35207q93294l40819K23473N4484k86050
$$ 200926 160518 350778 1120107 1670108 1234901 341607 788 224261 278745 -7305
35111g305j50645J11288Q180j15968K18779O38129M49492k55584p53421o85133
$$ -7305 -157950 -46662 -38482 -154450 64329 702458 1151950 896366 142945 -542188
35101e42188l10528N6217L36799M81531M08163J92436M2039K7049J6090p6034
$$ -542188 -852716 -796499 -459700 21831 429994 622430 664469 691518 707608 631574
35091F31574j29421j6753J20489j0726l92399n67299k05697L63855N33216K22485
$$ 631574 502153 485400 605889 595163 202764 -364535 -570232 -206377 326839 549324
35081E49324j05348j72739j30263q4253M1359J25257m0582k00161P7170M79142
$$ 549324 443976 271237 140974 56721 98080 223337 182755 -17406 59764 538906
35071E38906K33202n01477o21914J23902N48660n9493o80755k61731M90796L77921
$$ 538906 772108 270631 -351283 -227381 321279 261786 -418969 -680700 -189904 188017
35061A88017j85521K4878P59250O19183n28775j214009o09684L98649P47127M96705
$$ 188017 2496 27374 786624 1405807 877032 -336977 -946661 -548012 199115 695820
35051F95820J57914j74737m95091n49372k78190L6740K71019M71895L85211k17813
$$ 695820 853734 678997 183906 -365466 -643656 -606916 -335897 135998 521209 303396
35041C03396p74091m65104M27155P56168K40130j79334L0046K09408j50542m50287
$$ 303396 -470695 -935799 -508644 247524 487654 308320 338366 547774 397232 -53055
35031e3055r4171M01103K67176k61089m08128p9078J59833R86l36038n24918l60805
$$ -53055 -147226 253877 521053 259964 -148164 -227242 -67409 -66423 -402461 -927379 -1288184
35020a288184J82101P57911Q04229K19672m01502m89487j51824J30256J29663
$$ -1288184 -1106083 -348172 456057 675729 274227 -215260 -367084 -236828 -107165
35011a07165l9763j65578p2802K12936L48453L9913m50470n69805k57378R080
$$ -107165 -146928 -312506 -385308 -172372 176081 215994 -234476 -804281 -1061659 -1052579
35001a052579l3707j61698j80475j52110m5151K58775N35267L93567l9245k20067
$$ -1052579 -1086286 -1247984 -1428459 -1580569 -1625720 -1366945 -831678 -438111 -477356 -697423
34991f97423l1834J23555J00259J42290K03694l3077l61767j84228L85411N15266
$$ -697423 -729257 -605702 -505443 -363153 -159459 -192536 -554303 -738531 -353120 162146
34981A62146J7370l07888n7778J25893j71463l18138J63803N88560K26339m06162
$$ 162146 179516 -128372 -186150 -60257 -231720 -549858 -386055 202505 428844 22682
34971B2682m04705L3148O0078l50432m75785j26257J56032R1761j2128N1521R4611
$$ 22682 -382023 -348875 -288797 -639229 -1115014 -1241271 -1085239 -993478 -1005606 -954085 -859474
34960h59474l863p2964N3007L50811O50037O30735N1934p45973r66254l49542
$$ -859474 -863337 -936301 -883294 -532483 117554 748289 800223 54250 -912004 -1261546
34950a261546L99566N99860M82942N45108N78384J28603m97645n80190j33945
$$ -1261546 -861980 -262120 220822 765930 1344314 1472917 975272 395082 261137
34941B61137J50672L9735O006K97132N03519K41515l01973o93495p02215l36314
$$ 261137 411809 451544 457550 754682 1258201 1499716 1197743 504248 -197967 -534281
34931e34281J79254M20696J44275l25405m34126j00872K71220M05716L50651J38231
$$ -534281 -355027 65669 209944 -115461 -549587 -650459 -379239 26477 377128 515359
34921E15359k44056n22640l15108K16199L83911q6426n45867k36930O11829R61227
$$ 515359 271303 -251337 -566445 -350246 33665 -52761 -598628 -835558 -223729 737498
34911G37498K68361p48103r22008p2203P68533O63887r6631n50335m10532k25008
$$ 737498 1005859 257756 -664252 -736455 32078 695965 599334 48999 -361533 -586541
34901e86541k87803j84077L39371P57963N06218j46266m60217j55864M31058Q23100
$$ -586541 -874344 -1058421 -719050 38913 545131 398865 -61352 -217216 213842 1036942
34891A036942O78886m5016q28675q81222j38067M56409J82981l93486k90538L61551
$$ 1036942 1715828 1670812 842137 -39085 -177152 279257 462238 68752 -221786 139765
34881A39765N48761l1668n59666l79872J60583M43478M20106L24014J32960j93762
$$ 139765 688526 656858 97192 -282680 -122097 321381 741487 1065501 1198461 1004699
34871A004699l46525l8388M70901O40367L12892k00553n68747o62491m54443o0910
$$ 1004699 658174 619786 1090687 1731054 2043946 1843393 1274646 612155 157712 96802
34861I6802J58961o1640l99730j94234N91141J064174N01987n21995p49880M1131
$$ 96802 255763 194123 -205607 -399841 191300 1255474 1757461 1235466 485586 526717
34851E26717O63714J53786r06182j264128o76419M2230L27824L66747L71042K20224
$$ 526717 1190431 1344217 438035 -826093 -1502512 -1460282 -1132458 -765711 -394669 -174445
34841a74445l3466m5755K06207L10791J11517j00081k28100n02717p65555m37300
$$ -174445 -207911 -253666 -47459 263332 374849 274768 46668 -456049 -1221604 -1658904
34831a658904M35051R15971M86958j43499j54784J87463K01981L242J20149L77840
$$ -1658904 -1223853 -307882 179076 35577 -119207 68256 270237 273479 393628 771468
34821G71468J66515m10659o14358k30394J81964K17642O6348k8560r8736j53090
$$ 771468 937983 527324 -87034 -317428 -135464 82178 148526 119966 21230 -131860
34811a31860r7032m303j0431J9387K43989L93941J26330k87473k64977J61370
$$ -131860 -228892 -233195 -243626 -224239 19750 413691 540021 252548 -12429 148941
34801A48941L92033K18273K4767j5556j99160n65356o25790j24765N05467P48240
$$ 148941 540974 759247 784014 768458 569298 3942 -621848 -746613 -241146 507094
34791E07094N74740J88369k82121n96282m50756k82J85504l8045j58857O6799
$$ 507094 1081834 1270203 988082 391800 -58956 -59238 126266 88221 -70636 -3837
34781c837J20545l40631o94225k36398N94832P35474K7178o10267n24549o4322
$$ -3837 116708 -223923 -918148 -1154546 -559714 175760 202938 -407329 -931878 -996200
34771i96200J77971J53903R3228N857j68055k81978k05571n8462M8355K29701
$$ -996200 -818229 -664326 -571098 -565241 -733296 -1015274 -1220845 -1279307 -1230952 -1001251
34761a001251N10784N86965K48432j91388k86889j11147r4498l15181m01892j44516
$$ -1001251 -490467 96498 344930 153542 -133347 -244494 -338992 -654173 -1056065 -1200581
34751a200581K15741L74335K91296P0453j61481k15729j6324J76377Q3257j06876
$$ -1200581 -984840 -610505 -319209 -248756 -410237 -625966 -642290 -465913 -382656 -489532
34741d89532n6958j65m09815r10866m92710Q22308J558061P68945m71179n83887
$$ -489532 -546490 -546655 -956470 -1867336 -2360046 -1537738 20323 789268 318089 -265798
34731b65798K42994N58283m9217n81493m51849k29716l31362k75333K63268P28507
$$ -265798 -22804 535479 486262 -95231 -547080 -776796 -1108158 -1383491 -1120223 -391716
34721c91716O00524J81500q2527k95823n91981o41412k49250J78162K85442K87387
$$ -391716 208808 390308 307781 11958 -580023 -1221435 -1470685 -1292523 -1007081 -719694
34711g19694L63878K00501l20600o27926k89297K42883L51444J77424J69462K33142
$$ -719694 -355816 -155315 -475915 -1103841 -1393138 -1150255 -798811 -621387 -451925 -218783
34701b18783M6919k03136j25151J67343K82925J92794R8478L601q7118L6370L11601
$$ -218783 -171864 -375000 -500151 -332808 -49883 142911 241389 244990 157872 194242 505843
34690E05843K50532k09682l52122J71487N65847J06516n96436n82866j20640o7953
$$ 505843 756375 546693 194571 366058 931905 1038421 441985 -140881 -261521 -329474
34680c29474k20515K46881J010250Q71212j87121p95344l31349K23622N2667k65793
$$ -329474 -549989 -303108 707142 1578354 1391233 595889 264540 488162 540829 275036
34670B75036k2282L41396J41869k83742k15425K04759L02993m880k61348l07289
$$ 275036 252754 594150 736019 452277 236852 441611 744604 739724 478376 171087
34660A71087l30349l20528j32259R9248J51431J16458J25919l5615m89972p44322
$$ 171087 -159262 -479790 -612049 -512801 -361370 -244912 -118993 -154608 -644580 -1388902
34650a388902k95356M42548N78786P5568j65223L08123Q12377O14761J6677k44819
$$ -1388902 -1684258 -1241710 -662924 -587356 -752579 -444456 367921 982682 999359 754540
34640G54540j80269l56693p47434o43709J52171Q21747O21102j04511n18090m52049
$$ 754540 574271 217578 -529856 -1173565 -1021394 -199647 421455 316944 -201146 -653195
34630f53195l31336k50329R2421O02716P14974K68992j86564k06063j1625M393
$$ -653195 -984531 -1234860 -1142439 -539723 175251 444243 257679 51616 39991 44384
34620D4384j65761l45453m51938l46056Q8897N08189L48965k25657l37342K60981
$$ 44384 -121377 -466830 -918768 -1264824 -1175927 -667738 -318773 -544430 -881772 -620791
34610f20791O43352J24993n60439l65394L99397N48967j49279p13035m63855J49532
$$ -620791 22561 147554 -412885 -778279 -378882 170085 20806 -692229 -1156084 -1006552
34600a006552L98638J95678o4617p0414J73056L52886J03349m65929o88620j66708
$$ -1006552 -607914 -412236 -476853 -547267 -374211 -21325 82024 -383905 -1072525 -1239233
34590a239233N75716P30967K53800k33946l31889j17751K30465N02876L89861
$$ -1239233 -663517 67450 321250 87304 -244585 -362336 -131871 371005 760866
34581G60866r6004l98134j62071J57657M7425j68154M2258L45370O7057n49881
$$ 760866 664862 266728 104657 262314 309739 141585 183843 529213 596270 46389
34571D6389o63562k01255J50111J76594K69080M08718J64590k78628k37039K34488
$$ 46389 -617173 -818428 -668317 -491723 -222643 186075 350665 72037 -165002 69486
34561F9486L49264m2582k44856l3638K6181j86538p7173L58333K81472m32955
$$ 69486 418750 376168 131312 97674 123855 -62683 -139856 218477 499949 66994
34551F6994p20327p2953N34809K97020r9579J72610N45740J10102o97118p96553
$$ 66994 -653333 -726286 -191477 105543 5964 178574 724314 834416 137298 -659255
34541f59255k29285R8926q264j82J72857L7413k82816j32605M14941M88650j34442
$$ -659255 -888540 -789614 -797878 -798060 -625203 -587790 -870606 -1003211 -588270 -99620 -234062
34530b34062n23780j731P49921O40945k55246q08052m03995K47430J67819m62034
$$ -234062 -757842 -759573 -9652 631293 376047 -432005 -836000 -588570 -420751 -882785
34520h82785n46388K71935R61810N74116k95823l79209L38950O88617K22726k06931
$$ -882785 -1429173 -1157238 -195428 378688 82865 -296344 42606 731223 953949 747018
34510G47018m4088P5993l65526p12253k68422M10978L88977j52804l34793m0058
$$ 747018 702930 778923 413397 -298856 -567278 -156300 232677 79873 -254920 -294978
34500b94978R5928j09368j83507P5172L11976K76746J12980k0287r3147l6628
$$ -294978 -199050 -308418 -491925 -416753 -104777 171969 284949 264662 171515 134887
34490A34887J18301Q6089k52780n12676l54835p8222j02293j73092K27655Q87242
$$ 134887 253188 339277 86497 -426179 -781014 -859236 -961529 -1134621 -906966 -19724
34480a9724J020708L93198l67953o31190l95907j8457K34343K81147K07455J76032
$$ -19724 1000984 1394182 1026229 395039 -868 -19325 215018 496165 703620 879652
34470H79652J62011n9126m41404n05235o581N55990N61194J11973k25730k65820
$$ 879652 1041663 982537 541133 35898 29317 585307 1146501 1258474 1032744 766924
34460G66924k42222k17150k8939K61129L72777K21533m1219l08210n26963n83596
$$ 766924 524702 307552 278613 539742 912519 1134052 1092833 784623 257660 -325936
34450c25936m39140j86400J73174O36383P90633J63022p80951q61735J03479P95157
$$ -325936 -765076 -951476 -778302 -141919 648714 811736 30785 -830950 -727471 67686
34440F7686L40303l02474q173N15945l8613j121179j013800L04610J009582L27477
$$ 67686 407989 105515 97342 613287 574674 -546505 -1560305 -1255695 -246113 81364
34430H1364l78045m866N95261K87490m52723n11683N4863L82853K32032j4552
$$ 81364 -296681 -301547 293714 581204 128481 -383202 -328339 54514 286546 271994
34420B71994k12595l67012j90605L52042N49978q1333p74627m68894N12965Q32647
$$ 271994 59399 -307613 -498218 -146176 403802 322469 -452158 -921052 -408087 424560
34410D24560J07800n65986k74432M64900N66815j45650q70267q96375k74975M44874
$$ 424560 532360 -33626 -308058 156842 723657 578007 -292260 -1188635 -1463610 -1018736
34400a018736P68349N38185l9030n05525m52094P1786M75725K14793m69334p06259
$$ -1018736 -250387 287798 248768 -256757 -708851 -637065 -161340 53453 -415881 -1122140
34390a122140j04345O40475O23087p9655o20502n68929k40276N9893L74511O12203
$$ -1122140 -1226485 -586010 37077 -42578 -663080 -1232009 -1472285 -1412392 -1037881 -425678
34380d25678M80450J07434K8980K98616L15022j54977n30478m01054j76583k18133
$$ -425678 54772 162206 191186 489802 804824 649847 119369 -281685 -458268 -676401
34370f76401j34368L22135M55281k72112r73842m28844R00404J304656K94765
$$ -676401 -810769 -488634 -33353 -305465 -1279307 -1708151 -807747 496909 791674
34361G91674p26773o00470O6143J93809m7454J48660O07787M16887m27874q15272
$$ 791674 64901 -535569 -469426 -275617 -323071 -174411 433376 850263 422389 -392883
34351c92883j93158N37714L46223m29219o66186j38192K96849J39713o8005J57391
$$ -392883 -586041 -48327 297896 -131323 -797509 -935701 -638852 -499139 -567144 -409753
34341d09753L26983j24119o60173l57000N15815P50344N3167n25493l19974j7235
$$ -409753 -82770 -206889 -867062 -1224062 -708247 42097 95264 -430229 -750203 -767438
34331g67438k62289m32288J83631Q94833O05218k86396m37427K42293M76915j99992
$$ -767438 -1029727 -1462015 -1278384 -383551 221667 -64729 -502156 -259863 217052 17060
34321A7060o85593j98653M48541K71940k92272k26829L89156O04302J02436m42123
$$ 17060 -668533 -867186 -418645 -146705 -438977 -665806 -276650 327652 430088 -12035
34311a2035l74557K37253Q15372P72805J5132p76854p65691j06395J62874k74026
$$ -12035 -386592 -149339 666033 1438838 1453970 677116 -88575 -194970 -32096 -306122
34301c06122m24688L21220R35804L16133p53354o95291L35182P19879O513n25906
$$ -306122 -730810 -409590 526214 842347 88993 -606298 -271116 448763 455276 -70630
34291g0630j52176K22439j22325m52850n5857L90342N4761n17366l42722L35626
$$ -70630 -222806 -367 -122692 -575542 -631399 -241057 -186296 -703662 -1046384 -710758
34281g10758N39112J26929k59602l68848l90650k31285K36411N43542K35845k25192
$$ -710758 -171646 -44717 -304319 -673167 -1063817 -1295102 -1058691 -515149 -279304 -504496
34271e04496j52642J64789L6752k49159R3054P37861N66040l89741p96172j10613
$$ -504496 -657138 -492349 -455597 -704756 -611702 126159 692199 302458 -493714 -604327
34261f04327N74852K92914m52502p57886o18791l86284Q1451Q24078J140593N18933
$$ -604327 -29475 263439 -189063 -946949 -1565740 -1952024 -1870573 -1046495 94098 613031
34251F13031l73676n56317j36560N9631j08887m8399L62763M90428K1801m40790
$$ 613031 239355 -316962 -453522 -393891 -502778 -551177 -188414 302014 323815 -116975
34241a16975k12836N00667Q36004L06909o40980j121370p42876N6211O06700P08800
$$ -116975 -329811 170856 1006860 1313769 672789 -448581 -1191457 -1135246 -528546 180254
34231A80254N56948K67368j01445k83273j19583R318k77564n31680m2007P86792
$$ 180254 737202 1004570 903125 619852 500269 509587 232023 -299657 -341664 445128
34221D45128P13665l97407j088751m11053N72690L76179o60323r51968m5389Q79079
$$ 445128 1158793 761386 -327365 -738418 -165728 210451 -449872 -1401840 -1447229 -568150
34211e68150Q21008J33928l30917l48256j99529m2821J66801M12842N49997M17416
$$ -568150 252858 386786 55869 -292387 -491916 -534737 -367936 44906 594903 1012319
34201A012319K864m14884m40989n6667K79066K36041L8685J1214M9787o0689j57840
$$ 1012319 1015183 600299 159310 102643 381709 617750 656435 667649 717436 656747 498907
34190D98907l6367L3422k76376o31784m19493K17180M27195j37430p69580o47020
$$ 498907 462540 495962 219586 -412198 -831691 -614511 -187316 -324746 -1094326 -1741346
34180a741346J09610O75335N90436K26520J68601M02232L77789j32223o08866
$$ -1741346 -1631736 -956401 -365965 -139445 29156 431388 809177 676954 68088
34171F8088m97590j8797K30446K30695L86826N62407K04035m80290n40317J51881
$$ 68088 -429502 -448299 -217853 12842 399668 962075 1166110 685820 145503 297384
34161B97384M66622k13873q75368m47826M61110N91805M3896j02228L01370L93242
$$ 297384 764006 550133 -325235 -773061 -311951 279854 323750 221522 522892 916134
34151I16134k9732k05442J06476J41193m95990j049026p14566K50641R83230J010150
$$ 916134 886402 680960 787436 928629 432639 -616387 -1330953 -1080312 -97082 913068
34141I13068M75101j55826m06894k08252l8415k53899m56588j28392L47090J60221
$$ 913068 1388169 1232343 825449 617197 578782 324883 -131705 -260097 86993 247214
34131B47214n22050o34526J54506Q61626N92510k84264p97078n63681P9980O22179
$$ 247214 -274836 -909362 -754856 106770 699280 415016 -382062 -945743 -865763 -243584
34121b43584P02239L13044j00234j15941N4527q0289l96912l09782J71682L58669
$$ -243584 458655 771699 671465 555524 610051 529762 132850 -176932 -5250 353419
34111C53419J0751k84753j29270R7738J9696j28497r3189j00827k98554l33616
$$ 353419 364170 79417 -49853 47885 67581 -60916 -154105 -254932 -553486 -887102
34101h87102J3948L45255K87111J12693K20938M52475M26014J75574j8597j15684
$$ -887102 -873154 -527899 -240788 -128095 92843 545318 971332 1146906 1128309 1012625
34091A012625k13656k47265j54461r0601j65173k04023l8235J88297K11894k3374
$$ 1012625 798969 551704 397243 306642 141469 -62554 -100789 87508 299402 276028
34081B76028l29359l97868k1960N49709O63039O9586n49314m30379J49726L23635
$$ 276028 -53331 -451199 -473159 76550 739589 809175 259861 -170518 -20792 302843
34071C02843j1832j77744N7340K15305R5047J8298J0756k35361m90554j93106
$$ 302843 291011 113267 170607 385912 480959 499257 510013 274652 -215902 -409008
34061d09008L54783K38471m21612m70532K76166N63642j58661p09407j84099N28279
$$ -409008 -54225 184246 -237366 -707898 -431732 131910 -26751 -736158 -920257 -391978
34051c91978L70130j35381o6311K21140L6066j50072K98545O82724J23526o53247
$$ -391978 -21848 -157229 -223540 -2400 33666 -116406 182139 864863 988389 335142
34041C35142m54095K05131k3149q14582o23793N87946J182233N21332j77427n0160
$$ 335142 -118953 86178 63029 -751553 -1375346 -787400 394833 916165 738738 688578
34031F88578J96357j02477l76212n8448L07615P0295m40409n81626l34912Q550
$$ 688578 884935 782458 406246 347798 655413 725708 285299 -296327 -631239 -622689
34021f22689L30824M09431l7059o35153n46611K35329O85068K76760k28641p6782
$$ -622689 -291865 117566 80507 -554646 -1101257 -865928 -180860 95900 -132741 -209523
34011b09523L23751K41197j57467k14763J19069L20343J13209k56077l56310M1828
$$ -209523 114228 355425 197958 -16805 102264 422607 535816 279739 -76571 -34743
34001c4743O30125O43964j97760r81586o54082L29868N42423j84422m65782L03138
$$ -34743 595382 1239346 1041586 60000 -594082 -264214 278209 93787 -371995 -68857
33991f8857Q46842Q9912j034976j046565j22978M63380L42278J44738J45145R0303
$$ -68857 777985 867897 -167079 -1213644 -1336622 -873242 -530964 -386226 -241081 -150778
33981a50778M7178K63432M25301Q2788m34023m88275k29294k29719l58826r6311
$$ -150778 -103600 159832 585133 667921 233898 -254377 -483671 -713390 -1072216 -1168527
33971a168527L05599J45087l93935m18862J86091O03261M49853J79058M7489j68925
$$ -1168527 -862928 -717841 -1111776 -1530638 -1344547 -741286 -291433 -112375 -64886 -233811
33961b33811l15880P5430O66995N21593k53018m05799M07253Q59865L5749j024414
$$ -233811 -549691 -474261 192734 714327 461309 55510 462763 1322628 1358377 333963
33951C33963r35221n6413K91658q9411l26219j07194O7774M1636J80414M42050
$$ 333963 -601258 -657671 -366013 -455424 -781643 -888837 -821063 -779427 -599013 -156963
33941a56963L45296o4710j64006K14779N14109L46886o4468m30538o75520o22936
$$ -156963 188333 123623 -40383 174396 688505 1035391 970923 540385 -135135 -758071
33931g58071j38269L40771J92682l46375l50658L70563Q69736M51578l31646n76773
$$ -758071 -896340 -555569 -362887 -709262 -1059920 -689357 180379 631957 300311 -276462
33921b76462k38175J30159K71789K65655J21832p8027k0525L14986L61375k26193
$$ -276462 -514637 -384478 -112689 152966 274798 196771 176246 491232 852607 626414
33911F26414q43934o97828M90L41003O4221j81183L6680K98796Q3672m08825n57746
$$ 626414 -217520 -915348 -914858 -573855 -509634 -690817 -654137 -355341 -271669 -680494 -1238240
33900a238240j51633M02176N94147L39902j2877j31708n9658k5032j3294J47910
$$ -1238240 -1389873 -987697 -393550 -53648 -66525 -198233 -257891 -282923 -296217 -148307
33890a48307L08647R7147l67876m52248q11K77965p7795m31335m2021O35883O01468
$$ -148307 160340 257487 -110389 -562637 -563448 -285483 -363278 -794613 -836634 -200751 400717
33879D00717r0380m38862r6092K18253l375l60561l65124q9644K52324N71060
$$ 400717 310337 -128525 -224617 -6364 -9739 -370300 -735424 -825068 -572744 -1684
33869a684N50662r4468p99390n71447M42741Q98608K58269l19921J24651P37081
$$ -1684 548978 454510 -344880 -916327 -473586 425022 683291 363370 488021 1225102
33859A225102K81448p34247q12697J63802Q06750L40874m96003p92699n40425
$$ 1225102 1506550 772303 -40394 123408 930158 1271032 775029 -17670 -558095
33850e58095j17209L02876M97107J91280l58248m97677j53057M5554j49968k13719
$$ -558095 -675304 -372428 124679 315959 -42289 -539966 -693023 -647469 -797437 -1011156
33840a011156J10786K41233k06150n90766k14084M90216O06697J83013P1437M70828
$$ -1011156 -900370 -659137 -865287 -1456053 -1670137 -1179921 -573224 -390211 -318774 152054
33830A52054O00770M654o63198o00687m2879R6863m64644r77834o30101M22590
$$ 152054 752824 757478 94280 -506407 -549286 -452423 -917067 -1894901 -2525002 -2102412
$$ [...]
##END NTUPLES=NMR SPECTRUM
##END=
