##TITLE=31Pdec_E3d0806M
 , 24 sc
 9.6.2023
##JCAMPDX= 6.0         $$ Bruker NMR JCAMP-DX V2.0
##DATA TYPE= NMR SPECTRUM
##DATA CLASS= NTUPLES
##ORIGIN= UXNMR, Bruker Analytische Messtechnik GmbH
##OWNER= root
$$ XWIN-NMR		Version 3.5
$$ Fri Jun  9 13:49:52 2023 Russian Standard Time (UT+4h)  she@DPX200
##.OBSERVE FREQUENCY= 81.013821
##.OBSERVE NUCLEUS= ^31P
##.ACQUISITION MODE= SIMULTANEOUS
##.ACQUISITION SCHEME= undefined
##.AVERAGES= 24
##.DIGITISER RES= 16
##SPECTROMETER/DATA SYSTEM= spect
##.PULSE SEQUENCE= zgpg30
##.SOLVENT NAME= CDCl3
##.SHIFT REFERENCE= (INTERNAL, CDCl3, 0, 248.564)
##AUDIT TRAIL= $$ (NUMBER, WHEN, WHO, WHERE, WHAT)
$$ ##TITLE= Audit trail, XWIN-NMR		Version 3.5
$$ ##JCAMPDX= 5.01
$$ ##ORIGIN= Bruker BioSpin GmbH
$$ ##OWNER= she
$$ F:/spectra/data/she/nmr/P31/1/pdata/1/auditp.txt
$$ ##AUDIT TRAIL=  $$ (NUMBER, WHEN, WHO, WHERE, WHAT)
(   1,<2023-06-09 13:48:58.00 +0400>,<she>,<DPX200>,
      <created by zg, POWCHK disabled, PULCHK disabled
       configuration hash MD5:
       00 E9 B6 7A A2 85 ED C7 34 08 36 98 17 FE 4E 26
       data hash MD5: 32K
       63 F4 56 8E CA F1 77 9A 14 7A A6 39 EE A8 35 B0>)
(   2,<2023-06-09 13:49:00.81 +0400>,<she>,<DPX200>,
      <Start of raw data processing
       efp BC_mod = 2 LB = 1 FT_mod = 6 PKNL = 1 PHC0 = -10645.78 PHC1 = 2.68486 SI = 64K 
       data hash MD5: 64K
       72 EA A6 82 CC 19 37 19 9C CC 32 11 E2 0C 4C CC>)
(   3,<2023-06-09 13:49:17.48 +0400>,<she>,<DPX200>,
      <pk PHC0 = -71.64875 PHC1 = 133.6 
       data hash MD5: 64K
       22 57 E0 46 03 80 21 E6 01 E1 B7 B2 EF B5 8D AE>)
(   4,<2023-06-09 13:49:21.31 +0400>,<she>,<DPX200>,
      <abs ABSG = 5 
       data hash MD5: 64K
       CA 18 83 00 8E C8 89 AB A5 C3 75 B8 D8 1D 2B 32>)
$$ ##END=
$$ 
$$ hash MD5
$$ 2B 31 BB 3E 03 62 1D 97 83 10 79 98 19 97 D1 C2
##$RELAX= 
##$RELAX= 
##$RELAX= 
##$RELAX= 
##$RELAX= 
##$RELAX= 
##$RELAX= 
##$RELAX= 
##$RELAX= 
$$ Bruker specific parameters
$$ --------------------------
##$DU= <F:/spectra>
##$EXPNO= 1
##$NAME= <P31>
##$PROCNO= 1
##$TYPE= <nmr>
##$USER= <she>
##$AMP= (0..31)
100 100 100 100 100 100 100 100 100 100 100 100 100 100 100 100 100 100 
100 100 100 100 100 100 100 100 100 100 100 100 100 100 
##$AQSEQ= 0
##$AQ_mod= 1
##$AUNM= <au_zg>
##$AUTOPOS= <>
##$BF1= 81.014009
##$BF2= 200.13
##$BF3= 200.13
##$BF4= 200.13
##$BF5= 200.13
##$BF6= 200.13
##$BF7= 200.13
##$BF8= 200.13
##$BYTORDA= 1
##$CFDGTYP= 0
##$CFRGTYP= 5
##$CHEMSTR= <none>
##$CNST= (0..31)
1 1 145 1 1 1 1 1 1 1 1 1 1 1 1 1 1 1 1 1 1 1 1 1 1 1 1 1 1 1 1 1 
##$CPDPRG= <waltz16>
##$CPDPRG1= <>
##$CPDPRG2= <waltz16>
##$CPDPRG3= <>
##$CPDPRG4= <mlev>
##$CPDPRG5= <mlev>
##$CPDPRG6= <mlev>
##$CPDPRG7= <mlev>
##$CPDPRG8= <mlev>
##$CPDPRGB= <>
##$CPDPRGT= <>
##$D= (0..31)
0 1 0 0 0 0 0 0 0 0 0 0.03 2e-05 3e-06 0 0 0 0 0 0 0 0 0 0 0 0 0 0 0 0 
0 0 
##$DATE= 1686304137
##$DBL= (0..7)
120 120 120 11 120 120 24 19 
##$DBP= (0..7)
150 150 150 150 150 150 150 150 
##$DBP07= 0
##$DBPNAM0= <>
##$DBPNAM1= <>
$$ [...]
##$SUBNAM3= <"">
##$SUBNAM4= <"">
##$SUBNAM5= <"">
##$SUBNAM6= <"">
##$SUBNAM7= <"">
##$SUBNAM8= <"">
##$SUBNAM9= <"">
##$SW= 501.771253377433
##$SWIBOX= (0..15)
0 1 3 0 0 0 0 0 0 0 0 0 0 0 0 0 
##$SW_h= 40650.406504065
##$TD= 32768
##$TD0= 1
##$TE= 0
##$TE2= 300
##$TE3= 300
##$TEG= 300
##$TL= (0..7)
0 120 53 12 22 120 120 120 
##$TP= (0..7)
150 150 150 150 150 150 150 150 
##$TP07= 0
##$TPNAME0= <>
##$TPNAME1= <>
##$TPNAME2= <>
##$TPNAME3= <>
##$TPNAME4= <>
##$TPNAME5= <>
##$TPNAME6= <>
##$TPNAME7= <>
##$TPOAL= (0..7)
0.5 0.5 0.5 0.5 0.5 0.5 0.5 0.5 
##$TPOFFS= (0..7)
0 0 0 0 0 0 0 0 
##$TUNHIN= 0
##$TUNHOUT= 0
##$TUNXOUT= 0
##$USERA1= <user>
##$USERA2= <user>
##$USERA3= <user>
##$USERA4= <user>
##$USERA5= <user>
##$V9= 5
##$VALIST= <valist>
##$VCLIST= <CCCCCCCCCCCCCCC>
##$VD= 0
##$VDLIST= <DDDDDDDDDDDDDDD>
##$VPLIST= <PPPPPPPPPPPPPPP>
##$VTLIST= <TTTTTTTTTTTTTTT>
##$WBST= 1024
##$WBSW= 4
##$XGAIN= (0..3)
0 0 0 0 
##$XL= 0
##$YL= 0
##$YMAX_a= 31894
##$YMIN_a= -27347
##$ZGOPTNS= <>
##$ZL1= 120
##$ZL2= 120
##$ZL3= 120
##$ZL4= 120
##$ABSF1= 248.5645
##$ABSF2= -253.2056
##$ABSG= 5
##$ABSL= 3
##$ALPHA= 0
##$AQORDER= 0
##$ASSFAC= 0
##$ASSFACI= 0
##$ASSFACX= 0
##$ASSWID= 0
##$AUNMP= <proc_1d>
##$AZFE= 0.1
##$AZFW= 0.5
##$BCFW= 0
##$BC_mod= 2
##$BYTORDP= 0
##$COROFFS= 0
##$CY= -3
##$DATMOD= 1
##$DC= 0
##$DFILT= <>
##$DTYPP= 0
##$F1P= 0
##$F2P= 0
##$FCOR= 1
##$FTSIZE= 65536
##$FT_mod= 6
##$GAMMA= 0
##$GB= 0
##$INTBC= 1
##$INTSCL= 6.047779e-11
##$ISEN= 30
##$LB= 1
##$LEV0= 0
##$LPBIN= 0
##$MAXI= 10000
##$MC2= 0
##$MEAN= 0
##$ME_mod= 0
##$MI= 50
##$NCOEF= 0
##$NC_proc= -4
##$NLEV= 6
##$NOISF1= 182.463
##$NOISF2= 159.3651
##$NSP= 0
##$NTH_PI= 0
##$NZP= 0
##$OFFSET= 248.5645
##$PC= 4
##$PHC0= -10717.43
##$PHC1= 136.2849
##$PH_mod= 1
##$PKNL= yes
##$PPARMOD= 0
##$PSCAL= 0
##$PSIGN= 0
##$REVERSE= no
##$SF= 81.0140089999694
##$SI= 65536
##$SIGF1= 159.3651
##$SIGF2= -187.1042
##$SINO= 113.3802
##$SIOLD= 16384
##$SREGLST= <1H.CDCl3>
##$SSB= 0
##$STSI= 65536
##$STSR= 0
##$SW_p= 40650.406504065
##$SYMM= 0
##$S_DEV= 0
##$TDeff= 32768
##$TDoff= 0
##$TI= <>
##$TILT= no
##$TM1= 0
##$TM2= 0
##$TOPLEV= 0
##$USERP1= <user>
##$USERP2= <user>
##$USERP3= <user>
##$USERP4= <user>
##$USERP5= <user>
##$WDW= 1
##$XDIM= 65536
##$YMAX_p= 454459369
##$YMIN_p= -66241230
$$ End of Bruker specific parameters
$$ ---------------------------------
##NTUPLES= NMR SPECTRUM
##VAR_NAME=  FREQUENCY,     SPECTRUM/REAL,   SPECTRUM/IMAG
##SYMBOL=    X,             R,               I
##VAR_TYPE=  INDEPENDENT,   DEPENDENT,       DEPENDENT
##VAR_FORM=  AFFN,          ASDF,            ASDF
##VAR_DIM=   65536,         65536,           65536
##UNITS=     HZ,            ARBITRARY UNITS, ARBITRARY UNITS
##FACTOR=    0.620285442955139, 1,           1
##FIRST=     20137.2065510682, 0,            0
##LAST=      -20513.1999529968, 0,           0
##MIN=       -20513.1999529968, -66241230,   0
##MAX=       20137.2065510682, 454459369,    0
$$ Real data points
##PAGE= N=1
##DATA TABLE= (X++(R..R)), XYDATA
$$ [...]
39796b00572k61712j56294J9219K16630K74504J10326m6716R7222M04400M06308
39786H63315q869l82223l27263k7544J36505J13654M6421p2841k57076k93458
39776b09379m6101K04519J23423j29570j31592J24447K31008K9446j68333r8152
39766g0284J01343J85365J36518M1319j05296k88245l57865k13384J6940J27032
39756d26557Q2866M936l3474p4718j55268k01470r9871J25347K68198J69602l2690
39745c73099m2584J68473K73832M8098k86806l62604j49984Q8025K00259K38022
39735a98368K22170J10598j2907J2476J52550J85140K5444j61035k20789j91296
39725g6017j50526p1316P0184J73091J15974p1237k11840j54468N9650K03422
$$ y = [-200572, -462284, -618578, -599359, -382729, -108225, 2101, -44615, 52607, 457007, 863315, 854446, 472223, 144960, 117416, 253921, 367575, 413996, 341155, 84079, -209379, -255480, -50961, 72462, -57108, -188700, -64253, 166755, 196201, 27868, -70284, 31059, 216424, 352942, 394261, 288965, 720, -357145, -570529, -553589, -426557, -343691, -338755, -372229, -446947, -602215, -803685, -903556, -778209, -510011, -340409, -373099, -415683, -247210, 26622, 74720, -212086, -574690, -724674, -636649, -436390, -198368, 23802, 134400, 121493, 133969, 286519, 471659, 497103, 336068, 115279, -76017, -226543, -297859, -227675, -54584, 61390, -9847, -221687, -376155, -316505, -113083]
39715a13083J00455j35477k19332q7720J5811n5519j03566N8690K36950J44856
39705a57935j04913j55089M2406J93422J47330N3131K0226k4229r3013q5222l3792
39694a97678q4334j69345n2428K16044K66987j1154k39558j15609J32046J43151
39684a11878j1046j4186J44745J82699L635j64217j21874N2541J48355O0507j33596
39673C5685k37907j09053J51221K45282K7996k72556l16165p6319J41757R7340
39663c12719j02762j61239L5660K70992K61111L8695n6766J49361L64632K11728
39653F98693j96852l80774j79773M1936j2262j35747j2993K36385K39416n0289
39643B47740k81060j89039R2130K42482J25624r1331j30758P3129K59560J57062
$$ y = [-113083, -12628, -148105, -367437, -455157, -439346, -494865, -598431, -539741, -302791, -157935, -262848, -417937, -375531, -182109, -34779, 18352, 38578, 14349, -78664, -163886, -197678, -282012, -451357, -503785, -287741, -20754, -31908, -271466, -387075, -255029, -111878, -122924, -137110, 7635, 190334, 193969, 29752, -92122, -39581, 108774, 169281, 35685, -202222, -311275, -160054, 85228, 113224, -159332, -475497, -551816, -410059, -312719, -415481, -576720, -541060, -270068, -8957, 29738, -27028, 122333, 486965, 698693, 501841, 121067, -58706, -16770, -29032, -164779, -177772, 58613, 298029, 247740, -33320, -222359, -130229, 112253, 237877, 146546, 15788, 88917, 348477, 505539]
39633E05539j14366j80728J8038J14576q8656k65840j03460J32977N286l35283
39623c11917l28277R9098L72370J33386k41400k53336N9R9151R034M6115K45850
39612a29867K48563q9013l71108k00028K23487L63839J03719j25571j0113K00578
39602B14486J25300j35661j71962N4834J14127k14729n32204l48781J96910M81272
39592b16408K00040k72626l93604r0413K52021L11025J41454k4922j18255k32113
39582d43801l52149k88614L1563L66405M29635K67338J53496J64487J18781n0727
39572C96414j63007j26967j21195k53134k98933m5467K99595L50474R4574j11327
39562B1027o8913L5464k2234j84792k45124j23258R0982K59667K87857J78152
$$ y = [505539, 391173, 210445, 228483, 343059, 254403, -11437, -114897, 18080, 23366, -311917, -640194, -541096, -168726, -35340, -276740, -530076, -530017, -430866, -421832, -375717, -129867, 118696, 29683, -341425, -541453, -317966, 45873, 149592, 24021, 13908, 214486, 339786, 204125, 32163, 86997, 201124, -13605, -545809, -894590, -697680, -216408, -16368, -288994, -682598, -773011, -520990, -209965, -68511, -93433, -211688, -443801, -795950, -1084564, -1053001, -686596, -256961, 10377, 163873, 328360, 447141, 396414, 233407, 106440, -14755, -267889, -566822, -612289, -312694, 37780, 132354, 21027, -47886, -12422, -34656, -219448, -464572, -587830, -496848, -237181, 50676, 228828]
39552B28828L9935k3376m0094r5304j49565p2957J20779K29007J22557o9522j36085
39541A54203n8607p7o2738j61374j41732L7911K53851L16743J40308j51717l11701
39530A5070k23628n8243p7685k67050l01114J1143L84469L86348N2501j34749
39520b12938N2568K58364J25739j27009q9299J28451P1381k58859l43192K7528
39510c67266L97973L44385O1343n7036k7793q8502k01101j69804n0957l2628m6386
39499b37772J01765L09413K80741J1540j88497j49943m210R3558J01090j9974
39489B97711k37150l08912n5699K57270J92057j92049l56635n3964L40642M15898
39479B99169K37712N6282j20472l52922m62214k55246J07284K82287J86427J3840
$$ y = [228828, 268763, 245387, 205293, 109989, -39576, -112533, 8246, 237253, 359810, 290288, 154203, 95596, 95519, 32781, -128593, -270325, -232414, 21437, 338180, 478488, 326771, 15070, -208558, -266801, -344486, -611536, -912650, -901507, -517038, -130690, -78189, -212938, -160370, 97994, 223733, 96724, 7425, 135876, 207257, -51602, -394794, -367266, 30707, 375092, 436435, 379399, 351606, 263104, 62003, -107801, -158758, -191386, -237772, -136007, 173406, 454147, 465687, 277190, 127247, 123037, 216595, 317685, 297711, 60561, -248351, -304050, -46780, 145277, -46772, -403407, -457371, -116729, 299169, 536881, 593163, 472691, 119769, -342445, -597691, -490407, -208120, -21693, -7853]
39469g853r5894j60299j78597q3169J22369L14064L39673J15028k80254n57383
39459d72315m36038r476K92293K38710Q5099J33652K50053J27047j47953j87081
39449a26009Q3196K96123J93120m7085j49222j14196q2586p0747m7690q9577k34803
39438c89476l13741j52245J29056K42516J31491K0796N0117P6904n6926k37919
39428d99427k29415k4316J33355Q8540j9126K7581K01173K60988R7567r1083m9250
39417a03413J88203L23468J69325j28676k97285k56673j37684n9084l0908m5790
39407c78517r9451j04284M3152K52231K81222R3449k8820R9129K30188L9279l29211
39396I8367m22496j47685J09454R4924J8807J08311K00719O3349j68092k08636
$$ y = [-7853, -103747, -264046, -442643, -525812, -403443, -89379, 250294, 365322, 85068, -472315, -908353, -917829, -625536, -386826, -301727, -168075, 81978, 209025, 61072, -126009, -42813, 253310, 446430, 399345, 250123, 135927, 53341, -17406, -65096, -154673, -389476, -703217, -855462, -726406, -483890, -352399, -331603, -281486, -204582, -261508, -499427, -728842, -753158, -619803, -531263, -550389, -522808, -321635, -60647, 36920, -54163, -103413, 84790, 408258, 577583, 448907, 151622, -105051, -242735, -301819, -332727, -378517, -477968, -582252, -539100, -286869, -5647, 87802, 58982, 158111, 388299, 427578, 98367, -324129, -471814, -362360, -267436, -248629, -140318, 60401, 123750, -44342, -252978]
39386b52978q5988m0323r7671q6013J1163N5542N3599J21149J81144M5494j97273
39375b92155k34915k1305J41121R2784L1040J01428J37748J2927q0954L4939J88514
39364A11172J43003m268k1212M3363j8725j63201j58100o761M0859q4677j52972
39353b71519j8358J50358J50892M5206J8505Q1248Q1059m2676j57835j16250M2014
39342c7356J25686M4090m8291M0888K23998K04354q0890l01787j81044Q5821J04968
39331A80437j36097k66978r4428J46102J80101O8823L7778J14417J23781l7244
39321C16692k69290l88862k94139l5578K27453L52686L09260J43608q2397k57481
39311B1952k30316k204J70826O8656j58968j97231o5123p9930k84707l01444P0799
$$ y = [-252978, -338966, -379289, -476960, -562973, -551810, -496268, -442669, -321520, -140376, -94882, -292155, -527070, -548375, -407254, -314470, -283430, -182002, -44254, -31327, -112281, -77342, 111172, 254175, 249907, 228695, 272058, 253333, 90132, -67968, -74729, -33870, -118547, -271519, -289877, -139519, 11373, 56579, 75084, 156332, 237391, 194715, 36880, -79370, -37356, 88330, 132420, 84129, 125017, 349015, 553369, 472479, 170692, -10352, 75469, 180437, 44340, -222638, -317066, -170964, 9137, 77960, 115738, 230155, 353936, 316692, 47402, -341460, -635599, -671177, -443724, -91038, 218222, 361830, 279433, 21952, -208364, -210568, -39742, 28914, -130054, -327285, -392408, -472338, -757045, -1058489, -987690]
39300i87690M77767N08263K66020J05709N8036p0052k10810j30950O2868O032
39290H5193k98662l97986n5398L96469N34972L38426L4950k09975k75653q1155
39280G1181J93588J89451j14429k86052p9570J72428J14767o3387l7113L4218
39270A95082j57335l77643j46896L84911N36328J10306l20946k87610P13J57261
39260I4171J58639J06503p0083l40188l97563j05568K13698K43234R9254M325
39250F422r8255k53937k01168J90580N09862L29980j03675k32648l1539N6249
39240A71871j04625k02813p7597Q4390J59652K01313J37338j43561l93453k30434
39230c97919J89945L01557K2485j02763J54902K94943l7602l97535k66275R1225
$$ y = [-987690, -509923, -1660, 264360, 370069, 428105, 358053, 147243, 16293, 79161, 85193, -213469, -611455, -666853, -270384, 264588, 603014, 637964, 427989, 152336, 71181, 264769, 454220, 339791, 53739, -25831, 146597, 261364, 197977, 160864, 195082, 37747, -339896, -486792, -101881, 434447, 544753, 223807, -63803, -63090, 94171, 252810, 359313, 289230, -50958, -448521, -554089, -340391, -97157, 2097, 6422, -91833, -345770, -546938, -356358, 153504, 483484, 379809, 147161, 115622, 171871, 67246, -135567, -213164, -128774, 30878, 232191, 369529, 225968, -167485, -397919, -207974, 93583, 116068, 13305, 168207, 463150, 425548, 28013, -238262, -147037]
39220a47037J09150j28885j06869J84147K34049j02133l61431k17059P8681J74086
39210b83301R6410K9776k6596j24593j56489l5197R4083N5551o7187n3983J18658
39199c52868K61380K52034J57044O8841k2684j42012k26133k03590j15876n6676
39189c80540j5252R2613K20584J81904n6970k34297j30351Q1070P6963j01679
39179b65955j16822Q9482J82984J6107r6621P7298K55284J04873j81005k14104
39169a48479o6266p8660j80325O984M12564M95701J07376k25823j29574N9054
39159B52552p3859l14344k38828L2131O5760j21552j24383J21435K44659R7615
39149e8814l0475K8175M8088j07625j81506K9342K85852K77750Q8150k4274m7205
$$ y = [-147037, -37887, -166772, -273641, -89494, 144555, 42422, -319009, -536068, -457387, -283301, -186891, -157115, -183711, -308304, -464793, -499990, -405907, -350356, -417543, -471526, -352868, -91488, 160546, 317590, 386431, 363747, 221735, -4398, -207988, -323864, -380540, -395792, -303179, -82595, 99309, 42339, -191958, -322309, -241239, -164276, -265955, -382777, -293295, -110311, -94204, -190825, -113527, 141757, 246630, 65625, -148479, -214745, -293405, -473730, -466746, -54182, 441519, 548895, 323072, 193498, 252552, 178693, -135651, -374479, -342348, -276588, -398140, -522523, -401088, -156429, -58814, -89289, -61114, -13026, -120651, -302157, -272815, 13037, 290787, 378937, 354663, 307458]
39138C07458q7497o0138J19132K21391J050l24805l32385n2994Q3457m9112j24202
39127b98645J0323P0795j06068k24448m0393J93416J47864n1113j03350o9065
39117d70684j78846l07107j23560L05104N31535L70615J23979Q6702J76149J67807
39107F81694K2934j46158k36823j95724o2238j034j16453k45639j51557R9178
39097c51820K13588J23909N5966J03378P0016j37088k68588q5544K70927M55086
39087D49830L08529n1503l73566m07037r5153K60783K46578j33967m04457k35603
39077d35566J31141K73565J56495M5679M1290N590j24680k26550j89621m6493
39067c69150R5972J47137Q5963p560l6007k4067n5263p3189M2444J77753N8751
$$ y = [307458, 219961, 159823, 278955, 500346, 501396, 176591, -155794, -208788, -125331, -174443, -298645, -288322, -217527, -323595, -548043, -588436, -395020, -247156, -298269, -401619, -470684, -649530, -956637, -1080197, -775093, -243558, 127057, 251036, 337738, 513887, 681694, 704628, 558470, 321647, 125923, 63685, 62651, -53802, -299441, -450998, -351820, -138232, -14323, 41643, 145021, 215037, 77949, -190639, -276183, -5256, 449830, 758359, 706856, 333290, -73747, -168900, 91883, 338461, 204494, -199963, -435566, -304425, -30860, 125635, 171314, 212604, 218194, 93514, -133036, -322657, -369150, -273178, -126041, -40078, -47638, -83645, -107712, -162975, -236164, -193720, -15967, 42784]
39056D2784k73527l94122r3382K76170L08857R8928k2617j5666k7107j4879J00483
39045a4078J17584j42566l70773j24396M26280O41560L14390r1655j81253r3303
39035D81790q2475j21629j42332k42277l88444k89837J36921M94174M06259L0961
39025B83111k29745k72080k17526m3574L06627N89705M60706j2215l76419l57261
39015A31329j09745R7827J63636P8133j42385l47404l15268n3509J49886J04047
39005b43453k2961K9216K25428L06050J73476N003k9857O380m7106k00348l03365
38994a01537k48173q5341O5938J43754J44032O6997n7212j24663m5685J07610
38984a34280J45570O038j41934j28762k7931k4292r5803l2966J95107L17256J34200
$$ y = [42784, -230743, -624865, -718247, -442077, -133220, -34292, -56909, -72575, -99682, -114561, -14078, 103506, -39060, -409833, -534229, -107949, 533611, 848001, 756346, 575093, 481790, 399315, 277686, 135354, -106923, -495367, -785204, -648283, -154109, 252150, 283111, 53366, -218714, -436240, -479814, -173187, 416518, 877224, 865009, 488590, 131329, 21584, 119411, 283047, 361180, 218795, -128609, -443877, -497386, -347500, -243453, -266414, -237198, -11770, 294280, 467756, 472759, 442902, 449282, 402176, 201828, -101537, -349710, -435051, -369113, -225359, -81327, -14330, -71542, -196205, -241890, -134280, 11290, 17328, -124606, -253368, -281299, -305591, -401394, -434360, -239253, 78003, 212203]
38973B12203j64127k53337j22265k4222n1754m7279N4561J02426L9284M1706J81554
38962c1250K21797j1373k81519k58795j0746J41198J18899Q8923O6277p9142k43510
38951b79241j42823J89597L65125K20152M6629P6255J18566m6322k60020k73422
38941A4496j63247j34004j27012K5737K19602K05051J0309r0225K238J01456N0375
38930A14776q0215j24724j803K25351L65395K53558j2810j30715m890Q3045j01135
38919E85833l54773l27891l9082J88379J95439J01273J8733o4758j48037j86693
38909c1577j83190j44255k4766J38777J78317M9382m3216K7005P7961l8557j24867
38898a18986J2606J66371P1436j04833o5075O5984O635r4667N3601K02596j07181
$$ y = [212203, 48076, -205261, -327526, -351748, -403502, -450781, -396220, -293794, -254510, -212804, -31250, 190547, 179174, -102345, -361140, -371886, -230688, -111789, -22866, 43411, -35731, -279241, -422064, -232467, 132658, 352810, 399439, 475694, 594260, 547938, 287918, 14496, -148751, -282755, -409767, -384030, -164428, 40623, 50932, -39293, -37055, 64401, 114776, 34561, -90163, -91966, 133385, 498780, 752338, 739528, 608813, 603923, 686968, 585833, 231060, -96831, -135913, 52466, 247905, 349178, 367911, 303153, 155116, -31577, -214767, -359022, -383788, -245011, -66694, -17312, -60528, -33523, 44438, 5881, -118986, -106380, 59991, 131427, 26594, -38481, 27503, 34138, -60529, -6928, 195668, 88487]
38887H8487o19604n79510O1843M95997L10751M4782J42125K05378j46078m27419
38877d23248o2575N30144M82096j88351o14800l61437R9439K44624J62916J58254
38867B7062K09388J19905j04871k90552l34728k45344n2973J93344L99512M59170
38857C79913L10178l88k77825l05081q6538J29876J57418Q0855O3708Q3326L321
38846E38763j91096l71664m11147k55624M7606L10511L20912R5558j12800j42335
38836a71316r0993o8420P178K04743L65197K93690L6599k08493l40589l59971
38826c32375k57345o3267R7778J40128J06660M6340m5199r3906K6793K32639K36523
38815I4769l4587k78042k33999j1128J72318K81343L00552J07040k33001l70997
$$ y = [88487, -531117, -1110627, -1048784, -552787, -242036, -197254, -55129, 150249, 4171, -423248, -485823, 44321, 526417, 338066, -276734, -638171, -538732, -294108, -131192, 27062, 236450, 356355, 251484, -39068, -373796, -619140, -672113, -478769, -79257, 379913, 690091, 689703, 411878, 106797, 20259, 150135, 307553, 388408, 452116, 535442, 538763, 347667, -23997, -435144, -690768, -643162, -332651, -11739, 83819, -28981, -171316, -262309, -330729, -323551, -118808, 246389, 540079, 576678, 368185, 27596, -332375, -589720, -652987, -555209, -415081, -308421, -262081, -307280, -401186, -374393, -141754, 94769, 60182, -217860, -451859, -462987, -290669, -9326, 291226, 398266, 165265, -205732]
38805b05732j81815k0070j23625j49266K25339O07776M20116j31920l19721n159
38795A15923K31866Q3802j04662q8808j35028l80205m18620L2086N37802N18192
38785C92348Q1114k00522j26883o347n6636j23686l0337J41877K21636J75381
38775D67945O9094n1301j56900j98146j34016K8117K26016L45800K64133l3447
38765H27295l63801m51563j92179K05467M07663K99812O5786r7884k03191k97719
38755A99686k54355P787K19245N3620k97961k97088J04393L06515j4782l49343
38745c22283j42247L17016L73205M1433j10608O5258J58637J189r9243j9650n1057
38734B11650k72628l13275j8407J99725K6875k21853j38589J13358J18547j08461
$$ y = [-205732, -387547, -407617, -531242, -680508, -455169, 152607, 572723, 440803, 121082, 115923, 347789, 431591, 326929, 238121, 103093, -277112, -695732, -663646, -125844, 392348, 473462, 272940, 146057, 139710, 83074, -40612, -70949, 70928, 292564, 467945, 537039, 485738, 328838, 130692, -3324, 24793, 250809, 596609, 860742, 827295, 463494, 11931, -180248, 25219, 432882, 732694, 798480, 700596, 497405, 199686, -54669, -46882, 172363, 225983, -71978, -369066, -264673, 41842, 27060, -322283, -464530, -147514, 225691, 267124, 156516, 221774, 380411, 381600, 282357, 262707, 211650, -60978, -374253, -392660, -192935, -166060, -387913, -526502, -413144, -294597, -403058]
38724d03058k09666n7546J53296K51960K06650L3947j30709n0038K49760L53011
38714C97607K4638l33876k21562J73300K47620n7115j80026J04623K78856q7010
38704C47055n97921n73772k0273M21887L66975O0900j33490j91924k22852j62679
38694g06094N4174K37967J63083n4657r8358O0814J21780m8900j85850m0238K34799
38683b61480L29422K10812O9331j8184j07881j75730j53721j13741j58074j84108
38673e63354k6947K09370K54170Q4922n7711o4098m8012l6128P7276K11532J22011
38662A63031j44335k16167r9R7942j71037m17212j81708L17395M83525K05190
38652A36525p5895r3012m8555j17320j22944Q4503K78780J69587j38921k82022
$$ y = [-403058, -612724, -670270, -516974, -265014, -58364, -24417, -155126, -205164, 44596, 397607, 422245, 88369, -133193, 40107, 287727, 230612, 50586, 155209, 434065, 347055, -250866, -824638, -844911, -423024, -56049, 4851, -128639, -320563, -543415, -706094, -651920, -413953, -250870, -305527, -403885, -343071, -221291, -270191, -456041, -496279, -261480, 67942, 278754, 348085, 329901, 222020, 46290, -107431, -221172, -379246, -563354, -590301, -380931, -126761, -41839, -99550, -163648, -211660, -247788, -170512, 41020, 163031, 18696, -197471, -197570, -99628, -270665, -687877, -869585, -552190, -68665, 136525, 60630, -32382, -80937, -198257, -321201, -236698, 42082, 211669, 72748, -209274]
38642b09274j34205P1297J05754J4889k7947K2514Q1359R5482Q3627M9422k2294
38631A30624p9821l9639N9082O3378o2711j47059n6758Q2934O4103r5511j80453
38620b61831o4150J69113L37805K87448l471l14028l14637J6132K69173J26053
38610B47607j77532k12676k082R9096L7867Q5065K50876K13218q2762k67411j50457
38599D0809j648k7564m1868R0593J44994j3535j01307R9712L14007K18132l3108
38588F89217j29965j30173k27513k98422j39413R8441J65713J57537K43598K31068
38578F60088p6936l45102j37019L04251L57744p918k45393j57233r9318k09015
38568D4149j59748J41137K90341Q5507j22258o8033K297j18306j67960N9938K48420
$$ y = [-209274, -343479, -272182, -166428, -151539, -179486, -156972, -75613, 19869, 103496, 152918, 130624, 50803, 11164, 70246, 133624, 70913, -76146, -132904, -49970, 14133, -81378, -261831, -325981, -156868, 180937, 468385, 464914, 150886, -163751, -147619, 121554, 247607, 70075, -142601, -144683, -45587, -7720, 77345, 328221, 541439, 458677, 191266, 40809, 39161, 11597, -30271, 60322, 205316, 191781, 90474, 190186, 504193, 722325, 689217, 559252, 429079, 201566, -96856, -236269, -137828, 27885, 185422, 429020, 660088, 583152, 238050, 101031, 405282, 763026, 755108, 509715, 352482, 253164, 44149, -115599, 25538, 315879, 401386, 279128, 211095, 213392, 95086, -72874, -12936, 235484]
38557B35484P5866k00738j71922M2331M3726j57854k15773m3843J28151J91052
38547g3520K21764J92052J3762j79753j73303m7069n1552j48504o4246J96768
38537a13601K90322O4368k00608k13484m7573N1991Q464q0901j09531k3629J41960
38526b32222K31492J22091o1579p2057Q7857J35767p6603l41749l91650k10768
38516h09421N5486K93332L88409K24011j02572k57742q0271J60469J49102r120
38506A1683m442J40453J30321n7636j09460P9830K05552O5545r9837l6354P7570
38495D03225m2642k53235j87338J26775K82692J21146o8889m8138N0200M3415
38485D27211J1703O9537Q6381j01566l64373m10726j63941J68194L20841J59468
$$ y = [235484, 311350, 110612, -61310, -18979, 24747, -133107, -348880, -392723, -264572, -73520, 148244, 340296, 354058, 174305, 1002, -46067, -97619, -246123, -310369, -113601, 176721, 241089, 40481, -173003, -220576, -168585, -160121, -241022, -350553, -374182, -232222, -730, 121361, 59782, -12275, 75582, 211349, 134746, -207003, -598653, -809421, -753935, -460603, -72194, 151817, 49245, -208497, -288768, -128299, 20803, 11683, 7241, 147694, 278015, 220379, 110919, 190749, 396301, 461846, 362009, 325655, 403225, 360583, 107348, -79990, 46785, 329477, 450623, 381734, 333596, 383796, 427211, 438914, 508451, 594832, 493266, 128893, -281833, -445774, -277580, 43261, 202729]
38475B02729k21478m75515k77250K23895M55709J49740k43593j87427J45351J67455
38465f0384j83991l64857r6505K43016K68438J22220Q5603Q6734m4505j67330
38455a11561q1875M8726n1153k53054j87023J45996L36269J61801j31779k18321
38445c41974o6205J57244L08863L08145J54838k1853r6532j32418k31255k50007
38435b11154J1808L45283K80628j70155l85134k8069L76389K08941k71686l28171
38425a71320R4890L25716Q0461j25964Q5024L10285J03430k14142r8372K53999
38415F44007K09213k26036l92712n9271K27691O8882j91348j46085q069j16408
38405I864k38214J8256M05379L40788j17909l01311K6152L15851J29454k17253
$$ y = [202729, -18749, -494264, -771514, -547619, -91910, 57830, -185763, -373190, -227839, -60384, -244375, -609232, -705737, -462721, -194283, -72063, 13540, 100274, 55769, -111561, -193436, -144710, -195863, -448917, -635940, -489944, -153675, 8126, -123653, -341974, -408179, -250935, 57928, 366073, 520911, 499058, 402526, 270108, 38853, -211154, -199346, 145937, 426565, 256410, -128724, -156793, 219596, 428537, 156851, -171320, -76430, 249286, 329747, 203783, 288807, 599092, 702522, 488380, 390008, 644007, 853220, 627184, 234472, 175201, 402892, 471774, 280426, 134341, 126272, 9864, -228350, -210094, 195285, 536073, 418164, 116853, 143005, 458856, 588310, 371057]
38395C71057k46165n9618m4750j90124j97232n9605k7208r4615j3694J91993J97811
38384a72150n3161j88842J4565K73698K47877K8265r8160j06677j36327j40082
38374c30994L658J56540P7188j34719j27497J47884L36042K15534k494n5581L638
38363B89199J6962K1057R4701J23479j5151j88516j90927o8956j7678n9651p6525
38352g2006o4408r6756j10019N088J56005J60796N9756M0547R9605P5341j4846
38341B39103M437J12791R8237o2925j70799j73614k07059k23782q324L40807M01622
38330C50494P3366k25449k24147j83356l11585l05983Q0143M55581L36179n5611
38320a0368j42327Q4837J37386r0401j74946P2571L00385K15692o338r1139m3222
$$ y = [371057, 124892, 65274, 20524, -169600, -366832, -426437, -453645, -548260, -561954, -369961, -172150, -225311, -414153, -399588, -125890, 121987, 150252, 52092, -54585, -190912, -330994, -327336, -170796, -93608, -228327, -355824, -207940, 128102, 343636, 341142, 285561, 289199, 306161, 327218, 421919, 545398, 530247, 341731, 150804, 81848, 64170, 4519, -72006, -136414, -233170, -343189, -338101, -182096, -21300, 38456, 79003, 178608, 253949, 239103, 243540, 356331, 454568, 391643, 220844, 47230, -159829, -383611, -391935, -51128, 350494, 423860, 198411, -25736, -209092, -520677, -826660, -746517, -290936, 45243, -10368, -152695, -67858, 69528, -20873, -195819, -123248, 177137, 392829, 386491, 295352, 252130]
38309B52130J1591L3195j1621j40269j96718j9351J98767R8703k36740l05372
38299c15685N0302L60394K36835o6808j18757L6746P1693m9816r9626l0536l175
38288G1567l4940L4288K18222L02468J49165j01377k09409j16317J5888J5638
38278C45193r2286j39785p1784k0488m3426K2139K38899L08426j6136l99956k87794
38267a56998K28342M49533R1053l06116k41428J8387j2198k29257k14442L866
38257c69258N2499r1828q8028J25623K04319j0556k17222j23377J45583K81209
38247i1036J96141L0806q1472j12159q8710m9203j7578Q203L3876N5815P5545
38236c9772P5224J4j30192j39208Q2554L07235K03001j45943l03111j40740j8919
$$ y = [252130, 263721, 296916, 285295, 145026, -51692, -71043, 127724, 226427, -10313, -315685, -265383, 95011, 331846, 265038, 146281, 183027, 254720, 204904, 105278, 74742, 71567, 36627, 70915, 289137, 591605, 740770, 639393, 429984, 313667, 329555, 345193, 252907, 113122, 41338, 20850, -22576, -437, 238462, 546888, 530752, 130796, -156998, 71344, 520877, 611930, 305814, 64386, 82773, 70575, -158682, -373124, -369258, -316759, -408587, -496615, -370992, -166673, -177229, -394451, -517828, -372245, -91036, 105105, 135911, 54439, -57720, -146430, -195633, -213211, -205008, -171132, -115317, -39772, 35452, 35466, -94726, -233934, -151380, 155855, 358856, 212913, -90198, -230938, -249857]
38225b49857j36393j76473R1354L22634J56558j33381q8556J46041R3318k04550
38215a79305k59980K2358K23885J40661L6551R1699J42755Q7364N9209Q5108K0985
38204D71290q1025m136J58891O5704k44567l25511p6502N7129j37216k50136L0645
38193c35434L57821K95177j1557j75809j80986j94382j28504J25710L17877J77376
38183B47289r5203j32170J8970O9923L8164J27331K24243M1691l07080l80621
38173a47463o9297K47279K46968J3239j95731k17938k0487K59854L35906R4655
38163E46985j71920j43133M5643M1447j32675j53755O326M4590j05813j57630
38153a79935j573J05620K5358j6038J49310L30414L01935J17424p5827k36517
$$ y = [-249857, -386250, -562723, -471369, -148735, 7823, -125558, -214114, -68073, 25245, -179305, -439285, -416927, -193042, -52381, -15830, 75869, 218624, 305988, 365197, 450305, 471290, 390265, 386129, 545020, 610724, 366157, 40646, -35856, 21273, -115943, -366079, -335434, 22387, 317564, 306007, 130198, -50788, -245170, -373674, -247964, 69913, 247289, 152086, 19916, 38886, 108809, 146973, 274304, 498547, 540238, 233158, -147463, -216760, 30519, 277487, 290726, 94995, -122943, -143430, 116424, 452330, 546985, 375065, 231932, 277575, 319022, 186347, 32592, 38918, 83508, -22305, -179935, -181508, -75888, -50530, -66568, 82742, 413156, 715091, 832515, 756688, 520171]
38143E20171k94568j39275R5133P2957k21666l61285j10741J77646J18046r8730
38133b42312n3996J96834K40916O1j62388l2573J55607J10763j19402k67967j79658
38122c54115P3089K79190K44037l5053l19889l54553j48069N8982J05354P1169
38112c79858J02340J82279J65135N814j35583q2127J03592J71639K9659j14621
38102D8269p1085L4996q982j17473m7749J50932J85648J6242p7749Q652M0154
38091A61855r8862j73227k0430J63696J84939J34903Q2094j18782m16723m03145
38081e03682M2017L72221J43788k33921j30895K58742K48581j66656l03465N5294
38071b17976L27776J24890j79389j66059j0983l1796j28130q2579J836m0564q5836
$$ y = [520171, 225603, 86328, 181461, 254418, 32752, -328533, -439274, -261628, -143582, -242312, -296308, -99474, 141442, 141503, -20885, -53458, 102149, 212912, 93510, -174457, -354115, -281026, -1836, 242201, 207148, -112741, -467294, -615363, -556381, -451027, -379858, -277518, -95239, 69896, 75710, -59873, -142000, -38408, 133231, 162890, 48269, -22816, 12180, 3198, -114275, -162024, -11092, 174556, 190798, 113049, 121701, 161855, 62993, -110234, -130664, 33032, 217971, 352874, 434968, 316186, -100537, -503682, -461665, -89444, 54344, -179577, -310472, -51730, 196851, 30195, -273270, -217976, 109800, 234690, 55301, -110758, -121741, -153537, -281667, -364246, -362410, -402974, -488810]
38060d88810J8656J43933J44567J33229J95257J50361q5801k29767p3692J08477
38050A6410j3240k68287k70024k8227J43138J43654J01986L7540q9389j33844
38040c60283L1833K07372J40695l2919k2601J17427J54336J56472K90593L10410
38030I93335j21936o77585o33614K2242M73582K62170j11107j02653M4493r6637
38020E2290k85780n4793L72101L55393j04861l30457l6336K37511Q729l92771
38010a78974l60393O8141L18022J49570p3243k6449J07413L5816j14920k4284
38000i9301K38033K68944k6297k51959j15182J51236J85354K3140n9632l624N8875
37989C69587J06642J65867R4919j93033m14419k40196J40793K37460K036j42485
$$ y = [-488810, -470154, -326221, -181654, -48425, 146832, 297193, 211392, -18375, -92067, 16410, 3170, -265117, -535141, -563368, -420230, -276576, -174590, -137050, -226439, -360283, -328450, -121078, 19617, -13302, -35903, 81524, 235860, 392332, 682925, 993335, 871399, 193814, -439800, -417558, 56024, 318194, 207087, 104434, 148927, 52290, -233490, -288283, 83818, 439211, 334350, 3893, -32443, 205068, 213797, -178974, -539367, -471226, -153204, -3634, -76877, -103326, 4087, 39903, -75017, -99301, 138732, 407676, 381379, 129420, 14238, 165474, 350828, 373968, 314336, 310712, 369587, 476229, 642096, 737015, 543982, 129563, -110633, 30160, 267620, 269656, 127171]
37979A27171n0007n9771l00295l64027N900M01218L41670O22j23585K6248J16938
37968A22082M8874K5865P9602m84k32910l37420j55399J23148K51326K12328J27504
37957B64516O7173M2104N0152N9238K0115p6870j97365k80498k31957n570K49034
37946c9928K74985N2656j18423k9891J39244J40202N7811J04594J85608M3403
37936H10261k45319l22251j11047O2175L036o5578P2514K38084J56791o7701r3350
37925D37615J24868K33294k6041m23019m94283j25797K84692L09244R216j84645
37915A45144n7637J50544J44914k3427j08128l7823N8667P3886j0190j62996k55499
37904h2545j18276J68826K35399p8605l77233k08957K36617L56300L59l44913
$$ y = [127171, 77164, 17393, -282902, -646929, -641029, -239811, 101859, 102481, -21104, 5144, 122082, 170956, 196821, 276423, 275939, 43029, -294391, -449790, -326642, -75316, 137012, 264516, 331689, 373793, 423945, 483183, 503298, 426428, 229063, -51435, -283392, -288962, -39928, 235057, 287713, 169290, 139399, 278643, 418845, 476656, 581250, 766858, 810261, 564942, 242691, 131644, 193819, 196855, 131277, 203791, 441875, 598666, 530965, 437615, 562483, 795777, 769736, 346717, -147566, -273363, 11329, 320573, 329789, 145144, 87507, 238051, 382965, 359538, 251410, 213587, 272254, 346140, 335950, 172954, -82545, -200821, -31995, 203404, 124799, -252434, -461391, -224774, 131526, 131885, -213028]
37894b13028k90529j9036J16795P9390J9811k5052p2405n1202P3455J97764K46785
37883F2748K78688L15353K63313J04496m3828j48478k96108m21919l07409R226
37873a83918J56119k3799j79306R549L07119K93290O303j86979j76497j39509
37863a17628j09755M1399K36866K29007K3552j03950n2450r195p4602j14798n3984
37852a05538J1281N5696J54111K05624n12l45546m14715j29032Q7224L031k0801
37841d99177L00959N56311K30115l82974n14078n6099L04585J47024j39689r1853
37831a44876J21266R9859j02026j46217j467Q2704N0745P6178J80125J85465N5266
37820D57022l9074j5449K7400L9032O9502O7292q5520k80845k38517L5188J59622
$$ y = [-213028, -503557, -522593, -405798, -326408, -306597, -331649, -404054, -455256, -381801, -184037, 62748, 341436, 656789, 920102, 1024598, 980770, 832292, 536184, 114265, -193144, -183918, -27799, -51598, -230904, -221355, 85764, 379054, 385357, 198378, 21881, -117628, -227383, -185984, 50882, 279889, 303441, 199491, 147041, 137846, 63244, -51554, -105538, -94257, -38561, 115550, 321174, 320662, -24884, -439599, -568631, -481407, -478376, -499177, -198218, 358093, 588208, 205234, -308844, -364943, -60358, 86666, -53023, -144876, -23610, 76249, -25777, -171994, -173461, -90757, -40012, 36166, 216291, 401756, 457022, 417948, 402499, 429899, 468931, 538433, 605725, 520205, 239360, 843, 36031, 195653]
37809A95653o3101k99063j62242J91548K93426N0638j66786j10926L3784K5016
37799a2053n4079J0918J72376J69449p3006l07165k81885n6813J13141J22230
37789a96887Q5147Q1243L1640q0295p3699J42427L08326J34205k03712k44315
37779a5920P8602L30486K38925L9216l2048j37894l95559m46881J5317N66197
37769B40441M95916j56612o05300l86745J18981L59235K80391J02967j12064l37836
37759f26l58593m7088L27067L92525J65196k5394j2592N0955j6820j80063k57724
37748C6843j54297L549j3205k14443k81778J9631M01018L56299q2379l17860n6421
37737c03043K55019J52446j22829q4044J56671J00963k37324k98515J06776M50185
$$ y = [195653, 132552, -166511, -328753, -137205, 156221, 206859, 40073, -70853, -37069, -12053, -66132, -55214, 117162, 286611, 213605, -93560, -375445, -432258, -319117, -196887, -111740, -30497, 1143, -79152, -152851, -10424, 297902, 432107, 228395, -15920, 62682, 393168, 632093, 671309, 639261, 501367, 105808, -341073, -325756, 240441, 736357, 579745, -25555, -412300, -293319, 65916, 346307, 449274, 337210, -626, -359219, -406307, -79240, 313285, 478481, 453087, 440495, 491450, 474630, 294567, 36843, -117454, -113905, -127110, -341553, -623331, -603700, -202682, 153617, 71238, -246622, -303043, -48024, 104422, -18407, -102451, 54220, 155183, -82141, -380656, -273880, 176305]
37727A76305K75369j52154l06834j49911k8225n9907m3291R5745J56097K6235
37717a0571r9988j7842J68153J94726J6566j42517j03666N0150J20830N2873m1135
37706A87579n5471M91N0337L1957n9651j52240j43348k8830O2908M7610K2562
37695c6096R2505J38715k1219k72896k80839J5870K67336K10326L2500K6091J15656
37684B87949L0931j99318k70010q4262J00208O6964o7504p0316O7185J39479J4065
37673A5371j85804k09090Q267K05431R4421k08381k62996Q4861M27872L48890
37663C18842J8135r0704P9198J48910l7569j85972p7423Q7420O3884m8718l8812
37652B37191N2439N7733j6074o5179j05745j63150r4269J92332M47087L36665
$$ y = [176305, 451674, 299520, -7314, -157225, -185450, -245357, -288648, -192903, -36806, -10571, -110559, -128401, 39752, 234478, 251044, 108527, 4861, 55011, 175841, 228714, 187579, 132108, 132599, 182936, 214893, 155242, 3002, -140346, -169176, -106268, -58658, -36096, 56409, 195124, 173905, -98991, -379830, -363960, -96624, 113702, 146202, 172293, 287949, 318880, 119562, -150448, -234710, -134502, -67538, -135042, -205358, -138173, 1306, 15371, -170433, -379523, -371256, -165825, -71404, -279785, -542781, -457920, -30048, 318842, 336977, 246273, 325471, 474381, 436812, 250840, 173417, 260837, 324721, 276003, 237191, 289630, 347363, 331289, 266110, 160365, -2785, -97054, 95278, 542365, 879030]
37642H79030l9912k23596l6252J63051L826l69490n13936k74407Q6190K80774
37632d4722K85861K04763N2163j84324l72678l15081k9377J89974J05449j39369
37622b47341j80201Q5850L53712L27518J15668L3407J26568J48342k872j08361
37612F52290L532J64671J30259n3796j75418k00277k19094j62356R3241L64266
37602E97318K90332r5893l05067p0611K57045K44502j5823j61199j50634j86277
37592D03693k29976p1747J92473K26199R351j22031n5107o1641k51186l21814
37582b81786p9712K03355K34775J45703J70719K00909K9695k02449k07163k6643
37572A87403O2971N577l1594j0592l2269o4228J0357J26425J28237O1836O5518
$$ y = [879030, 839118, 615522, 579270, 742321, 746147, 376657, -137279, -411686, -325496, -44722, 241139, 445902, 498065, 313741, -58937, -374018, -403395, -213421, -107972, -247341, -427542, -341692, 12020, 339538, 455206, 488613, 615181, 763523, 760651, 652290, 655822, 820493, 950752, 896956, 721538, 521261, 302167, 139811, 233052, 597318, 887650, 791757, 486690, 416079, 673124, 917626, 901803, 740604, 589970, 403693, 173717, 101970, 294443, 520642, 529993, 407962, 352855, 291214, 40028, -281786, -361498, -158143, 76632, 222335, 393054, 593963, 623658, 421209, 214046, 187403, 250374, 255951, 224357, 213765, 181496, 117268, 127625, 254050, 382287, 444123, 509641]
37561E09641N4354j30007l27810k29385Q5361K12284O3977j2196J37647K01206
37551E65072l3467k74999k00410K1319L8739j08488j13053O5477J74458J09480
37541B44128L3852N1563N8724j8549p8205l3824K1703l4587j47102j49230q230
37530e9757J09226N5724q7051j17673j6371J5152j15925j94811p973K79024L12009
37519A71574O6784j15807m3205P7370P636j70942k42296j75750p0225N0513J84384
37508b59964K21652P7630j17022j38806M6704K50269K77923J09758q8004r2053
37498B88087J42384L58546K65831m8051j99835p0545J5922j61719l23781j38853
37488A27986J94672K23491n4453k05451m9650J07764J7616j37908r4252P2483
$$ y = [509641, 563995, 433988, 106178, -123207, -37846, 174438, 238415, 226219, 363866, 565072, 531605, 256606, 56196, 77515, 116254, 7766, -105287, -39810, 134648, 244128, 277980, 329543, 388267, 369718, 291513, 257689, 279392, 244805, 97703, -51527, -59757, 49469, 105193, 18142, -99531, -115902, -100750, -216675, -411486, -419459, -140435, 171574, 238358, 122551, 79346, 156716, 164352, -6590, -248886, -424636, -494861, -444348, -259964, -38312, 39318, -77704, -216510, -169806, 80463, 358386, 468144, 380140, 288087, 430471, 789017, 1054848, 1006797, 806962, 736417, 752339, 590620, 266839, 127986, 322658, 546149, 491696, 286245, 236595, 344359, 361975, 224067, 129815, 202298]
37478B02298J04600m2652j85121j88395r1037J921L5699L9225Q1940J55038J21907
37467B35423r2723k90669j79885J90294M02383K07338j18559j53437Q7105K09253
37457D96523K7804j87855j28097J13016J75462p1651l43475k84892Q6798L71451
37447B55084K30146k16586n02468l31470R4658L25049J87913m1145k6179J90599
37437A65601K69367N8180j86254j57516P2443J80618P6461n407O6006Q7266j04330
37426E22435k70040q4828L13990M44367J47189k00792k41123r5239p8198j90356
37416B67405j71746M9115K42201K18174O8495l802M5274Q8752K5441r0641j29570
37405F09098o7042l1901j23021k29400j50871J10181L28036L53515K63516J53026
$$ y = [202298, 306898, 264246, 79125, -109270, -200307, -198386, -162687, -123462, -41522, 113516, 235423, 142700, -147969, -327854, -137560, 264823, 472161, 353602, 200165, 287270, 496523, 524327, 336472, 208375, 321391, 496853, 425202, 81727, -203165, -116367, 255084, 485230, 268644, -233824, -565294, -470636, -145587, 42326, 1181, -24998, 165601, 434968, 493148, 306894, 149378, 221821, 402439, 478900, 473493, 539499, 626765, 522435, 252395, 167567, 481557, 925924, 1073113, 872321, 631198, 535959, 457761, 267405, 95659, 144774, 386975, 605149, 673644, 669842, 715116, 803868, 829309, 738668, 609098, 542056, 510155, 387134, 157734, 6863, 117044, 445080, 798595, 1062111, 1215137]
37395A215137j1457k07480k48474n9229J35127J32034O9227J29072J35103j46018
37385A143042m55683l26830J14982K29661j45383m02026j27678K43483J79004
37376D52572r2329n5037J77396J17628j85847k39521K364Q2853j03972j43229
37366A2878Q6315J53123j19029k68030J2396L08219J74142j40546j74321r470
37356C5677K3243R628J93961L62194J67056j41652m3506L01462K13204l49740
37346G71527n96935j16414M59693M22187P821j03265J29390J87521n7138j54482
37336I49905J25242L77770J80426k66670m32576j87152Q8430P9125q2271j16121
37326G16108m1739q5434k45385k44072L2537L10171K92114N5728j06310r6291
$$ y = [1215137, 1203680, 996200, 747726, 688497, 823624, 955658, 1024885, 1153957, 1289060, 1143042, 687359, 360529, 475511, 705172, 559789, 157763, 30085, 273568, 452572, 360243, 305206, 482602, 600230, 414383, 174862, 177226, 260079, 156107, 12878, 99193, 252316, 133287, -134743, -122347, 185872, 360014, 219468, 45147, 35677, 58920, 68548, 262509, 624703, 791759, 650107, 606601, 908063, 1121267, 771527, 174592, 58178, 517871, 940058, 947879, 844614, 974004, 1161525, 1104387, 949905, 1075147, 1452917, 1633343, 1366673, 934097, 746945, 835375, 914500, 832229, 716108, 674369, 588935, 343550, 99478, 132015, 442186, 734300, 790028, 683718, 587427]
37316E87427n3874q7430j68691k30558j95732J1663L10292M22143J90949j59593
37306F26596k97508k02607q7007l1443J6339P801j08171j52838N2016L03106K67182
37295C93466M6555K8281J93363J21383k35814l69046k1217L59721L03315j3647
37285H06360j64088j32877j39735j30134N7814K37091R6094k23261k57366P1155
37275B21053L12485J46220j77936k27000K0566J75741l7428m19836n25835k17156
37265g29126J40970J41641j26291k27065k823K55228K85037J68996O8542k4751
37255d9642j09295n4442J36805K24968J01160j7996K5420N0130j04049k34754
37245c1695j10966J10713J47298N3015P0308J91177K14211J07395j232p6342j39323
$$ y = [587427, 533553, 446123, 277432, 46874, -148858, -137195, 173097, 595240, 786189, 626596, 329088, 126481, 39474, 8031, 24370, 32171, -76000, -228838, -176822, 126284, 393466, 440021, 468302, 661665, 783048, 547234, 178188, 156971, 516692, 820007, 806360, 642272, 509395, 369660, 239526, 297340, 534431, 630525, 407264, 149898, 221053, 533538, 679758, 501822, 274822, 295388, 471129, 433701, 13865, -511970, -729126, -588156, -446515, -572806, -799871, -802694, -547466, -262429, -93433, -24891, -49642, -158937, -213379, -76574, 148394, 249554, 231558, 256978, 307108, 203059, -31695, -142661, -31948, 115350, 168365, 238673, 429850, 644061, 751456, 750224, 673882, 534559]
37234E34559j14597K3139R9515p280j39964j33949r5236j39456j17399P8714K12478
37223B00524P8635r1301n542J80529J75688Q0903J06628P0527k26257m11975m9271
37212A09088M83842M26222j47728m02519o5245K14894M610k94611k86923k20555
37202a78925l36754l10281J04648M71852L26269m1868p2031J71359K15513J9145
37192C68927l8651J27099J90352N63j92853j60854J5842J48220J78825J62856
37182H00326J63666J82005J24305p9280k90171k74415o5175K9380j11074k27368
37172B52199j09913P8881J23766J02483J50980J61618K0266j02551k9566O9607
37162G17770m4222k31945j83068O0493J68210L3190j35059j85573j60181p7674
$$ y = [534559, 419962, 443101, 542616, 535336, 395372, 261423, 166187, 26731, -90668, -11954, 200524, 279159, 187858, 182316, 362845, 538533, 619436, 726064, 796591, 570334, 158359, 109088, 592930, 1019152, 871424, 468905, 403660, 618554, 623164, 328553, 41630, -178925, -515679, -825960, -721312, -249460, 76809, 34941, -37090, 134269, 349782, 368927, 330276, 457375, 647727, 648290, 455437, 294583, 310425, 458645, 637470, 800326, 963992, 1145997, 1270302, 1191022, 900851, 626436, 561261, 590641, 479567, 252199, 142286, 221167, 344933, 447416, 598396, 760014, 780280, 677729, 648163, 717770, 673548, 441603, 258535, 319028, 487238, 520428, 385369, 199796, 39615, -38059]
37152c8059R3228K38009J73431m2023j35504m303J56032J57631M6168m4106q7653
37141E12851j39257k16991k67681j96917M7130L56138M88562L13731j7684k33949
37131F45933k17847n4858J01292J26460q364j75835j95732o9800K1010J4248N7912
37120B44419J96989K19027R394j80999r8993P9698K2814j89541j64474J58053
37110B96387L61881J68402j40947j35871J39317K34079n7455l76725k69864J67461
37100C86665L72547P8577k93701k30167J28165K17111q1278k85400q5411K21358
37090D28466K57834R0255m7433j57004k72072k04970J11072L22008J24103k01536
37080D50723j77176J34726K62723P7594q1423n973J16658Q9419k7808j12068j32980
$$ y = [-38059, 55169, 293178, 466609, 424586, 289082, 284779, 440811, 598442, 644610, 600504, 512851, 373594, 156603, -111078, -307995, -260865, 95273, 583835, 897566, 879882, 645933, 428086, 373228, 474520, 600980, 592616, 416781, 221049, 151249, 172259, 186507, 244419, 441408, 660435, 669829, 488830, 389837, 469535, 492349, 302808, 138334, 296387, 658268, 826670, 685723, 549852, 689169, 923248, 865793, 489068, 219204, 386665, 759212, 837789, 544088, 313921, 442086, 659197, 577919, 292519, 207108, 428466, 686300, 776555, 729122, 572118, 300046, 95076, 206148, 528156, 652259, 450723, 273547, 408273, 670996, 748590, 667167, 661194, 777852, 867271, 839463, 727395, 594415]
37069E94415p0356N8823R6540o1752k10104p8692K09492K84844J10628J3116R9538
37058A046492Q5444j61426l23113j21000K21826L03391J08085n5875n6384o4047
37048I83393j86772k53036q9454J45884J26764j45898k55197N4939M14089K69276
37038A063988k86247n62788k25838K63286L65204J65780L0443k6133j71180k77424
37028C39091j30441J01608J08398j8324K5458J75929J34294m2049l5333J17985
37018G76616P9514j43674j78789N1954K09067J39658N8339M4549q3094k75141
37008F78999k01817J34937K86632O2138j72517j19280L7200P9249J07149J65699
36998A058389L1857k94097l67619M7345N21897N47717K13800p1369j79250k03275
$$ y = [594415, 524059, 582882, 679422, 617670, 407566, 328874, 538366, 823210, 933838, 946954, 1046492, 1131936, 970510, 647397, 526397, 748223, 1051614, 1159699, 1103824, 1047440, 983393, 796621, 543585, 454131, 600015, 726779, 580881, 325684, 380623, 794712, 1063988, 777741, 214953, -10885, 252401, 617605, 783385, 813828, 787695, 616515, 339091, 208650, 310258, 418656, 400332, 425790, 601719, 736013, 693964, 658631, 776616, 856130, 712456, 533667, 585621, 794688, 934346, 992685, 1037234, 954140, 678999, 477182, 612119, 898751, 960889, 788372, 669092, 706292, 785541, 892690, 1058389, 1090246, 796149, 428530, 475875, 997772, 1545489, 1759289, 1687920, 1508670, 1305395]
36988A305395j29819M2654J28505M1262j3881P7757R7359o6689j26083R2554K49807
36977A698821N3751j83474p6096J18713n8022l94712k93862K04082M14643O4245
36967A548089l15199k17055J63664L34529J76018o6273j87053j68096o7496N3948
36957A255076J42612J57707O1621j35417k81416j78170J26830L19136K28872N9369
36947A756220K7493K3091j13890k19730n7812K25555K63316o476k94810l57842
36937A245115j66148J87778M61048L16791k34037o17180l42249K66912M60500
36928A578530J00631k17200r8825J46196J07078j02289j13153J14460K80156J65485
36918A961069j39634l60289k94216j8109J56203L7842j76581j52869J20756L32659
$$ y = [1305395, 1175576, 1218230, 1346735, 1387997, 1374116, 1451873, 1549232, 1482543, 1356460, 1449014, 1698821, 1752572, 1569098, 1493002, 1611715, 1553693, 1158981, 865119, 1069201, 1483844, 1548089, 1232890, 1015835, 1179499, 1514028, 1690046, 1623773, 1436720, 1268624, 1201128, 1255076, 1397688, 1555395, 1617016, 1481599, 1200183, 1022013, 1148843, 1467979, 1696851, 1756220, 1783713, 1806804, 1692914, 1473184, 1415372, 1640927, 1904243, 1897767, 1602957, 1245115, 1078967, 1266745, 1727793, 2044584, 1810547, 1193367, 851118, 1118030, 1578530, 1679161, 1461961, 1363136, 1509332, 1616410, 1514121, 1400968, 1515428, 1795584, 1961069, 1821435, 1461146, 1166930, 1148821, 1305024, 1342866, 1166285, 1013416, 1134172, 1466831]
36908A466831K78332P2282p2424p8067p66M9811m264r3700m6650J40755K28431
36897A940571Q3924q4229n7635M7095L7463J4320J37185K45318J26093l4555N9537
36886B515087K38843J11921k22159k88171l1288J12203n801k1886K25130L61844
36876B995723J32327j34686m3950K83866M73572M19975K64113J17477N4829J36026
36866D699272K37416J10823k26615m32435l17525r3960k177r955l7081j33523
36856C794240k46878j65730Q6791J56644r1898k82003q6903K28738J96687j48270
36846C441418l21974m7411M29256O39560L57103j71183m14744j31175K79480K66577
36836D326907p5518j44097K07886M18502J36674j98983q7956K45750L02620J34716
$$ y = [1466831, 1745163, 1817445, 1745021, 1666954, 1666188, 1715999, 1711735, 1618035, 1571385, 1712140, 1940571, 2024495, 1940266, 1882631, 1929726, 1967189, 1981509, 2118694, 2364012, 2490105, 2455550, 2515087, 2753930, 2865851, 2643692, 2355521, 2324233, 2436436, 2430635, 2408749, 2633879, 2995723, 3128050, 2993364, 2949414, 3233280, 3706852, 4126827, 4390940, 4508417, 4563246, 4699272, 4936688, 5047511, 4820896, 4388461, 4070936, 3976976, 3974799, 3964844, 3927763, 3794240, 3547362, 3381632, 3468423, 3625067, 3533169, 3251166, 3164263, 3393001, 3589688, 3441418, 3119444, 3072033, 3501289, 4140849, 4497952, 4326769, 3912025, 3780850, 4060330, 4326907, 4251389, 4107292, 4315178, 4733680, 4870354, 4671371, 4583415, 4829165, 5131785, 5266501]
36826E266501J45246L36865L59706J80140J50110M18245P08428P17010M11924
36817H694175n8026m81808o43015m93029k34003p1171O753O2608L2293r2095j28866
36806F593816K733Q5342l9342j49372K0798L36634M79201M19446L51369L11035
36796H411660J87681K930r6978l8397J68658M58521O19964M41033R2599L0404
36786A0278075L36125N65309M70789L76933N19008N74644L09493J32878M26386
36777A3989640Q14838P67695M93213N21877P82461Q53105Q08125J017972J356884
36768B1405810J404341J239414J276918J513662J681253J906386K434747K960745
36760C5823276L069567L079367L568434M366635M961387N560400O695886Q141616
$$ y = [5266501, 5411747, 5748612, 6108318, 6288458, 6438568, 6856813, 7565241, 8282251, 8694175, 8636149, 8154341, 7511326, 7018297, 6784294, 6713123, 6719876, 6782484, 6814777, 6722682, 6593816, 6596549, 6681891, 6642549, 6493177, 6513975, 6850609, 7329810, 7749256, 8100625, 8411660, 8599341, 8602271, 8505293, 8466896, 8635554, 9094075, 9714039, 10155072, 10247671, 10278075, 10614200, 11179509, 11650298, 12027231, 12546239, 13120883, 13430376, 13563254, 13989640, 14804478, 15572173, 16065386, 16587263, 17369724, 18222829, 19030954, 20048926, 21405810, 22810151, 24049565, 25326483, 26840145, 28521398, 30427784, 32862531, 35823276, 38892843, 41972210, 45540644, 49907279, 54868666, 60429066, 67124952, 75266568]
36752G5266568R396648J0841718J3104596J5769996J8274137K1490492K6486651
36745A90630806L2371528L7870891M4083996N1403393N3284159L8862569N952027
36738D54459369l1852222n5985640n9889568n1758993m2251686l4768835k7931253
36731A50021172k1637774j7171109j4310759j1808889r626221q422770p714620
36724E9329030o462125m874633l989141l877655l671108l051529k491412k214849
36716B8696578j975396j727033j633586j551494j252930r66817r98658j062773
36708A7527891p16531k07937j13085l18233j89392K99429M21261k05854j055144
36699A5442405j426721j228272q22997n16234m05082m50577n20101n08265m61760
$$ y = [75266568, 84663216, 95504934, 108609530, 124379526, 142653663, 164144155, 190630806, 223002334, 260873225, 304957221, 356360614, 409644773, 448507342, 454459369, 422607147, 366621507, 306731939, 254972946, 212721260, 177952425, 150021172, 128383398, 111212289, 96901530, 85092641, 75466420, 67043650, 59329030, 52866905, 47992272, 44003131, 40125476, 36454368, 33402839, 30911427, 28696578, 26721182, 24994149, 23360563, 21809069, 20556139, 19589322, 18590664, 17527891, 16811360, 16603423, 16490338, 16172105, 15982713, 16282142, 16703403, 16497549, 15442405, 14015684, 12787412, 11964415, 11448181, 11043099, 10592522, 10072421, 9564156, 9102396]
36690I102396m56088m11957k21746J3317P9750o2205k56310l51690l00716j55768
36680F978983o4400j23229j77331N563L03785L19308J615k14261q8377O2460l1180
36669F972936j18259L8358J44560p7146k64793J1450M13624L15715j23638j82668
36659G130139K23088M03740L8840l38957k41091Q4723J97943J43718J96572L38684
36649H177399L82113L34462L19932L36173L41089M18180O51559R51823J139092
36640A3051822J120935R65462R01460J172306J714381K108201K101251K012979
36632B5148797K277574K780161L125014L400017M058897N097030O018367O622484
36624E8528341P008888O640566M390894J31794m435396p286008q002328p598724
$$ y = [9102396, 8646308, 8234351, 8012605, 8025922, 8105672, 8043467, 7787157, 7435467, 7134751, 6978983, 6914583, 6791354, 6614023, 6619586, 6923371, 7242679, 7244294, 7030033, 6941656, 7004116, 6972936, 6854677, 6893035, 7037595, 6960449, 6695656, 6707106, 7120730, 7436445, 7312807, 7130139, 7353227, 7756967, 7795807, 7456850, 7215759, 7300482, 7498425, 7642143, 7838715, 8177399, 8559512, 8893974, 9213906, 9550079, 9891168, 10309348, 10960907, 11912730, 13051822, 14172757, 15138219, 16039679, 17211985, 18926366, 21034567, 23135818, 25148797, 27426371, 30206532, 33331546, 36731563, 40790460, 45887490, 51905857, 58528341, 65537229, 72177795, 76568689, 76700483, 72265087, 64979079, 56976751, 49378027]
36616D9378027o904226n949007m724219l635817l014739k736247k516705k234132
36608A7662935j872365j467310j168526j089662j089693r53513p51227p33243
36600H537396q95292r46878p27217l89875j47783n4545n3495o3077k8093k5343
36590E205798k22775n70819p03101l97072L0943J13050j17179k29838p6034N5024
36580C087997l5478j76182j69787p6508k1470J0190N1944M3415l9426r9816n4068
36569B520811N6601J12390l171k94160n23211l59091J57213N01246L04405j03345
36559B369688j57951J29652K92090J78306N2553p888j97429m31200l46337J2885
36549A894369J36890j17498k57853O023K75597J79553k3377j4422k5769l22364
$$ y = [49378027, 42473801, 36524794, 31800575, 28164758, 25150019, 22413772, 19897067, 17662935, 15790570, 14323260, 13154734, 12065072, 10975379, 10021866, 9270639, 8537396, 7642104, 6695226, 5968009, 5578134, 5430351, 5375806, 5322311, 5259234, 5231141, 5205798, 4983023, 4412204, 3709103, 3312031, 3342974, 3456024, 3338845, 3109007, 3032973, 3087997, 3052519, 2876337, 2706550, 2630042, 2608572, 2618762, 2670706, 2714121, 2674695, 2574879, 2520811, 2577412, 2689802, 2686631, 2392471, 1869260, 1510169, 1667382, 2168628, 2473033, 2369688, 2211737, 2341389, 2633479, 2811785, 2864338, 2856450, 2659021, 2227821, 1881484, 1894369, 2031259, 1913761, 1655908, 1661931, 1937528, 2117081, 2093704, 2079282, 2053513, 1731149]
36539A731149n55214k76812K51715M20114J73551o9200j72370l06360l86764j69446
36529F40363J72832K17629L708m7633J05616R8212r6385r5808J18676R1702k36640
36518I72272k87240J84406N56380K67066k97437m12197p0723J73554J08671j1113
36508A183639n1895j17178j60633k1693J63963P8404k18486k97368j7102K44606
36498G86257J70422n1976q0665O7030J13717l0037j69341j25055N3783J86660
36488I20795J67037M7903l8239l1479q321p4536k14372k89776j86171O6567L04007
36477F63415L48830J68784p0015j68081j20546q5247j11505o2676J11773K14163
36467H88895Q2585j08549p0709J49351K10955j4841k38427j55384J35003K71140
$$ y = [1731149, 1175935, 899123, 1150838, 1570952, 1744503, 1675303, 1502933, 1196573, 809809, 640363, 813195, 1030824, 1034532, 986899, 1092515, 1190727, 1094342, 998534, 1117210, 1208912, 972272, 685032, 869438, 1425818, 1692884, 1395447, 983250, 912527, 1086081, 1194752, 1183639, 1131744, 1014566, 853933, 832240, 996203, 1074607, 856121, 558753, 541651, 786257, 956679, 904703, 824038, 891068, 1004785, 974748, 805407, 680352, 734135, 920795, 1087832, 1135735, 1097496, 1066017, 1057696, 983160, 768788, 479012, 292841, 359408, 663415, 1012245, 1181029, 1111014, 942933, 822387, 737140, 625635, 562959, 674732, 888895, 971480, 862931, 792222, 941573, 1152528, 1137687, 899260, 743876, 878879, 1150019]
36457A150019Q9176k09205l24595j81107M6621J61540J35177O4402M443o5409
36447H71062j18662n1086J56710L43394L36822J61745j7146j05141j27649j17704
36437A332345p3398j8688j1179p7285j78999k23649j06216J59389L34968J60474
36427A297762k51511m38823j79352J69143J87558L3294J49966M67573M28227j16207
36417A747630n65365l93604J12492L10956R9281p5628O0726L08203L78382K19240
36407B202313p4036l70278m78376k84641K2585J16400j3064k9853K22520M56117
36397A769687L83430J61705J17452K23030J93805J3555j9031K03528M12318M17139
36387C876618M21240O54757R55595J022071R18207R87350J333792J720434J950423
$$ y = [1150019, 1239195, 1029990, 705395, 524288, 570909, 732449, 867626, 932028, 936471, 871062, 752400, 701314, 858024, 1201418, 1538240, 1699985, 1682839, 1577698, 1450049, 1332345, 1258947, 1240259, 1229080, 1151795, 972796, 749147, 642931, 802320, 1137288, 1297762, 1046251, 607428, 428076, 597219, 784777, 818071, 968037, 1435610, 1863837, 1747630, 1182265, 788661, 901153, 1212109, 1311390, 1235762, 1296488, 1604691, 1983073, 2202313, 2128277, 1757999, 1279623, 994982, 1017567, 1133967, 1120903, 1091050, 1313570, 1769687, 2153117, 2314822, 2432274, 2655304, 2849109, 2862664, 2843633, 3047161, 3459479, 3876618, 4297858, 4952615, 5908210, 6930281, 7848488, 8835838, 10169630, 11890064, 13840487]
36378A3840487J987663J670526P38767o52478j806494k182041j983553j760482
36370I852395j642362j351166q34659m36424l94063n28180n45324l95015k18456
36361C506746j38969j87368k81851k52559m4505J28213M1225j71370j91542l5690
36351B372330l1140k27860k63289J6787K31318N0414k60842k68031n1222j6069
36341A552396k01522k54232l8285J79537J94506J25478J15777R9995J343r5759
36331A679234j03028n6255J3698J38861K51254J78382o9021k07125m8946J95417
36321A972471J87020p7386k75940j92482O0802K65027L60197M06757M05276K92983
36311C404725R7660k7593K7754J99297L42198M03044M28316M62263N38318P14182
$$ y = [13840487, 15828150, 17498676, 18237443, 17584965, 15778471, 13596430, 11612877, 9852395, 8210033, 6858867, 6024208, 5587784, 5193721, 4665541, 4120217, 3725202, 3506746, 3367777, 3180409, 2898558, 2645999, 2601494, 2729707, 2770932, 2599562, 2408020, 2372330, 2341190, 2113330, 1850041, 1866828, 2098146, 2148560, 1887718, 1619687, 1568465, 1552396, 1350874, 1096642, 1058357, 1237894, 1432400, 1557878, 1673655, 1773650, 1774993, 1679234, 1576206, 1519951, 1533649, 1672510, 1923764, 2102146, 2033125, 1826000, 1777054, 1972471, 2159491, 2082105, 1806165, 1613683, 1674485, 1939512, 2299709, 2706466, 3111742, 3404725, 3502385, 3474792, 3502546, 3701843, 4044041, 4447085, 4875401, 5337664, 5875982, 6590164]
36301F590164R72377J135003J080628J037004J389256K098372K558058K204499
36293A9065361J097889k38902j345919k007537k155188j904110j574971j399923
36285I536700j271359r96869o78037n63943o32305o22953m35560k08957n4976
36276D071741O090q5257l07937l80598p0879L48127L59951m8032l20809j12203
36266C460194K79780L94844J54891k29122n33541n39279j49406L04251K52859
36257C395471l47876q08324n69717N5498L73010K35799M2700J9998l13j43439
36247B252807k76990k85712k31690j69390n2496J06846J84950J22784J6669k0365
36237A647413J309j8518j30047k34380j66084N2642J33968j01707l55989j84258
$$ y = [6590164, 7562541, 8697544, 9778172, 10815176, 12204432, 14302804, 16860862, 19065361, 20163250, 19924348, 18578429, 16570892, 14415704, 12511594, 10936623, 9536700, 8265341, 7268472, 6590435, 6026492, 5394187, 4771234, 4335674, 4126717, 4071741, 4077831, 3992574, 3684637, 3304039, 3233160, 3581287, 3941238, 3893206, 3572397, 3460194, 3739974, 4134818, 4289709, 4060587, 3527046, 2987767, 2838361, 3142612, 3395471, 3047595, 2239271, 1669554, 1725052, 2098062, 2333861, 2376561, 2396559, 2396246, 2252807, 1975817, 1690105, 1458415, 1289025, 1236529, 1343375, 1528325, 1651109, 1667778, 1647413, 1648722, 1630204, 1500157, 1265777, 1099693, 1152335, 1286303, 1184596, 828607, 644349]
36227F44349L02990M85693J03152l57938l76198p9448J01672Q0436K4597m6976
36217H82329j40628m4392L20004N42188K30337l08376m25687n0985K82120K60351
36207A547261J02134M1050J2967o0690j02741p9125l8733M7581J76071J37686
36197A783461j61591l56101p9405L71915M10468R2425Q659K66591L34732J0643
36187B681797k29871q9131Q6622L1615N4464L87399O70307N63923L30390L11934
36177D799449L36809J50862l9872O564N2440j49992l04088q7884J76706L6791
36167D977785k62857j85351J44919J68401j06928j26976K36134N01805M22537
36158E769469K98686L35566L46379K78725M34922R13061J325224J346915J159753
$$ y = [644349, 947339, 1433032, 1536184, 1178246, 802048, 722600, 824272, 904708, 929305, 882329, 741701, 697309, 1017313, 1559501, 1789838, 1481462, 1055775, 1004790, 1286910, 1547261, 1649395, 1690445, 1703412, 1642722, 1539981, 1460856, 1422123, 1469704, 1645775, 1783461, 1621870, 1265769, 1186364, 1558279, 1968747, 2061172, 2069831, 2336422, 2671154, 2681797, 2451926, 2362795, 2449417, 2481032, 2535496, 2922895, 3593202, 4157125, 4487515, 4799449, 5136258, 5287120, 5247248, 5253812, 5306252, 5156260, 4852172, 4764288, 4940994, 4977785, 4714928, 4529577, 4674496, 4842897, 4735969, 4608993, 4845127, 5346932, 5769469, 6068155, 6403721, 6750100, 7028825, 7463747, 8376808, 9702032, 11048947, 12208700]
36149A2208700J110339J256860J469382J720179K092475K659434L420525M266701
36141C0204595N139526O310710P995181R212458P711298K249758n086640j0119326
36133E3617560j0624327q250515n992641m872679l985331k804065j937866j802141
36125A3347995j873711j584323j088546p85340o99776o81170p30844q02833o60238
36116D441214k49542P7300J5454k48506l29557j96794j36082k70225m11590l81860
36106B309812k38221j29211r5944r4045r8982j02809p7168k6184k7576j21404
36096A298268j87532o8056J70892K57600P9124j25019p7872J55966K97566K53637
36086B054574J51697N2302q4250j69523n5018J31374O5620k49963m01330j72856
$$ y = [12208700, 13319039, 14575899, 16045281, 17765460, 19857935, 22517369, 25937894, 30204595, 35344121, 41654831, 49650012, 58862470, 66573768, 68823526, 63736886, 53617560, 42993233, 34742718, 28750077, 23877398, 19892067, 17088002, 15150136, 13347995, 11474284, 9889961, 8801415, 8016075, 7316299, 6635129, 5904285, 5101452, 4441214, 4191672, 4268972, 4284426, 4035920, 3706363, 3509569, 3373487, 3103262, 2691672, 2309812, 2071591, 1942380, 1846436, 1752391, 1653409, 1550600, 1473432, 1447248, 1419672, 1298268, 1110736, 1042680, 1213572, 1471172, 1550296, 1425277, 1347405, 1503371, 1800937, 2054574, 2206271, 2258573, 2174323, 2004800, 1949782, 2081156, 2146776, 1896813, 1495483, 1322627]
36076A322627J16227J33706L8690J15468K16709L6558k59179k02856K25780N26836
36066B270566M14015J60128Q3451J21672J26527J99490M43074O76428P33882Q22555
36056F051788J194443J577988J359586L85925p49035j351647j318822j029400
36048F120826p74527n59150l68061l10788m08320m54264k73655k1500k2403l19863
36038B608295n75403m86248j50602J01097J22166L3641m1543j20993k08377j86874
36028A095159J0826K36348K75768J25325j6707k7213J0178j1452m4603N619R7164
36017A756412J18066Q5697J11562J76233J34982L000K9126L43033O92740P35802
36007D186653N00850L51324N30919R35074J300022J411343J134367M73662l30649
$$ y = [1322627, 1438854, 1572560, 1611250, 1726718, 1943427, 1979985, 1720806, 1517950, 1743730, 2270566, 2684581, 2844709, 2928160, 3049832, 3176359, 3375849, 3818923, 4495351, 5229233, 6051788, 7246231, 8824219, 10183805, 10569730, 9820695, 8469048, 7150226, 6120826, 5346299, 4787149, 4419088, 4108300, 3699980, 3245716, 2972061, 2950561, 2928158, 2608295, 2032892, 1546644, 1396042, 1497139, 1619305, 1652946, 1611403, 1490410, 1282033, 1095159, 1105985, 1342333, 1618101, 1743426, 1726719, 1699506, 1709684, 1698232, 1653629, 1659248, 1756412, 1874478, 1960175, 2071737, 2247970, 2382952, 2385952, 2415078, 2758111, 3450851, 4186653, 4687503, 5038827, 5569746, 6504820, 7804842, 9216185, 10350552, 10824214, 10493565]
35998A0493565r43043j233114j299628j202892r00253m93015k68116l47726n06837
35989C298941m97653l63352k58871j63883r075P7505o1448k87399l04893j05270
35979A324602J0915j08276k49580j76458K9869J23063M0085o8959q0195q652Q6628
35968I23042J63405J54589J1040j54381j04939K05274M56986L11153j03660l07118
35958A555391j24329P2854m4254k40100j16992J93784K07665j22495k94721k0204
35948A066599L59764M06409J52360r5796k05378k08867j06461N6851J11507j3656
35938A523332j57622j81584j51932j30631m9566N1545j4663j90895j20296K52425
35928H30113M42223J52308j76717k6729L61106L88649N1248j55181q1727r538
$$ y = [10493565, 9550522, 8317408, 7017780, 5814888, 4914635, 4421620, 4153504, 3805778, 3298941, 2801288, 2437936, 2179065, 2015182, 2006107, 2083612, 2022164, 1734765, 1429872, 1324602, 1335517, 1227241, 977661, 801203, 831072, 954135, 994220, 925261, 845066, 836414, 923042, 1086447, 1241036, 1252076, 1097695, 992756, 1198030, 1655016, 1966169, 1862509, 1555391, 1431062, 1503916, 1459662, 1219562, 1102570, 1296354, 1504019, 1381524, 1086803, 1066599, 1426363, 1832772, 1985132, 1889336, 1683958, 1475091, 1368630, 1425481, 1536988, 1523332, 1365710, 1184126, 1032194, 901563, 851997, 903542, 888879, 697984, 577688, 830113, 1272336, 1424644, 1247927, 1221198, 1582304, 1970953, 2022201, 1867020, 1785293, 1775755]
35918A775755M741J76594M03529L06717p1661k52814j09755m8864k57227l89055
35908A537960k19342k9131p1342j72767j45413j13036j52589p2600J70141K71842
35898A003723P1012j85527k96959l66262l87672j25839L12273L85755k7051k96794
35888H6659k1353K94026J11300k00736l4104L64396L16309j26907l29841j66349
35878B93400q5976j81927n9503L23488M78056J83766k02313l70927l89825l00624
35868c12385N716L73873M20699J37976o5390k4055K5465Q659J08387K06041o1512
35857H23474n12499m60967J52777M67889l741n49156l39744L08142N09953J61529
35847E57657j05484j1089J36000J43697J40477J12548j06820l64681k92107O4464
$$ y = [1775755, 1780496, 1957090, 2360619, 2667336, 2595675, 2342861, 2233106, 2184242, 1927015, 1537960, 1318618, 1289487, 1218145, 1045378, 899965, 786929, 634340, 561740, 731881, 1003723, 1074735, 889208, 592249, 225987, -161685, -287524, 24749, 410504, 383453, 86659, 65306, 359332, 470632, 269896, 235792, 600188, 916497, 789590, 459749, 293400, 207424, 25497, -34006, 289482, 767538, 951304, 748991, 378064, -11761, -312385, -306669, 67204, 487903, 625879, 560489, 536434, 561899, 570558, 678945, 884986, 823474, 310975, -149992, 2785, 470674, 466933, -82223, -421967, -113825, 396128, 557657, 452173, 441084, 577084, 720781, 861258, 973806, 866986, 502305, 210198, 274662]
35837B74662K46669Q8406q9419q2487r8034k77832l78912j71813J81727L79741
35827G2708L48900J81659m5844k14068j48091J36927L48705K51716l8323k25087
35817F69202j79230j0049J00726N4247q2013j15133L2840J46216k6022l42254
35807B48530l78651l9599K51721J46289j30574j36710J40065L17638J97679k1018
35797E95370j02479n8323r516O082j1282q9038j94825k07510p3822J02597K04070
35786A61324K22669J63212l1885l14017m17141j46639K72999M02244J63462o0896
35776D15332k147J20090P397k06086j89982J1446O1902p4023p7440J24315J74788
35765C65592r4631l00718r3342K43905K06174j47648k99143o1592K08697K11353
$$ y = [274662, 521331, 609737, 520318, 437831, 339797, 61965, -316947, -488760, -307033, 72708, 421608, 603267, 557423, 343355, 195264, 332191, 680896, 932612, 894289, 669202, 489972, 479923, 580649, 634896, 552883, 437750, 470590, 616806, 590784, 248530, -130121, -169720, 82001, 228290, 97716, -38994, 101071, 418709, 616388, 595370, 492891, 434568, 425052, 431134, 419852, 330814, 135989, -71521, -145343, -42746, 161324, 383993, 547205, 515320, 201303, -215838, -362477, -89478, 312766, 476228, 415332, 413185, 533275, 540672, 334586, 144604, 156050, 217952, 143929, 66489, 190804, 365592, 270961, -29757, -123099, 120806, 326980, 179332, -119811, -181403, 27294, 238647]
35755B38647P4493J6849J6693p15M9495K12892L07351J70241n3111r4693M6847
35744I84989J11698m5417k56178k59420k7821J95055J84096J2479m0786J17483
35734I76178K32061N2192k76129l85353j96846j521j6145j21711j27319n2946
35724H2461r063J2510O1632Q4462J9639n5129j9767J01230J58443N3025j55728
35713C33715k75200j29261K10899L92887J70583k05382k54344N9498K59509P0037
35703F32941j84769j25660R8027J13958o3948j40619o8749m7712r8683n2175Q9321
35692A51932J57082J49485J90103J97378J888k33583j70150J05391J38646j30461
35682E57711k05941J44420M44891K44390j68722k39247K2498J82036R9492j2550
$$ y = [238647, 313140, 329989, 346682, 345967, 395462, 608354, 915705, 1085946, 1032835, 938142, 984989, 1096687, 1051270, 795092, 535672, 507851, 702906, 887002, 899481, 858695, 976178, 1208239, 1260431, 984302, 598949, 402103, 400582, 384437, 262726, 135407, 82461, 73398, 85908, 147540, 232002, 251641, 196512, 176745, 277975, 436418, 489443, 333715, 58515, -70746, 140153, 533040, 703623, 498241, 243897, 303395, 562904, 632941, 448172, 322512, 420539, 534497, 470549, 329930, 261181, 213469, 114786, 62611, 151932, 309014, 458499, 648602, 845980, 847868, 614285, 444135, 549526, 688172, 557711, 351770, 496190, 941081, 1185471, 1016749, 777502, 800000, 982036, 1081528, 1068978]
35672A068978q1794k02272k58483m7241K40435J73632k24152m28047j84028J37497
35662A94525J48072l1939j08019r2455j34005j62839m2645J30347J82223J43122
35652B26387J15283N4321n5406l7524J50642J80690j53368m41356j85876L29767
35642A83560L50543j71333m22567L0599N43381L74752j96294l47088N2585L56879
35632G55017J63113k19958l64145k56950j08527k1719r837n2934l0437J50065
35622C688L12801J89512j31989k67716j03416O9141P7561J14951K81393L07188
35612H53114K3687k60261k06735K6632Q5579j4886k3664O3822P9779O9123J67744
35601H63934K40248Q9889r7102q400J94099Q7076k39690k47086J38410L27439
$$ y = [1068978, 987184, 784912, 526429, 479188, 719623, 893255, 669103, 241056, 57028, 194525, 342597, 310658, 202639, 110184, -23821, -186660, -229305, -98958, 83265, 226387, 341670, 395991, 340585, 303061, 453703, 634393, 481025, 39669, -146207, 183560, 534103, 362770, -59797, -29198, 514183, 888935, 692641, 345553, 398138, 755017, 918130, 698172, 334027, 77077, -31450, -53169, -63006, -115940, -146377, 3688, 316489, 506001, 374012, 106296, 2880, 72021, 149582, 264533, 545926, 853114, 876801, 616540, 409805, 436437, 522016, 507130, 483466, 547288, 627067, 696190, 863934, 1104182, 1194071, 1096969, 1088569, 1282668, 1369744, 1130054, 882968, 1021378, 1348817]
35591A348817J918l75871l22473l9571O2508M6515J39626J64034j20226m01788
35581E03489k01685K89086M12288M5763k34026p0116J98896J78693L031k3911
35571A101508N0287K1015n1518J5399J47017J19408m8579j15785J278J23397R4005
35560A457432l3105j24345j27096n9584L1402N3346q0272l03038l76000j26051
35550C12689L00742N29664L64618L4874p4269R6516K29497R4348j33638j62656
35540A592385k7672r333j83786l22566k67888j58586j74030k44076j72050N9467
35530I1865K59951K74220J41880R022m8966p9034j31658j38356N886K26288K73241
35519H84339M7892k03689j91845J5510J08619k250r5443j6388J10368J14324J259
$$ y = [1348817, 1350735, 974864, 652391, 612820, 675328, 721843, 861469, 1025503, 905277, 503489, 301804, 590890, 1003178, 1048941, 814915, 744799, 943695, 1122388, 1125419, 1101508, 1151795, 1172810, 1121292, 1136691, 1283708, 1403116, 1354537, 1238752, 1240030, 1363427, 1457432, 1424327, 1299982, 1172886, 1113302, 1144704, 1198050, 1117778, 814740, 438740, 312689, 613431, 1143095, 1507713, 1542587, 1468318, 1564834, 1794331, 1888679, 1755041, 1592385, 1564713, 1555380, 1371594, 1049028, 781140, 622554, 448524, 204448, 32398, 91865, 351816, 626036, 767916, 776938, 727972, 648938, 517280, 378924, 384810, 611098, 884339, 932231, 728542, 536697, 552207, 660826, 658576, 563133, 546745, 657113, 771437, 772696]
35508G72696j35322k19578j45573J41586M31894L85024J6945k24765o9341J71696
35498A125262Q6206k00065k42581J8577K06104J27133J5103N6635O9632j30262
35488A131744l35203k13931J72799M18193L00328K1768j21533r9981o0238k8163
35478A185783R7620K89701L44288J72352k8421m0952N2136J3248j60715k38198
35468A686842j38677n3293j06211j49734m0050R9142P8786n0242r6209j8861O8682
35457A280175J08178J29814J34370Q9726K586j00454j89344j77951j1540J31656
35447A397216k4604l79546m22353O6146N75081M98239k8129l63362k64583m7171
35437A006934N8924J48802K15046M8289k89583l98130j44912J11579J15944P7842
$$ y = [772696, 637374, 417796, 272223, 413809, 845703, 1230727, 1247672, 1022907, 953566, 1125262, 1211468, 1011403, 768822, 787399, 993503, 1120636, 1135739, 1192374, 1262006, 1131744, 796541, 582610, 755409, 1173602, 1473930, 1495698, 1374165, 1274184, 1213946, 1185783, 1283403, 1573104, 1917392, 2089744, 2061323, 2020371, 2072507, 2085755, 1925040, 1686842, 1548165, 1494872, 1388661, 1238927, 1198877, 1298019, 1376805, 1326563, 1230354, 1211493, 1280175, 1388353, 1518167, 1652537, 1742263, 1744849, 1644395, 1455051, 1277100, 1265560, 1397216, 1372612, 993066, 570713, 636859, 1211940, 1710179, 1682050, 1318688, 1054105, 1006934, 1065858, 1214660, 1429706, 1477995, 1188412, 790282, 645370, 756949, 872893, 950735]
35427I50735J84146K15105j601j73494o926K56386K31966M0135N6212K23922J63849
35416B140435j38216k95665j68675m0697p8317p9231J01059K69376K25327N4361
35406A989757q8694k13958l32791l06784o8504J88760K38208J08541j1170m0807
35396A462558m1475p3192j42997k19411k11972k9734K53749L94281K39836p4034
35386A557609k82870k81352j64561m1606P9521K18331L14155K55374L1472j90372
35376A495701k24867j03457l3235r5679j49276j03133p7601j47020j53155q38
35366D07440R2940m8012j82848k9018J88989P5549j97139j15949K43188K48613
35356F83753j90461l53522J21061N63065L16072k13258k62362O3115J04967j72501
$$ y = [950735, 1134881, 1349986, 1348385, 1174891, 1167965, 1424351, 1656317, 1696452, 1752664, 1976586, 2140435, 2002219, 1706554, 1537879, 1497182, 1418865, 1339634, 1440693, 1710069, 1935396, 1989757, 1901063, 1687105, 1354314, 1047530, 979026, 1167786, 1405994, 1514535, 1503365, 1462558, 1421083, 1347891, 1204894, 985483, 773511, 743777, 997526, 1391807, 1631643, 1557609, 1274739, 993387, 828826, 787220, 866741, 1085072, 1399227, 1654601, 1686073, 1495701, 1270834, 1167377, 1134142, 1038463, 889187, 786054, 708453, 561433, 408278, 407440, 500380, 452368, 269520, 240502, 429491, 505040, 307901, 191952, 435140, 683753, 493292, 139770, 260831, 823896, 1139968, 926710, 664348, 727463, 832430, 659929]
35346F59929k27610K0183J08601m0103n268K25130J24757l56381n11472j0730
35336a2964M65602K65044k31155k83746N0017J63542n3077j68046l7379L0599
35326A88437p8917r2946J16930L06857K80719J37651l658j72247l26214k85776
35316G0836k1474K36138K91416J94190Q1668k338o2217q6633q6961q5155o4303
35305D65167l4118p0602j50082p4384K23113M38839K63172j23959k71053j06183
35295E59910J9410o7407j37441j4436J48245J92094K01085K49969K12549O182
35285A370160k31122l63347m09618l61260j38096J43903J86042m2399j88566l7603
35275g1906J81210K12210J37592Q1189o4171k99868l02165O4914L74700K33282
$$ y = [659929, 432319, 452502, 561103, 521000, 515732, 740862, 865619, 509238, -2234, -12964, 452638, 717682, 486527, 202781, 252798, 416340, 363263, 195217, 157838, 188437, 109520, 16574, 133504, 440361, 721080, 858731, 855073, 682826, 356612, 70836, 49362, 285500, 576916, 771106, 852774, 850436, 788219, 701586, 614625, 529470, 465167, 431049, 360447, 210365, 135981, 359094, 797933, 1061105, 937146, 666093, 559910, 579320, 511913, 374472, 360036, 508281, 700375, 901460, 1151429, 1363978, 1370160, 1139038, 775691, 366073, 4813, -133283, 10620, 196662, 154263, -34303, -71906, 109304, 321514, 459106, 540295, 476124, 176256, -125909, -60995, 313705, 546987]
35265E46987p3558m9953J78890J14995k24146l29761m7893K48075L42712L96904
35255A103252M07163J02631m35194o71330m07680j13299j47354j96755R8365M48682
35245A88481L69875k0046k13329r9391j773n7546p7024R900L4013m9145p3977
35234A0038j0762m2544j99175k31961P724L18946M31493L37755J98404Q1256m3170
35223H58004j51225j71364j08257n3763p2009j27004j31849n4759L2800L6965
35213E7539k9991o2303k3613n529o4418j07147m4479M6029O0089P8800K33888
35202A38865M03034K99143p3561l01410p5280L38104L80251p7053n32837m76505
35192B2751l3512K11538p473k93674j56683K73199M01441J6284l69633k06855
$$ y = [546987, 473429, 423476, 602366, 717361, 493215, 163454, 115561, 363636, 706348, 1103252, 1510415, 1613046, 1177852, 506522, 98842, -14457, -161811, -358566, -260201, 188481, 558356, 538310, 324981, 225590, 223817, 166271, 89247, 99147, 133160, 84015, 10038, -724, -43268, -242443, -474404, -466680, -147734, 283759, 621514, 819918, 901174, 858004, 706779, 535415, 427158, 373395, 301386, 174382, 42533, -12226, 20574, 57539, 27548, -34755, -58368, -63897, -128315, -235462, -279941, -233912, -173823, -95023, 138865, 541899, 841042, 767481, 466071, 390791, 728895, 1109146, 1032093, 499256, 22751, -10761, 200777, 193304, -100370, -257053, 16146, 417587, 433871, 64238, -142617]
35182a42617L22266N40243J78550l05092l71417o0502J74051R9248p7312p5923
35172B81495Q8603J81905O9142j45979k68075k15428o8981L1224J0731q6589j38377
35161b60329n7237J05124J92691J22900m844m1260O146j918j07882j72685o7248
35150b86542J43919K75745K20357K6891j55049j75710m861K01890K30742N1728
35140E29110j42107j77584q6833R77L5619L1889m204l2487K7843J47946J52942
35129D83111k1132j59484n2539J52025J27345j38423k91413j03891K11608K84150
35119D91357K4133l18308m27245j88940K12038M20149K39428j31052l07042j74785
35109a60267K0759O3311K5011M7226Q1923K1646p9924j10618r4374q9926k2970
$$ y = [-142617, 179649, 719892, 898442, 593350, 221933, 161431, 335482, 434730, 357418, 281495, 370098, 552003, 621145, 475166, 207091, -8337, -77318, -46094, -35363, -121952, -260329, -317566, -212442, -19751, 103149, 98305, 57045, 63191, 61273, -46609, -219294, -286542, -142623, 133122, 353479, 380370, 225321, 49611, 44750, 246640, 477382, 529110, 387003, 209419, 122586, 123563, 159182, 191071, 186867, 154380, 182223, 330169, 483111, 461979, 302495, 249956, 401981, 529326, 390903, 99490, -4401, 207207, 491357, 515490, 197182, -230063, -419003, -206965, 213184, 452612, 321560, 14518, -160267, -139508, -76197, -51186, -3960, 77963, 99609, 19685, -90933, -185307, -275233, -298203]
35098b98203J52027K38619L8110k55223k32848J26098L73178K23053o1442j11454
35088A91915K0341N7198j5158j7319J6777r5422k59391j63020J75821L25082O4994
35077C01818k58639k47328j3159P8631l466L395J59108K44159J56229M1881j373
35066D61256n0945j21030q1302P8944J57040M8833o3383r083O4189r3136m02079
35055a0696m78612j25716L53126M51112N2445l80861l22802J62128M75780K51470
35045D27374j91454l41882j85359o7486o8099K7685J98625J43582j48018k74255
35035d79287n5393J57953O3974j18938q1341M8880p49j23652l8353J89025K59242
35024a78639J43125O1926N7943j8542j43509j21665M4324J22702J8829j05280
$$ y = [-298203, -146176, 92443, 130553, -124670, -357518, -231420, 141758, 364811, 303369, 191915, 212256, 269454, 254296, 236977, 253754, 158332, -101059, -264079, -88258, 236824, 301818, 43179, -204149, -217308, -138677, -142143, -138748, 20360, 264519, 420748, 462629, 461256, 410311, 289281, 207979, 286923, 443963, 492796, 429413, 420330, 484519, 391383, -10696, -489308, -615024, -261898, 189214, 241659, -139202, -462004, -299876, 175904, 427374, 235920, -105962, -291321, -358807, -426906, -399221, -200596, -57014, -205032, -479287, -534680, -376727, -312753, -431691, -513032, -464152, -464901, -588553, -626906, -437881, -178639, -35514, 26412, 84355, 65813, -77696, -199361, -155037, -32335, -13506, -118786]
35014a18786r8405K2185J65297K13634M9733k42609l23154k2047L09753K24830
35004A80431j53083k95681n5122J68584Q4895j07214j23735Q759J36359K37112
34994H1305L12954K80455J35641J4831l2541j20105k73647l33095k18571p5862
34984b28635l6187l0109L9543J16819J03089J3294o2156n0519O6861K06940K16280
34973C55220P5551k8621O314J3339j09980j29038J06279K34633j01560n25132
34963a02995l73850K12319M18030K4099k64426N828L39489J84403j92896k61855
34953a1854q2642k3233p2594j0444R2510P0565M6728J51580J87163J8637p2322
34942B94094R8946J68620j62661m83982k86007J55494K24064k6553q4015N5061
$$ y = [-118786, -217191, -195006, -29709, 183925, 233658, -8951, -332105, -354152, -44399, 180431, 27348, -268333, -323455, -154871, -69976, -177190, -300925, -292166, -155807, 81305, 394259, 674714, 810355, 825186, 792645, 672540, 398893, 65798, -152773, -228635, -264822, -294931, -255388, -138569, -35480, -22186, -84342, -134861, -68000, 138940, 355220, 430771, 402150, 408464, 421803, 311823, 182785, 289064, 523697, 422137, -102995, -476845, -264526, 153504, 177603, -86823, -80995, 258494, 442897, 250001, -11854, -94496, -117729, -190323, -200767, -108257, -37692, 9036, 160616, 347779, 366416, 294094, 393040, 561660, 398999, -84983, -370990, -215496, 8568, -17985, -102000, -46939]
34932d6939k1484k37595j19574K43528K47068j31669j98394K67142N66502K11173
34922G79758k90058k80088N5394J33865o6693j19813O5428J50985m2062k94321
34912I2395l36883j61761L5835Q9910L6327N2877J67410J54628q3950k31661l844
34901a88717K98387J84737j90838k18259J59709L40073Q1996j23300K8876J36050
34891E08714r6308k53927J0470K62607L1436k99207j34888K44285J32966l55531
34881E0617m44419O143L01284J03562p4451J57869L96626J77697k30120k84771
34871A60037r337J41547Q04j83522k01297p8077J06213K79147K98386R1912j34916
34860D70897r1285J67031K42290o0320l96747l00939J55172L87928N8428m44672
$$ y = [-46939, -68423, -306018, -425592, -182064, 65004, -66665, -265059, 2083, 568585, 779758, 489700, 209612, 265006, 398871, 332178, 212365, 277793, 428778, 386716, 92395, -244488, -406249, -370414, -280504, -244177, -191300, -23890, 130738, 46788, -184873, -188717, 109670, 294407, 103569, -114690, 45019, 385092, 467088, 343788, 372664, 508714, 412406, 158479, 168949, 431556, 462992, 163785, 28897, 273182, 406148, 50617, -393802, -387659, -86375, 17187, -57264, 100605, 497231, 674928, 444808, 160037, 150700, 292247, 293051, 109529, -91768, -169845, -63632, 215515, 513901, 605813, 470897, 379612, 546643, 788933, 728613, 331866, 30927, 186099, 574027, 632455, 187783]
34850A87783n03272r3869K26294J38331l8248P1700K96611K40311m5539j45686
34840C34416N2705K14882J20186k7290L189Q4476k5076k67373l69086k37060m0276
34829a56307P1812J29612J85389J63233j1911k11685j91254Q1079L11533K20095
34819E91596q2948k29812q7314Q9008N0916j01344j18361J3189P7756m2489k14852
34808e4655k25900j5630K44571K88655M5417k16565j87479M1617Q4021j37476
34798a33424k28428M6111L26034J94691j37192j43314J94755L86808K10474k6351
34788F90164o7576o3624j65592j87104O0038L93324M97568L32843P8558j53620
34778A414979l38308m13872l44090k06140p6224O2213J90127J92151O0298k917
$$ y = [187783, -315489, -409358, -183064, -44733, -82981, -11281, 285330, 525641, 480102, 334416, 387121, 602003, 722189, 694899, 698088, 782564, 757488, 490115, 121029, -116031, -156307, -84495, 45117, 230506, 393739, 381828, 170143, -21111, 59968, 371501, 591596, 508648, 278836, 191522, 280530, 331446, 230102, 111741, 124930, 202686, 160197, -54655, -280555, -296185, -51614, 237041, 282458, 65893, -121586, -79969, 4052, -133424, -361852, -315741, 10293, 204984, 67792, -75522, 119233, 506041, 716515, 690164, 622588, 558964, 393372, 206268, 266306, 659630, 1157198, 1490041, 1568599, 1414979, 1076671, 662799, 318709, 112569, 36345, 98558, 288685, 480836, 541134, 538217]
34768E38217J52970L98655N16045M77917L75290K12647l2006k62353l71807l93833
34758A611742l73554k29758M3340J90235k066l16473l48829r2642P3687m37k9993
34747E25252J72628L33511J43723k28714l76560k36336r6441r9469q2118N8341
34737A13817J53896N4520j06025j14390J280M9050j0712k8072O8091J48460Q7308
34726D17223m8391j08581p1808l3216k2099L7073J58480K11521R2471r4636j52253
34715C85784o0469M923n7241j43663j56286j63145k02020j02617K38720N28716
34705B72702L75860q9020k87398l67L00744J62021j94929k78929q3859J9650n3750
34694A42725n7741N7566P9285j1670o728P4341p027j75112n9685L11398M19291
$$ y = [538217, 691187, 1089842, 1605887, 2083804, 2459094, 2671741, 2639735, 2377382, 2005575, 1611742, 1238188, 1008430, 1051770, 1242005, 1239939, 923466, 574637, 481995, 555682, 555245, 525252, 697880, 1031391, 1175114, 946400, 569840, 333504, 237063, 137594, 55476, 113817, 267713, 322233, 216208, 101818, 103098, 152148, 141436, 113364, 181455, 329915, 417223, 368832, 260251, 188443, 155227, 133128, 170201, 328681, 540202, 632673, 538037, 385784, 325315, 330238, 272997, 129334, -26952, -190097, -392117, -494734, -256014, 272702, 648562, 559542, 272144, 271777, 572521, 734542, 539613, 260684, 176825, 196475, 142725, 84984, 142550, 221835, 210165, 203437, 277778, 270751, 95639, 35954, 347352, 766643]
34683G66643R4506j44256N1611K52711L033l51563k30380J90664K84446R303j22222
34672H04496K0521N6764j02923q8428J71366K38641n3935k59207n7249K26174
34662I56220J95128j9626j16037j24288j53112n2478K18019K65758j61497n83082
34652D25005l66720K79193N32617J42174k52500j17071K40780K39355j02772k84513
34642G35548r2586J77559K33663J45949R5475N6033o3371j43806o055K29555K44680
34631A612644K7447n1742J79749L73701J98296r9314p8014J64347J60523j14434
34621B373203j84674J11404L34712J79226m7546O995J63516J05459l0805P5334
34611C086824L37296M09612K61233J66242K29346L14902L70766M54625M94552
$$ y = [766643, 861149, 716893, 768504, 1021215, 1024248, 672685, 442305, 632969, 917415, 926718, 804496, 825017, 881781, 778858, 690430, 861796, 1100437, 1046502, 787295, 730046, 956220, 1151348, 1131722, 1015685, 891397, 738285, 685807, 903826, 1169584, 1008087, 425005, 58285, 337478, 870095, 1012269, 759769, 642698, 883478, 1122833, 1020061, 735548, 642962, 820521, 1054184, 1200133, 1295608, 1351641, 1288270, 1144464, 1138409, 1367964, 1612644, 1640091, 1588349, 1768098, 2141799, 2340095, 2240781, 2162767, 2327114, 2487637, 2373203, 2188529, 2299933, 2634645, 2813871, 2766325, 2773320, 2936836, 3042295, 3011490, 3086824, 3424120, 3833732, 4094965, 4261207, 4490553, 4805455, 5176221, 5630846, 6125398]
34602F125398L73812K20897K87526N54936P63742Q21644Q89908J066060J257604
34593A2361527J392174J521889J709788K000101K459740L066328L647434M135368
34585C2294349M742021N624445O539297P133534P364714P193472O054265L296273
34577H0242370p39876m636918p127437q040623p918783p205107o129847m997306
34569C3446473m115275l530859l093547k696285k306605j903158j528914j277887
34561A2993943j132716r75732q24649q31696r59178r21569n98324k54186j72971
34552F322922k98914m19591m77575n03925m58912l49486l07511l51203k79337
34543B876468j1873J98816J45243J1000L8530Q7321r6887l58625l31682p3754
$$ y = [6125398, 6499210, 6720107, 7007633, 7562569, 8326311, 9147955, 10037863, 11103923, 12361527, 13753701, 15275590, 16985378, 18985479, 21445219, 24511547, 28158981, 32294349, 37036370, 42660815, 49200112, 56333646, 63698360, 70891832, 76946097, 80242370, 79502494, 74865576, 67738139, 59697516, 51778733, 44573626, 38443779, 33446473, 29331198, 25800339, 22706792, 20010507, 17703902, 15800744, 14271830, 12993943, 11861227, 10885495, 10060846, 9229150, 8269972, 7348403, 6750079, 6495893, 6322922, 6024008, 5604417, 5126842, 4622917, 4164005, 3814519, 3507008, 3155805, 2876468, 2864595, 3063411, 3208654, 3219654, 3258184, 3345505, 3248618, 2889993, 2558311, 2484557]
34533B484557j7676k59797l74482r5118K37248J75757j83062l82241k67518j19744
34523A197924j53073k03117l9827K22585K50797k6830k87481k36322J3235J39071
34513H76962O6533m684K0865J1022q8615j11918K0130R8310n4068k50519j87768
34502C96250R7455K79833J94960m529j22309j26771p0187J5158R7656J43900J50301
34491A051717R9480n8144k70980l30835j25415J29157J25607r8498k00519k5747
34481B95823J83742J57245m1518j62997j33736r0513j10937q5207R0847K93430
34471C96179K66576k8241k73063j52574J90589K81482m7157l86800k98007Q7572
34461C6556K73949P9667j92217k22067k1205K11286L24759K55435M6078j11636
$$ y = [2484557, 2466881, 2207084, 1832602, 1737484, 1974732, 2150489, 1967427, 1585186, 1317668, 1197924, 1044851, 841734, 801907, 1024492, 1275289, 1248459, 960978, 724656, 737891, 876962, 943495, 938811, 959676, 970698, 882083, 770165, 790295, 888605, 834537, 584018, 396250, 493705, 773538, 968498, 963969, 841660, 714889, 644702, 659860, 757516, 901416, 1051717, 1151197, 1093053, 822073, 491238, 365823, 494980, 620587, 522089, 321570, 295823, 479565, 636810, 595292, 432295, 298559, 208046, 97109, 11902, 102749, 396179, 662755, 634514, 361451, 208877, 399466, 680948, 633791, 246991, -51016, 36556, 310505, 390172, 197955, -24112, -45317, 165969, 490728, 746163, 792241, 680605]
34451F80605m6871J27699J19913j21591l08339k23181j3623O4767R621o083N9047
34440C41964Q8974L4534j6285P858P0521J12812J31248J27331M6883j52452l75722
34429D17666m16698j84123J42048K93750K37031J57344J20705j3198k46926l00628
34419B06971m2542J88182L2258k94218k79133Q9854K86384N2977k25557j34629
34409a19453J90186L53212K52679O3776q5849j43669l7279J70747K03092p9326
34399G68116l90323l69265r4069O3139R65l6130O6116R9131p7685k43687j13139
34388c26831K36178M39687L08611M5556m7091M2000O3736r0412k04964q1398J02460
34377D87532L0466k28934k74578R768K51550J60436m6023m9245M6967l7092k10783
$$ y = [680605, 633734, 761433, 881346, 759755, 451416, 228235, 214612, 279379, 289000, 282917, 341964, 430938, 465472, 449187, 457045, 527566, 640378, 771626, 898957, 945840, 793388, 417666, 968, -183155, -41107, 252643, 489674, 647018, 767723, 754525, 507599, 206971, 164429, 352611, 384869, 90651, -188482, -98628, 187756, 240733, 15176, -119453, 70733, 423945, 676624, 740400, 654551, 510882, 473603, 644350, 847442, 768116, 377793, 8528, -85541, -22402, -21437, -57567, 8549, 107680, 29995, -213692, -326831, -90653, 349034, 657645, 703201, 656110, 698110, 761846, 671434, 466470, 385072, 487532, 517998, 289064, 14486, 24254, 275804, 436240, 390217, 340972, 387939, 350847, 140064]
34366A40064j46931J36507K64249Q5389j19543r2976O4817J27030L7785j33400
34356C62991k99494l15435n9915L23781M81425K73959l5921j45722p1383m530
34346E09756k009j721o291n8204j18948j29453j13246r1048N538J90617L00271
34335D85262J87451l6863j40074q9488m7780q0870p3734M8645J98799K65778K27392
34324I44518R2589j15722k81790k63538j01484n247n7491r9995j5334O8658J9317
34313A84481l9022N7967J75597O3835j86201k20799J3314J53375r82j53205M23
34302D8783K49528J83999j65524l86135k90993r0857K3509R9024J69365J36688
34292b2613J9637J4914J63673K27098O5653j06961n5856J01300R5306o7927j32833
$$ y = [140064, -6867, 129640, 393889, 479278, 359735, 266759, 331576, 458606, 496391, 362991, 63497, -251938, -311853, 11928, 493353, 767312, 731391, 585669, 514286, 509756, 507747, 506026, 499735, 441531, 322583, 193130, 79884, -11164, -5626, 184991, 485262, 672713, 635850, 495776, 406288, 358508, 277638, 203904, 252549, 451348, 717126, 944518, 1037107, 921385, 639595, 376057, 274573, 269326, 211835, 111840, 96506, 165164, 184481, 145459, 203426, 379023, 442858, 256657, 35858, 49172, 202547, 201565, 48360, 48783, 298311, 482310, 316786, -69349, -360342, -451199, -427690, -328666, -159301, -22613, -2976, 11938, 175611, 402709, 468362, 361401, 305545, 406845, 502151, 434224, 301391]
34281C01391K1557K30220K61053O1392j93714k50107m4843J65201R6243j43182
34271E05211j75890N6049J66783n6311k83365j72043P4758P1007j04455r0014
34261h270J03682J26113r5641k62637k27304j47127q3310Q7388K83503K17716
34251e887p6144j81211M0687J84276l4370k88485j76768J28365K03067N4876L880
34240a47714P3757J0752j67285j45554J22278K72636Q4315j99892k74228j78417
34230e49352r9947l6147Q8047J56853J1325k29786k73520o4443J43826J56980
34220f96164O8794N7938J42713K31266K55395J55397r6512l30766k43720J62093
34210b93566M04382J12323l57999l39219J54118L84863q640m33366k29162L26476
$$ y = [301391, 322948, 553168, 814221, 875613, 681899, 431792, 386949, 552150, 648393, 505211, 329321, 385370, 552153, 495842, 212477, 40434, 115192, 186199, 81744, -8270, 95412, 221525, 125884, -136753, -364057, -511184, -594494, -507106, -223603, -5887, -82031, -263242, -222555, -38279, -72649, -361134, -537902, -409537, -206470, -151594, -147714, -73957, -63205, -230490, -376044, -253766, 18870, 103185, -96707, -370935, -549352, -649299, -685446, -597399, -440546, -429221, -659007, -932527, -996970, -853144, -696164, -627370, -569432, -426719, -195453, 59942, 215339, 118827, -211939, -455659, -293566, 110816, 223139, -134860, -474079, -319961, 64902, 56262, -377104, -606266, -279790]
34200b79790M45587j3290m28134l70023q0527Q2067J37730K16017K12750Q581
34190f9032k29180k37530j2283K22176K99769K32576J19962L3456m3933j70301
34180A45680k89614k16615Q6626L38170K62971m451j12804o260P1870K2240l1992
34169B65821q0650k27312l34792j19722L11070M76267K18196o3767n9355L5420
34159D21176j4952p1656O978J8387j77197k92388q1347J68709P6449j92754k15294
34148c53889o229Q3572J424Q016J50641K10823J41521J09719J15543j0744k21260
34137B29137k53562n4759J45652K09140K06282J58719N424j55668j35655k700
34127C52010k9041k36684l23014j24052J45501K18874R5262n7621j05568N674
$$ y = [-279790, 165797, 152507, -275627, -645650, -726177, -644110, -506380, -290363, -77613, -69032, -298212, -535742, -548025, -325849, -26080, 206496, 326458, 359914, 315981, 145680, -143934, -360549, -273923, 64247, 327218, 322767, 209963, 203703, 275573, 297813, 265821, 185171, -42141, -376933, -496655, -185585, 290682, 508878, 445111, 385756, 421176, 406224, 334568, 341546, 359933, 182736, -109652, -190999, -22290, 54159, -138595, -353889, -360118, -276546, -275122, -267106, -116465, 94358, 235879, 345598, 461141, 450397, 229137, -24425, -79184, 66468, 275608, 481890, 640609, 646033, 490365, 354710, 352010, 322969, 86285, -236729, -360781, -215280, 3594, 98856, 41235, -64333, -58659]
34117e8659K06946K84063R8814j79829k81870k21619k02522j98711J668L22460
34107b29259L78418N4546k62255k31731l3825l5969k08796j80405J96607N93154
34097D0485N88256J85843j70140j23828J54782K19840j5779j86028p5961N0463
34087F67933n4394j78056o1243Q5082m4768k34103p9472K46070K22136j07335
34077D61850j61954J86556L79374J10717j93309j46008j5392j48878l22009j67589
34067a6642J43146J72735q8164k70988j99832n231J96560L73836M23353K56696
34057I85469j1362j84103k18675j84455j15839m9606m7946n7286N6221K16232
34047C88650J48439j62623l36228j36006J52664J58886l2719q9402M3525J45475
$$ y = [-58659, 148287, 432350, 531164, 351335, 69465, -152154, -354676, -553387, -551719, -229259, 149159, 203705, -58550, -290281, -324106, -360075, -568871, -749276, -552669, 40485, 628741, 814584, 644444, 520616, 675398, 895238, 879459, 693431, 617470, 667933, 613539, 435483, 374240, 459322, 414554, 180451, 100979, 347049, 569185, 461850, 299896, 486452, 865826, 976543, 783234, 637226, 621834, 472956, 150947, -16642, 126504, 299239, 211075, -59913, -259745, -264976, -68416, 305420, 728773, 985469, 974107, 790004, 571329, 386874, 271035, 221429, 173483, 116197, 172418, 388650, 537089, 374466, 38238, -97768, 54896, 213782, 181063, 91661, 135186, 280661]
34037B80661Q7177q5720k89168l87059k14389J62152L98518L03105R3649J6733
34027C65659j2793j36795k21622j23646p168m5686p4639Q1485K09550O2594j41812
34016d4873n8091J70473J55918m2169l5967J72471J80068j07858l15758k21701
34006a47487m0759K5264O1499J25531P8068j03411j94409p0822J05178J69333
33996G985J52609J05318J40j09767j01478r634J4002j7693K5335P5260n0264k46214
33984a54401k02375O5152J87806L6916r8992n5081l8042j39819r0633K07132L52462
33973G0125M6927l48148l08474P0567K63336J08225o8766m4891M9008Q7818J44843
33962G0570K21657J34388j55784l54416j91872J76989L42681J53482j31519k15313
$$ y = [280661, 367838, 282118, -7050, -394109, -608498, -446346, -47828, 255277, 348926, 365659, 352866, 216071, -5551, -129197, -136365, -182051, -256690, -175205, 34345, 96939, -44873, -102964, 67509, 223427, 181258, 145291, 317762, 497830, 389972, 74214, -147487, -188246, -162982, -101483, 24048, 102116, -1295, -195704, -266526, -161348, 7985, 160594, 265912, 266052, 156285, 54807, 45173, 59175, 41482, 66817, 142077, 91813, -154401, -356776, -291624, -103818, -66902, -165894, -220975, -259017, -398836, -489469, -282337, 70125, 117052, -231096, -539570, -469003, -205667, -97442, -166208, -211099, -162091, -74273, 70570, 292227, 426615, 270831, -83585, -275457, -98468, 244213, 397695, 266176, 50863]
33952E0863j17834n8776j07318j27015m2243M1924L9125R749m664p3135j60689
33941e50013m8557L08517N61646M07391O6720m1284M7642k7083k47488j95350
33931B82141J88176L79437N3135l83235l82046l2602J45201l7905k67465k17270
33921b72433Q6566L67549L79497J19445j47442j63270n539M0433n1914j3373K11479
33910E50998L00265R7103p2998N3418J86941m1255m06714m02026m4712J65295
33900C86315L3365j21203p8926j8362o0880m034K39895L45224N0438l56785m11853
33889C194j53009k8996j87341k65430P107L43777K92113r9167l17511p7225L10402
33878a72086L76743R7329j53742j41098n875M2331K9681R0776J90633J52019o6091
$$ y = [50863, -66971, -125747, -233065, -360080, -402323, -360399, -321274, -311525, -316189, -389324, -550013, -598570, -290053, 271593, 678984, 745704, 704420, 752062, 724979, 477491, 282141, 470317, 849754, 902889, 519654, 137608, 105006, 250207, 212302, -55163, -272433, -185867, 181682, 561179, 680624, 533182, 369912, 364373, 404806, 352892, 339519, 550998, 851263, 948366, 875368, 928786, 1115727, 1074472, 667758, 265732, 221020, 386315, 419680, 298477, 219551, 201189, 140309, 136275, 376170, 721394, 771832, 415047, 3194, -149815, -178811, -366152, -631582, -624475, -280698, 11415, -87752, -405263, -482488, -172086, 204657, 301986, 148244, 7146, 1271, 43602, 73283, 164059, 354692, 506711, 440620]
33867D40620k56735j99728L0978R6417j86414n18463m12872J44082N82334M69391
33857A89610Q4788k8382J31330J09290k07199l98337j99808J09029K03046J71362
33847A64729K09218K10365l671l06111m34285l49867j72451N1015K66400L12700
33837e1958J59086L4351O6861L5517k24967m29181k33644J77406L26473J39958
33827i8j5863O4632K00164J95862Q1610n1684j57974j68917p5916m1215j72551
33816a41950k72326j07026J71737K18195K3598j11062o8221O847O1878J56806
33806f1524J72462m4396k65096j08868K84977L54076k5791l35482k30701j68K9704
33795b30807j3893K9875j2910k00026j60668K79570O06183L16581k38448l38344
$$ y = [440620, 183885, -15843, 15135, 111552, -74862, -593325, -1006197, -862115, -279781, 189610, 274398, 246016, 377346, 486636, 279437, -118900, -318708, -209679, -6633, 164729, 373947, 584312, 580641, 274530, -159755, -509622, -682073, -631058, -364658, -51958, 107128, 141479, 208340, 243857, 18890, -410291, -643935, -466529, -140056, -98, -15961, 48671, 248835, 444697, 526307, 474623, 316649, 147732, 71816, 30601, -141950, -414276, -521302, -349565, -131370, -107772, -218834, -287055, -280208, -218330, -61524, 110938, 66542, -198554, -307422, -22445, 331631, 305840, -29642, -260343, -260511, -230807, -244700, -214825, -227735, -427761, -588429, -308859, 297324, 613905, 375457, 37113]
33785C7113K7793K28975K1464j65917k0956J85759J10307j48661k76154j73431
33775a73708K9522J76514J68458J7170j12576p1710N1909N9379m0823o8328j915
33764C3892o610j11678j33686J7516J93834K38578J57443J5680j34540j96232
33754G4197j03130L2120N4694L1455J24261K36599J18624j68584k73364j01849
33744B5023N5930N4991J03831K58729J94048k04723m71198k20492J88896J75940
$$ y = [37113, 64906, 293881, 315345, 149428, 128472, 314231, 424538, 275877, -277, -173708, -144186, 32328, 200786, 217956, 105380, 33670, 85579, 144958, 104135, 35807, 33892, 27282, -84396, -218082, -200566, -6732, 231846, 389289, 404969, 270429, 74197, -28933, 3187, 57881, 89336, 213597, 450196, 568820, 400236, 126872, 25023, 80953, 135944, 239775, 498504, 692552, 487829, 16631, -203861, -14965, 160975]
$$ [...]
##END NTUPLES=NMR SPECTRUM
##END=
