##TITLE=31Pdec_E3d2512-2.2
 CDCl3
  24 sc
 26.12.2023
##JCAMPDX= 6.0         $$ Bruker NMR JCAMP-DX V2.0
##DATA TYPE= NMR SPECTRUM
##DATA CLASS= NTUPLES
##ORIGIN= UXNMR, Bruker Analytische Messtechnik GmbH
##OWNER= root
$$ XWIN-NMR		Version 3.5
$$ Tue Dec 26 14:47:58 2023 Russian Standard Time (UT+4h)  she@DPX200
##.OBSERVE FREQUENCY= 81.013821
##.OBSERVE NUCLEUS= ^31P
##.ACQUISITION MODE= SIMULTANEOUS
##.ACQUISITION SCHEME= undefined
##.AVERAGES= 24
##.DIGITISER RES= 16
##SPECTROMETER/DATA SYSTEM= spect
##.PULSE SEQUENCE= zgpg30
##.SOLVENT NAME= CD2Cl2
##.SHIFT REFERENCE= (INTERNAL, CD2Cl2, 0, 248.564)
##AUDIT TRAIL= $$ (NUMBER, WHEN, WHO, WHERE, WHAT)
$$ ##TITLE= Audit trail, XWIN-NMR		Version 3.5
$$ ##JCAMPDX= 5.01
$$ ##ORIGIN= Bruker BioSpin GmbH
$$ ##OWNER= she
$$ F:/spectra/data/she/nmr/P31/1/pdata/1/auditp.txt
$$ ##AUDIT TRAIL=  $$ (NUMBER, WHEN, WHO, WHERE, WHAT)
(   1,<2023-12-26 14:46:59.06 +0400>,<she>,<DPX200>,
      <created by zg, POWCHK disabled, PULCHK disabled
       configuration hash MD5:
       00 E9 B6 7A A2 85 ED C7 34 08 36 98 17 FE 4E 26
       data hash MD5: 32K
       69 53 12 FC AE 1B 64 0E 23 EE 66 8D B9 3B A9 03>)
(   2,<2023-12-26 14:47:03.26 +0400>,<she>,<DPX200>,
      <Start of raw data processing
       efp BC_mod = 2 LB = 10 FT_mod = 6 PKNL = 1 PHC0 = -12644.6 PHC1 = 1381.694 SI = 64K 
       data hash MD5: 64K
       54 1F B3 14 5B D1 26 9E D1 5B 2A C4 90 03 1D C6>)
(   3,<2023-12-26 14:47:19.93 +0400>,<she>,<DPX200>,
      <pk PHC0 = -75.18352 PHC1 = 0 
       data hash MD5: 64K
       67 3F 37 14 B6 73 60 A4 89 A7 87 8E AE 06 58 08>)
(   4,<2023-12-26 14:47:23.20 +0400>,<she>,<DPX200>,
      <abs ABSG = 5 
       data hash MD5: 64K
       1A 64 F9 8B 16 F3 03 4B B7 77 09 87 61 21 C7 30>)
$$ ##END=
$$ 
$$ hash MD5
$$ AF E6 3F 28 08 EC 37 9C 7C D6 B8 13 37 83 36 4E
##$RELAX= 
##$RELAX= 
##$RELAX= 
##$RELAX= 
##$RELAX= 
##$RELAX= 
##$RELAX= 
##$RELAX= 
##$RELAX= 
$$ Bruker specific parameters
$$ --------------------------
##$DU= <F:/spectra>
##$EXPNO= 1
##$NAME= <P31>
##$PROCNO= 1
##$TYPE= <nmr>
##$USER= <she>
##$AMP= (0..31)
100 100 100 100 100 100 100 100 100 100 100 100 100 100 100 100 100 100 
100 100 100 100 100 100 100 100 100 100 100 100 100 100 
##$AQSEQ= 0
##$AQ_mod= 1
##$AUNM= <au_zg>
##$AUTOPOS= <>
##$BF1= 81.014009
##$BF2= 200.13
##$BF3= 200.13
##$BF4= 200.13
##$BF5= 200.13
##$BF6= 200.13
##$BF7= 200.13
##$BF8= 200.13
##$BYTORDA= 1
##$CFDGTYP= 0
##$CFRGTYP= 5
##$CHEMSTR= <none>
##$CNST= (0..31)
1 1 145 1 1 1 1 1 1 1 1 1 1 1 1 1 1 1 1 1 1 1 1 1 1 1 1 1 1 1 1 1 
##$CPDPRG= <waltz16>
##$CPDPRG1= <>
##$CPDPRG2= <waltz16>
##$CPDPRG3= <>
##$CPDPRG4= <mlev>
##$CPDPRG5= <mlev>
##$CPDPRG6= <mlev>
##$CPDPRG7= <mlev>
##$CPDPRG8= <mlev>
##$CPDPRGB= <>
##$CPDPRGT= <>
##$D= (0..31)
0 1 0 0 0 0 0 0 0 0 0 0.03 2e-05 3e-06 0 0 0 0 0 0 0 0 0 0 0 0 0 0 0 0 
0 0 
##$DATE= 1703587618
##$DBL= (0..7)
120 120 120 11 120 120 24 19 
##$DBP= (0..7)
150 150 150 150 150 150 150 150 
##$DBP07= 0
##$DBPNAM0= <>
##$DBPNAM1= <>
$$ [...]
##$SUBNAM3= <"">
##$SUBNAM4= <"">
##$SUBNAM5= <"">
##$SUBNAM6= <"">
##$SUBNAM7= <"">
##$SUBNAM8= <"">
##$SUBNAM9= <"">
##$SW= 501.771253377433
##$SWIBOX= (0..15)
0 1 3 0 0 0 0 0 0 0 0 0 0 0 0 0 
##$SW_h= 40650.406504065
##$TD= 32768
##$TD0= 1
##$TE= 0
##$TE2= 300
##$TE3= 300
##$TEG= 300
##$TL= (0..7)
0 120 53 12 22 120 120 120 
##$TP= (0..7)
150 150 150 150 150 150 150 150 
##$TP07= 0
##$TPNAME0= <>
##$TPNAME1= <>
##$TPNAME2= <>
##$TPNAME3= <>
##$TPNAME4= <>
##$TPNAME5= <>
##$TPNAME6= <>
##$TPNAME7= <>
##$TPOAL= (0..7)
0.5 0.5 0.5 0.5 0.5 0.5 0.5 0.5 
##$TPOFFS= (0..7)
0 0 0 0 0 0 0 0 
##$TUNHIN= 0
##$TUNHOUT= 0
##$TUNXOUT= 0
##$USERA1= <user>
##$USERA2= <user>
##$USERA3= <user>
##$USERA4= <user>
##$USERA5= <user>
##$V9= 5
##$VALIST= <valist>
##$VCLIST= <CCCCCCCCCCCCCCC>
##$VD= 0
##$VDLIST= <DDDDDDDDDDDDDDD>
##$VPLIST= <PPPPPPPPPPPPPPP>
##$VTLIST= <TTTTTTTTTTTTTTT>
##$WBST= 1024
##$WBSW= 4
##$XGAIN= (0..3)
0 0 0 0 
##$XL= 0
##$YL= 0
##$YMAX_a= 3385
##$YMIN_a= -3165
##$ZGOPTNS= <>
##$ZL1= 120
##$ZL2= 120
##$ZL3= 120
##$ZL4= 120
##$ABSF1= 248.5645
##$ABSF2= -253.2056
##$ABSG= 5
##$ABSL= 3
##$ALPHA= 0
##$AQORDER= 0
##$ASSFAC= 0
##$ASSFACI= 0
##$ASSFACX= 0
##$ASSWID= 0
##$AUNMP= <proc_1d>
##$AZFE= 0.1
##$AZFW= 0.5
##$BCFW= 0
##$BC_mod= 2
##$BYTORDP= 0
##$COROFFS= 0
##$CY= -3
##$DATMOD= 1
##$DC= 0
##$DFILT= <>
##$DTYPP= 0
##$F1P= 0
##$F2P= 0
##$FCOR= 1
##$FTSIZE= 65536
##$FT_mod= 6
##$GAMMA= 0
##$GB= 0
##$INTBC= 1
##$INTSCL= 6.047779e-11
##$ISEN= 30
##$LB= 10
##$LEV0= 0
##$LPBIN= 0
##$MAXI= 10000
##$MC2= 0
##$MEAN= 0
##$ME_mod= 0
##$MI= 50
##$NCOEF= 0
##$NC_proc= -7
##$NLEV= 6
##$NOISF1= 182.463
##$NOISF2= 159.3651
##$NSP= 0
##$NTH_PI= 0
##$NZP= 0
##$OFFSET= 248.5645
##$PC= 4
##$PHC0= -12719.78
##$PHC1= 1381.694
##$PH_mod= 1
##$PKNL= yes
##$PPARMOD= 0
##$PSCAL= 0
##$PSIGN= 0
##$REVERSE= no
##$SF= 81.0140089999694
##$SI= 65536
##$SIGF1= 159.3651
##$SIGF2= -187.1042
##$SINO= 113.3802
##$SIOLD= 16384
##$SREGLST= <1H.CDCl3>
##$SSB= 0
##$STSI= 65536
##$STSR= 0
##$SW_p= 40650.406504065
##$SYMM= 0
##$S_DEV= 0
##$TDeff= 32768
##$TDoff= 0
##$TI= <>
##$TILT= no
##$TM1= 0
##$TM2= 0
##$TOPLEV= 0
##$USERP1= <user>
##$USERP2= <user>
##$USERP3= <user>
##$USERP4= <user>
##$USERP5= <user>
##$WDW= 1
##$XDIM= 65536
##$YMAX_p= 296892461
##$YMIN_p= -2872786
$$ End of Bruker specific parameters
$$ ---------------------------------
##NTUPLES= NMR SPECTRUM
##VAR_NAME=  FREQUENCY,     SPECTRUM/REAL,   SPECTRUM/IMAG
##SYMBOL=    X,             R,               I
##VAR_TYPE=  INDEPENDENT,   DEPENDENT,       DEPENDENT
##VAR_FORM=  AFFN,          ASDF,            ASDF
##VAR_DIM=   65536,         65536,           65536
##UNITS=     HZ,            ARBITRARY UNITS, ARBITRARY UNITS
##FACTOR=    0.620285442955139, 1,           1
##FIRST=     20137.2065510682, 0,            0
##LAST=      -20513.1999529968, 0,           0
##MIN=       -20513.1999529968, -2872786,    0
##MAX=       20137.2065510682, 296892461,    0
$$ Real data points
##PAGE= N=1
##DATA TABLE= (X++(R..R)), XYDATA
$$ [...]
$$ plain form
40058 213390 258656 345625 463170 598096 737135 868356 982154 1072274 1136859 1178741
40048 1178741 1204297 1221079 1235392 1250907 1268502 1286838 1303187 1314386 1317923 1312986 1301027 1285568
40036 1285568 1271432 1263903 1268165 1288847 1329107 1389195 1465228 1549347 1631626 1702862 1756650 1789648
40024 1789648 1800350 1787692 1750868 1690522 1610247 1516954 1419509 1326229 1242502 1169562 1104856
40013 1104856 1043762 982002 917765 852658 791152 738920 701030 680799 679582 697211 732532
40002 732532 783597 847557 920574 998042 1075025 1146599 1207990 1254787 1283554 1292706 1283180 1258334
39990 1258334 1222961 1181714 1137701 1091973 1044244 994338 943382 894066 850047 815135 792741
39979 792741 785628 795721 823700 868322 925783 989688 1052134 1105730 1145613 1170200 1180200 1176610
$$ packed form
40058B13390M5266Q6969J17545J34926J39039J31221J13798R0120O4585M1882
40048A178741K5556J6782J4313J5515J7595J8336J6349J1199L537m937j1959j5459
40036A285568j4136p529M262K0682M0260O0088P6033Q4119Q2279P1236N3788L2998
40024A789648J0702j2658l6824o0346q0275r3293r7445r3280q3727p2940o4706
40013A104856o1094o1760o4237o5107o1506n2232l7890k0231j217J7629L5321
40002G32532N1065O3960P3017P7468P6983P1574O1391M6797K8767R152r526k4846
39990A258334l5373m1247m4013m5728m7729m9906n0956m9316m4019l4912k2394
39979G92741p113J0093K7979M4622N7461O3905O2446N3596L9883K4587J0000l590
$$ plain form
39967 1176610 1159177 1126394 1076897 1011181 932538 846729 760688 680947 612537 558668 521023
39956 521023 500168 495767 506768 531672 568828 616522 672826 735242 800211 862689 916208 953761
39944 953761 969226 958557 920117 854204 762313 646707 510554 358470 196976 34339
39934 34339 -120292 -258113 -371823 -456622 -510940 -536653 -538600 -523485 -498534 -470181 -442956
39923 -442956 -418855 -397527 -377097 -355107 -329072 -296661 -255974 -206114 -147915 -84542 -21649
39912 -21649 33006 70464 81767 59210 -2344 -104082 -241952 -406189 -582247 -753135 -902426
39901 -902426 -1016929 -1088497 -1114817 -1099176 -1049156 -974435 -884400 -786445 -685404 -583830 -482670
39890 -482670 -382006 -281970 -183633 -89292 -1730 77445 149340 218100 289669 369544 460680
$$ packed form
39967A176610j7433l2783m9497o5716p8643q5809q6041p9741o8410n3869l7645
39956E21023k0855m401J1001K4904L7156M7694N6304O2416O4969O2478N3519L7553
39944I53761J5465j0669l8440o5913r1891j15606j36153j52084j61494j62637
39934C4339j54631j37821j13710q4799n4318k5713j947J5115K4951K8353K7225
39923d42956K4101K1328K0430K1990K6035L2411M0687M9860N8199O3373O2893
39912b1649N4655L7458J1303k2557o1554j01738j37870j64237j76058j70888j49291
39901i02426j14503p1568k6320J5641N0020P4721R0035R7955J01041J01574J01160
39890d82670J00664J00036R8337R4341Q7562P9175P1895O8760P1569P9875R1136
$$ plain form
39879 460680 562515 671396 782034 889370 990193 1083919 1172160 1257161 1339951 1419445
39869 1419445 1493158 1558834 1615521 1663041 1700252 1723546 1727000 1704618 1653713 1577633 1486087
39858 1486087 1392716 1311191 1251888 1220316 1217142 1239089 1280318 1334273 1395744 1462173 1533380
39847 1533380 1609776 1690264 1771246 1847260 1912544 1962327 1993170 2002601 1988768 1950567 1888143
39836 1888143 1803363 1699857 1582478 1456275 1325344 1192041 1056969 919784 780380 639839
39826 639839 500779 367155 243781 135595 46624 -21157 -68560 -98936 -116998 -127138 -131916
39815 -131916 -131155 -121914 -99477 -59170 1634 82242 178730 285252 395752 505223 610128
39804 610128 708163 797663 876999 944263 997411 1034702 1055114 1058618 1046406 1021076 986450 946664
$$ packed form
39879D60680J01835J08881J10638J07336J00823R3726Q8241Q5001Q2790P9494
39869A419445P3713O5676N6687M7520L7211K3294L454k2382n0905p6080r1546
39858A486087r3371q1525n9303l1572l174K1947M1229N3955O1471O6429P1207
39847A533380P6396Q0488Q0982P6014O5284M9783L0843R431j3833l8201o2424
39836A888143q4780j03506j17379j26203j30931j33303j35072j37185j39404j40541
39826F39839j39060j33624j23374j08186q8971o7781m7403l0376j8062j0140m778
39815a31916P61R241K2437M0307O0804Q0608R6488J06522J10500J09471J04905
39804F10128R8035Q9500P9336O7264N3148L7291K0412L504j2212k5330l4626l9786
$$ plain form
39792 946664 904840 862166 818116 771739 723136 674113 627383 584624 544450 501609 448155
39781 448155 376291 281528 164624 31392 -109338 -248524 -379178 -497340 -601620 -691912
39771 -691912 -768147 -829906 -876942 -910081 -931796 -946065 -957488 -969927 -985219 -1002702 -1019880
39760 -1019880 -1033693 -1041404 -1040651 -1029125 -1004649 -965784 -912380 -845487 -766610 -676920 -576980 -467299
39748 -467299 -349473 -227467 -108343 -1824 81627 133771 151441 138057 103155 60280 24028
39737 24028 7080 17799 58750 126310 211491 301952 384922 450265 492672 512245 513389 502608
39725 502608 486036 467539 447863 424934 395041 354583 301895 238448 168646 98069 31074
39714 31074 -30892 -89359 -147387 -207432 -269570 -330908 -386340 -430105 -457336 -465078 -452867 -422948
$$ packed form
39792I46664m1824m2674m4050m6377m8603m9023m6730m2759m0174m2841n3454
39781D48155p1864r4763j16904j33232j40730j39186j30654j18162j04280r0292
39771f91912p6235o1759m7036l3139k1715j4269j1423j2439j5292j7483j7178
39760a019880j3813p711P53J1526K4476L8865N3404O6893P8877Q9690R9940J09681
39748d67299J17826J22006J19124J06519Q3451N2144J7670j3384l4902m2875l6252
39737B4028j6948J0719M0951O7560Q5181R0461Q2970O5343M2407J9573J144j0781
39725E02608j6572j8497j9676k2929k9893m0458n2688o3447o9802p0577o6995
39714C1074o1966n8467n8028o0045o2138o1338n5432m3765k7231p742J2211K9919
$$ plain form
39702 -422948 -380005 -330167 -279405 -231721 -187698 -143836 -93094 -26695 63311 181672 328591
39691 328591 499647 686613 878670 1063801 1230359 1368697 1472424 1538774 1568058 1562837
39681 1562837 1527593 1469013 1396014 1318664 1246061 1184249 1135276 1097692 1068002 1042415 1018230
39670 1018230 994419 971309 949960 932031 920284 919151 934528 972665 1038468 1133785 1256198
39659 1256198 1398841 1551444 1702167 1839441 1953337 2036476 2084748 2097900 2079881 2038708
39649 2038708 1985500 1932548 1890850 1867944 1866878 1886348 1921639 1965976 2012119 2053980 2087752
39638 2087752 2112068 2127227 2134149 2133874 2127836 2118395 2108847 2102707 2102639 2109633 2122646 2138696 2153306
39625 2153306 2161242 2157295 2136868 2096265 2032850 1945251 1833771 1700938 1552055 1395347 1241313
$$ packed form
39702d22948M2943M9838N0762M7684M4023M3862N0742O6399R0006J18361J46919
39691C28591J71056J86966J92057J85131J66558J38338J03727O6350K9284n221
39681A562837l5244n8580p2999p7350p2603o1812m8973l7584k9690k5587k4185
39670A018230k3811k3110k1349j7929j1747j133J5377L8137O5803R5317J22413
39659A256198J42643J52603J50723J37274J13896Q3139M8272J3152j8019m1173
39649B038708n3208n2952m1698k2906j066J9470L5291M4337M6143M1861L3772
39638B087752K4316J5159O922k75o038r441r548o140o8O994J3013J6050J4610
39625B153306P936l947k0427m0603o3415q7599j11480j32833j48883j56708j54034
$$ plain form
39614 1241313 1101016 983688 894557 833812 797003 776431 762843 747111 721861 682860 629746
39603 629746 565822 497133 431338 376753 341581 333260 357765 418811 517032 649424 809387
39592 809387 987479 1172836 1354747 1523704 1671407 1790034 1871905 1910508 1902510 1849330
39582 1849330 1757043 1634813 1492954 1341491 1189325 1043744 910216 792442 692392 610071
39572 610071 543149 487225 437276 389905 345009 305561 275390 256275 246106 239119 227786 205151
39560 205151 166627 111055 41188 -36340 -111886 -174595 -214854 -226676 -209167 -166437 -105872
39549 -105872 -35449 38643 113258 188328 266262 351110 447525 559457 688824 834514 992182
39538 992182 1154902 1314415 1462354 1591031 1693777 1765192 1801381 1799926 1759541 1679877 1562130
$$ packed form
39614A241313j40297j17328q9131o0745l6809k0572j3588j5732k5250l9001n3114
39603F29746o3924o8689o5795n4585l5172q321K4505O1046R8221J32392J59963
39592H09387J78092J85357J81911J68957J47703J18627Q1871L8603p998n3180
39582A849330r2287j22230j41859j51463j52166j45581j33528j17774j00050q2321
39572F10071o6922n5924m9949m7371m4896l9448l0171j9115j0169o987j1333k2635
39560B05151l8524n5572o9867p7528p5546o2709m0259j1822J7509M2730O0565
39549a05872P0423P4092P4615P5070P7934Q4848R6415J11932J29367J45690J57668
39538I92182J62720J59513J47939J28677J02746P1415L6189j455m0385p9664j17747
$$ plain form
39527 1562130 1410387 1232716 1040985 849206 671122 517985 397102 311316 259540 238133
39517 238133 242480 267986 310203 364537 426149 490173 551964 607389 653514 689773 718849 746296
39505 746296 778572 820300 872202 930718 989414 1041285 1080770 1104756 1112701 1106510 1090476 1070853
39493 1070853 1054431 1046049 1046057 1049222 1046043 1026205 982637 914215 825838 725971 623270 524241
39481 524241 432936 352115 284419 232605 199031 185098 190975 215453 255794 307839 366696 427904
39469 427904 488584 548108 608159 672241 744636 828785 925429 1031275 1138989 1238624 1319782
39458 1319782 1373559 1393838 1378011 1327299 1246485 1142852 1024508 898782 771355 646332
39448 646332 526978 416643 319449 240436 185024 157900 161579 195110 253435 327805 407344
$$ packed form
39527A562130j51743j77671j91731j91779j78084j53137j20883q5786n1776k1407
39517B38133M347K5506M2217N4334O1612O4024O1791N5425M6125L6259K9076K7447
39505G46296L2276M1728N1902N8516N8696N1871L9485K3986P945o191j6034j9623
39493A070853j6422q382QL165l179j9838m3568o8422q8377r9867j02701r9029
39481E24241r1305q0821o7696n1814l3574j3933N877K4478M0341N2045N8857O1208
39469D27904O0680N9524O0051O4082P2395Q4149R6644J05846J07714R9635Q1158
39458A319782N3777K0279j5827n0712q0814j03633j18344j25726j27427j25023
39448F46332j19354j10335r7194p9013n5412k7124L679L3531N8325P4370P9539
$$ plain form
39437 407344 481366 541569 583328 605809 611263 604043 589574 573338 559987 552903 554291 565498
39425 565498 587080 618541 658068 702673 748827 793351 834174 870640 903156 932343 958083
39414 958083 978984 992578 996150 987879 967630 936899 897914 852663 802650 749374 694772 641111
39402 641111 590532 544803 505335 473018 447564 426717 405939 379093 340023 284391 210947
39391 210947 121698 21209 -84481 -188907 -286087 -371089 -439994 -489399 -516013 -516950 -490604
39380 -490604 -437439 -360097 -262785 -150381 -27743 100572 230218 356785 475615 581962
39370 581962 671703 742408 794139 829370 851942 865679 873376 876620 876311 873308 868583 862670 855015
39357 855015 844216 829516 812762 799361 797272 814149 853937 914571 987900 1061805 1123361 1161681
$$ packed form
39437D07344P4022O0203M1759K2481N454p220j4469j6236j3351p084J388J1207
39425E65498K1582L1461L9527M4605M6154M4524M0823L6466L2516K9187K5740
39414I58083K0901J3594L572q271k0249l0731l8985m5251n0013n3276n4602n3661
39402F41111n0579m5729l9468l2317k5454k0847k0778k6846l9070n5632p3444
39391B10947q9249j00489j05690j04426r7180q5002o8905m9405k6614r37K6346
39380d90604N3165P7342R7312J12404J22638J28315J29646J26567J18830J06347
39370E81962Q9741P0705N1731L5231K2572J3737P697L244l09l003m725n913p655
39357H55015j0799j4700j6754j3401k089J6877L9788O0634P3329P3905O1556L8320
$$ plain form
39345 1161681 1169704 1144931 1089365 1008878 912121 809237 710629 625885 562697 525576 514518
39334 514518 524500 546584 570431 586866 589316 574185 541093 493309 437699 383521 340243 315429
39322 315429 313476 335325 378894 440053 514016 596865 686444 781961 882289 983984 1080437
39311 1080437 1162921 1223158 1256172 1262254 1247304 1221594 1197496 1186973 1199352 1239663 1307702
39300 1307702 1397972 1500512 1602597 1691162 1755553 1789663 1792370 1766150 1715024 1643300 1555806
39289 1555806 1459000 1361731 1274716 1208537 1170910 1164574 1186771 1230327 1285628 1342813 1393850
39278 1393850 1434177 1463368 1484533 1502757 1523272 1549962 1584439 1625823 1671259 1716973 1759363
39267 1759363 1795513 1823094 1840198 1845883 1841320 1830475 1819170 1812543 1812287 1815406 1815290 1804565 1778354
$$ packed form
39345A161681Q023k4773n5566q0487r6757j02884r8608q4744o3188l7121j1058
39334E14518R982K2084K3847J6435K450j5131l3092m7784n5610n4178m3278k4814
39322C15429j953K1849M3569O1159P3963Q2849Q9579R5517J00328J01695R6453
39311A080437Q2484O0237L3014O082j4950k5710k4098j0523J2379M0311O8039
39300A307702R0270J02540J02085Q8565O4391L4110K707k6220n1126p1724q7494
39289A555806r6806r7269q7015o6179l7627o336K2197M3556N5301N7185N1037
39278A393850M0327K9191K1165J8224K0515K6690L4477M1384M5436M5714M2390
39267A759363L6150K7581J7104N685m563j0845j1305o627k56L119j16j0725k6211
$$ plain form
39254 1778354 1736602 1684622 1631713 1588360 1563008 1559659 1577144 1609983 1650010 1687902 1714526
39243 1714526 1722452 1707514 1669675 1612504 1541531 1462416 1379728 1296547 1214645 1134955 1058111
39232 1058111 984840 916121 853082 796693 747455 705313 669805 640187 615205 592670 569307
39221 569307 541281 505243 459345 403712 340243 271929 202063 133622 69027 10295 -40365
39210 -40365 -79756 -103310 -105920 -84109 -38432 25512 98247 169109 229036 272318 296964 303872
39198 303872 295288 273230 238569 191084 130161 55524 -32508 -133273 -246163 -370666 -505783
39187 -505783 -649060 -795882 -939514 -1071743 -1183632 -1266198 -1311244 -1312640 -1267685 -1177943 -1049201
39176 -1049201 -890745 -714375 -533242 -360455 -207468 -82502 10621 72934 109852 129719
$$ packed form
39254A778354m1752n1980n2909m3353k5352l349J7485L2839M0027L7892K6624
39243A714526P926j4938l7839n7171p0973p9115q2688q3181q1902p9690p6844
39232A058111p3271o8719o3039n6389m9238m2142l5508k9618k4982k2535k3363
39221E69307k8026l6038m5898n5633o3469o8314o9866o8441o4595n8732n0660
39210d0365l9391k3554k610K1811M5677O3944P2735P0862N9927M3282K4646O908
39198C03872q584k2058l4661m7485o0923p4637q8032j00765j12890j24503j35117
39187e05783j43277j46822j43632j32229j11889q2566m5046j396M4955Q9742J28742
39176a049201J58456J76370J81133J72787J52987J24966R3123O2313L6918J9867
$$ plain form
39166 129719 141642 153301 169459 191580 218455 247469 276044 302878 328631 355868 388303
39155 388303 429498 481352 542863 609865 676115 735443 783896 820825 848630 871653 894981
39144 894981 923572 961678 1012328 1076734 1153692 1239355 1327742 1412097 1486704 1548426 1597269
39133 1597269 1635761 1667590 1696282 1724525 1754012 1785365 1817856 1849239 1876078 1894570 1901311
39122 1901311 1893641 1869716 1828758 1771504 1700315 1618479 1529007 1433873 1334309 1231836 1129117
39111 1129117 1030100 939538 862230 802094 761119 738448 730162 730159 732093 731659 728141 724345 724860 733482
39097 733482 751012 774255 796510 809292 804658 777269 725719 653108 566953 478154 398780 339120
39085 339120 305266 298263 314908 349574 396431 451409 513130 582193 659055 741752 824831 900029
$$ packed form
39166A29719J1923J1659J6158K2121K6875K9014K8575K6834K5753K7237L2435
39155C88303M1195N1854O1511O7002O6250N9328M8453L6929K7805K3023K3328
39144H94981K8591L8106N0650O4406P6958Q5663Q8387Q4355P4607O1722M8843
39133A597269L8492L1829K8692K8243K9487L1353L2491L1383K6839J8492O741
39122A901311p670k3925m0958n7254p1189q1836q9472r5134r9564j02473j02719
39111A129117r9017r0562p7308o0136m0975k2671q286lJ934m34l518l796N15Q622
39097G33482J7530K3243K2255J2782m634k7389n1550p2611q6155q8799p9374n9660
39085C39120l3854p003J6645L4666M6857N4978O1721O9063P6862Q2697Q3079P5198
$$ plain form
39073 900029 958252 991718 995304 966771 906370 816655 702870 573444 439772 314746 210351
39062 210351 135106 92313 79612 89783 112365 135753 149549 146933 126383 91983 51904 15537
39050 15537 -9611 -19975 -16277 -2345 16739 36253 52713 64089 69526 68802 61773 48121 27693
39037 27693 1310 -28624 -58392 -84167 -103332 -114883 -118650 -114139 -100067 -74995 -38403 8728
39025 8728 64339 126384 193873 267166 347235 434194 525879 617387 702126 774069 830131 871435
39013 871435 902896 931482 964074 1005641 1057979 1119043 1183105 1242134 1288357 1317118 1328631
39002 1328631 1327646 1321188 1315541 1313794 1314823 1313845 1303961 1277879 1229196 1153358 1048649 917182 765138
38989 765138 601696 436974 280014 137547 13531 -90837 -176853 -247789 -308273 -363683
$$ packed form
39073I00029N8223L3466L586k8533o0401q9715j13785j29426j33672j25026j04395
39062B10351p5245m2793j2701J0171K2582K3388J3796k616k0550l4400m0079l6367
39050A5537k5148j0364L698J3932J9084J9514J6460J1376N437p24p029j3652k0428
39037B7693k6383k9934k9768k5775j9165j1551l767M511J4072K5072L6592M7131
39025H728N5611O2045O7489P3293Q0069Q6959R1685R1508Q4739P1943N6062M1304
39013H71435L1461K8586L2592M1567N2338O1064O4062N9029M6223K8761J1513
39002A328631r85o458n647j747J029r78r884k6082m8683p5838j04709j31467j52044
38989G65138j63442j64722j56960j42467j24016j04368q6016p0936o0484n5410
$$ plain form
38979 -363683 -419460 -480289 -549263 -627354 -713207 -803011 -890427 -966963 -1023324 -1051579 -1047205 -1009863
38967 -1009863 -942662 -850672 -739898 -617229 -490727 -369265 -261126 -172322 -105664 -61014
38957 -61014 -36310 -28722 -35539 -54641 -84418 -123158 -168311 -216198 -262305 -301824 -330036 -342582
38945 -342582 -335776 -306880 -254080 -176342 -73815 50994 192038 339852 483641 614399
38935 614399 727329 822306 902405 971458 1031637 1081788 1117069 1130303 1114725 1066872 988176
38924 988176 884597 764737 637436 509701 385653 266850 153841 48034 -47214 -126873
38914 -126873 -185520 -218742 -223913 -200181 -148095 -69407 32779 153877 288033 428609 568478
38903 568478 699906 814334 902588 955805 966963 932547 853732 736627 591368 430197
$$ packed form
38979c63683n5777o0829o8974p8091q5853q9804q7416p6536n6361k8255M374L7342
38967a009863O7201R1990J10774J22669J26502J21462J08139Q8804O6658M4650
38957f1014K4704P588o817j9102k9777l8740m5153m7887m6107l9519k8212j2546
38945c42582O806K8896N2800P7738J02527J24809J41044J47814J43789J30758
38935F14399J12930R4977Q0099O9053O0179N0151L5281J3234j5578m7853p8696
38924I88176j03579j19860j27301j27735j24048j18803j13009j05807r5248p9659
38914a26873n8647l3222n171K3732N2086P8688J02186J21098J34156J40576J39869
38903E68478J31428J14428Q8254N3217J1158l4416p8815j17105j45259j61171
$$ plain form
38893 430197 265046 105389 -42855 -177180 -297572 -405469 -502795 -590974 -670156 -739201
38883 -739201 -796413 -840266 -869527 -883318 -881942 -868291 -848362 -829853 -819320 -819684 -829420 -843504
38871 -843504 -855285 -858298 -847519 -819997 -775103 -714533 -641928 -562081 -480008 -400438 -327965 -267278
38859 -267278 -222605 -196155 -186500 -188386 -194662 -199358 -199949 -197508 -195110 -196049 -203169 -219282 -247789 -292595
38845 -292595 -357150 -443139 -549462 -671957 -803826 -936533 -1060872 -1168264 -1252142 -1309231
38835 -1309231 -1340197 -1349414 -1343826 -1331130 -1317605 -1306235 -1295855 -1281796 -1257740 -1218115 -1160264 -1085751
38823 -1085751 -1000192 -911471 -827094 -752168 -688907 -637328 -596002 -562175 -531464 -497943 -455354
38812 -455354 -399421 -330327 -253780 -179561 -118047 -76386 -56183 -53508 -60998 -71017 -78567 -82815
$$ packed form
38893D30197j65151j59657j48244j34325j20392j07897r7326q8179p9182o9045
38883g39201n7212m3853k9261j3791J376J3651J9929J8509J0533l64r736j4084
38871h43504j1781l013J0779K7522M4894O0570P2605P9847Q2073P9570P2473O0687
38859b67278M4673K6450R655j886o276m696n91K441K398r39p120j6113k8507m4806
38845b92595o4555q5989j06323j22495j31869j32707j24339j07392q3878n7089
38835a309231l0966r217N588J2696J3525J1370J0380J4059K4056L9625N7851P4513
38823a085751Q5559Q8721Q4377P4926O3261N1579M1326L3827L0711L3521M2589
38812d55354N5933O9094P6547P4219O1514M1661K0203K675p490j0019p550m248
$$ plain form
38800 -82815 -86711 -95020 -111568 -136874 -167317 -196446 -217803 -227513 -225219 -213185 -194548 -171777
38788 -171777 -145817 -115976 -80467 -37269 15137 77515 150096 233174 327816 436320 561829
38777 561829 706770 870418 1046780 1224252 1387734 1522526 1618142 1670473 1681846 1659588
38767 1659588 1613789 1554728 1490528 1425816 1361840 1297631 1231361 1161407 1087224 1010179 934091
38756 934091 864941 809613 774054 761583 771959 801452 843917 892502 941322 986287 1024838
38745 1024838 1055066 1075057 1082964 1077634 1059328 1030116 993821 955531 920823 894995 882465 886348
38733 886348 908029 946571 998111 1055623 1109579 1149675 1167191 1157289 1120477 1062823 994666 928046
38721 928046 873634 838285 824011 828286 844955 865157 878185 872737 838835 770054 665176 528465
$$ packed form
38800h2815l896q309j6548k5306l0443k9129k1357r710K294J2034J8637K2771
38788a71777K5960K9841L5509M3198N2406O2378P2581Q3078R4642J08504J25509
38777E61829J44941J63648J76362J77472J63482J34792R5616N2331J1373k2258
38767A659588m5799n9061o4200o4712o3976o4209o6270o9954p4183p7045p6088
38756I34091o9150n5328l5559j2471J0376K9493M2465M8585M8820M4965L8551
38745A024838L0228J9991P907n330j8306k9212l6295l8290l4708k5828j2530L883
38733H86348K1681L8542N1540N7512N3956M0096J7516r902l6812n7654o8157o6620
38721I28046n4412l5349j4274M275J6669K0202J3028n448l3902o8781j04878j36711
$$ plain form
38709 528465 368563 196579 24059 -138903 -285207 -411612 -518605 -609256 -687483 -756426
38699 -756426 -817646 -871445 -917883 -957689 -992479 -1024448 -1055970 -1089260 -1126008 -1166898 -1211115
38688 -1211115 -1255926 -1296499 -1326296 -1338303 -1326816 -1289035 -1225808 -1141323 -1042035 -935207 -827513
38677 -827513 -724161 -628779 -543906 -471534 -413235 -369843 -341069 -325486 -320904 -324751 -334135 -345779
38665 -345779 -356245 -362616 -363154 -357343 -345230 -326633 -300945 -267640 -226841 -179202 -125167 -64393
38653 -64393 3844 79415 160079 240994 315180 374737 412443 423203 404847 358035 285684 192568
38641 192568 85491 -26365 -131841 -219553 -280591 -310753 -310968 -285685 -240373 -179583 -106539
38630 -106539 -24089 63912 151881 232996 300647 350003 379090 389156 384309 370474 353923 339865
$$ packed form
38709E28465j59902j71984j72520j62962j46304j26405j06993r0651p8227o8943
38699g56426o1220n3799m6438l9806l4790l1969l1522l3290l6748m0890m4217
38688a211115m4811m0573k9797j2007J1487L7781O3227Q4485R9288J06828J07694
38677h27513J03352R5382Q4873P2372N8299M3392K8774J5583M582l847r384j1644
38665c45779j0466o371n38N811J2113J8597K5688L3305M0799M7639N4035O0774
38653f4393O8237P5571Q0664Q0915P4186N9557L7706J0760j8356m6812p2351r3116
38641A92568j07077j11856j05476q7712o1038l0162k15K5283M5312O0790P3044
38630a06539Q2450Q8001Q7969Q1115O7651M9356K9087J0066m847j3835j6551j4058
$$ plain form
38618 339865 331568 330073 334265 341175 346575 346045 336419 317040 290110 259861 231060 207771 192943
38605 192943 188606 196258 217079 251910 300924 363150 436375 517715 604718 696370 793523 898550
38593 898550 1014423 1143552 1286897 1443880 1612975 1792373 1980063 2173182 2367087 2554869
38583 2554869 2727755 2876460 2993155 3073317 3116680 3126773 3109250 3070009 3014216 2946556 2871904
38572 2871904 2795403 2721703 2654059 2594133 2542518 2499324 2464242 2436170 2413120 2392856 2373955
38561 2373955 2356447 2341542 2330739 2325009 2324329 2327566 2332732 2337774 2341780 2345894 2353268 2367991 2393541
38548 2393541 2431428 2480422 2536499 2593492 2644095 2680781 2696374 2684559 2640739 2563304 2454668
38537 2454668 2321365 2172934 2020038 1872576 1738326 1622193 1525925 1448044 1384021 1326929
$$ packed form
38618C39865q297j495M192O910N400n30r626j9379k6930l0249k8801k3289j4828
38605A92943m337P652K0821L4831M9014O2226P3225Q1340Q7003R1652R7153J05027
38593H98550J15873J29129J43345J56983J69095J79398J87690J93119J93905J87782
38583B554869J72886J48705J16695Q0162M3363J0093j7523l9241n5793o7660p4652
38572B871904p6501p3700o7644n9926n1615m3194l5082k8072k3050k0264j8901
38561B373955j7508j4905j0803n730o80L237N166N042M006M114P374J4723K5550
38548B393541L7887M8994N6077N6993N0603L6686J5593j1815m3820p7435j08636
38537B454668j33303j48431j52896j47462j34250j16133r6268p7881o4023n7092
$$ plain form
38527 1326929 1268874 1203006 1125307 1035195 934733 827200 716114 605222 499182 404128
38517 404128 327570 277396 260101 278758 331517 411433 507757 607927 699312 770373 811722
38506 811722 817518 786862 724222 638523 541318 444768 359752 294220 252257 234353 238746 262880
38494 262880 304030 359049 423928 493837 563663 628790 685784 732795 769598 797392 818544
38483 818544 836346 854558 876554 904351 938168 976942 1019411 1064828 1112631 1161341 1207738
38472 1207738 1247228 1275171 1288080 1283829 1261229 1220077 1162128 1092090 1017402 946281 884863
38461 884863 834874 793051 752622 706179 648642 579132 501288 422211 350527 294147 258459
38450 258459 245489 254085 280645 319898 365646 411655 452736 485710 509945 527326 541848 559024
$$ packed form
38527A326929n8055o5868p7699r0112j00462j07533j11086j10892j06040r5054
38517D04128p6558n0174j7295J8657N2759P9916R6324J00170R1385P1061M1349
38506H11722N796l0656o2640q5699r7205r6550q5016o5532m1963j7904M393K4134
38494B62880M1150N5019O4879O9909O9826O5127N6994M7011L6803K7794K1152
38483H18544J7802J8212K1996K7797L3817L8774M2469M5417M7803M8710M6397
38472A207738L9490K7943J2909m251k2600m1152n7949p0038p4688p1121o1418
38461H84863m9989m1823m0429m6443n7537o9510p7844p9077p1684n6380l5688
38450B58459j2970Q596K6560L9253M5748M6009M1081L2974K4235J7381J4522J7176
$$ plain form
38438 559024 585088 625902 685557 765017 861226 967187 1073322 1169882 1249347 1307401 1342016
38427 1342016 1351811 1335499 1293059 1227520 1145728 1057470 973541 903650 854702 829633 827033 841747
38415 841747 866533 894337 920424 943459 965029 987864 1013587 1041013 1065668 1080623 1078161 1051575
38403 1051575 996662 912805 803536 676290 541080 408257 286118 179297 88574 12072
38393 12072 -52780 -107432 -151286 -182039 -197185 -195996 -180956 -157742 -133691 -115537 -107459 -110207
38381 -110207 -121538 -137710 -155296 -172361 -188437 -203553 -217119 -227319 -231282 -225956 -209429 -182068
38369 -182068 -146838 -108475 -71798 -39680 -11454 17506 54409 106021 175245 258955 348210
38358 348210 430581 493308 526054 522673 482138 408690 310946 199912 86688 -18987 -108896
$$ packed form
38438E59024K6064M0814N9655P9460R6209J05961J06135R6560P9465N8054L4615
38427A342016R795j6312m2440o5539q1792q8258q3929o9891m8948k5069k600J4714
38415H41747K4786K7804K6087K3035K1570K2835K5723K7426K4655J4955k462k6586
38403A051575n4913q3857j09269j27246j35210j32823j22139j06821r0723p6502
38393A2072o4852n4652m3854l0753j5146J189J5040K3214K4051J8154Q078k748
38381a10207j1331j6172j7586j7065j6076j5116j3566j0200l963N326J6527K7361
38369a82068L5230L8363L6677L2118K8226K8960L6903N1612O9224Q3710Q9255
38358C48210Q2371O2727L2746l381m0535p3448r7744j11034j13224j05675q9909
$$ plain form
38347 -108896 -175973 -214523 -221200 -195877 -141409 -62350 36399 150008 273064 398788 519243
38336 519243 626867 716590 787191 841021 882117 913738 936668 949038 947459 928517 889914
38325 889914 831157 753999 662550 562683 460750 362114 270206 186358 110237 40474 -24768
38314 -24768 -87258 -148001 -206285 -258889 -300220 -323854 -325005 -302584 -259759 -203029 -140714 -81623
38302 -81623 -33782 -2766 10087 8363 -746 -9175 -10394 -306 23041 59818 108379 165219
38290 165219 225205 281943 328144 356401 360766 338736 292513 228672 156265 84302 19787 -32875
38278 -32875 -71111 -92919 -96439 -80887 -48133 -3496 45274 90360 125990 148959 157555 150268
38266 150268 125666 83503 25956 -42209 -114706 -185375 -249550 -304692 -350158 -386251 -412935
$$ packed form
38347a08896o7077l8550o677K5323N4468P9059R8749J13609J23056J25724J20455
38336E19243J07624Q9723P0601N3830M1096L1621K2930J2370j579j8942l8603
38325H89914n8757p7158r1449r9867j01933r8636r1908q3848p6121o9763o5242
38314b4768o2490o0743n8284n2604m1331k3634j151K2421M2825N6730O2315N9091
38302h1623M7841L1016J2853j724r109q429j219J0088K3347L6777M8561N6840
38290A65219N9986N6738M6201K8257M365k2030m6223o3841p2407p1963o4515n2662
38278c2875l8236k1808l520J5552L2754M4637M8770M5086L5630K2969Q596p287
38266A50268k4602m2163n7547o8165p2497p0669o4175n5142m5466l6093k6684
$$ plain form
38255 -412935 -428760 -430566 -414350 -377067 -318531 -242202 -154344 -62115 28059 111014 182537 239022
38243 239022 277655 296894 296776 278779 245408 199942 146751 92032 44157 12720 6042 28155
38231 28155 77001 144953 221347 295694 360129 410457 445919 468120 479783 483836 483142 480707
38219 480707 479991 484993 500036 529195 575373 639216 718344 807313 898286 982153 1049901 1094117
38207 1094117 1110200 1096713 1054735 986947 897385 791973 679007 568805 472416 399881 358475
38196 358475 351302 376649 428532 498326 576929 656693 732584 802280 865312 921859 971964 1015355
38184 1015355 1051465 1079113 1096026 1098814 1083825 1048591 993158 920714 837398 751524 672382
38173 672382 608557 565933 546183 546741 562574 588823 622878 665108 718203 785547 869124 967690
$$ packed form
38255d12935j5825j806J6216L7283N8536P6329Q7858R2229R0174Q2955P1523N6485
38243B39022L8633J9239j18j7997l3371m5466n3191n4719m7875l1437o678K2113
38231B8155M8846O7952P6394P4347O4435N0328L5462K2201J1663M053o94k435
38219D80707p16N002J5043K9159M6178O3843P9128Q8969R0973Q3867O7748M4216
38207A094117J6083j3487m1978o7788q9562j05412j12966j10202r6389p2535m1406
38196C58475p173K5347N1883O9794P8603P9764P5891O9696O3032N6547N0105M3391
38184A015355L6110K7648J6913K788j4989l5234n5433p2444q3316q5874p9142
38173F72382o3825m2624j9750N58J5833K6249L4055M2230N3095O7344Q3577R8566
$$ plain form
38161 967690 1076035 1185559 1285914 1367207 1422215 1447967 1445906 1420569 1377633 1322508 1259972
38150 1259972 1194472 1130383 1071851 1022073 982318 951372 926148 903411 881594 861537 845839
38139 845839 837458 838300 848109 863901 880191 890134 887027 865429 821667 754187 664165 556152
38127 556152 438080 320212 213136 125272 60672 17919 -9393 -30785 -56439 -95039 -152157
38116 -152157 -229185 -322773 -425012 -524689 -609600 -669415 -698178 -695545 -666392 -619014 -562625
38105 -562625 -505090 -451659 -405006 -366135 -335392 -313126 -299967 -296690 -303573 -319297 -340015 -359422
38093 -359422 -370169 -366083 -344163 -305443 -254462 -197706 -141804 -92161 -52438 -24757 -10206 -9092
38081 -9092 -20662 -42630 -71124 -101377 -128755 -149464 -160686 -160306 -146480 -117107 -69473 -473
$$ packed form
38161I67690J08345J09524J00355Q1293N5008K5752k061k5337m2936n5125o2536
38150A259972o5500o4089n8532m9778l9755l0946k5224k2737k1817k0057j5698
38139H45839q381Q42R809J5792J6290R943l107k1598m3762o7480r0022j08013
38127E56152j18072j17868j07076q7864o4600m2753k7312k1392k5654l8600n7118
38116a52157p7028r3588j02239r9677q4911n9815k8763K633K9153M7378N6389
38105e62625N7535N3431M6653L8871L0743K2266J3159L277o883j5724k0718j9407
38093c59422j0747M086K1920L8720N0981N6756N5902M9643L9723K7681J4551J114
38081i092j1570k1968k8494l0253k7378k0709j1222L80J3826K9373M7634O9000
$$ plain form
38069 -473 92290 209014 346669 499099 658161 815227 962534 1094072 1206002 1296512
38059 1296512 1365232 1412690 1440415 1451755 1452673 1451603 1458029 1480329 1523771 1589269 1673226 1768514
38047 1768514 1866449 1959172 2041561 2111897 2171106 2221273 2264410 2302073 2335586 2366299 2395596
38036 2395596 2424755 2454811 2486389 2519402 2552638 2583370 2607271 2619031 2613814 2588943 2544775
38025 2544775 2484173 2411118 2329403 2241956 2150588 2055925 1957684 1855518 1750153 1644003 1540649
38014 1540649 1443358 1353768 1271796 1196803 1128935 1069391 1019398 978731 944708 912052 873661
38003 873661 822224 752387 662748 556738 441899 327867 223954 137184 71290 26645 831
37992 831 -10514 -12878 -12299 -15056 -27233 -53603 -95921 -151495 -213204 -271283 -316210 -341413 -344862
$$ packed form
38069d73R2763J16724J37655J52430J59062J57066J47307J31538J11930R0510
38059A296512O8720M7458K7725J1340R18j070O426K2300M3442O5498Q3957R5288
38047A768514R7935R2723Q2389P0336N9209N0167M3137L7663L3513L0713K9297
38036B395596K9159L0056L1578L3013L3236L0732K3901J1760n217k4871m4168
38025B544775o0602p3055q1715q7447r1368r4663r8241j02166j05365j06150j03354
38014A540649r7291q9590q1972p4993o7868n9544m9993m0667l4023l2656l8391
38003H73661n1437o9837q9639j06010j14839j14032j03913q6770o5894m4645k5814
37992H31j1345k364N79k757j2177k6370m2318n5574o1709n8079m4927k5203l449
$$ plain form
37979 -344862 -329125 -299991 -264181 -227018 -190871 -154959 -116462 -72468 -21817 34065 91731
37968 91731 147149 197042 239443 273577 299597 318372 331017 337995 338395 330431 313277 289035
37956 289035 263046 242116 231895 235276 252593 282746 323921 373253 426134 476313 517209 543762
37944 543762 553725 547811 528990 501358 468886 434232 398163 359888 318092 271852 220926 165636
37932 165636 106955 47098 -9729 -57271 -88304 -96601 -78805 -35298 30106 110969 198992 284735
37920 284735 358799 413570 444927 452974 441355 415642 381743 345098 310758 283843 269606 272600
37908 272600 295057 335490 388790 448347 509124 569632 631424 696480 764375 831021 889547
37897 889547 932655 955107 955206 934697 897387 847449 788409 723175 654650 586102 520792 461084
$$ packed form
37979c44862J5737K9134L5810L7163L6147L5912L8497M3994N0651N5882N7666
37968I1731N5418M9893M2401L4134K6020J8775J2645O978M00p964j7154k4242
37956B89035k5989k0930j0221L381J7317L0153M1175M9332N2881N0179M0896K6553
37944E43762R963n914j8821k7632l2472l4654l6069l8275m1796m6240n0926n5290
37932A65636n8681n9857n6827m7542l1033q297J7796M3507O5404Q0863Q8023Q5743
37920B84735P4064N4771L1357Q047j1619k5713l3899l6645l4340k6915j4237K994
37908B72600K2457M0433N3300N9557O0777O0508O1792O5056O7895O6646N8526
37897H89547M3108K2452R9k0509l7310m9938n9040o5234o8525o8548o5310n9708
$$ plain form
37885 461084 407767 360369 318712 284989 264952 267045 299521 366891 467522 593476 732536
37874 732536 871352 998271 1104791 1185375 1236322 1254836 1239107 1189418 1109533 1007422 894639
37863 894639 784443 689367 619072 579029 570136 589151 629604 682780 738486 785799 814207
37852 814207 815233 784053 720369 628256 515332 391696 268747 157583 67059 2103 -36768
37841 -36768 -52468 -49521 -32526 -5445 28393 66040 104654 141242 172450 194630 204333 199226
37829 199226 179083 146243 105136 61113 19350 -15535 -39260 -47728 -37463 -6311 46303 119803
37817 119803 212904 323241 446238 574406 698270 808782 899798 969182 1018371 1051171
37807 1051171 1072688 1088515 1103867 1122434 1145300 1170558 1194061 1211028 1217615 1211817 1193653 1164977
$$ packed form
37885D61084n3317m7398m1657l3723k0037K093L2476O7370J00631J25954J39060
37874G32536J38816J26919J06520Q0584N0947J8514j5729m9689p9885j02111j12783
37863H94639j10196r5076p0295m0043q893J9015M0453N3176N5706M7313K8408
37852H14207J026l1180o3684r2113j12924j23636j22949j11164r0524o4956l8871
37841c6768j5700K947J6995K7081L3838L7647L8614L6588L1208K2180R703n107
37829A99226k0143l2840m1107m4023m1763l4885k3725q468J0265L1152N2614P3500
37817A19803R3101J10337J22997J28168J23864J10512R1016O9384M9189L2800
37807A051171K1517J5827J5352J8567K2866K5258K3503J6967O587n798j8164k8676
$$ plain form
37795 1164977 1128872 1088449 1045251 998161 943551 876723 793839 693521 577630 451066 320724
37784 320724 193897 76695 -27075 -116294 -192153 -257130 -313663 -363025 -405069 -439040 -464870
37773 -464870 -483916 -498330 -509295 -515310 -511841 -492822 -453286 -391814 -311668 -220342 -127911 -44877
37761 -44877 19891 60709 75830 67391 40685 2982 -37847 -74638 -101802 -115688 -114637 -99236
37749 -99236 -72892 -42213 -16313 -4743 -14821 -49663 -107845 -184353 -272004 -362812 -449478 -527019
37737 -527019 -593982 -652563 -707654 -765365 -831395 -909264 -998714 -1095154 -1190810 -1277059 -1346603
37726 -1346603 -1394439 -1417771 -1415574 -1388318 -1337939 -1267906 -1183248 -1090259 -995695 -905514 -823562
37715 -823562 -750684 -684641 -621051 -555200 -484022 -407256 -327300 -248207 -174772 -112215 -66209
$$ packed form
37795A164977l6105m0423m3198m7090n4610o6828q2884j00318j15891j26564j30342
37784C20724j26827j17202j03770q9219p5859o4977n6533m9362m2044l3971k5830
37773d64870j9046j4414j0965o015L469J9019L9536O1472Q0146R1326R2431Q3034
37761d4877O4768M0818J5121q439k6706l7703m0829l6791k7164j3886J051J5401
37749i9236K6344L0679K5900J1570j0078l4842n8182p6508q7651r0808q6666p7541
37737e27019o6963n8581n5091n7711o6030p7869q9450r6440r5656q6249o9544
37726a346603m7836k3332K197K7256N0379P0033Q4658R2989R4564R0181Q1952
37715h23562P2878O6043O3590O5851P1178P6766P9956P9093P3435O2557M6006
$$ plain form
37704 -66209 -42776 -47811 -86201 -160599 -270038 -409058 -567849 -733535 -892241 -1031441 -1142087
37693 -1142087 -1219935 -1265404 -1281844 -1273073 -1241484 -1187669 -1111448 -1013678 -897902 -771196 -643652
37682 -643652 -526452 -429214 -357872 -314059 -295981 -299919 -321468 -356139 -399438 -446728 -493257
37671 -493257 -534652 -567748 -591232 -605497 -611706 -610719 -602548 -586690 -563081 -533113 -500086 -468760
37659 -468760 -444181 -430319 -429154 -440462 -462171 -490923 -522633 -553184 -579453 -600401 -617482 -633856
37647 -633856 -652803 -676436 -705455 -739664 -778465 -820912 -865463 -909877 -951234 -985985 -1010038
37636 -1010038 -1019320 -1011077 -985518 -946640 -901213 -856170 -815970 -781629 -751806 -724803 -699900 -677320
37624 -677320 -657282 -639069 -620732 -599492 -572664 -538687 -497872 -452498 -406140 -362467 -323961
$$ packed form
37704f6209K3433n035l8390p4398j09439j39020j58791j65686j58706j39200j10646
37693a142087p7848m5469j6440Q771L1589N3815P6221R7770J15776J26706J27544
37682f43652J17200R7238P1342M3813J8078l938k1549l4671m3299m7290m6529
37671d93257m1395l3096k3484j4265o209R87Q171J5858K3609K9968L3027L1326
37659d68760K4579J3862J165j1308k1709k8752l1710l0551k6269k0948j7081j6374
37647f33856j8947k3633k9019l4209l8801m2447m4551m4414m1357l4751k4053
37636a010038r282Q243K5559L8878M5427M5043M0200L4341K9823K7003K4903K2580
37624f77320K0038J8213J8337K1240K6828L3977M0815M5374M6358M3673L8506
$$ plain form
37613 -323961 -291096 -262325 -234851 -205800 -173209 -136648 -97503 -58897 -25004 319 15012
37602 15012 19567 16715 10331 4060 56 -1737 -3284 -6978 -13630 -21072 -24059 -15404 12329 65285
37588 65285 147319 259652 400946 567530 753728 952352 1155531 1355751 1546709 1723612
37578 1723612 1882922 2021978 2139031 2233706 2307390 2363015 2404161 2433881 2453647 2462819 2458882
37567 2458882 2438517 2399037 2339528 2261244 2167410 2062618 1951863 1839169 1726224 1611845
37557 1611845 1492820 1365910 1230131 1088179 946272 812409 693922 595496 518397 460834
37547 460834 418911 387820 363332 343415 329298 325102 335925 365306 413630 478380 555962 643761
37535 643761 741033 848057 964131 1085732 1206008 1316021 1407193 1473984 1515806 1537678
$$ packed form
37613c23961L2865K8771K7474K9051L2591L6561L9145L8606L3893K5323J4693
37602A5012M555k852o384o271m004j793j547l694o652p442k987Q655K7733N2956
37588F5285Q2034J12333J41294J66584J86198J98624K03179K00220J90958J76903
37578A723612J59310J39056J17053R4675P3684N5625M1146K9720J9766R172l937
37567B458882k0365l9480n9509p8284r3834j04792j10755j12694j12945j14379
37557A611845j19025j26910j35779j41952j41907j33863j18487r8426p7099n7563
37547D60834m1923l1091k4488j9917j4117m196J0823K9381M8324O4750P7582Q7799
37535F43761R7272J07024J16074J21601J20276J10013R1172O6791M1822K1872
$$ plain form
37525 1537678 1549421 1563475 1591620 1641431 1713796 1802678 1897362 1986059 2059154 2110948 2139774
37514 2139774 2147258 2137417 2115923 2089389 2064476 2046936 2041022 2049504 2073956 2114726 2170456 2237824
37502 2237824 2312217 2389061 2464918 2537840 2607265 2673935 2739715 2806798 2876411 2947724 3017737
37491 3017737 3082243 3137363 3180923 3213001 3235413 3250445 3259594 3262991 3259564 3247491 3224518 3188132
37479 3188132 3135947 3066594 2980848 2882278 2776904 2671953 2574238 2488629 2416901 2357299 2305333
37468 2305333 2255769 2204914 2151935 2098527 2047217 1999431 1954410 1909532 1861622 1808126 1747352
37457 1747352 1677971 1598736 1509016 1409694 1303399 1193656 1083495 974623 867655 762993
37447 762993 661353 563579 470150 381206 297291 220234 153337 100473 64507 45900 42279
$$ packed form
37525A537678J1743J4054K8145M9811P2365Q8882R4684Q8697P3095N1794K8826
37514B139774P484r841k1494k6534k4913j7540n914Q482K4452M0770N5730O7368
37502B237824P4393P6844P5857P2922O9425O6670O5780O7083O9613P1313P0013
37491C017737O4506N5120M3560L2078K2412J5032R149L397l427j2073k2973l6386
37479C188132n2185o9353q5746r8570j05374j04951r7715q5609p1728n9602n1966
37468B305333m9564n0855n2979n3408n1310m7786m5021m4878m7910n3496o0774
37457A747352o9381p9235q9720r9322j06295j09743j10161j08872j06968j04662
37447G62993j01640r7774r3429q8944q3915p7057o6897n2864l5966j8607l621
$$ plain form
37436 42279 49144 61150 73287 81624 83807 79466 70386 60096 52680 51077 55631 63795 71191 73340
37422 73340 67056 51099 26337 -4332 -36464 -65112 -86154 -97238 -98004 -89587 -73826 -52668
37410 -52668 -28201 -3170 18712 33236 36778 27295 5003 -27018 -62324 -91567 -104717 -94438
37398 -94438 -58700 -1111 70929 148793 224632 292551 349230 394118 429156 458089 485672 516888
37386 516888 556161 606503 668916 742400 824696 913478 1007431 1106733 1212688 1326642 1448566
37375 1448566 1575850 1702767 1821002 1921222 1995203 2037676 2047139 2025375 1976073 1903401 1811285
37364 1811285 1703605 1584862 1460606 1337233 1221229 1118313 1032857 967634 923692 900045
37354 900045 893409 898562 909651 921794 931877 938012 938324 930287 911243 879696 836439 784664 729065
$$ packed form
37436D2279O865J2006J2137Q337K183m341r080j0290p416j603M554Q164P396K149
37422G3340o284j5957k4762l0669l2132k8648k1042j1084p66Q417J5761K1158
37410e2668K4467K5031K1882J4524L542r483k2292l2021l5306k9243j3150J0279
37398i4438L5738N7589P2040P7864P5839O7919N6679M4888L5038K8933K7583L1216
37386E16888L9273N0342O2413P3484Q2296Q8782R3953R9302J05955J13954J21924
37375A448566J27284J26917J18235J00220P3981M2473R463k1764m9302p2672r2116
37364A811285j07680j18743j24256j23373j16004j02916q5456o5223m3942k3647
37354I00045o636N153J1089J2143J0083O135L12q037j9044l1547m3257n1775n5599
$$ plain form
37341 729065 674477 624634 581238 543272 506897 466585 417456 357739 289769 219065 152489
37330 152489 96915 58826 44077 57006 99001 167561 256682 358452 464967 569741 668332
37319 668332 758320 838870 910098 972463 1026309 1071633 1108174 1135824 1155212 1168070 1177046 1184974
37307 1184974 1193724 1203059 1209963 1208941 1193306 1157015 1096437 1011555 906196 787034 661638
37296 661638 536449 415591 300794 191952 87871 -12891 -111094 -206023 -295206 -374867
37286 -374867 -440945 -490313 -521713 -536133 -536607 -527546 -513815 -499815 -488893 -483102 -483010 -487179 -491571
37273 -491571 -489604 -473390 -435698 -371609 -279134 -158986 -14180 150143 326824 507136 681715
37262 681715 841793 980386 1092988 1177497 1233482 1261452 1262663 1239330 1194509 1131336 1052141
$$ packed form
37341G29065n4588m9843m3396l7966l6375m0312m9129n9717o7970p0704o6576
37330A52489n5574l8089j4749J2929M1995O8560Q9121J01770J06515J04774R8591
37319F68332Q9988Q0550P1228O2365N3846M5324L6541K7650J9388J2858Q976P928
37307A184974Q750R335O904j022j5635l6291o0578q4882j05359j19162j25396
37296F61638j25189j20858j14797j08842j04081j00762r8203r4929q9183p9661
37286c74867o6078m9368l1400j4420m74R061J3731J4000J0922N791R2m169m392
37273d91571J967J6214L7692O4089R2475J20148J44806J64323J76681J80312J74579
37262F81715J60078J38593J12602Q4509N5985K7970J211k3333m4821o3173p9195
$$ plain form
37251 1052141 958320 851298 734027 612219 494550 391601 313739 268545 258615 280483
37241 280483 325284 381267 437345 486035 524408 553070 574361 591044 605734 620555 636535
37230 636535 652755 665718 669542 657236 622787 563210 479786 378165 267662 160045 67841
37219 67841 2033 -30551 -29146 869 49841 106738 161770 207956 241647 262163 270949 270675
37207 270675 264693 256789 250726 249406 254052 264029 277502 292397 307113 320840 333585 345902 358033
37194 358033 368610 373837 368251 347194 309695 259983 206792 160993 132753 129250 153295 202899
37182 202899 271693 350201 427805 494956 545034 575506 588432 590368 591328 602643 634139 691688
37170 691688 776051 883251 1006063 1135795 1263566 1380845 1479821 1554394 1601675 1622983
$$ packed form
37251A052141r3821j07022j17271j21808j17669j02949p7862m5194r930K1868
37241B80483M4801N5983N6078M8690L8373K8662K1291J6683J4690J4821J5980
37230F36535J6220J2963L824j2306l4449n9577q3424j01621j10503j07617r2204
37219F7841o5808l2584J405L0015M8972N6897N5032M6186L3691K0516Q786k74
37207B70675n982p904o063j320M646R977J3473J4895J4716J3727J2745J2317J2131
37194C58033J0577N227n586k1057l7499m9712n3191m5799k8240l503K4045M9604
37182B02899O8794P8508P7604O7151N0078L0472J2926J936R60J1315L1496N7549
37170F91688Q4363J07200J22812J29732J27771J17279R8976P4573M7281K1308
$$ plain form
37160 1622983 1623307 1609307 1586896 1559480 1527477 1489049 1441646 1383713 1315928 1241636 1166440 1097257
37148 1097257 1041302 1005260 994482 1011907 1056871 1124588 1207116 1295745 1383746 1468113 1549527
37137 1549527 1630715 1714123 1800123 1886625 1970145 2047492 2116928 2178162 2231538 2277197 2314680
37126 2314680 2342857 2360035 2364322 2354395 2330345 2293914 2247738 2193881 2132423 2060975 1975437 1871672
37114 1871672 1747232 1602237 1439144 1261685 1073739 878809 680438 483060 292368
37105 292368 114479 -45739 -186123 -307390 -411838 -501153 -574576 -628476 -657650 -657402 -625138
37094 -625138 -560815 -466537 -345903 -203410 -44001 127181 304921 484110 660082 828904
37084 828904 987395 1132914 1263310 1377241 1474729 1557453 1628447 1691337 1749635 1806457 1864520
$$ packed form
37160A622983L24j4000k2411k7416l2003l8428m7403n7933o7785p4292p5196o9183
37148A097257n5955l6042j0778J7425M4964O7717Q2528Q8629Q8001Q4367Q1414
37137A549527Q1188Q3408Q6000Q6502Q3520P7347O9436O1234N3376M5659L7483
37126B314680K8177J7178M287r927k4050l6431m6176n3857o1458p1448q5538j03765
37114A871672j24440j44995j63093j77459j87946j94930j98371j97378j90692
37105B92368j77889j60218j40384j21267j04448q9315p3423n3900k9174K48L2264
37094f25138O4323R4278J20634J42493J59409J71182J77740J79189J75972J68822
37084H28904J58491J45519J30396J13931R7488Q2724P0994O2890N8298N6822N8063
$$ plain form
37073 1864520 1926089 1992814 2065504 2143774 2225480 2306256 2379791 2439199 2479103 2497594 2497234 2484647
37061 2484647 2468800 2458707 2461481 2481222 2518808 2572505 2639283 2716444 2802804 2898869 3006080
37050 3006080 3125695 3257821 3400976 3552309 3708384 3866247 4024390 4183153 4344134
37041 4344134 4508476 4674674 4837144 4986529 5111792 5203260 5255351 5267912 5245643 5196011
37031 5196011 5126694 5043710 4950903 4850753 4745865 4640191 4539305 4449664 4377212 4325835
37021 4325835 4296271 4286049 4290601 4304776 4323789 4343540 4361093 4375730 4389874 4408890 4439532
37010 4439532 4487669 4556068 4642938 4741789 4842864 4935767 5012310 5068521 5105276 5127698 5144061
36999 5144061 5164647 5200351 5260657 5351221 5472194 5618258 5780603 5950147 6120813 6291306
$$ packed form
37073A864520O1569O6725P2690P8270Q1706Q0776P3535N9408L9904J8491l60j2587
37061B484647j5847j0093K774J9741L7586N3697O6778P7161Q6360R6065J07211
37050C006080J19615J32126J43155J51333J56075J57863J58143J58763J60981
37041D344134J64342J66198J62470J49385J25263R1468N2091J2561k2269m9632
37031E196011o9317q2984r2807j00150j04888j05674j00886q9641p2452n1377
37021D325835k9564j0222M552J4175J9013J9751J7553J4637J4144J9016L0642
37010D439532M8137O8399Q6870R8851J01075R2903P6543N6211L6755K2422J6363
36999E144061K0586L5704O0306R0564J20973J46064J62345J69544J70666J70493
$$ plain form
36989 6291306 6464361 6643892 6831929 7027284 7226562 7426649 7627263 7832241 8048862
36980 8048862 8285497 8548683 8840974 9160540 9502683 9862434 10236491 10623048 11019881
36971 11019881 11422578 11824552 12218787 12599855 12964852 13312903 13643958 13958077 14255970
36962 14255970 14540220 14815996 15090679 15373021 15672512 15998955 16362067 16771089 17234503
36953 17234503 17759775 18353302 19020905 19768571 20602592 21528876 22552275 23676825 24906850
36944 24906850 26248487 27711380 29310025 31063958 32996459 35132678 37498377 40119746
36936 40119746 43024270 46242462 49809794 53767652 58162995 63047576 68477395 74512013
36928 74512013 81213466 88645281 96871976 105958476 115968939 126965082 139003067 152126498
$$ packed form
36989F291306J73055J79531J88037J95355J99278K00087K00614K04978K16621
36980H048862K36635K63186K92291L19566L42143L59751L74057L86557L96833
36971A1019881M02697M01974L94235L81068L64997L48051L31055L14119K97893
36962A4255970K84250K75776K74683K82342K99491L26443L63112M09022M63414
36953A7234503N25272N93527O67603P47666Q34021R26284J023399J124550J230025
36944B4906850J341637J462893J598645J753933J932501K136219K365699K621369
36936D0119746K904524L218192L567332L957858M395343M884581N429819O034618
36928G4512013O701453P431815Q226695R086500J0010463J0996143J2037985J3123431
$$ plain form
36920 152126498 166353270 181655059 197927744 214951091 232339970 249496233 265577652
36913 265577652 279510724 290084308 296149036 296892461 292086818 282183186 268194590 251427304
36905 251427304 233190203 214589760 196442325 179275493 163375387 148848616 135682145
36898 135682145 123793756 113071278 103400139 94678381 86819985 79750943 73403629 67712589
36890 67712589 62612514 58038645 53929381 50229698 46893591 43884969 41177045 38749976
36882 38749976 36586704 34668248 32970501 31463679 30114403 28889516 27760299 26705483
36874 26705483 25712169 24774949 23893993 23072497 22313909 21619684 20988149 20414187 19889387
36865 19889387 19402861 18943041 18500072 18067803 17644723 17233779 16841252 16475186 16143972
$$ packed form
36920A52126498J4226772J5301789J6272685J7023347J7388879J7156263J6081419
36913B65577652J3933072J0573584O064728P43425m805643r903632j3988596j6767286
36905B51427304j8237101j8600443j8147435j7166832j5900106j4526771j3166471
36898A35682145j1888389j0722478r671139q721758p858396p069042o347314n691040
36890F7712589n100075m573869m109264l699683l336107l008622k707924k427069
36882C8749976k163272j918456j697747j506822j349276j224887j129217j054816
36874B6705483r93314r37220q80956q21496p58588o94225o31535n73962n24800
36865A9889387m86526m59820m42969m32269m23080m10944l92527l66066l31214
$$ plain form
36856 16143972 15855402 15615876 15429635 15298546 15223007 15203447 15241101 15337504 15493399 15708296
36846 15708296 15981147 16311619 16700927 17151689 17667195 18250939 18906691 19638362 20448999
36837 20448999 21339277 22306660 23345846 24449779 25609906 26814980 28048779 29287743
36829 29287743 30499400 31642009 32665561 33514498 34132506 34469256 34488131 34173141 33533018
36820 33533018 32600830 31428786 30079673 28617635 27100903 25577859 24086288 22654590
36812 22654590 21303448 20046958 18893187 17844640 16898895 16049377 15286349 14598326 13973793
36803 13973793 13402677 12877179 12392091 11944862 11535387 11165236 10836384 10549874 10304979
36794 10304979 10099132 9928308 9787356 9670128 9569800 9479762 9394584 9310433 9225051 9138117
$$ packed form
36856A6143972k88570k39526j86241j31089p5539j9560L7654R6403J55895K14897
36846A5708296K72851L30472L89308M50762N15506N83744O55752P31671Q10637
36837B0448999Q90278R67383J039186J103933J160127J205074J233799J238964
36829B9287743J211657J142609J023552Q48937O18008L36750J8875l14990o40123
36820C3533018r32188j172044j349113j462038j516732j523044j491571j431698
36812B2654590j351142j256490j153771j048547r45745q49518p63028o88023o24533
36803A3973793n71116n25498m85088m47229m09475l70151l28852k86510k44895
36794A0304979k05847j70824j40952j17228j00328r0038q5178q4151q5382q6934
$$ plain form
36784 9138117 9052247 8973598 8910869 8872696 8864776 8888372 8941040 9019101 9120398 9245682 9397951
36773 9397951 9580147 9792066 10027375 10271714 10502802 10692873 10812886 10837873 10752611 10556215
36763 10556215 10263386 9901097 9501819 9096296 8708610 8354633 8043274 7779030 7564207
36754 7564207 7400100 7287454 7226942 7219693 7267445 7372087 7534890 7755647 8031679 8356678
36744 8356678 8719730 9104837 9491137 9853686 10164684 10395333 10518960 10515812 10378492 10115358
36734 10115358 9749584 9313974 8843991 8371504 7920503 7505009 7129442 6791159 6484000
36725 6484000 6201336 5937852 5690173 5456727 5237056 5030974 4838034 4657545 4488815
36716 4488815 4331192 4183835 4045549 3914988 3791195 3674026 3564059 3461896 3367212 3278263
$$ packed form
36784I138117q5870p8649o2729l8173p920K3596N2668P8061J01297J25284J52269
36773I397951J82196K11919K35309K44339K31088J90071J20013K4987q5262j96396
36763A0556215k92829l62289l99278m05523l87686l53977l11359k64244k14823
36754G564207j64107j12646o0512p249M7752J04642J62803K20757K76032L24999
36744H356678L63052L85107L86300L62549L10998K30649J23627l148j37320k63134
36734A0115358l65774m35610m69983m72487m51001m15494l75567l38283l07159
36725F484000k82664k63484k47679k33446k19671k06082j92940j80489j68730
36716D488815j57623j47357j38286j30561j23793j17169j09967j02163r4684q8949
$$ plain form
36706 3278263 3192321 3106931 3021185 2936117 2853884 2776252 2703295 2633031 2562275 2488314 2410630
36695 2410630 2331797 2257128 2193423 2147467 2124760 2128534 2158975 2212705 2282881 2360282 2435405
36684 2435405 2500790 2552510 2590077 2614933 2628315 2629567 2615783 2583214 2529748 2456987 2370414
36673 2370414 2277417 2184286 2093791 2004518 1912146 1811938 1701381 1582051 1460170 1345676
36663 1345676 1249946 1183021 1151615 1158636 1203837 1284625 1396437 1532982 1686735 1849810 2014863
36652 2014863 2175505 2326092 2461248 2575776 2665125 2725954 2756340 2755670 2724405 2663700 2574924
36641 2574924 2459792 2321443 2165714 2001053 1836737 1680559 1537533 1409892 1297661
36632 1297661 1199243 1111991 1032888 959315 889699 823799 762519 707554 661390 627645 610990
$$ packed form
36706C278263q5942q5390q5746q5068q2233p7632p2957p0264p0756p3961p7684
36695B410630p8833p4669o3705m5956k2707L774L0441N3730P0176P7401P5123
36684B435405O5385N1720L7567K4856J3382J252j3784l2569n3466p2761q6573
36673B370414r2997r3131r0495q9273r2372j00208j10557j19330j21881j14494
36663A345676r5730o6925l1406P021M5201Q0788J11812J36545J53753J63075J65053
36652B014863J60642J50587J35156J14528Q9349O0829L0386o70l1265o0705q8776
36641B574924j15132j38349j55729j64661j64316j56178j43026j27641j12231
36632A297661r8418q7252p9103p3573o9616o5900o1280n4965m6164l3745j6655
$$ plain form
36621 610990 616013 645403 698687 772490 862198 964106 1076964 1202163 1342460 1499905 1673938
36610 1673938 1860476 2052148 2239540 2413100 2565135 2691164 2789971 2862403 2909834 2933508
36600 2933508 2935294 2919138 2891866 2862555 2840940 2836003 2855539 2906495 2995340 3127820 3308010
36589 3308010 3537228 3813554 4132296 4487047 4870622 5275740 5695944 6127199 6569739
36580 6569739 7028972 7514435 8036754 8603420 9214565 9859760 10516467 11150419 11718074
36571 11718074 12171631 12466804 12572148 12476859 12193474 11754005 11201241 10578960 9924337
36562 9924337 9264230 8615220 7986249 7382166 6806610 6263498 5757093 5291233 4868366
36553 4868366 4488957 4151504 3852953 3589128 3355114 3145854 2957170 2786918 2635825
$$ packed form
36621F10990N023K9390N3284P3803Q9708J01908J12858J25199J40297J57445J74033
36610A673938J86538J91672J87392J73560J52035J26029R8807P2432M7431K3674
36600B933508J786j6156k7272k9311k1615m937J9536N0956Q8845J32480J80190
36589C308010K29218K76326L18742L54751L83575M05118M20204M31255M42540
36580F569739M59233M85463N22319N66666O11145O45195O56707O33952N67655
36571A1718074M53557K95173J05344r5289k83385m39469n52764o22281o54623
36562I924337o60107o49010o28971o04083n75556n43112n06405m65860m22867
36553D868366l79409l37453k98551k63825k34014k09260j88684j70252j51093
$$ plain form
36544 2635825 2507501 2407299 2340232 2308821 2311996 2345700 2404704 2484544 2582482 2697017 2826240
36533 2826240 2965974 3108856 3244915 3363449 3455407 3515642 3544510 3548513 3539719 3534073 3548913
36522 3548913 3600231 3700230 3855740 4067990 4333834 4648111 5006463 5407840 5856032 6359770
36512 6359770 6931152 7582672 8323681 9157536 10080286 11080902 12142411 13243062 14356768
36503 14356768 15452345 16491838 17429394 18212880 18789785 19116764 19169890 18951425 18490032
36494 18490032 17834181 17041676 16169380 15265966 14368358 13501055 12677431 11902275 11174935
36485 11174935 10492429 9852010 9252712 8695616 8183001 7717043 7298662 6926754 6597953
36476 6597953 6306994 6047496 5812617 5595306 5388635 5186806 4986615 4788415 4595746
$$ packed form
36544B635825j28324j00202o7067l1411L175L3704N9004P9840R7938J14535J29223
36533B826240J39734J42882J36059J18534R1958O0235K8868M003q794n646J4840
36522C548913N1318R9999J55510K12250K65844L14277L58352M01377M48192N03738
36512F359770N71382O51520P41009Q33855R22750J000616J061509J100651J113706
36503A4356768J095577J039493R37556P83486N76905L26979N3126k18465m61393
36494A8490032o55851p92505q72296r03414q97608q67303q23624p75156p27340
36485A1174935o82506o40419n99298n57096n12615m65958m18381l71908l28801
36476F597953k90959k59498k34879k17311k06671k01829k00191j98200j92669
$$ plain form
36467 4595746 4413721 4246852 4097290 3964254 3844886 3735778 3633968 3536807 3441379 3344610
36457 3344610 3244383 3140836 3036672 2935936 2841780 2754441 2670722 2585456 2494209 2395755
36447 2395755 2292989 2191863 2098944 2018810 1952633 1898705 1854616 1819690 1796090 1787852 1798578
36436 1798578 1829306 1877859 1939889 2010821 2087413 2168028 2251717 2337068 2421876 2503835 2581598
36425 2581598 2655456 2727259 2799716 2875238 2954663 3036307 3115847 3187216 3244227 3282268 3299355
36414 3299355 3296186 3275445 3240929 3196845 3147204 3095214 3042900 2991072 2939517 2887026 2831397
36403 2831397 2769881 2700226 2621820 2536118 2446003 2354385 2262773 2170526 2075137 1973358 1862657
36392 1862657 1742371 1614143 1481701 1350262 1225854 1114490 1020867 946690 889677 844305
$$ packed form
36467D595746j82025j66869j49562j33036j19368j09108j01810r7161r5428r6769
36457C344610j00227j03547j04164j00736r4156q7339q3719q5266r1247r8454
36447B395755j02766j01126r2919q0134o6177n3928m4089l4926k3600q238J0726
36436A798578L0728M8553O2030P0932P6592Q0615Q3689Q5351Q4808Q1959P7763
36425B581598P3858P1803P2457P5522P9425Q1644P9540P1369N7011L8041J7087
36414C299355l169k0741l4516m4084m9641n1990n2314n1828n1555n2491n5629
36403B831397o1516o9655p8406q5702r0115r1618r1612r2247r5389j01779j10701
36392A862657j20286j28228j32442j31439j24408j11364r3623p4177n7013m5372
$$ plain form
36382 844305 804255 765102 725716 688026 656006 634714 629672 646506 690714 767419 880930
36371 880930 1034077 1227558 1459549 1725679 2019358 2332536 2656894 2985027 3310944 3629482
36361 3629482 3934880 4219424 4473183 4685431 4847395 4954918 5009460 5016915 4985150 4921858
36351 4921858 4833508 4725228 4600996 4463993 4317289 4164858 4012417 3867323 3737234 3628014
36341 3628014 3542039 3477870 3431335 3397147 3369962 3344448 3314806 3274604 3217495 3138605 3035737
36330 3035737 2909549 2762625 2598248 2419855 2231479 2038609 1848588 1670050 1511703
36321 1511703 1381030 1283387 1221449 1194843 1200091 1231167 1280670 1341054 1405293 1466998 1520714
36310 1520714 1562898 1593265 1615263 1634835 1657698 1686507 1719335 1750020 1770062 1771349 1748914
$$ packed form
36382H44305m0050l9153l9386l7690l2020k1292n042J6834M4208P6705J13511
36371H80930J53147J93481K31991K66130K93679L13178L24358L28133L25917L18538
36361C629482L05398K84544K53759K12248J61964J07523N4542P455l1765o3292
36351D921858q8350j08280j24232j37003j46704j52431j52441j45094j30089j09220
36341C628014q5975o4169m6535l4188k7185k5514k9642m0202n7109p8890j02868
36330C035737j26188j46924j64377j78393j88376j92870j90021j78538j58347
36321A511703j30673r7643o1938k6606N248L1076M9503O0384O4239O1705N3716
36310A520714M2184L0367K1998J9572K2863K8809L2828L0685K0042J287k2435
$$ plain form
36299 1748914 1702828 1638337 1564241 1490405 1425616 1376225 1345396 1332778 1334813 1345872 1359865
36288 1359865 1371680 1377955 1377071 1368551 1352251 1327851 1294876 1252976 1202059 1142134 1073233 995755
36276 995755 911164 822517 734294 651397 577726 515060 462868 419225 382392 352310 331219
36265 331219 323093 332034 360453 407886 470835 543366 617979 686696 742506 781062 802008 809311
36253 809311 810373 814047 827930 855730 895831 941797 984491 1014642 1024853 1010804 971885 911417
36241 911417 836287 755630 678616 611960 558336 516434 482295 450840 416869 375841 325035
36230 325035 265110 201219 142750 101272 87245 106916 160946 245332 353731 479584 616865
36219 616865 759454 899915 1028816 1135380 1209530 1244421 1238204 1194300 1120240 1025834 921250
$$ packed form
36299A748914m6086o4491p4096p3836o4789m9391l0829j2618K035J1059J3993
36288A359865J1815O275q84q520j6300k4400l2975m1900n0917n9925o8901p7478
36276I95755q4591q8647q8223q2897p3671o2666n2192m3643l6833l0082k1091
36265C31219q126Q941K8419M7433O2949P2531P4613O8717N5810L8556K0946P303
36253H09311J062L674J3883K7800M0101M5966M2694L0151J0211j4049l8919o0468
36241I11417p5130q0657p7014o6656n3624m1902l4139l1455l3971m1028n0806
36230C25035n9925o3891n8469m1478j4027J9671N4030Q4386J08399J25853J37281
36219F16865J42589J40461J28901J06564P4150L4891o217m3904p4060r4406j04584
$$ plain form
36208 921250 815370 714395 620867 533568 448821 362861 274013 183326 93470 6780 -76263
36197 -76263 -157312 -239030 -323097 -408376 -490383 -562391 -617559 -650950 -660658 -647936 -616793 -573511
36185 -573511 -526022 -482696 -450485 -433163 -430690 -439991 -456683 -476985 -499201 -523998 -553052 -586670
36173 -586670 -622087 -653875 -676224 -685543 -681758 -667744 -647291 -622571 -592388 -552107 -495438 -417224
36161 -417224 -315946 -194905 -61680 73770 201554 313972 406818 479676 535262 578124
36151 578124 613175 644467 674442 703680 731123 754524 770948 777255 770821 750606 718137 677608
36139 677608 634720 594702 560699 533510 512793 498744 492881 497274 512786 537636 567328 596023
36127 596023 618518 631760 635211 630222 619050 604144 587886 572658 560998 555446 557893 568799
$$ packed form
36208I21250j05880j00975r3528q7299q4747q5960q8848r0687q9856q6690q3043
36197g6263q1049q1718q4067q5279q2007p2008n5168l3391r708J2722L1143M3282
36185e73511M7489M3326L2211J7322K473r301j6692k0302k2216k4797k9054l3618
36173e86670l5417l1788k2349r319L785J4014K0453K4720L0183M0281N6669P8214
36161d17224J01278J21041J33225J35450J27784J12418R2846P2858N5586M2862
36151E78124L5051L1292K9975K9238K7443K3401J6424O307o434k0215l2469m0529
36139F77608m2888m0018l4003k7189k0717j4049n863M393J5512K4850K9692K8695
36127E96023K2495J3242L451m989j1172j4906j6258j5228j1660n552K447J0906
$$ plain form
36115 568799 587025 610592 637700 667128 698039 729900 762895 798376 838747 886810 944893
36104 944893 1014012 1093145 1178829 1265377 1345777 1413126 1462318 1491554 1503053 1502578 1497998 1497548
36092 1497548 1508274 1534779 1578222 1635767 1700778 1763959 1815362 1846804 1853969 1837304 1801371
36081 1801371 1753021 1699221 1645182 1593118 1541792 1487136 1424000 1348475 1259740 1160537 1056277
36070 1056277 953516 858693 777405 713961 670926 648710 645538 657952 681642 712130 745040
36059 745040 776067 801060 816463 819941 810789 789910 759469 722356 681406 638469 593715 545807
36047 545807 492969 434378 371177 306840 246898 198145 167342 159698 177647 220226 283117 359383
36035 359383 440985 520992 595786 666206 736865 813862 902058 1003144 1115079 1232486 1347338
$$ packed form
36115E68799J8226K3567K7108K9428L0911L1861L2995L5481M0371M8063N8083
36104I44893O9119P9133Q5684Q6548Q0400O7349M9192K9236J1499m75m580m50
36092A497548J0726K6505M3443N7545O5011O3181N1403L1442P165j6665l5933
36081A801371m8350n3800n4039n2064n1326n4656o3136p5525q8735r9203j04260
36070A056277j02761r4823q1288o3444m3035k2216l172J2414K3690L0488L2910
36059G45040L1027K4993J5403L478r152k0879l0441l7113m0950m2937m4754m7908
36047E45807n2838n8591o3201o4337n9942m8753l0803p644J7949M2579O2891P6266
36035C59383Q1602Q0007P4794P0420P0659P6997Q8196J01086J11935J17407J14852
$$ plain form
36024 1347338 1449737 1529101 1576013 1584308 1552513 1483962 1385661 1266615 1136336 1003694 875837
36013 875837 757096 648411 547925 452726 360680 271442 186532 109059 43473 -4939 -31149
36002 -31149 -31918 -7059 40191 103825 176286 249771 317301 373599 415872 444307 461938 473667
35990 473667 484812 499820 521543 550915 586918 626994 668187 708610 748199 788194 829885
35979 829885 873714 919226 965448 1011167 1054997 1095406 1130729 1159218 1179213 1189359 1188617 1175957
35967 1175957 1150324 1111431 1061071 1003866 946631 896599 859439 838000 832140 839539 856931 881114
35955 881114 909407 939610 969927 999151 1027198 1055608 1087480 1126382 1174496 1230808 1290362
35944 1290362 1345105 1386191 1406977 1405491 1385167 1353409 1318779 1288317 1266187 1253789 1250568 1254618
$$ packed form
36024A347338J02399P9364M6912Q295l1795o8551r8301j19046j30279j32642j27857
36013H75837j18741j08685j00486r5199r2046q9238q4910p7473o5586m8412k6210
36002c1149p69K4859M7250O3634P2461P3485O7530N6298M2273K8435J7631J1729
35990D73667J1145J5008K1723K9372L6003M0076M1193M0423L9589L9995M1691
35979H29885M3829M5512M6222M5719M3830M0409L5323K8489J9995J0146p42j2660
35967A175957k5633l8893n0360n7205n7235n0032l7160k1439n860P399J7392K4183
35955H81114K8293L0203L0317K9224K8047K8410L1872L8902M8114N6312N9554
35944A290362N4743M1086K0786j486k0324l1758l4630l0462k2130j2398l221M050
$$ plain form
35932 1254618 1262838 1271134 1275284 1272494 1262816 1249421 1237415 1231847 1235835 1249444 1269537 1290706 1307261
35919 1307261 1315624 1316000 1312363 1310850 1317490 1336179 1367285 1407071 1448306 1482386 1502366 1505567 1494513
35906 1494513 1475952 1458555 1450196 1455591 1474926 1503810 1534513 1557863 1565206 1549958 1508679 1441589
35894 1441589 1352426 1247619 1135059 1022944 918948 829505 758854 708059 674730 654095
35884 654095 641162 632863 628938 631108 641119 658874 681660 704628 721909 727755 717463 688168
35872 688168 639424 573262 493568 404966 311497 215437 116615 12657 -99721 -222792 -356056
35861 -356056 -495325 -632956 -759126 -863798 -938944 -980615 -990430 -975804 -948231 -919771 -899214
35850 -899214 -890116 -891830 -902554 -922100 -952550 -996682 -1055555 -1126949 -1205619 -1285215 -1360746 -1430286
$$ packed form
35932A254618Q220Q296M150k790r678j3395j2006n568L988J3609K0093K1169J6555
35919A307261Q363L76l637j513O640J8689L1106L9786M1235L4080J9980L201j1054
35906A494513j8561j7397q359N395J9335K8884L0703K3350P343j5248m1279o7090
35894A441589q9163j04807j12560j12115j03996q9443p0651n0795l3329k0635
35884F54095j2933q299l925K170J0011J7755K2786K2968J7281N846j0292k9295
35872F88168m8744o6162p9694q8602r3469r6060r8822j03958j12378j23071j33264
35861c56056j39269j37631j26170j04672p5146m1671r815J4626K7573K8460K0557
35850h99214R098j714j0724j9546l0450m4132n8873p1394p8670p9596p5531o9540
$$ plain form
35838 -1430286 -1495092 -1558330 -1623232 -1691677 -1763643 -1837369 -1909833 -1977201 -2035335 -2080419 -2109687
35827 -2109687 -2122043 -2118481 -2102031 -2076982 -2047168 -2013972 -1975204 -1925864 -1860554 -1776254 -1673909
35816 -1673909 -1558137 -1435461 -1312230 -1193347 -1082275 -981817 -894870 -824425 -772666 -739607
35806 -739607 -722106 -713916 -706890 -692801 -665145 -620708 -560770 -491436 -422352 -363657 -322308 -299582
35794 -299582 -291015 -288586 -283739 -269506 -240969 -194570 -127712 -39450 68187 189532 316194
35783 316194 439064 550165 643411 714440 760383 780137 774819 747616 702676 643472 571529
35772 571529 486180 385366 267019 130365 -23235 -189982 -363749 -536569 -699430 -843242
35762 -843242 -959906 -1043449 -1091163 -1104249 -1087411 -1047334 -990771 -923132 -848130 -768285 -685805
$$ packed form
35838a430286o4806o3238o4902o8445p1966p3726p2464o7368n8134m5084k9268
35827b109687j2356L562J6450K5049K9814L3196L8768M9340O5310Q4300J02345
35816a673909J15772J22676J23231J18883J11072J00458Q6947P0445N1759L3059
35806g39607J7501Q190P026J4089K7656M4437N9938O9334O9084N8695M1349K2726
35794b99582Q567K429M847J4233K8537M6399O6858Q8262J07637J21345J26662
35783C16194J22870J11101R3246P1029M5943J9754n318k7203m4940n9204p1943
35772E71529q5349j00814j18347j36654j53600j66747j73767j72820j62861j43812
35762h43242j16664q3543m7714j3086J6838M0077N6563O7639P5002P9845Q2480
$$ plain form
35751 -685805 -603326 -524211 -452479 -392616 -349241 -326330 -325867 -346494 -383181 -428456 -474702 -516402
35739 -516402 -551329 -580388 -606292 -631586 -656708 -678905 -692489 -690256 -665216 -611890 -527023 -410044
35727 -410044 -263359 -92080 96981 296584 499755 699761 889994 1064376 1218022 1347381
35717 1347381 1449579 1521677 1560836 1565594 1537333 1480810 1403309 1313078 1217959 1124685 1038645
35706 1038645 963776 902448 855480 822497 802548 794617 797414 808449 823208 835595 839876 832945
35694 832945 815356 790491 762670 735488 711037 689749 670273 649260 621588 581685 525825
35683 525825 454294 371996 287004 207855 140982 89375 52664 28154 12072 465 -10366
35672 -10366 -23596 -41558 -65511 -95872 -132897 -177309 -230265 -292537 -363369 -439724 -516429 -587315
$$ packed form
35751f85805Q2479P9115P1732N9863M3375K2911M63k0627l6687m5275m6246m1700
35739e16402l4927k9059k5904k5294k5122k2197j3584K233K5040N3326Q4867J16979
35727d10044J46685J71279J89061J99603K03171K00006J90233J74382J53646J29359
35717A347381J02198P2098L9159M758k8261n6523p7501r0231r5119r3274q6040
35706A038645p4869o1328m6968l2983j9949p931K797J1035J4759J2387M281o931
35694H32945j7589k4865k7821k7182k4451k1288j9476k1013k7672l9903n5860
35683E25825p1531q2298q4992p9149o6873n1607l6711k4510j6082j1607j0831
35672a0366j3230j7962k3953l0361l7025m4412n2956o2272p0832p6355p6705p0886
$$ plain form
35660 -587315 -646752 -690720 -716862 -723702 -709849 -673830 -614786 -533683 -434375 -323713 -210385
35649 -210385 -103052 -9012 65766 115693 134815 117306 59235 -39097 -171444 -325552 -485116
35638 -485116 -633054 -754876 -841219 -889151 -901923 -886892 -851898 -801608 -735781 -650387 -540612
35627 -540612 -403732 -240498 -55053 145717 352833 556068 745327 912396 1052271 1163438
35617 1163438 1247010 1305181 1339598 1350180 1334847 1290356 1214055 1105902 969699 812810 644367
35606 644367 472892 304635 143306 -9026 -150719 -279605 -392556 -485508 -553792 -592554
35596 -592554 -597090 -563358 -489035 -375141 -227364 -55980 125863 304572 467903 605638
35586 605638 709721 774664 798273 782073 730751 650660 548004 427567 292512 145129
$$ packed form
35660e87315n9437m3968k6142o840J3853L6019N9044Q1103R9308J10662J13328
35649b10385J07333R4040P4778M9927J9122j7509n8071r8332j32347j54108j59564
35638d85116j47938j21822q6343m7932j2772J5031L4994N0290O5827Q5394J09775
35627e40612J36880J63234J85445K00770K07116K03235J89259J67069J39875J11167
35617A163438Q3572N8171L4417J0582j5333m4491p6301j08153j36203j56889j68443
35606F44367j71475j68257j61329j52332j41693j28886j12951r2952o8284l8762
35596e92554m536L3732P4323J13894J47777J71384J81843J78709J63331J37735
35586F05638J04083O4943K3609j6200n1322q0091j02656j20437j35055j47383
$$ plain form
35576 145129 -12010 -175233 -339618 -499407 -648633 -781715 -893816 -980896 -1039399 -1065824
35566 -1065824 -1056542 -1008181 -918560 -787850 -619635 -421624 -205757 12650 216979 392225
35556 392225 527826 619372 668767 683096 672657 648648 620979 596746 579721 570913 569852 575989
35544 575989 589415 610462 638635 671889 706858 739617 766119 782193 783734 767559 732650 681141
35532 681141 618543 553082 494276 451197 431043 438378 474939 539737 629358 738445 860195
35521 860195 986804 1110100 1222780 1320096 1401302 1470082 1533619 1600424 1677526 1767907 1869221
35510 1869221 1974421 2074058 2159318 2224461 2267599 2289710 2292779 2278527 2248479 2204921 2151653
35499 2151653 2093838 2037153 1986784 1946580 1918306 1900992 1890802 1882014 1869081 1848835 1821462
$$ packed form
35576A45129j57139j63223j64385j59789j49226j33082j12101q7080n8503k6425
35566a065824R282M8361Q9621J30710J68215J98011K15867K18407K04329J75246
35556C92225J35601R1546M9395J4329j0439k4009k7669k4233j7025q808j061O137
35544E75989J3426K1047K8173L3254L4969L2759K6502J6074J541j6175l4909n1509
35532F81141o2598o5461n8806m3079k0154P335L6561O4798Q9621J09087J21750
35521H60195J26609J23296J12680R7316Q1206O8780O3537O6805P7102R0381J01314
35510A869221J05200R9637Q5260O5143M3138K2111L069j4252l0048m3558n3268
35499B151653n7815n6685n0369m0204k8274j7314j0190q788j2933k0246k7373
$$ plain form
35488 1821462 1789541 1755859 1721510 1685492 1645916 1601876 1554912 1509205 1470397 1443507 1430882
35477 1430882 1431147 1439576 1449554 1454415 1448962 1430455 1399035 1357578 1310922 1264637 1223761 1192008
35465 1192008 1171563 1163196 1166353 1179024 1197594 1216994 1231311 1234759 1222612 1191763 1140879 1070382
35453 1070382 982568 882005 775825 673321 584595 518593 481286 474624 496550 541977 604408
35442 604408 677571 756414 837215 917118 993612 1064197 1126388 1178052 1217933 1245936 1262909
35431 1262909 1270206 1269711 1264444 1259105 1259722 1272254 1300709 1345655 1403771 1468693 1532894 1589812 1635192
35418 1635192 1667133 1685168 1689204 1678934 1653719 1612782 1555702 1483269 1398301 1305754 1211715
35407 1211715 1121621 1038565 962350 889672 815255 733501 639889 531654 407737 268491 115608
$$ packed form
35488A821462l1921l3682l4349l6018l9576m4040m6964m5707l8808k6890j2625
35477A430882K65Q429R978M861n453j8507l1420m1457m6656m6285m0876l1753
35465A192008k0445q367L157J2671J8570J9400J4317L448j2147l0849n0884p0497
35453A070382q7814j00563j06180j02504q8726o6002l7307o662K1926M5427O2431
35442F04408P3163P8843Q0801P9903P6494P0585O2191N1664L9881K8003J6973
35431A262909P297m95n267n339O17J2532K8455M4946N8116O4922O4201N6918M5380
35418A635192L1941J8035M036j0270k5215m0937n7080p2433q4968r2547r4039
35407A211715r0094q3056p6215p2678p4417q1754r3612j08235j23917j39246j52883
$$ plain form
35396 115608 -47594 -215630 -380560 -532479 -661032 -757472 -816337 -836155 -819227 -770791
35386 -770791 -697864 -608063 -508765 -406770 -308085 -217424 -137427 -68083 -6753 51090 110619
35375 110619 176210 250171 332059 418644 504502 583099 648221 695384 722767 731347 724432 706918
35363 706918 684632 663871 651062 652222 671989 712486 772629 848417 933974 1022755 1108411 1185316
35351 1185316 1248964 1296510 1327410 1343820 1350246 1352314 1355258 1362895 1377383 1399180 1426735 1456020
35339 1456020 1480627 1492758 1484892 1451586 1391026 1306030 1204138 1096519 995775 913134 855751
35328 855751 825050 816950 824005 838388 854163 867938 878287 884753 886941 883767 873003 851529
35316 851529 816339 765710 699706 619784 528048 426863 319023 208111 98667 -3957
$$ packed form
35396A15608j63202j68036j64930j51919j28553r6440n8865j9818J6928M8436
35386g70791P2927Q9801R9298J01995R8685R0661P9997O9344O1330N7843N9529
35375A10619O5591P3961Q1888Q6585Q5858P8597O5122M7163K7383Q580o915j7514
35363G06918k2286k0761j2809J160J9767M0497O0143P5788Q5557Q8781Q5656P6905
35351A185316O3648M7546L0900J6410O426K068K944P637J4488K1797K7555K9285
35339A456020K4607J2131p866l3306o0560q4996j01892j07619j00744q2641n7383
35328H55751l0701q100P055J4383J5775J3775J0349O466K188l174j0764k1474
35316H51529l5190n0629o6004p9922r1736j01185j07840j10912j09444j02624
$$ plain form
35306 -3957 -93963 -165797 -215210 -240336 -242217 -224391 -191983 -150985 -108058 -70500 -45804 -40643
35294 -40643 -59659 -104592 -174156 -264499 -369890 -483296 -596901 -702827 -794147 -866008 -916509
35283 -916509 -947131 -962473 -969267 -974846 -985635 -1006165 -1038692 -1083139 -1137238 -1197194 -1258926 -1319358
35271 -1319358 -1376863 -1430613 -1479603 -1522349 -1557657 -1585837 -1609448 -1632894 -1660706 -1695108 -1734051
35260 -1734051 -1771008 -1796823 -1802662 -1782585 -1734809 -1661631 -1568402 -1461982 -1349084 -1234863 -1121931
35249 -1121931 -1009948 -895993 -775894 -646077 -505124 -354419 -198029 -42284 104888
35240 104888 235113 341168 418364 465116 482700 474869 447614 408743 366576 327645 294346
35229 294346 263935 229756 184224 122076 42312 -51810 -154167 -257516 -354839 -440143 -508852
$$ packed form
35306c957r0006p1834m9413k5126j881J7826L2408M0998M2927L7558K4696N161
35294d0643j9016m4933o9564r0343j05391j13406j13605j05926r1320p1861n0501
35283i16509l0622j5342o794n579j0789k0530l2527m4447n4099n9956o1732o0432
35271a319358n7505n3750m8990m2746l5308k8180k3611k3446k7812l4402l8943
35260a734051l6957k5815n839K0077M7776P3178R3229J06420J12898J14221J12932
35249a121931J11983J13955J20099J29817J40953J50705J56390J55745J47172
35240A04888J30225J06055P7196M6752J7584p831k7255l8871m2167l8931l3299
35229B94346l0411l4179m5532o2148p9764r4122j02357j03349r7323q5304o8709
$$ plain form
35218 -508852 -557834 -585102 -589519 -570902 -530590 -472001 -400671 -323732 -249056 -184215 -135008 -103604
35206 -103604 -87098 -77592 -64332 -37243 9609 76005 155607 237913 311356 366402 397495 403247
35194 403247 385262 346639 291059 222707 146722 69658 -507 -55147 -86507 -89539 -63362 -11698
35182 -11698 57964 136311 214545 286136 347241 395830 430353 449016 450221 433892 402853 363291
35170 363291 323751 293000 277828 281856 305615 347314 403587 470069 541994 614779 684313 746941
35158 746941 799575 840334 869414 889578 905820 924287 950801 989314 1040616 1101669 1165710
35147 1165710 1223285 1264238 1280444 1268381 1230306 1173312 1106734 1039187 976483 921083 873037
35136 873037 831643 796868 769788 752049 744889 748352 760940 779695 800484 818313 827667 822995
$$ packed form
35218e08852m8982k7268m417J8617M0312N8589P1330P6939P4676O4841M9207L1404
35206a03604J6506R506J3260K7089M6852O6396P9602Q2306P3443N5046L1093N752
35194D03247j7985l8623n5580o8352p5985p7064p0165n4640l1360l032K6177N1664
35182a1698O9662P8347P8234P1591O1105M8589L4523J8663J205j6329l1039l9562
35170C63291l9540l0751j5172M028K3759M1699N6273O6482P1925P2785O9534O2628
35158G46941N2634M0759K9080K0164J6242J8467K6514L8513N1302O1053O4041
35147A165710N7575M0953J6206j2063l8075n6994o6578o7547o2704n5400m8046
35136H73037m1394l4775k7080j7739p160L463J2588J8755K0789J7829R354m672
$$ plain form
35124 822995 799514 754167 686502 599120 497587 389708 284459 190925 117471 71048 56446
35113 56446 75522 126711 204992 302487 409715 517407 618244 707717 783806 846037 894797
35102 894797 931252 957544 976790 992732 1009082 1028710 1052815 1080429 1108735 1134367 1155172
35091 1155172 1171456 1185866 1201898 1221850 1245449 1269920 1291434 1306808 1314273 1312974 1302165 1281229
35079 1281229 1250521 1211801 1167304 1117941 1062198 996886 919440 830414 734766 641236 559903
35068 559903 498853 461446 445632 445764 455799 471805 492409 517545 547010 579860 614483 648698
35056 648698 679847 705291 723298 733590 737037 734836 728020 717653 705147 691954 678634 664009
35044 664009 645219 618825 582403 535736 481008 421964 362543 305676 252633 202810 153813
$$ packed form
35124H22995k3481m5347o7665q7382j01533j07879j05249r3534p3454m6423j4602
35113E6446J9076N1189P8281R7495J07228J07692J00837Q9473P6089O2231M8760
35102H94797L6455K6292J9246J5942J6350J9628K4105K7614K8306K5632K0805
35091A155172J6284J4410J6032J9952K3599K4471K1514J5374P465j299j0809k0936
35079A281229l0708l8720m4497m9363n5743o5312p7446q9026r5648r3530q1333
35068E59903o1050l7407j5814J32J0035J6006K0604K5136K9465L2850L4623L4215
35056F48698L1149K5444J8007J0292L447k201o816j0367j2506j3193j3320j4625
35044F64009j8790k6394l6422m6667n4728n9044n9421n6867n3043m9823m8997
$$ plain form
35033 153813 101935 43336 -24224 -99908 -179420 -255892 -321443 -368623 -391338 -385229 -347658 -277597
35021 -277597 -175694 -44754 109686 279277 453669 621935 773906 900949 996405 1056072
35011 1056072 1078662 1065800 1021314 950280 858516 752712 640744 531580 434584 358468 310261
35000 310261 294594 313390 365913 448920 556693 680973 811190 935608 1043482 1127550
34990 1127550 1185653 1220596 1238259 1244845 1244534 1238626 1226632 1208602 1187213 1168273 1159401 1167761
34978 1167761 1197805 1249745 1319153 1397966 1476615 1546489 1601811 1640532 1664357 1677842 1686431
34967 1686431 1693777 1699496 1698613 1682981 1643866 1574533 1472228 1339331 1183529 1016783 853108
34956 853108 705728 584474 494094 433674 397046 373979 352102 319521 267730 193809 100818
$$ packed form
35033A53813n1878n8599o7560p5684p9512p6472o5551m7180k2715O109L7571P0061
35021b77597J01903J30940J54440J69591J74392J68266J51971J27043R5456N9667
35011A056072K2590j2862m4486p1034r1764j05804j11968j09164r6996p6116m8207
35000C10261j5667J8796N2523Q3007J07773J24280J30217J24418J07874Q4068
34990A127550N8103L4943J7663O586l11n908j1994j8030k1389j8940q872Q360
34978A167761L0044N1940O9408P8813P8649O9874N5322L8721K3825J3485Q589
34967A686431P346N719q83j5632l9115o9333j02305j32897j55802j66746j63675
34956H53108j47380j21254r0380o0420l6628k3067k1877l2581n1791p3921r2991
$$ plain form
34945 100818 -3905 -111617 -214687 -307854 -388177 -454211 -505075 -539972 -558384 -560534 -547467
34934 -547467 -520520 -480662 -428283 -363420 -286011 -195897 -92810 23315 151671 289903 433966
34923 433966 578673 718633 848917 965251 1064142 1143281 1201861 1240180 1258501 1256091 1231266
34912 1231266 1182298 1108428 1010460 891036 754684 607516 456243 306631 161949 22302
34902 22302 -114539 -250976 -387080 -519045 -639335 -738400 -807212 -839895 -835725 -799761 -741611
34891 -741611 -672671 -602988 -539107 -483435 -434799 -389591 -343077 -290787 -229731 -159055 -79863
34880 -79863 5644 95029 185746 274400 355900 423598 470795 492823 488455 460018 412396 351426
34868 351426 282176 207764 129368 47445 -36683 -120074 -198661 -268525 -327057 -373392 -408081
$$ packed form
34945A00818j04723j07712j03070r3167q0323o6034n0864l4897j8412k150J3067
34934e47467K6947L9858N2379O4863P7409R0114J03087J16125J28356J38232J44063
34923D33966J44707J39960J30284J16334R8891P9139N8580L8319J8321k410k4825
34912A231266m8968p3870r7968j19424j36352j47168j51273j49612j44682j39647
34902B2302j36841j36437j36104j31965j20290r9065o8812l2683M170L5964N8150
34891g41611O8940O9683O3881N5672M8636M5208M6514N2290O1056P0676P9192
34880g9863Q5507Q9385R0717Q8654Q1500O7698M7197K2028m368k8437m7622o0970
34868C51426o9250p4412p8396q1923q4128q3391p8587o9864n8532m6335l4689
$$ plain form
34857 -408081 -432518 -448577 -458435 -463918 -465082 -458906 -439473 -400122 -336335 -247498 -136628 -8622
34845 -8622 131504 279337 430691 580954 725004 857654 973968 1069051 1137841 1175648
34835 1175648 1179368 1148617 1086153 997674 891242 776332 662497 558039 469195 399973 352294
34824 352294 326047 319086 327491 346340 370919 397905 426027 455967 489711 529585 577013 631056
34812 631056 687176 737078 770238 776884 751300 693972 611539 514555 414305 320245 239012
34801 239012 174683 129220 102532 92545 96046 110302 134293 168291 211884 262163 313918 362108
34789 362108 405010 445979 492667 553914 635638 737500 851973 966383 1067002 1143347 1190940
34778 1190940 1211753 1212612 1202550 1190319 1182706 1183622 1193711 1210563 1229844 1247227 1260162 1268470
$$ packed form
34857d08081k4437j6059r858n483j164O176J9433L9351O3787Q8837J10870J28006
34845h622J40126J47833J51354J50263J44050J32650J16314R5083O8790L7807
34835A175648L720l0751o2464q8479j06432j14910j13835j04458q8844o9222m7679
34824C52294k6247o961Q405J8849K4579K6986K8122K9940L3744L9874M7428N4043
34812F31056N6120M9902L3160O646k5584n7328q2433r6984j00250r4060q1233
34801B39012o4329m5463k6688r987L501J4256K3991L3998M3593N0279N1755M8190
34789C62108M2902M0969M6688O1247Q1724J01862J14473J14410J00619P6345M7593
34778A190940K0813Q59j0062j2231p613R16J0089J6852J9281J7383J2935Q308
$$ plain form
34766 1268470 1273505 1276579 1277795 1275947 1269313 1256523 1236815 1209777 1175118 1132934 1084324 1032055
34754 1032055 980971 937889 910665 906391 929250 978968 1050593 1135674 1224340 1307259 1376749
34743 1376749 1426984 1453951 1455697 1432546 1386661 1320983 1238432 1142139 1036526 928209 825699
34732 825699 737761 671067 628403 608429 607085 619756 642950 674628 713102 755185 794831 823487
34720 823487 832385 815654 772586 707948 630507 550597 477628 418130 374669 345769 326771 311520
34708 311520 294472 272616 246452 219726 198187 188044 194608 221433 269977 339706 428274 531514
34696 531514 643499 757271 866492 967222 1058602 1141891 1218587 1288901 1351364 1403492 1442994
34685 1442994 1468971 1482644 1487278 1487287 1486896 1489046 1495155 1505877 1522193 1545824 1578446 1620272 1669138
$$ packed form
34766A268470N035L074J216j848o634j2790j9708k7038l4659m2184m8610n2269
34754A032055n1084m3082k7224m274K2859M9718P1625Q5081Q8666Q2919O9490
34743A376749N0235K6967J746k3151m5885o5678q2551r6293j05613j08317j02510
34732H25699q7938o6694m2664j9974j344J2671K3194L1678L8474M2083L9646K8656
34720H23487Q898j6731m3068o4638p7441p9910p2969n9498m3461k8900j8998j5251
34708C11520j7048k1856k6164k6726k1539j0143O564K6825M8544O9729Q8568J03240
34696E31514J11985J13772J09221J00730R1380Q3289P6696P0314O2463N2128L9502
34685A442994K5977J3673M634Rl91K150O109J0722J6316K3631L2622M1826M8866
$$ plain form
34672 1669138 1720762 1769769 1810745 1838958 1850796 1844218 1819431 1779777 1732284 1686906 1653995
34661 1653995 1640943 1649839 1677359 1716605 1759540 1798847 1828801 1845267 1845418 1827710 1792258 1741089
34649 1741089 1677732 1606143 1529705 1450998 1372203 1295582 1223432 1157642 1099314 1048846 1006442
34638 1006442 972641 948537 935578 935042 947318 971302 1004146 1041532 1078254 1108813 1128076 1132171
34626 1132171 1119649 1092400 1055705 1017214 985219 966799 966302 984465 1018333 1061910 1107344 1146306
34614 1146306 1171276 1176564 1158889 1117539 1054295 973281 880818 785042 695129 620045 567086
34603 567086 540789 542866 573330 632037 719324 835042 976704 1138342 1311187 1485864 1654731
34592 1654731 1813018 1958262 2088584 2200955 2290598 2352043 2381455 2378979 2349668 2302180 2245777
$$ packed form
34672A669138N1624M9007M0976K8213J1838o578k4787l9654m7493m5378l2911
34661A653995j3052Q896K7520L9246M2935L9307K9954J6466J51j7708l5452n1169
34649A741089o3357p1589p6438p8707p8795p6621p2150o5790n8328n0468m2404
34638A006442l3801k4104j2959n36J2276K3984L2844L7386L6722L0559J9263M095
34626A132171j2522k7249l6695l8491l1995j8420m97J8163L3868M3577M5434L8962
34614A146306K4970N288j7675m1350o3244q1014r2463r5776q9913p5084n2959
34603E67086k6297K077L0464N8707Q7287J15718J41662J61638J72845J74677J68867
34592A654731J58287J45244J30322J12371Q9643O1445K9412k476k9311m7488n6403
$$ plain form
34581 2245777 2187222 2129182 2070680 2008816 1940670 1864561 1780547 1690310 1596727 1503292 1413521
34570 1413521 1330429 1256300 1192886 1141831 1104826 1083191 1077139 1085352 1105296 1134232 1170358 1213324
34558 1213324 1263693 1321788 1387061 1458770 1537343 1624890 1723843 1834427 1952674 2070241 2176014
34547 2176014 2258504 2307954 2317607 2284229 2208252 2093622 1947083 1776726 1590274 1393991
34537 1393991 1192747 990893 793168 605121 433079 283733 163491 77696 29941 21587
34527 21587 51355 115029 205749 315302 436036 562328 690745 819178 945743 1067961
34517 1067961 1182212 1283537 1366266 1425682 1460087 1472045 1468071 1456904 1447117 1444984 1453198 1470840
34505 1470840 1494405 1519307 1541204 1556866 1564618 1564432 1557692 1546611 1533571 1520637 1509321 1500431
$$ packed form
34581B245777n8555n8040n8502o1864o8146p6109q4014r0237r3583r3435q9771
34570A413521q3092p4129o3414n1055l7005k1635o052Q213J9944K8936L6126M2966
34558A213324N0369N8095O5273P1709P8573Q7547R8953J10584J18247J17567J05773
34547B176014Q2490M9450R653l3378p5977j14630j46539j70357j86452j96283
34537A393991k01244k01854j97725j88047j72042j49346j20242q5795m7755q354
34527B1587K9768O3674R0720J09553J20734J26292J28417J28433J26565J22218
34517A067961J14251J01325Q2729N9416L4405J1958l974j1167r787k133Q214J7642
34505A470840K3565K4902K1897J5662P752j86o740j1081j3040j2934j1316q890
$$ plain form
34493 1500431 1493805 1488039 1480477 1467684 1446201 1413265 1367148 1307008 1232438 1142988 1038086 917460
34481 917460 781882 633702 476905 316743 159291 11081 -121263 -231706 -315951 -372892
34471 -372892 -405650 -421199 -428222 -433998 -442025 -451675 -459754 -462570 -457097 -440917 -411682 -367033 -305194
34458 -305194 -225745 -129992 -20779 98023 222028 346697 467600 580618 682208 769743
34448 769743 841776 897945 938401 963103 971519 963013 937536 895891 839268 768568 684494 588727
34436 588727 485427 381525 285000 201882 133969 78917 32751 -6819 -38362 -56955 -56404
34425 -56404 -32057 17199 88696 177454 278288 387100 500560 614702 723812 820697 898452
34414 898452 952867 984335 998333 1004230 1012928 1034280 1075177 1138700 1224289 1328539 1446355
$$ packed form
34493A500431o626n766p562j2793k1483l2936m6117o0140p4570q9450j04902j20626
34481I17460j35578j48180j56797j60162j57452j48210j32344j10443q4245n6941
34471c72892l2758j5549p023n776q027r650q079k816N473J6180K9235M4649O1839
34458c05194P9449R5753J09213J18802J24005J24669J20903J13018J01590Q7535
34448G69743P2033N6169M0456K4702Q416q506k5477m1645n6623p0700q4074r5767
34436E88727j03300j03902r6525q3118o7913n5052m6166l9570l1543j8593N51
34425e6404K4347M9256P1497Q8758J00834J08812J13460J14142J09110R6885P7755
34414H98452N4415L1468J3998N897Q698K1352M0897O3523Q5589J04250J17816
$$ plain form
34403 1446355 1572089 1700509 1827211 1948260 2059230 2154380 2226885 2270147 2279294 2251736
34393 2251736 2186734 2084813 1947887 1779915 1587214 1377915 1161006 945882 742706 562772
34383 562772 417773 317618 267744 267272 308996 381288 471202 567531 662534 751845 833201
34372 833201 905223 967040 1018593 1060974 1096342 1127357 1156407 1184868 1212655 1238177 1258753
34361 1258753 1271431 1273886 1264953 1244631 1213766 1173910 1127507 1078052 1029783 986737 951554 924595
34349 924595 903872 885903 867113 845223 820161 794129 770648 752707 740798 732031 720963 701738
34337 701738 670317 625740 570085 507423 442368 378703 318365 260927 203736 142972 75574
34326 75574 1288 -76267 -150245 -212718 -257343 -281392 -286373 -277152 -260115 -241253 -224954 -213698
$$ packed form
34403A446355J25734J28420J26702J21049J10970R5150P2505M3262R147k7558
34393B251736o5002j01921j36926j67972j92701k09299k16909k15124k03176j79934
34383E62772j44999j00155m9874m72M1724P2292Q9914R6329R5003Q9311Q1356
34372H33201P2022O1817N1553M2381L5368L1015K9050K8461K7787K5522K0576
34361A258753J2678K455q933k0322l0865l9856m6403m9455m8269m3046l5183k6959
34349I24595k0723j7969j8790k1890k5062k6032k3481j7941j1909q767j1068j9225
34337G01738l1421m4577n5655o2662o5055o3665o0338n7438n7191o0764o7398
34326G5574p4286p7555p3978o2473m4625k4049m981R221J7037J8862J6299J1256
$$ plain form
34314 -213698 -208308 -208180 -211328 -214637 -214869 -210316 -202224 -194938 -194584 -207159 -237173 -287257 -358089 -447826
34300 -447826 -550914 -657284 -753112 -823637 -857217 -848983 -802457 -728460 -641896 -558044 -489788
34289 -489788 -446190 -431820 -446231 -483960 -535753 -591075 -640942 -679687 -704938 -716303 -713938 -698108
34277 -698108 -669697 -630730 -584062 -532314 -476957 -418203 -355579 -288600 -217211 -141880 -63414
34266 -63414 17319 99445 181708 261905 336541 400924 449699 477937 482863 465706 432532 393258
34254 393258 359204 340437 343796 371690 421569 486305 555871 619962 670582 703604 718780 718313
34242 718313 704825 680063 645264 602816 557590 516653 487406 475249 481742 503726 533636 561178
34230 561178 576072 570965 543522 497072 439622 381554 332738 300171 287028 293149 316295 353238
$$ packed form
34314b13698N390J28l148l309k32M553Q092P286L54j2575l0014n0084p0832q9737
34300d47826j03088j06370r5828p0525l3580Q234M6526P3997Q6564Q3852O8256
34289d89788M3598J4370j4411l7729n1793n5322m9867l8745k5251j1365K365J5830
34277f98108K8411L8967M6668N1748N5357N8754O2624O6979P1389P5331P8466
34266f3414Q0733Q2126Q2263Q0197P4636O4383M8775K8238M926j7157l3174l9274
34254C93258l4054j8767L359K7894M9879O4736O9566O4091N0620L3022J5176m67
34242G18313j3488k4762l4799m2448m5226m0937k9247j2157O493K1984K9910K7542
34230E61178J4894n107k7443m6450n7450n8068m8816l2567j3143O121K3146L6943
$$ plain form
34218 353238 400208 452921 506705 557041 600304 634279 658312 673336 681940 688162 696593 710759
34206 710759 731493 756218 779585 795129 797022 781143 745398 689781 616630 530970 440255 353008
34194 353008 276514 214604 166787 129242 97010 66055 34203 857 -34007 -70787 -110569
34183 -110569 -154547 -202910 -253925 -303692 -346543 -375821 -384922 -368569 -323982 -251499 -154481 -38756
34171 -38756 87989 216885 338778 445661 532386 598035 646136 683432 717812 756388 804279
34160 804279 863984 935013 1013769 1093972 1167906 1228304 1270347 1292969 1298954 1293823 1284010 1275006
34148 1275006 1269942 1269099 1270524 1271660 1271166 1269928 1270703 1276763 1290341 1311625 1338472 1366755 1390985
34135 1390985 1405014 1402834 1379724 1333799 1267404 1187424 1103979 1028024 969032 933706 925883 947224
$$ packed form
34218C53238M6970N2713N3784N0336M3263L3975K4033J5024Q604O222Q431J4166
34206G10759K0734K4725K3367J5544J893j5879l5745n5617p3151q5660r0715q7247
34194C53008p6494o1910m7817l7545l2232l0955l1852l3346l4864l6780l9782
34183a10569m3978m8363n1015m9767m2851k9278r101J6353M4587P2483R7018J15725
34171c8756J26745J28896J21893J06883Q6725O5649M8101L7296L4380L8576M7891
34160H04279N9705P1029P8756Q0203P3934O0398M2043K2622N985n131r813r004
34148A275006n064q43J425J136m94j238P75O060J3578K1284K6847K8283K4230
34135A390985J4029k180k3110m5925o6395p9980q3445p5955n8992l5326p823K1341
$$ plain form
34123 947224 998207 1078951 1189383 1328498 1492920 1675580 1865500 2049148 2212961 2345836
34113 2345836 2440412 2492801 2501518 2466871 2391396 2280925 2145151 1996873 1850040 1717403
34103 1717403 1608665 1529521 1481596 1463172 1470481 1499026 1544228 1601065 1663195 1722517 1769901
34092 1769901 1796989 1798373 1773123 1724833 1660008 1585538 1506451 1424899 1340420 1250881 1153533
34081 1153533 1045977 927062 797555 660270 519526 380156 246505 121799 8006
34072 8006 -93884 -183372 -260086 -323675 -373724 -409410 -428993 -429682 -408224 -361942 -289614 -191811
34060 -191811 -70780 69880 225554 390819 559561 725222 881249 1021607 1141059 1235281
34050 1235281 1301203 1337810 1346949 1333459 1304262 1266672 1226584 1187172 1148536 1108304 1062977
$$ packed form
34123I47224N0983Q0744J10432J39115J64422J82660J89920J83648J63813J32875
34113B345836R4576N2389Q717l4647p5475j10471j35774j48278j46833j32637
34103A717403j08738p9144m7925j8424P309K8545M5202N6837O2130N9322M7384
34092A769901K7088J384k5250m8290o4825p4470p9087q1552q4479q9539r7348
34081A153533j07556j18915j29507j37285j40744j39370j33651j24706j13793
34072H006j01890q9488p6714o3589n0049l5686j9583o89K1458M6282P2328R7803
34060a91811J21031J40660J55674J65265J68742J65661J56027J40358J19452R4222
34050A235281O5922L6607R139j3490k9197l7590m0088l9412l8636m0232m5327
$$ plain form
34039 1062977 1009560 947050 877251 804410 733601 668447 609392 553416 495215 429095 350677
34028 350677 257978 151779 35416 -85888 -205926 -318414 -417798 -499829 -561792 -602284
34018 -602284 -620726 -617058 -591928 -547173 -486041 -412736 -331521 -246019 -159280 -74455 4675 74062
34006 74062 130642 173718 205624 231254 256610 286904 324913 370472 421364 475013 529837 585560
33994 585560 642655 701499 761612 821043 876185 922452 955895 975134 982457 983279 984112 990131 1003637
33981 1003637 1024074 1049367 1077686 1108607 1143130 1182696 1228019 1278554 1332796 1389052 1446150
33970 1446150 1503783 1562413 1622774 1685245 1749461 1814335 1878269 1939258 1994852 2042282 2079137
33959 2079137 2104608 2120841 2133405 2150034 2177770 2219855 2274127 2333758 2389709 2433512 2459299
$$ packed form
34039A062977n3417o2510o9799p2841p0809o5154n9055n5976n8201o6120p8418
34028C50677r2699j06199j16363j21304j20038j12488r9384q2031o1963m0492
34018f02284j8442L668K5130M4755O1132P3305Q1215Q5502Q6739Q4825P9130O9387
34006G4062N6580M3076L1906K5630K5356L0294L8009M5559N0892N3649N4824N5723
33994E85560N7095N8844O0113N9431N5142M6267L3443J9239P323Q22Q33O019J3506
33981A003637K0437K5293K8319L0921L4523L9566M5323N0535N4242N6256N7098
33970A446150N7633N8630O0361O2471O4216O4874O3934O0989N5594M7430L6855
33959B079137K5471J6233J2564J6629K7736M2085N4272N9631N5951M3803K5787
$$ plain form
33948 2459299 2464693 2450631 2420357 2377961 2327001 2269511 2205476 2132768 2047827 1947361 1830586
33937 1830586 1700765 1565023 1432568 1312365 1211155 1132105 1074293 1033447 1003926 981073
33927 981073 962639 948833 941557 943628 958227 988233 1035161 1097868 1171605 1248115 1317033 1368169
33915 1368169 1393752 1389855 1356636 1297506 1217625 1122504 1017413 907665 799103 698071 610675
33904 610675 541779 494247 468665 463528 475624 500271 531291 561217 582325 588485 576995 549256
33892 549256 509897 464709 418435 373427 329806 286793 244246 203478 167146 138511 120385
33881 120385 113913 117599 127221 136969 141391 137199 124097 104248 80607 54910 26517 -7052 -48144
33868 -48144 -96849 -150071 -202262 -247321 -280726 -300976 -309841 -311424 -310596 -311711 -318159 -332702 -357897
$$ packed form
33948B459299N394j4062l0274m2396n0960n7490o4035p2708q4941j00466j16775
33937A830586j29821j35742j32455j20203j01210p9050n7812m0846k9521k2853
33927I81073j8434j3806p276K071J4599L0006M6928O2707P3737P6510O8918N1136
33915A368169K5583l897l3219n9130p9881r5121j05091j09748j08562j01032q7396
33904F10675o8896m7532k5582n137J2096K4647L1020K9926K1108O160j1490k7739
33892E49256l9359m5188m6274m5008m3621m3013m2547m0768l6332k8635j8126
33881A20385o472L686R622R748M422m192j3102j9849k3641k5697k8393l3569m1092
33868d8144m8705n3222n2191m5059l3405k0250q865j583Q28j115o448j4543k5195
$$ plain form
33855 -357897 -395866 -447157 -509346 -576292 -638644 -685396 -705838 -691337 -636749 -541242 -408297
33844 -408297 -244840 -59879 136694 334720 523993 694487 836848 943063 1007276 1026875
33834 1026875 1003736 944763 860737 763476 662748 564742 472659 388380 313810 251324 203674
33823 203674 173848 164920 179598 219358 283446 368210 467199 572137 674589 767842 848350
$$ packed form
33855c57897l7969n1291o2189o6946o2352m6752k0442J4501N4588R5507J32945
33844d08297J63457J84961J96573J98026J89273J70494J42361J06215O4213J9599
33834A026875k3139n8973q4026r7261j00728r8006r2083q4279p4570o2486m7650
33823B03674k9826q928J4678L9760O4088Q4764R8989J04938J02452R3253Q0508
$$ [...]
##END NTUPLES=NMR SPECTRUM
##END=
