##TITLE=31Pdec_E3d2512-2.1
 CDCl3
  24 sc
 26.12.2023
##JCAMPDX= 6.0         $$ Bruker NMR JCAMP-DX V2.0
##DATA TYPE= NMR SPECTRUM
##DATA CLASS= NTUPLES
##ORIGIN= UXNMR, Bruker Analytische Messtechnik GmbH
##OWNER= root
$$ XWIN-NMR		Version 3.5
$$ Tue Dec 26 14:58:40 2023 Russian Standard Time (UT+4h)  she@DPX200
##.OBSERVE FREQUENCY= 81.013821
##.OBSERVE NUCLEUS= ^31P
##.ACQUISITION MODE= SIMULTANEOUS
##.ACQUISITION SCHEME= undefined
##.AVERAGES= 24
##.DIGITISER RES= 16
##SPECTROMETER/DATA SYSTEM= spect
##.PULSE SEQUENCE= zgpg30
##.SOLVENT NAME= CD2Cl2
##.SHIFT REFERENCE= (INTERNAL, CD2Cl2, 0, 248.564)
##AUDIT TRAIL= $$ (NUMBER, WHEN, WHO, WHERE, WHAT)
$$ ##TITLE= Audit trail, XWIN-NMR		Version 3.5
$$ ##JCAMPDX= 5.01
$$ ##ORIGIN= Bruker BioSpin GmbH
$$ ##OWNER= she
$$ F:/spectra/data/she/nmr/P31/1/pdata/1/auditp.txt
$$ ##AUDIT TRAIL=  $$ (NUMBER, WHEN, WHO, WHERE, WHAT)
(   1,<2023-12-26 14:57:43.64 +0400>,<she>,<DPX200>,
      <created by zg, POWCHK disabled, PULCHK disabled
       configuration hash MD5:
       00 E9 B6 7A A2 85 ED C7 34 08 36 98 17 FE 4E 26
       data hash MD5: 32K
       C3 F3 29 A5 A6 0C F1 7D 5E 85 60 B0 12 FF 8F 05>)
(   2,<2023-12-26 14:57:46.68 +0400>,<she>,<DPX200>,
      <Start of raw data processing
       efp BC_mod = 2 LB = 10 FT_mod = 6 PKNL = 1 PHC0 = -12719.78 PHC1 = 1381.694 SI = 64K 
       data hash MD5: 64K
       05 45 2F 47 D0 D9 E0 F7 B9 DE D0 F9 48 DF 92 A5>)
(   3,<2023-12-26 14:57:58.81 +0400>,<she>,<DPX200>,
      <pk PHC0 = -1.170552 PHC1 = 0 
       data hash MD5: 64K
       D5 BC B1 D5 EE 37 5D EE 1E 32 92 B9 17 AB F8 77>)
(   4,<2023-12-26 14:58:06.10 +0400>,<she>,<DPX200>,
      <abs ABSG = 5 
       data hash MD5: 64K
       27 3D 95 B6 6D 21 EC CC 54 26 6A D7 B7 E7 6A 47>)
$$ ##END=
$$ 
$$ hash MD5
$$ CE 58 AA E0 EA F3 68 CE 7A 17 AE B5 25 20 05 57
##$RELAX= 
##$RELAX= 
##$RELAX= 
##$RELAX= 
##$RELAX= 
##$RELAX= 
##$RELAX= 
##$RELAX= 
##$RELAX= 
$$ Bruker specific parameters
$$ --------------------------
##$DU= <F:/spectra>
##$EXPNO= 1
##$NAME= <P31>
##$PROCNO= 1
##$TYPE= <nmr>
##$USER= <she>
##$AMP= (0..31)
100 100 100 100 100 100 100 100 100 100 100 100 100 100 100 100 100 100 
100 100 100 100 100 100 100 100 100 100 100 100 100 100 
##$AQSEQ= 0
##$AQ_mod= 1
##$AUNM= <au_zg>
##$AUTOPOS= <>
##$BF1= 81.014009
##$BF2= 200.13
##$BF3= 200.13
##$BF4= 200.13
##$BF5= 200.13
##$BF6= 200.13
##$BF7= 200.13
##$BF8= 200.13
##$BYTORDA= 1
##$CFDGTYP= 0
##$CFRGTYP= 5
##$CHEMSTR= <none>
##$CNST= (0..31)
1 1 145 1 1 1 1 1 1 1 1 1 1 1 1 1 1 1 1 1 1 1 1 1 1 1 1 1 1 1 1 1 
##$CPDPRG= <waltz16>
##$CPDPRG1= <>
##$CPDPRG2= <waltz16>
##$CPDPRG3= <>
##$CPDPRG4= <mlev>
##$CPDPRG5= <mlev>
##$CPDPRG6= <mlev>
##$CPDPRG7= <mlev>
##$CPDPRG8= <mlev>
##$CPDPRGB= <>
##$CPDPRGT= <>
##$D= (0..31)
0 1 0 0 0 0 0 0 0 0 0 0.03 2e-05 3e-06 0 0 0 0 0 0 0 0 0 0 0 0 0 0 0 0 
0 0 
##$DATE= 1703588263
##$DBL= (0..7)
120 120 120 11 120 120 24 19 
##$DBP= (0..7)
150 150 150 150 150 150 150 150 
##$DBP07= 0
##$DBPNAM0= <>
##$DBPNAM1= <>
$$ [...]
##$SUBNAM3= <"">
##$SUBNAM4= <"">
##$SUBNAM5= <"">
##$SUBNAM6= <"">
##$SUBNAM7= <"">
##$SUBNAM8= <"">
##$SUBNAM9= <"">
##$SW= 501.771253377433
##$SWIBOX= (0..15)
0 1 3 0 0 0 0 0 0 0 0 0 0 0 0 0 
##$SW_h= 40650.406504065
##$TD= 32768
##$TD0= 1
##$TE= 0
##$TE2= 300
##$TE3= 300
##$TEG= 300
##$TL= (0..7)
0 120 53 12 22 120 120 120 
##$TP= (0..7)
150 150 150 150 150 150 150 150 
##$TP07= 0
##$TPNAME0= <>
##$TPNAME1= <>
##$TPNAME2= <>
##$TPNAME3= <>
##$TPNAME4= <>
##$TPNAME5= <>
##$TPNAME6= <>
##$TPNAME7= <>
##$TPOAL= (0..7)
0.5 0.5 0.5 0.5 0.5 0.5 0.5 0.5 
##$TPOFFS= (0..7)
0 0 0 0 0 0 0 0 
##$TUNHIN= 0
##$TUNHOUT= 0
##$TUNXOUT= 0
##$USERA1= <user>
##$USERA2= <user>
##$USERA3= <user>
##$USERA4= <user>
##$USERA5= <user>
##$V9= 5
##$VALIST= <valist>
##$VCLIST= <CCCCCCCCCCCCCCC>
##$VD= 0
##$VDLIST= <DDDDDDDDDDDDDDD>
##$VPLIST= <PPPPPPPPPPPPPPP>
##$VTLIST= <TTTTTTTTTTTTTTT>
##$WBST= 1024
##$WBSW= 4
##$XGAIN= (0..3)
0 0 0 0 
##$XL= 0
##$YL= 0
##$YMAX_a= 2626
##$YMIN_a= -3459
##$ZGOPTNS= <>
##$ZL1= 120
##$ZL2= 120
##$ZL3= 120
##$ZL4= 120
##$ABSF1= 248.5645
##$ABSF2= -253.2056
##$ABSG= 5
##$ABSL= 3
##$ALPHA= 0
##$AQORDER= 0
##$ASSFAC= 0
##$ASSFACI= 0
##$ASSFACX= 0
##$ASSWID= 0
##$AUNMP= <proc_1d>
##$AZFE= 0.1
##$AZFW= 0.5
##$BCFW= 0
##$BC_mod= 2
##$BYTORDP= 0
##$COROFFS= 0
##$CY= -3
##$DATMOD= 1
##$DC= 0
##$DFILT= <>
##$DTYPP= 0
##$F1P= 0
##$F2P= 0
##$FCOR= 1
##$FTSIZE= 65536
##$FT_mod= 6
##$GAMMA= 0
##$GB= 0
##$INTBC= 1
##$INTSCL= 6.047779e-11
##$ISEN= 30
##$LB= 10
##$LEV0= 0
##$LPBIN= 0
##$MAXI= 10000
##$MC2= 0
##$MEAN= 0
##$ME_mod= 0
##$MI= 50
##$NCOEF= 0
##$NC_proc= -8
##$NLEV= 6
##$NOISF1= 182.463
##$NOISF2= 159.3651
##$NSP= 0
##$NTH_PI= 0
##$NZP= 0
##$OFFSET= 248.5645
##$PC= 4
##$PHC0= -12720.95
##$PHC1= 1381.694
##$PH_mod= 1
##$PKNL= yes
##$PPARMOD= 0
##$PSCAL= 0
##$PSIGN= 0
##$REVERSE= no
##$SF= 81.0140089999694
##$SI= 65536
##$SIGF1= 159.3651
##$SIGF2= -187.1042
##$SINO= 113.3802
##$SIOLD= 16384
##$SREGLST= <1H.CDCl3>
##$SSB= 0
##$STSI= 65536
##$STSR= 0
##$SW_p= 40650.406504065
##$SYMM= 0
##$S_DEV= 0
##$TDeff= 32768
##$TDoff= 0
##$TI= <>
##$TILT= no
##$TM1= 0
##$TM2= 0
##$TOPLEV= 0
##$USERP1= <user>
##$USERP2= <user>
##$USERP3= <user>
##$USERP4= <user>
##$USERP5= <user>
##$WDW= 1
##$XDIM= 65536
##$YMAX_p= 451666598
##$YMIN_p= -8844142
$$ End of Bruker specific parameters
$$ ---------------------------------
##NTUPLES= NMR SPECTRUM
##VAR_NAME=  FREQUENCY,     SPECTRUM/REAL,   SPECTRUM/IMAG
##SYMBOL=    X,             R,               I
##VAR_TYPE=  INDEPENDENT,   DEPENDENT,       DEPENDENT
##VAR_FORM=  AFFN,          ASDF,            ASDF
##VAR_DIM=   65536,         65536,           65536
##UNITS=     HZ,            ARBITRARY UNITS, ARBITRARY UNITS
##FACTOR=    0.620285442955139, 1,           1
##FIRST=     20137.2065510682, 0,            0
##LAST=      -20513.1999529968, 0,           0
##MIN=       -20513.1999529968, -8844142,    0
##MAX=       20137.2065510682, 451666598,    0
$$ Real data points
##PAGE= N=1
##DATA TABLE= (X++(R..R)), XYDATA
$$ [...]
39822H62077o0130q3087j11395j42577j73275j99226k15852k19293k07111j78685
39812g28554j35916q3998l0937J5038M8733O9680Q1397Q9347R8919J14014J36140
39801c26137J64122J94540K22719K44036K55157K54836K43790K23882J97138J65182
39791A839265J29398R1492N3737J8126j5292m9235q7805j33689j86166k41210
39781A418621k92975l35466l63852l75403l69771l48408l13592k67691k12700
39772a461237j50168q1803j0665N8306J19624J69671K08035K36348K55699K65012
39762c91178K61825K44669K14937J76556J33956R0167M6701N017l2210o1413p9753
39751F09274q6339q1876o7229m2644q655L2376P5737J15371J45323J60760J58945
$$ plain form
39822 862077 801947 718860 607465 464888 291613 92387 -123465 -342758 -549869 -728554
39812 -728554 -864470 -948468 -979405 -964367 -915634 -845954 -764557 -675210 -576291 -462277 -326137
39801 -326137 -162015 32525 255244 499280 754437 1009273 1253063 1476945 1674083 1839265
39791 1839265 1968663 2060155 2113892 2132018 2116726 2067491 1979686 1845997 1659831 1418621
39781 1418621 1125646 790180 426328 50925 -318846 -667254 -980846 -1248537 -1461237
39772 -1461237 -1611405 -1693208 -1703873 -1645567 -1525943 -1356272 -1148237 -911889 -656190 -391178
39762 -391178 -129353 115316 330253 506809 640765 730932 777633 782650 750440 689027 609274
39751 609274 522935 441059 373830 331186 322531 354907 430644 546015 691338 852098 1011043
39740A011043J40577J10545P6639M6396K4127J0057J670m007q488j1084r458j104
39728A386913J5132L8163O4723R0181J09979J21313J24109J20464J12608J00933
39718B284518Q3697N8823K6336j0467m5788p3336q8355q9145p7754n9402m0319
39707A968808k4952j4243o167J882J0474J6939J6526N394j6298m3435o8079q3460
39695A763389q7147q1525p1636o2282n6078n3086n1500m8730m2599l2386j9128
39684A157292m828Q936K1769L3985M5329N4117N7227N0766L0943m655n5203j15049
39672A280629j74037k20716k47206k52555k42368k25206k08297j94971j84444
39663f69171j73213j56860j31455r4381m4899J5353Q2287J49908K11147K58565
$$ plain form
39740 1011043 1151620 1262165 1338804 1385200 1409327 1419384 1421054 1417047 1408559 1397475 1388017 1386913
39728 1386913 1402045 1440208 1504931 1595112 1705091 1826404 1950513 2070977 2183585 2284518
39718 2284518 2368215 2427038 2453374 2442907 2397119 2323783 2235428 2146283 2068529 2009127 1968808
39707 1968808 1943856 1929613 1923446 1925328 1935802 1952741 1969267 1974661 1958363 1914928 1846849 1763389
39695 1763389 1676242 1594717 1523081 1460799 1404721 1351635 1300135 1251405 1208806 1176420 1157292
39684 1157292 1152464 1161400 1183169 1217154 1262483 1316600 1373827 1424593 1455536 1450881 1395678 1280629
39672 1280629 1106592 885876 638670 386115 143747 -81459 -289756 -484727 -669171
39663 -669171 -842384 -999244 -1130699 -1225080 -1269979 -1254626 -1172339 -1022431 -811284 -552719
39653e52719K85297K86913K63523K20284J65515J07650N3055N338l4293o5895
39643G34668q8910j00599r6408p2647k9723K6241Q4353J31929J58359J58450J33714
39632A039427R0919L8912j4236o2474j01739j29941j47353j56871j63149j70701
39622B22794j81878j95611k07055k08149j89645j44794p3300J7046J12543J98460
39612f49589K63859L04101L20482L17608L00321K72080K35538J93997J51714J12488
39602A822599P7821M6268J4373k1232o1529j03813j42548j72186j90055j97307
39592A072391j97550j94400j89556j82303j70691j53793j33459j14100j00491
39583c63952r5278r7937j05568j14364j20631j21097j13172r5955p1464m4764
$$ plain form
39653 -552719 -267422 19491 283014 503298 668813 776463 829518 834856 800563 734668
39643 734668 645758 545159 448751 376104 346381 372622 456975 588904 747263 905713 1039427
39632 1039427 1130346 1169258 1155022 1092548 990809 860868 713515 556644 393495 222794
39622 222794 40916 -154695 -361750 -569899 -759544 -904338 -977638 -960592 -848049 -649589
39612 -649589 -385730 -81629 238853 556461 856782 1128862 1364400 1558397 1710111 1822599
39602 1822599 1900420 1946688 1961061 1939829 1878300 1774487 1631939 1459753 1269698 1072391
39592 1072391 874841 680441 490885 308582 137891 -15902 -149361 -263461 -363952
39583 -363952 -459230 -557167 -662735 -777099 -897730 -1018827 -1131999 -1227954 -1299418 -1344182
39573a344182k2119q269m616r243j7884k4942k4814j3832P904L6356O5350Q9086
39561a271205J03901J09006J06690J01799R9968J04625J14474J23665J25058J14463
39551a67556R2766O4760L6208J1601o324j6094j7230j0572J381J4786K5701L1478
39539F0905L1462K6643J8991J1215O639Q403J7803L2958M8961N9630N9946M7977
39527D31533K5620k240k9837n2830o9435p9876q4916q4913q0119p1558o1250n1308
39515b11129m2643l4386k4277r584J1983M1473P8200J19888J63280K04655K39645
39504E37105K62949K68878K53035K14409J56522Q6981J5496m8752r9251j33070
39494A514302j50443j53394j43941j22666q8638m1185J7535Q1242J40779J86967
$$ plain form
39573 -1344182 -1366301 -1374570 -1379186 -1388429 -1406313 -1431255 -1456069 -1469901 -1461997 -1425641 -1360291 -1271205
39561 -1271205 -1167304 -1058298 -951608 -849809 -749841 -645216 -530742 -407077 -282019 -167556
39551 -167556 -74790 -10030 26178 37779 31455 15361 -1869 -12441 -11060 3726 29427 60905
39539 60905 92367 119010 138001 149216 155855 164258 182061 215019 263980 323610 383556 431533
39527 431533 457153 454913 425076 372246 302811 222935 138019 53106 -27013 -98571 -159821 -211129
39515 -211129 -253772 -288158 -312435 -322019 -310036 -268563 -190363 -70475 92805 297460 537105
39504 537105 800054 1068932 1321967 1536376 1692898 1779879 1795375 1746623 1647372 1514302
39494 1514302 1363859 1210465 1066524 943858 855220 814035 831570 912812 1053591 1240558
39484A240558K13142K16291J97169J59890J10922N7384N175m2273q4118j21293
39474A952847j54935j84695k07800k19583k15362j92708j53124j02284m8379Q59
39464D74836M0714O9773Q7918R4053Q5605N9921J6383m1771j06384j65066k04452
39453D11530k15222j96128j54101j00344m4928O483N2270R1914J23426J43201
39443A18101J48073J37481J14227Q3621N1842K4060K966j1646k1910l0122l7486
39432E79207m4150n0141n6296o4210p5030q7845r9059j03755r8263q2112n7982
39421b39636l0140k990J9295L2652L3700K1245k413l1634n9268p9180q8238q7038
39409e13645p9219o9679o2709o1090o6403p9613j00884j28643j58902j85535k01711
$$ plain form
39484 1240558 1453700 1669991 1867160 2027050 2137972 2195356 2200531 2158258 2074140 1952847
39474 1952847 1797912 1613217 1405417 1185834 970472 777764 624640 522356 473977 474836
39464 474836 515550 585323 673241 767294 852899 912820 929203 887432 781048 615982 411530
39453 411530 196308 180 -153921 -254265 -299193 -292710 -240440 -148526 -25100 118101
39443 118101 266174 403655 517882 601503 653345 677405 680371 668725 646815 616693 579207
39432 579207 535057 484916 428620 364410 289380 201535 102476 -1279 -99542 -181654 -239636
39421 -239636 -269776 -272766 -253471 -220819 -187119 -165874 -168287 -199921 -259189 -338369 -426607 -513645
39409 -513645 -592864 -662543 -725252 -786342 -852745 -932358 -1033242 -1161885 -1320787 -1506322 -1708033
39398a708033k02131j85364j54846j17390p9592m4440j0430K6368O9072J17606
39388b289180J68186K14272K48164K62822K53775K20957J69526J08893M9947J729
39378e90909l0931m7951n2628m9036l9445k3557j92K9749O1531Q7502J00146R5412
39366d60309P4808M5361J7194p54m937J371J0713J6519J6863J4470J3701J7593
39354b37407K7188M2666O4338R2329J25533J61002J94297K20444K35019K35157
39344A160566K20375J92886J57121J18446Q1635M9611K3073J041j7912l4461m8190
39333A904191n8228o4198o6641o6986o7578p1850q3926j07205j42657j87958k37789
39322G49175k84872l21399l40749l39167l16524k75941k22604j62393j00417l9720
$$ plain form
39398 -1708033 -1910164 -2095528 -2250374 -2367764 -2447356 -2491796 -2502226 -2475858 -2406786 -2289180
39388 -2289180 -2120994 -1906722 -1658558 -1395736 -1141961 -921004 -751478 -642585 -592638 -590909
39378 -590909 -621840 -669791 -722419 -771455 -810900 -834457 -834649 -804900 -743369 -655867 -555721 -460309
39366 -460309 -385501 -340140 -322946 -323700 -328637 -327266 -316553 -300034 -283171 -268701 -255000 -237407
39354 -237407 -210219 -167553 -103215 -10886 114647 275649 469946 690390 925409 1160566
39344 1160566 1380941 1573827 1730948 1849394 1931029 1980640 2003713 2004754 1986842 1952381 1904191
39333 1904191 1845963 1781765 1715124 1648138 1580560 1508710 1424784 1317579 1174922 986964 749175
39322 749175 464303 142904 -197845 -537012 -853536 -1129477 -1352081 -1514474 -1614891 -1654611
39312a654611J8895P5592J29626J78598K19362K49363K67065K71311K60981K35867
39302B52049J98315J53983J10542P4781M9845L4229K2989J0291p861l1873n8523
39291H08767q2638r9582j06943j04449r2548p1332m1232m899L1873O1994Q0782
39280C79793Q8508Q9377Q7880Q5597Q0780P0185N1241K3136j3139n5194r9601
39269G88563j42079j77766k01776k10379k02379j79958j48228j13515q1221n4624
39259g23362l5242k4053k2148l0235m7702p2323j00872j30152j57978j83706k07827
39248a735600k30535k50213k63080k64454k50663k20531j75899j21144o1762k659
39238c576540N2595J01002J39008J62744J69916J61641J42598J19462R8943Q6293
$$ plain form
39312 -1654611 -1635716 -1560124 -1430498 -1251900 -1032538 -783175 -516110 -244799 16182 252049
39302 252049 450364 604347 714889 789670 839515 873744 896733 907024 899163 867290 808767
39291 808767 726129 626547 519604 415155 322607 251275 210043 205144 237017 299011 379793
39280 379793 468301 557678 645558 731155 811935 882120 933361 956497 943358 888164 788563
39269 788563 646484 468718 266942 56563 -145816 -325774 -474002 -587517 -668738 -723362
39259 -723362 -758604 -782657 -804805 -835040 -882742 -955065 -1055937 -1186089 -1344067 -1527773 -1735600
39248 -1735600 -1966135 -2216348 -2479428 -2743882 -2994545 -3215076 -3390975 -3512119 -3573881 -3576540
39238 -3576540 -3523945 -3422943 -3283935 -3121191 -2951275 -2789634 -2647036 -2527574 -2428631 -2342338
39228b342338Q4249R2262J06559J21750J33518J40859J46400J54643J69469J92058
39218a000571K19756K45963K61680K58818K34237J91911J41611R4918O0903M3457
39208G52683M0779M6792N4063N7130N4511M8396M2708M1073M5504N5788O9639
39197A309066Q3781R5389J02883J05791J04517J00499R6018R3134R2632R4157
39187B277867R7165J01245J05511J08093J06420R7692P9186M9127Q421l8044q2254
39176B910429j15859j33009j31727j13779q3710m7509j1388J9097L9666M8017
39166B380228M4327L0802J0392j4445m2171p2207j04823j40546j78519k14912
39156A698126k43068k56116k50528k28296j96348j63519j36842j19158j09112
$$ plain form
39228 -2342338 -2258089 -2165827 -2059268 -1937518 -1804000 -1663141 -1516741 -1362098 -1192629 -1000571
39218 -1000571 -780815 -534852 -273172 -14354 219883 411794 553405 648323 709226 752683
39208 752683 793462 840254 894317 951447 1005958 1054354 1097062 1138135 1183639 1239427 1309066
39197 1309066 1392847 1488236 1591119 1696910 1801427 1901926 1997944 2091078 2183710 2277867
39187 2277867 2375032 2476277 2581788 2689881 2796301 2893993 2973179 3022306 3030727 2992683 2910429
39176 2910429 2794570 2661561 2529834 2416055 2332345 2284836 2273448 2292545 2332211 2380228
39166 2380228 2424555 2455357 2465749 2451304 2409133 2336926 2232103 2091557 1913038 1698126
39156 1698126 1455058 1198942 948414 720118 523770 360251 223409 104251 -4861
39147d861j03108r7786r1526q4343p6458o6632n1629k7561P559N1763R9152J42006
39135c03424J73555J89907J90490J77570J55554J30039J06394Q8115P5878O7992
39125A052070O1933N6065N0742M8256N1225O0012P0965P7406P3254N6662L0805
39114A689395J504k6239n0330p1554r2156j14135j38039j62493j84509k00380
39104F51064k07052k03211j89422j67075j37219j00569n8871j6026K2613N2632
39094c53136P2797Q5569R5618J07250J21965J37143J46783J44323J26233R4261
39084G78806N4903J6459j4450l5090m6604n2292n5423n7853n9896o0824n9443
39073D08293n4623m6217l5982k7533k4659k8922l8477m9146n7065o0835o1990
$$ plain form
39147 -4861 -107969 -205755 -297281 -381624 -458082 -524714 -576343 -603904 -596345 -544582 -445430 -303424
39135 -303424 -129869 60038 250528 428098 583652 713691 820085 908200 984078 1052070
39125 1052070 1114003 1170068 1220810 1269066 1320291 1380303 1451268 1528674 1601928 1658590 1689395
39114 1689395 1690899 1664660 1614330 1542776 1450620 1336485 1198446 1035953 851444 651064
39104 651064 444012 240801 51379 -115696 -252915 -353484 -412355 -428381 -405768 -353136
39094 -353136 -280339 -194770 -99152 8098 130063 267206 413989 558312 684545 778806
39084 778806 833709 850168 835718 800628 754024 701732 646309 588456 528560 467736 408293
39073 408293 353670 307453 271471 243938 219279 190357 151880 102734 45669 -15166 -77156
39062g7156o3634o8393p6651q6102r2843r3348q5806o9926m5928j4169K3947O4887
39050f85122J03243J33392J51572J57062J52031J40162J24719J07090Q6619O1683
39040E32451L1016n446m6083q7247j23430j48540j58013j50484j28006r5124n7714
39029d36620k2018O398K3872K9536K5055J3225l652k4641m9992q0344j15729j54477
39017g89387j92333k22646k38204k34112k09789j68993j18204o4902j6364K1598
39007b233336M6269N9222O5650P1783Q2022R7528J16897J38001J59659J82149
38997a214156K06394K32568K59375K84556L05868L21396L29005L26264L11677
38988A362947K86603K56048K27330K07167J98601J99181K01166J93974J68070
$$ plain form
39062 -77156 -140790 -209183 -285834 -371936 -464779 -558127 -643933 -713859 -759787 -773956 -750009 -685122
39050 -685122 -581879 -448487 -296915 -139853 12178 152340 277059 384149 470768 532451
39040 532451 563467 558021 511938 424691 301261 152721 -5292 -155776 -283782 -378906 -436620
39029 -436620 -458638 -452240 -428368 -398832 -373777 -360552 -364204 -388845 -438837 -519181 -634910 -789387
39017 -789387 -981720 -1204366 -1442570 -1676682 -1886471 -2055464 -2173668 -2238570 -2254934 -2233336
39007 -2233336 -2187067 -2127845 -2062195 -1990412 -1908390 -1810862 -1693965 -1555964 -1396305 -1214156
38997 -1214156 -1007762 -775194 -515819 -231263 74605 396001 725006 1051270 1362947
38988 1362947 1649550 1905598 2132928 2340095 2538696 2737877 2939043 3133017 3301087
38979C301087J18637M7511l7276j23869j99880k55453k85239k88924k70658k37948
38969A767988k00307j67512j47448j44149j57063j82048k13647k47209k79691
38960B8914l09001l32957l48959l54654l48722l30963l01655k61045k09672j49231
38950b917945q2907j4572N2558J16460J75489K26975K66690K89801K92898K75939
38940a318614K43136K02163J61901J29559J08642R8476R5258R3742Q9046P8205
38930a8486O1091M0199J9357K242q478j1288n777P307K5989M7330O7913Q4332
38918C11731R3649R3875Q4571O7463M6657K7889J6687J6181K5958M2414O0028
38907H87103P2579P4234O1029L2610o721m8620q2931j00626r6467p0529k8137
$$ plain form
38979 3301087 3419724 3467235 3429959 3306090 3106210 2850757 2565518 2276594 2005936 1767988
38969 1767988 1567681 1400169 1252721 1108572 951509 769461 555814 308605 28914
38960 28914 -280087 -613044 -962003 -1316657 -1665379 -1996342 -2297997 -2559042 -2768714 -2917945
38950 -2917945 -3000852 -3015424 -2962866 -2846406 -2670917 -2443942 -2177252 -1887451 -1594553 -1318614
38940 -1318614 -1075478 -873315 -711414 -581855 -473213 -374737 -279479 -185737 -96691 -18486
38930 -18486 42605 82804 102161 104403 95925 84637 78860 86167 112156 159486 227399 311731
38918 311731 405380 499255 583826 651289 697946 725835 742522 758703 784661 827075 887103
38907 887103 959682 1033916 1094945 1127555 1120834 1072214 989283 888657 792190 721661 693524
38896F93524K1852O9917J08855J35485J50203J54819J50537J37814J17843R3700
38886A834549O9510M8385L1024J5881K77j8501m2209p0810j02070j32300j57892
38875A475844j76743j88538j93906j93202j85957j71429j49851j23256r4955o7926
38865f9919m3220j9713M594L0396N5385P4120Q0111O9318M3055Q012k6897n4650
38853A50592p2420q1233q4235q4772q4615q2454p3792n3172j7863K9364Q0499
38842c74101J25791J58584J78463J90410K00605K12275K24736K35536K42697K45216
38832A640212K42484K34278K21205K04622J85836J65688J44979J25116J08113
38823C272533R5906Q9324Q6985Q4865P7255N9185K8890j1129n4821r4180j21101
$$ plain form
38896 693524 715376 785293 894148 1029633 1179836 1334655 1485192 1623006 1740849 1834549
38886 1834549 1904059 1952444 1983468 1999349 1999626 1981125 1938916 1868106 1766036 1633736 1475844
38875 1475844 1299101 1110563 916657 723455 537498 366069 216218 92962 -1993 -69919
38865 -69919 -113139 -132852 -128258 -97862 -42477 31643 111754 181072 224127 232139 205242 150592
38853 150592 78172 -3061 -87296 -172068 -256683 -339137 -412929 -466101 -483964 -454600 -374101
38842 -374101 -248310 -89726 88737 279147 479752 692027 916763 1152299 1394996 1640212
38832 1640212 1882696 2116974 2338179 2542801 2728637 2894325 3039304 3164420 3272533
38823 3272533 3368439 3457763 3544748 3629613 3706868 3766053 3794943 3783814 3728993 3634813 3513712
38812C513712j29608j18256r1496n8421k9042j0153l347n950j3548k2143k8909
38801C002839l1929k9929k2633j1514M7P830Q562J179j3311l3042n6554q3453
38789B738092j14245j49513j88889k30373k70315l03953l26321l33540l24301
38780D96642l00628k67017k28271j87646j46552j05643o6008k9529J735K6478
38770h06439M4673N7224O5008O8229O6640O0486N1224M1441L4033L0949L2051
38759b54481L4716L4854K9121J7073J561j2862k2098k3532j5615K772L2115P1366
38747a05010J17489J65938K11516K48895K72716K77776K59902K17380J52349P1413
38737A890364j5202r5940j60950k04644k26725k31549k26476k19926k19350k29071
$$ plain form
38812 3513712 3384104 3265848 3174352 3115931 3086889 3076736 3073389 3067439 3053891 3031748 3002839
38801 3002839 2970910 2940981 2918348 2906834 2906881 2914711 2923273 2924452 2911141 2878099 2821545 2738092
38789 2738092 2623847 2474334 2285445 2055072 1784757 1480804 1154483 820943 496642
38780 496642 196014 -71003 -299274 -486920 -633472 -739115 -805123 -834652 -832917 -806439
38770 -806439 -761766 -704542 -639534 -571305 -504665 -444179 -392955 -351514 -317481 -286532 -254481
38759 -254481 -219765 -184911 -155790 -138717 -137156 -150018 -172116 -195648 -211263 -208491 -176376 -105010
38747 -105010 12479 178417 389933 638828 911544 1189320 1449222 1666602 1818951 1890364
38737 1890364 1875162 1779222 1618272 1413628 1186903 955354 728878 508952 289602 60531
38727F0531k48718k73548k96960l13578l20532l16341k99286k67337k20005j60302
38717b656076r5020l3007J7552N1315O6685O5797N4029L9115K9123K9614M1347
38706b389526O0231P9617R3352R7827R2342P8273N7878L3488P297j8398m1032
38695a848651n7991o7351o8757o4123n7535n4184n8350p1196q9509j06567j15149
38684b659363j11191r5672p3516n0551l0735j5276l675M202O613K97j7169m4882
38672c090918p8184j10570j36078j50494j51627j39665j17679r1288o7207n1204
38662d184914m6377n2326o5528q0828r3186r8692r4624p9287n2059j3511L4755
38651d826577R0283J49831K09419K64716L11625L46694L67303L71928L60596L35220
$$ plain form
38727 60531 -188187 -461735 -758695 -1072273 -1392805 -1709146 -2008432 -2275769 -2495774 -2656076
38717 -2656076 -2751096 -2784103 -2766551 -2715236 -2648551 -2582754 -2528725 -2489610 -2460487 -2430873 -2389526
38706 -2389526 -2329295 -2249678 -2156326 -2058499 -1966157 -1887884 -1830006 -1796518 -1789221 -1807619 -1848651
38695 -1848651 -1906642 -1973993 -2042750 -2106873 -2164408 -2218592 -2276942 -2348138 -2437647 -2544214 -2659363
38684 -2659363 -2770554 -2866226 -2939742 -2990293 -3021028 -3036304 -3039979 -3035777 -3029164 -3028867 -3046036 -3090918
38672 -3090918 -3169102 -3279672 -3415750 -3566244 -3717871 -3857536 -3975215 -4066503 -4133710 -4184914
38662 -4184914 -4231291 -4283617 -4349145 -4429973 -4523159 -4621851 -4716475 -4795762 -4847821 -4861332 -4826577
38651 -4826577 -4736294 -4586463 -4377044 -4112328 -3800703 -3454009 -3086706 -2714778 -2354182 -2018962
38641b018962K99188K56133K08647J57892J04449M9698l269m9690q4142j02236
38631a182292j02506q7478o3058l6353j3184L333J2577J5241J2353N363l136r250
38619a448390r093q89J3570K9185L9586M0329L1810J9785J2391J5427K9626N1778
38607a174885P7766J04343J28656J47400J57346J57058J48242J35376J23777J17290
38597A22369J17080J21853J28651J33601J32974J24609J08825Q7735O3680L8508
38587A179885J4009p650k4390l4853l8583l6215l0307k5744k8261m1351o3796
38576H62744q9791j11560j22699j20507j06559q5754o4516m8799m2551m7165o1935
38565c9092q5013j14177j47245j82100k16250k45859k65480k69705k56354k28265
$$ plain form
38641 -2018962 -1719774 -1463641 -1254994 -1097102 -992653 -942955 -946224 -995914 -1080056 -1182292
38631 -1182292 -1284798 -1372276 -1435334 -1471687 -1484871 -1481538 -1468961 -1453720 -1441367 -1436004 -1439140 -1448390
38619 -1448390 -1457483 -1458372 -1444802 -1415617 -1376031 -1335702 -1303892 -1284107 -1271716 -1256289 -1226663 -1174885
38607 -1174885 -1097119 -992776 -864120 -716720 -559374 -402316 -254074 -118698 5079 122369
38597 122369 239449 361302 489953 623554 756528 881137 989962 1077697 1141377 1179885
38587 1179885 1193894 1186244 1161854 1127001 1088418 1052203 1021896 996152 967891 926540 862744
38576 862744 772953 661393 538694 418187 311628 225874 161358 112559 70008 22843 -39092
38565 -39092 -124105 -238282 -385527 -567627 -783877 -1029736 -1295216 -1564921 -1821275 -2049540
38555b049540j91696j52461j13316p4479l6050L23L1467N3861O4798O3203N0012
38544b353878K8023J270k5876m9308o5268p0277o1681l8981n086L3874P0507R8827
38532b437854J15979J21986J18047J04811Q1995M9461Q647l6914q2254j22075
38522b078171j51592j67136j66909j51949j26830r9159p7279o6774o7688p4472
38512c227959p8997p4680n9162l4159l338K9755O2232R0947J11592J19456J11836
38501b952477R0458O1773L4574J6504J1718K0717M1413O9860J00484J26688J42389
38490b235899J43755J30064J03736P0246L7941J6800J5298L6513P5771J21804
38480a483971J61128J83359J84759J68781J44154J21634J10295J14315J31694
$$ plain form
38555 -2049540 -2241236 -2393697 -2507013 -2581492 -2617542 -2617219 -2585752 -2531891 -2467093 -2403890 -2353878
38544 -2353878 -2325855 -2324585 -2350461 -2399769 -2465037 -2535314 -2596995 -2635976 -2641062 -2607188 -2536681 -2437854
38532 -2437854 -2321875 -2199889 -2081842 -1977031 -1895036 -1845575 -1836928 -1873842 -1956096 -2078171
38522 -2078171 -2229763 -2396899 -2563808 -2715757 -2842587 -2941746 -3019025 -3085799 -3153487 -3227959
38512 -3227959 -3306956 -3381636 -3440798 -3474957 -3478295 -3448540 -3386308 -3295361 -3183769 -3064313 -2952477
38501 -2952477 -2862019 -2800246 -2765672 -2749168 -2737450 -2716733 -2675320 -2605460 -2504976 -2378288 -2235899
38490 -2235899 -2092144 -1962080 -1858344 -1788098 -1750157 -1733357 -1718059 -1681546 -1605775 -1483971
38480 -1483971 -1322843 -1139484 -954725 -785944 -641790 -520156 -409861 -295546 -163852
38471a63852J55829J79001J95244K00949J93941J73055J39065R5891N0354R940
38461A229417k0207l9222n0314n8975p0782q9740j17317j52208j90929k29059
38451B10664k62482k88011l03245l06157k94981k68817k28801j78785j24668p2427
38441b117710k6353J1276L9251N6456O1722N4527L6165J0853j4170l0299l0699
38430a948981j3045J9790O1336J03937J40882J67971J84550J93433J98832K03194
38420f88101K04881J98426J77066J35824P3740n250r2784j77811k49145k98044
38410g21198l20169l16401k92007k54236k09455j61659j12842o4268j7280K6690
38400b442825O6453J01470J32136J59405J83497K02517K12140K06750J81442J34176
$$ plain form
38471 -163852 -8023 170978 366222 567171 761112 934167 1073232 1169123 1219477 1229417
38461 1229417 1209210 1169988 1119674 1060699 989917 900177 782860 630652 439723 210664
38451 210664 -51818 -339829 -643074 -949231 -1244212 -1513029 -1741830 -1920615 -2045283 -2117710
38441 -2117710 -2144063 -2132787 -2093536 -2037080 -1975358 -1920831 -1884666 -1873813 -1887983 -1918282 -1948981
38430 -1948981 -1962026 -1942236 -1880900 -1776963 -1636081 -1468110 -1283560 -1090127 -891295 -688101
38420 -688101 -483220 -284794 -107728 28096 101836 96586 3802 -174009 -423154 -721198
38410 -721198 -1041367 -1357768 -1649775 -1904011 -2113466 -2275125 -2387967 -2452235 -2469515 -2442825
38400 -2442825 -2376372 -2274902 -2142766 -1983361 -1799864 -1597347 -1385207 -1178457 -997015 -862839
38390h62839O7420j1594r2612j65391k22247k59020k74774k71075k51146k18825
38380b562103j77722j30974q1240l0505K0165P0198J18325J61622J95881K17355
38370b198998K24749K20170K08411J94916J83473J74595J65436J51385J28727
38361e47136R7034N9988K4171l493j8416k0009j1521J937J6257L0140M4684O1170
38349b65194P9050R5635J07405J11662J07289R4460P3835M6118J2444k4735o1085
38338C76884r0935j08858j11479r8669p3481m0902n947K7774N8178Q3624J01875
38327A18064J10166J06244Q9494O1431K5574j3081m8993p7362r5312j02661j02063
38316G1501r8475r7590j03441j16316j32233j44546j46591j34086j06501o7320
$$ plain form
38390 -862839 -795419 -807013 -899625 -1065016 -1287263 -1546283 -1821057 -2092132 -2343278 -2562103
38380 -2562103 -2739825 -2870799 -2952039 -2982544 -2962379 -2892181 -2773856 -2612234 -2416353 -2198998
38370 -2198998 -1974249 -1754079 -1545668 -1350752 -1167279 -992684 -827248 -675863 -547136
38361 -547136 -450102 -390114 -365943 -369436 -387852 -407861 -419382 -417445 -401188 -371048 -326364 -265194
38349 -265194 -186144 -90509 16896 128558 235847 330307 404142 450260 462704 437969 376884
38338 376884 285949 177091 65612 -33057 -106538 -147440 -153387 -125613 -67435 16189 118064
38327 118064 228230 334474 423968 485399 510973 497892 448899 371537 276225 173564 71501
38316 71501 -26974 -124564 -228005 -344321 -476554 -621100 -767691 -901777 -1008278 -1075598
38306a075598k3165J8368N1746P5918R4572J13806J38528J69600K03044K31476
38296a705K47311K46433K30443K05820J80265J58588J40591J21833R6347N9916
38286A685842J2397m2065r7117j46938j87741k17473k35125k40752k35856k23118
38276G2054k05376j84869j63412j43077j26238j14693j08723j07164j08630j12461
38266a302589j18371j25201j30319j30491j23445j08868q8228o3932l8378j3254
38256b243076J0975L5487O3081R6883J37854J82704K24313K54750K68423K63011
38246g05595K38436J95953J38540P1599K484o1399j14634j54657j81197j95031
38236g65501j97117j88545j70972j46958j19907r3525p0850n3082l8919k4992
$$ plain form
38306 -1075598 -1098763 -1080395 -1028649 -952731 -858159 -744353 -605825 -436225 -233181 -1705
38296 -1705 245606 492039 722482 928302 1108567 1267155 1407746 1529579 1625926 1685842
38286 1685842 1698239 1656174 1559057 1412119 1224378 1006905 771780 531028 295172 72054
38276 72054 -133322 -318191 -481603 -624680 -750918 -865611 -974334 -1081498 -1190128 -1302589
38266 -1302589 -1420960 -1546161 -1676480 -1806971 -1930416 -2039284 -2127512 -2191444 -2229822 -2243076
38256 -2243076 -2232101 -2196614 -2133533 -2036650 -1898796 -1716092 -1491779 -1237029 -968606 -705595
38246 -705595 -467159 -271206 -132666 -61067 -58583 -119982 -234616 -389273 -570470 -765501
38236 -765501 -962618 -1151163 -1322135 -1469093 -1589000 -1682525 -1753375 -1806457 -1845376 -1870368
38226a870368p203J7657N0566Q9498J29680J65065J90536K03524K04264J94839
38216f31942J77845J55422J29025R9909O9726M0673J5108m898j7892k3649k3960
38205a4633k2779k4984l4472n3023q0320j14364j51386j85823k11215k22127k15986
38194a331112j93718j58939j16394p0645k5592J5401M9552P5577R4955J12384
38184a548531J34389J66549K10639K63150L15583L56370L73667L58467L07254
38175I37537K23582J17746M455j00681j84308k37124k54595k37525j92566j31401
38165e4880o7541j1598L2220O6111R5232J23284J49869J70869J80691J74634J50336
38154A009227J08471N3008r314p0583j23980j65479j94205k11666k20689k24569
$$ plain form
38226 -1870368 -1877571 -1859914 -1809348 -1719850 -1590170 -1425105 -1234569 -1031045 -826781 -631942
38216 -631942 -454097 -298675 -169650 -69741 -15 40658 55766 50868 32976 9327 -14633
38205 -14633 -37412 -62396 -96868 -149891 -230211 -344575 -495961 -681784 -892999 -1115126 -1331112
38194 -1331112 -1524830 -1683769 -1800163 -1870808 -1896400 -1880999 -1831447 -1755870 -1660915 -1548531
38184 -1548531 -1414142 -1247593 -1036954 -773804 -458221 -101851 271816 630283 937537
38175 937537 1161119 1278865 1283320 1182639 998331 761207 506612 269087 76521 -54880
38165 -54880 -122421 -134019 -101799 -35688 59544 182828 332697 503566 684257 858891 1009227
38154 1009227 1117698 1170706 1161392 1090809 966829 801350 607145 395479 174790 -49779
38144d9779k26327k27761k28413k25088k12736j86731j45500r1822l1796K7778
38134a598175Q1946J28509J67171J97945K20019K31785K31785K19954J98294J70609
38124B49842J41278J13917R0705P2657O0082N2524M8297M4601L8581K8517J4044
38113I55045m461k6243m9572p0936q5292q7870p6761n4748k9054q621j74n351
38101D55962k0703m0320n8986p3908q4328q9788q8456p7066n3018j7294K4474
38090a23431O4125R4829J13789J22319J24074J22855J20784J17310J09688R4923
38080I61265P1980M2803J1535j7413m1523o1556q1246j05187j36048j72816k10907
38069B60887k43680k64372k67764k51100k14138j58656q8223q430P3023J47200
$$ plain form
38144 -49779 -276106 -503867 -732280 -957368 -1170104 -1356835 -1502335 -1594157 -1625953 -1598175
38134 -1598175 -1516229 -1387720 -1220549 -1022604 -802585 -570800 -339015 -119061 79233 249842
38124 249842 391120 505037 595742 668399 728481 781005 829302 873903 912484 941001 955045
38113 955045 950584 924341 874769 803833 718541 630671 553910 499162 470108 461487 461313 455962
38101 455962 435259 394939 335953 262045 177717 87929 -527 -77593 -130611 -147905 -123431
38090 -123431 -59306 35523 149312 271631 395705 518560 639344 756654 866342 961265
38080 961265 1033245 1076048 1087583 1070170 1028647 967091 885845 780658 644610 471794 260887
38069 260887 17207 -247165 -514929 -766029 -980167 -1138823 -1227046 -1235476 -1162453 -1015253
38059a015253K05751K42931K57015K50789K31023K06885J87430J78804J82204
38050I27579J93740K06499K13804K11799K00049J80234J54229J22832Q5592M1598
38040B537955r210o4818j20776j71079k09972k33643k41042k33879k16196j93647
38030H43693j72150j55902j45784j39412j33076j24405j13701j02948r3171q2187
38020d19043o4718l5104R028O4447J22682J72813K05430K16055K06476J83308
38010F61374J54595J26483J01619P9440N7553L3413N773k4584n5225q3143j05664
37999I51634j20578j25982j20307j02660p3354l4639Q696M9768Q1717J00472J05977
37988G20744J01055Q9268P3743N7142M1664K8505J7701Q954K791O68L807J1721
$$ plain form
38059 -1015253 -809502 -566571 -309556 -58767 172256 379141 566571 745375 927579
38050 927579 1121319 1327818 1541622 1753421 1953470 2133704 2287933 2410765 2496357 2537955
38040 2537955 2528745 2463927 2343151 2172072 1962100 1728457 1487415 1253536 1037340 843693
38030 843693 671543 515641 369857 230445 97369 -27036 -140737 -243685 -336856 -419043
38020 -419043 -483761 -518865 -509837 -445390 -322708 -149895 55535 271590 478066 661374
38010 661374 815969 942452 1044071 1123511 1181064 1214477 1220250 1195666 1140441 1057298 951634
37999 951634 831056 705074 584767 482107 408753 374114 382810 432578 514295 614767 720744
37988 720744 821799 911067 984810 1041952 1083616 1112121 1129822 1138776 1141567 1142235 1146042 1157763
37976A157763K1509K8385K7139J3738j3715n4893j07402j66550k25150k74460
37966D06364l06495l16584l04699k75026k34380j90101j48027j11074p8907m8780
37956a607709j7133J8798N9889J04706J49708J89859K19743K35130K34473K19505
37946a93031J94497J64507J33565J03419P3236M0465K682m0322q5380j26524j56973
37935A10141j71553j68403j49310j18848q2835m6906j5380R367K7069L8939M6450
37924e21269N0069M8844M1258K6713O352j7689m3913p2258j02938j34273j61655
37913h80759j78799j80475j65110j35979j00516o7720m4464l2466k7792k3189
37903a837269j1844R479L9025P0615R5860J07376J01713Q0653N0190J8006r124
$$ plain form
37976 1157763 1179272 1207657 1234796 1248534 1234819 1179926 1072524 905974 680824 406364
37966 406364 99869 -216715 -521414 -796440 -1030820 -1220921 -1368948 -1480022 -1558929 -1607709
37956 -1607709 -1624842 -1606044 -1546155 -1441449 -1291741 -1101882 -882139 -647009 -412536 -193031
37946 -193031 1466 165973 299538 402957 476193 516658 519340 479018 393638 267114 110141
37935 110141 -61412 -229815 -379125 -497973 -580808 -627714 -643094 -633727 -606658 -567719 -521269
37924 -521269 -471200 -422356 -381098 -354385 -348033 -365722 -409635 -481893 -584831 -719104 -880759
37913 -880759 -1059558 -1240033 -1405143 -1541122 -1641638 -1709358 -1753822 -1786288 -1814080 -1837269
37903 -1837269 -1849113 -1839634 -1800609 -1729994 -1634134 -1526758 -1425045 -1344392 -1294202 -1276196 -1285320
37892a285320k6598l1886k3922k983K8941O7972J08944J46458J75849J93898J99508
37881d49139J94103J81318J65632J50581J37373J24583J09094Q7695N8572K2002
37871G81814j9663o2259j00331j28354j42399j41235j26095r9885o6818l2219
37861a37444j483K1693L6145M2079L9317K7252O985j6602l5428m1817l2895j2615
37849a04813J0102K6047L0222K3641J1922K177Q9Q313K6209N0387P5548R5557
37837B55401J04901J00178Q0939M9428R631l3623p5371j10973j36147j46684j38831
37826d1151j11230o7380j6094L1286O5233Q1078P9543O5349M4865K3481L718j4740
37814A43958l3184n1565o7162p4804o8740m5777q120L6493P8043J08591J24609
$$ plain form
37892 -1285320 -1311918 -1343804 -1367726 -1370709 -1341768 -1273796 -1164852 -1018394 -842545 -648647 -449139
37881 -449139 -255036 -73718 91914 242495 379868 504451 613545 701240 759812 781814
37871 781814 762151 699892 599561 471207 328808 187573 61478 -38407 -105225 -137444
37861 -137444 -138927 -117234 -81089 -39010 307 27559 34544 17942 -17486 -59303 -92198 -104813
37849 -104813 -94711 -68664 -38442 -14801 -2879 -702 -613 7700 33909 84296 159844 255401
37837 255401 360302 460480 541419 590847 600478 566855 491484 380511 244364 97680 -41151
37826 -41151 -152381 -219761 -235855 -204569 -139336 -58258 21285 86634 131499 154980 158698 143958
37814 143958 110774 59209 -7953 -82757 -151497 -197274 -205394 -168901 -90858 17733 142342
37803A42342J26323J16201R8397P9181O6763O9581R3302J37733J95321K52609
37793A377753K94625L10339K96497K58001K04986J48317R5911N1550J6239r551
37783C044667k4771k8625k2482j1037j459p08j2561l6280o7760j02200j36373
37772B600411j69148k00308k28950k52725k68303k72619k63898k42157k09187
37763D93116j68361j24128q1165m3345j3034Q877K2351K7301K3092Q885j5268
37752A38321m7385q3370j17952j46281j65486j75633j79577j81555j85020j90802
37742a334740j96532j97514j88575j66308j30785q5909l8052O192M1814O6014
37732b224395P8285Q0851P9126Q0724R2307J15886J47450J79228K03937K17866
$$ plain form
37803 142342 268665 384866 483263 562444 629207 698788 792090 929823 1125144 1377753
37793 1377753 1672378 1982717 2279214 2537215 2742201 2890518 2986429 3037979 3054218 3044667
37783 3044667 3019896 2991271 2968789 2957752 2956293 2955585 2943024 2906744 2838984 2736784 2600411
37772 2600411 2431263 2230955 2002005 1749280 1480977 1208358 944460 702303 493116
37763 493116 324755 200627 119462 76117 63083 71960 94311 121612 144704 153589 138321
37752 138321 90936 7566 -110386 -256667 -422153 -597786 -777363 -958918 -1143938 -1334740
37742 -1334740 -1531272 -1728786 -1917361 -2083669 -2214454 -2300363 -2338415 -2332223 -2290409 -2224395
37732 -2224395 -2146110 -2065259 -1986133 -1905409 -1813102 -1697216 -1549766 -1370538 -1166601 -948735
37722i48735K21120K15673K03129J83770J57302J24536Q8488N3697K4048Q76j7214
37711C06690l2922m8580o5229q2524r9086j13062j22539j25774j21315j08532
37701f12873q8408o3717l7967j3692Q586L0039N2227P5769R9265J18920J29240
37690c02611J25007J03567O5956J6483l8386r0848j32632j56716j59482j41857
37680g11519j08561o6088k0898K1517N6817Q1893R5074R6515Q8285P3708N5858
37669c37399L6176J4221j1268m0958p4050j08274j40475j67632j87965k01305
37659a218929k08269k08938k02428j87970j66143j38665j06641o9245k4420K8872
37649b502776Q8969J51923K13500K70932L23038L68825M05864M29908M36279M22111
$$ plain form
37722 -948735 -727615 -511942 -308813 -125043 32259 156795 245283 298980 323028 323904 306690
37711 306690 273768 225188 159959 77435 -21651 -134713 -257252 -383026 -504341 -612873
37701 -612873 -701281 -764998 -802965 -816657 -808071 -778032 -725805 -650036 -550771 -431851 -302611
37690 -302611 -177604 -74037 -8081 8402 -29984 -120832 -253464 -410180 -569662 -711519
37680 -711519 -820080 -886168 -907066 -885549 -828732 -746839 -651765 -555250 -466965 -393257 -337399
37669 -337399 -301223 -287002 -298270 -339228 -413278 -521552 -662027 -829659 -1017624 -1218929
37659 -1218929 -1427198 -1636136 -1838564 -2026534 -2192677 -2331342 -2437983 -2507228 -2531648 -2502776
37649 -2502776 -2413807 -2261884 -2048384 -1777452 -1454414 -1085589 -679725 -249817 186462 608573
37639F08573L87990L37934K77788K13050J47313Q1956J7100m6790j07462j60315
37629A757137j99136k17968k13466j86634j43067r1651m2246l012K1915L3344
37619G15216L5737L4095L1127K6565J8636N899j2046l5044o3109r6591j35346
37608E25139j76886k14620k38123k36625k04145j43041o3454K0557R5592J51827
37598d83779J83977J91032J75846J44852J07401P3979N3159M8607N8110P5200
37588F28384R2254J03231J05109R8349Q6563P5240O9512P1890Q1280R3826J04932
37577A610570J11161J11117J05192R4744Q1267O5755M8370K8401M610k4191n8360
37566B178636r6491j34561j65991j83445j82119j62657j31364r6950o5513l7307
$$ plain form
37639 608573 996563 1334497 1612285 1825335 1972648 2054604 2071704 2024914 1917452 1757137
37629 1757137 1558001 1340033 1126567 939933 796866 705215 662969 659957 681872 715216
37619 715216 750953 785048 816175 842740 861376 867275 855229 820185 757076 660485 525139
37608 525139 348253 133633 -104490 -341115 -545260 -688301 -751755 -731198 -635606 -483779
37598 -483779 -299802 -108770 67076 211928 319329 393308 446467 495074 553184 628384
37588 628384 720638 823869 928978 1027327 1113890 1189130 1258642 1330532 1411812 1505638 1610570
37577 1610570 1721731 1832848 1938040 2032784 2114051 2179806 2228176 2256577 2261187 2236996 2178636
37566 2178636 2082145 1947584 1781593 1598148 1416029 1253372 1122008 1025058 959545 922238
37556I22238p672K8524P2292J19063J60991J90809K04861K03963J92364J75464
37546B262897J57332J39121J19031R3756O0475J8752k8350p4362j10948j30572
37536B507132j29420j09242p7166m3265j6904l818n298j9444m3067p2912j05742
37525A880854j37785j64420j80748j83123j70994j47779j19861r3915p4189o1389
37515E46651n3624m8234m2938l5926k5559j0309J0767L7070O5365Q9544J02380
37504F35187R8836P8728M6847J0793k1697m4742n5495n4604m5614l3540k3447
37493E91252j9341k2962l2409m1952m4145l3625j0226K0480M9400O7629O9968
37482E94069N6618L2233L064k5625n0349o8852p9769q3052q0157p3159o3536n2019
$$ plain form
37556 922238 914566 943090 1015382 1134445 1295436 1486245 1691106 1895069 2087433 2262897
37546 2262897 2420229 2559350 2678381 2772137 2832612 2851364 2823014 2748652 2637704 2507132
37536 2507132 2377712 2268470 2191304 2148039 2131135 2127317 2122019 2102575 2059508 1986596 1880854
37525 1880854 1743069 1578649 1397901 1214778 1043784 896005 776144 682229 608040 546651
37515 546651 493027 444793 401855 365929 340370 330061 340828 377898 443263 532807 635187
37504 635187 734023 812751 859598 870391 848694 803952 748457 693853 648239 614699 591252
37493 591252 571911 548949 516540 474588 430443 396818 386592 407072 456472 524101 594069
37482 594069 650687 682920 685984 660359 610010 541158 461389 378337 298180 225021 161485 109466
37470A09466l9466k7313j6967q986l305k53j172q092k2918m6546p7963j13690
37458b57205j48302j76193j93453j98431j90784j70190j36128q9046l1947K9369
37448a562310Q8083J39242J81420K15822K43655K64137K74670K72642K57213K29711
37438F04285J92550J47669R5862L7891k3256q0923j26059j50873j52490j34178
37428D10478j03663p0038m0881k0511r891q139j4548k9340n2297q0693j08764
37417a28287j29436j37124j29916j10389q5079o2507n0228n2024o6533q7832j07574
37406a146929j17814j13485r3472n9870j6224L3734Q6061J36016J78167K07611
37396i06205K21296K18420J99749J66749J21228O5536K887o2315j24607j78295
$$ plain form
37470 109466 70000 42687 25720 16734 13429 13176 12004 3912 -19006 -65552 -143515 -257205
37458 -257205 -405507 -581700 -775153 -973584 -1164368 -1334558 -1470686 -1559732 -1591679 -1562310
37448 -1562310 -1474227 -1334985 -1153565 -937743 -694088 -429951 -155281 117361 374574 604285
37438 604285 796835 944504 1040366 1078257 1055001 974078 848019 697146 544656 410478
37428 410478 306815 236777 195896 175385 165494 157355 142807 113467 61170 -19523 -128287
37417 -128287 -257723 -394847 -524763 -635152 -720231 -782738 -832966 -884990 -951523 -1039355 -1146929
37406 -1146929 -1264743 -1378228 -1471700 -1531570 -1547794 -1514060 -1427999 -1291983 -1113816 -906205
37396 -906205 -684909 -466489 -266740 -99991 21237 86773 89660 27345 -97262 -275557
37386b75557k18880k44183k54264k50633k35760k13218j87390j62066j38620j15404
37376b295975q9082n6965j8730K3653O7370J10235J50659J86318K13065K25840
37366a483612K21397K00916J70461J38514J12060R3536Q0682O9085N5329L8572
37356c03060K0022J683j4537k7264l6095m1763m5505m7725m7158m1646l0367j5846
37344f29261l999j796j3907m0515p7454j18106j55360j82728j95014j89269j65767
37333a773176j28026q1425l1450J7048N9436R0809J06529J03664Q2404M6407J710
37322a506070m5276q9369j26785j54189j67938j64625j42517j02549m8369J4179
37312b533508P7863J35426J81586K14546K35732K47852K53131K53180K50112K47082
$$ plain form
37386 -275557 -494437 -738620 -992884 -1243517 -1479277 -1692495 -1879885 -2041951 -2180571 -2295975
37376 -2295975 -2385057 -2442022 -2460752 -2437099 -2369729 -2259494 -2108835 -1922517 -1709452 -1483612
37366 -1483612 -1262215 -1061299 -890838 -752324 -640264 -546728 -466046 -396961 -341632 -303060
37356 -303060 -283038 -281355 -295892 -323156 -359251 -401014 -446519 -494244 -541402 -583048 -613415 -629261
37344 -629261 -633260 -635056 -648963 -689478 -766932 -885038 -1040398 -1223126 -1418140 -1607409 -1773176
37333 -1773176 -1901202 -1982627 -2014077 -1997029 -1937593 -1846784 -1740255 -1636591 -1554187 -1507780 -1506070
37322 -1506070 -1551346 -1640715 -1767500 -1921689 -2089627 -2254252 -2396769 -2499318 -2547687 -2533508
37312 -2533508 -2455645 -2320219 -2138633 -1924087 -1688355 -1440503 -1187372 -934192 -684080 -436998
37302d36998K47342K52621K62183K73009K80745K80864K69793K45671K08456J59678
37292B043364J02168L9849k2839q1654j32945j73587k01127k14444k14357k03466
37282I40962j85403j64030j42723j23595j06925r1340p4929n6345l5145j0987
37272e0460J7538N3514J00787J61597K33924L10318L79256M28600M49663M39962
37262B524699M03350L47670K81455K11695J43493Q0750K6618j6840m9171p1795
37252C881924q7833j01503j17024j37155j62149j89945k17661k43123k65165k82653
37242B077713k93558k95408k86793k68439k42816k12748j80211j45752j08468
37233D3520o6648j9458L0956P8834J17067J41065J51296J52580J51212J52113
$$ plain form
37302 -436998 -189656 62965 325148 598157 878902 1159766 1429559 1675230 1883686 2043364
37292 2043364 2145532 2185381 2162542 2080888 1947943 1774356 1573229 1358785 1144428 940962
37282 940962 755559 591529 448806 325211 218286 126946 52017 -4328 -39473 -50460
37272 -50460 -32922 20592 121379 282976 516900 827218 1206474 1635074 2084737 2524699
37262 2524699 2928049 3275719 3557174 3768869 3912362 3993112 4019730 4002890 3953719 3881924
37252 3881924 3794091 3692588 3575564 3438409 3276260 3086315 2868654 2625531 2360366 2077713
37242 2077713 1784155 1488747 1201954 933515 690699 477951 297740 151988 43520
37233 43520 -23128 -42586 -11630 67204 184271 325336 476632 629212 780424 932537
37223I32537J57058J63999J67555J61302J41181J07846O6090K1729k1699o4262
37213A833336j08461j56561k08137k59064l02397l30548l37853l22725k88560
37204d80970k42847j94484j50473j13653q2762n4705k7387j035K2839M3514O2055
37193a219908Q0401R9788J19874J38784J53470J60260J56079J40111J14951Q6407
37183C0217O1951M8372M9441O4734R0523J22358J57328J94116K31002K64116K87964
37172A602122K97943K92424K72500K39998J96148J42278Q1438J8839l9811r0784
37162C013095j33638j70146k01622k26614k41109k41252k26716k02104j75415
37153A194479j54655j44592j45535j54822j69869j90252k16977k49627k84100
$$ plain form
37223 932537 1089595 1253594 1421149 1582451 1723632 1831478 1897568 1919297 1897598 1833336
37213 1833336 1724875 1568314 1360177 1101113 798716 468168 130315 -192410 -480970
37204 -480970 -723817 -918301 -1068774 -1182427 -1265189 -1319894 -1347281 -1348316 -1325477 -1281963 -1219908
37193 -1219908 -1139507 -1039719 -919845 -781061 -627591 -467331 -311252 -171141 -56190 30217
37183 30217 92168 140540 189981 254715 345238 467596 624924 819040 1050042 1314158 1602122
37172 1602122 1900065 2192489 2464989 2704987 2901135 3043413 3124851 3143690 3103879 3013095
37162 3013095 2879457 2709311 2507689 2281075 2039966 1798714 1571998 1369894 1194479
37153 1194479 1039824 895232 749697 594875 425006 234754 17777 -231850 -515950
37144e15950l12844l27303l20891k91144k40388j74580j01062k6550M3317J03382
37134b164013J48907J76859J87556J85029J75672J66030J60847J61742J66857
37125f34514J71996J73238J69506J62964J56876J52840J49836J45453J37846J26923
37115I12964J14407J03165R6126R5146J00266J09511J19322J25737J26373J22266
37105B025283J18076J19823J31425J52400J78183K02540K20132K27771K24350
37096C599983K10354J87562J58666J26449R2931N9225K6008o063l6387o4532r0163
37085D264033j12975j32631j48498j59401j64048j62141j54994j44759j33132
37076B951454j21020j09216r8828r0867q5765q3608q4509q8302r3807r8779j00765
$$ plain form
37144 -515950 -828794 -1156097 -1476988 -1768132 -2008520 -2183100 -2284162 -2310712 -2267395 -2164013
37134 -2164013 -2015106 -1838247 -1650691 -1465662 -1289990 -1123960 -963113 -801371 -634514
37125 -634514 -462518 -289280 -119774 43190 200066 352906 502742 648195 786041 912964
37115 912964 1027371 1130536 1226662 1321808 1422074 1531585 1650907 1776644 1903017 2025283
37105 2025283 2143359 2263182 2394607 2547007 2725190 2927730 3147862 3375633 3599983
37096 3599983 3810337 3997899 4156565 4283014 4375945 4435170 4461178 4455115 4418728 4354196 4264033
37085 4264033 4151058 4018427 3869929 3710528 3546480 3384339 3229345 3084586 2951454
37076 2951454 2830434 2721218 2622390 2531523 2445758 2362150 2277641 2189339 2095532 1996753 1895988
37065A895988r8165r0520p8147o1653m1771j9621L082K4487M3905O3066Q5747
37054A726398J15401J52487J93876K34737K71052L00640L22475L35592L38669
37045C991327L30295L09491K76144K31252J76877J15884N1620j2404p2821j26487
37035E271178j70133k00117k12987k06927j83035j45247r8962m9431q03M4232
37025D047768Q4683J21315J56050J90588K24961K56945K82700K98334L01755K93862
37015F258961K78221K59198K39753K20735K01992J83907J67628J53856J41557
37006H105808J27959J10235Q7812O3584M2795L0260K8263L6720N4767Q1462J14809
36995H884474J50482J82298K04634K15285K16900K16027K20309K35357K62850
$$ plain form
37065 1895988 1797823 1707303 1629156 1567503 1525732 1506111 1509193 1533680 1577585 1640651 1726398
37054 1726398 1841799 1994286 2188162 2422899 2693951 2994591 3317066 3652658 3991327
37045 3991327 4321622 4631113 4907257 5138509 5315386 5431270 5482890 5470486 5397665 5271178
37035 5271178 5101045 4900928 4687941 4481014 4297979 4152732 4053770 4004339 4003536 4047768
37025 4047768 4132451 4253766 4409816 4600404 4825365 5082310 5365010 5663344 5965099 6258961
37015 6258961 6537182 6796380 7036133 7256868 7458860 7642767 7810395 7964251 8105808
37006 8105808 8233767 8344002 8431814 8495398 8538193 8568453 8596716 8633436 8688203 8769665 8884474
36995 8884474 9034956 9217254 9421888 9637173 9854073 10070100 10290409 10525766 10788616
36986A0788616L00459L43180L85026M20452M45341M57840M58958M52382M43114
36977A4495368M35551M32193M33460M38107M43656M46982M45264M37123M23714
36968A8431418M09568M02361M10536M39233M87143N46622O06860O58144O95497
36959B3087382P20821P42545P72438Q21001Q93800R90073J103651J225710J348197
36950C1705618J466036J577069J680932J779055J875804J979241K100466K252121
36942D6416342K446245K691542K991060L342130L738623M174046M644248N149461
36934G5593697N694989O289998O945102P670479Q474827R364440J0342768J1411291
36926A41787591J2570737J3821087J5160824J6586665J8091936J9660266K1254672
$$ plain form
36986 10788616 11089075 11432255 11817281 12237733 12683074 13140914 13599872 14052254 14495368
36977 14495368 14930919 15363112 15796572 16234679 16678335 17125317 17570581 18007704 18431418
36968 18431418 18840986 19243347 19653883 20093116 20580259 21126881 21733741 22391885 23087382
36959 23087382 23808203 24550748 25323186 26144187 27037987 28028060 29131711 30357421 31705618
36950 31705618 33171654 34748723 36429655 38208710 40084514 42063755 44164221 46416342
36942 46416342 48862587 51554129 54545189 57887319 61625942 65799988 70444236 75593697
36934 75593697 81288686 87578684 94523786 102194265 110669092 120033532 130376300 141787591
36926 141787591 154358328 168179415 183340239 199926904 218018840 237679106 258933778
36919B58933778K2805267K4196928K5256414K5742161K5344881K3710220K0499645
36912D26489294J5505215Q802993Q69096p448161j5141799k1355429k5619706
36905C82101503k7902405k8492269k7824097k6338552k4406355k2302883k0211407
36898B04623535j8238677j6432695j4799808j3322539j1976940j0743933r612029
36891A09496914q575039p629612o773724o005379n321837m719794m195388l743317
36883F2532824l355813l022773k733114k476970k248172k045652j872257j731290
36875D3046783j623030j543223j483893j435733j391015j345289j296826j244901
36867C1682873j189017j129472j067468j003915r38261q68941p94845p16417o35439
$$ plain form
36919 258933778 281739045 305935973 331192387 356934548 382279429 405989649 426489294
36912 426489294 441994509 450797502 451666598 444218437 429076638 407721209 382101503
36905 382101503 354199098 325706829 297882732 271544180 247137825 224834942 204623535
36898 204623535 186384858 169952163 155152355 141829816 129852876 119108943 109496914
36891 109496914 100921875 93292263 86518539 80513160 75191323 70471529 66276141 62532824
36883 62532824 59177011 56154238 53421124 50944154 48695982 46650330 44778073 43046783
36875 43046783 41423753 39880530 38396637 36960904 35569889 34224600 32927774 31682873
36867 31682873 30493856 29364384 28296916 27293001 26354740 25485799 24690954 23974537 23339098
36858B3339098n54077m73934l95929l20980k50557j86080j27689p3907k2751K6951
36848B0960145P5319J22192J68293K16346K71648L41371M32324N48102O86990
36839B3822730Q41720J001453J155457J296677J423160J536597J639196J730570
36831C4447560J806031J856862J872445J843029J761530J623903J428832J177314
36823D7817506Q72296N18943J26229k90894p11163j110044j464874j759278j985036
36814D2013685k141401k232826k266455k250450k193490k104669j992996j866631
36806B4964767j732248j594744j457238j321669j189992j065067r50243q47901
36798A4805665p58255o79411o08480n43014m81947m25648l74936l29789k88725
$$ plain form
36858 23339098 22785021 22311087 21915158 21594178 21343621 21157541 21029852 20955945 20933194 20960145
36848 20960145 21035464 21157656 21325949 21542295 21813943 22155314 22587638 23135740 23822730
36839 23822730 24664450 25665903 26821360 28118037 29541197 31077794 32716990 34447560
36831 34447560 36253591 38110453 39982898 41825927 43587457 45211360 46640192 47817506
36823 47817506 48689802 49208745 49334974 49044080 48332917 47222873 45757999 43998721 42013685
36814 42013685 39872284 37639458 35373003 33122553 30929063 28824394 26831398 24964767
36806 24964767 23232519 21637775 20180537 18858868 17668876 16603809 15653566 14805665
36798 14805665 14047410 13367999 12759519 12216505 11734558 11308910 10933974 10604185 10315460
36789A0315460k49504k10645j72498j36806j04925p6164m7762j6592J8862N7906
36779I377332R8823J40594J83559K28262K73599L16113L51202L74892L84091L74920
36769A2103387L41068K74303J68008K2367j51538l31817m91239o05815o61962
36760A0666762o58911o06419n20064m16026l06764j98801r3463J0367J13560K15594
36750H205835L14548M07443M90668N60753O15199O52547O71391O69121O41515
36741A3229020N83294M89367L56675J87123r293k13903m03388n57001o62671p19010
36731A2280213p33909p21671o99351o81808o76763o82699o91214o92233o78825
36722F021740o49098o04986n49280m82914m04273l10896k02641q4442L3048J35558
$$ plain form
36789 10315460 10065956 9855311 9682813 9546007 9441082 9364918 9317156 9300564 9319426 9377332
36779 9377332 9476155 9616749 9800308 10028570 10302169 10618282 10969484 11344376 11728467 12103387
36769 12103387 12444455 12718758 12886766 12909133 12757595 12425778 11934539 11328724 10666762
36760 10666762 10007851 9401432 8881368 8465342 8158578 7959777 7866314 7876681 7990241 8205835
36750 8205835 8520383 8927826 9418494 9979247 10594446 11246993 11918384 12587505 13229020
36741 13229020 13812314 14301681 14658356 14845479 14836186 14622283 14218895 13661894 12999223 12280213
36731 12280213 11546304 10824633 10125282 9443474 8766711 8084012 7392798 6700565 6021740
36722 6021740 5372642 4767656 4218376 3735462 3331189 3020293 2817652 2733210 2766258 2901816
36712B901816K09301K45190K41278K02514J38503O0522k1091r8720j68163k27886
36702C483264k76798l11527l25456l11182k65562j93884j09732l0126L1208O8568
36692A758773Q4665Q7107Q3593P8709P3740O8542O3273N8687N5346N3029N1037
36681B516501M8897M6292M1911L2453J3474j7759n9496j05228j46068j74000j83920
36670B013057j74231j46618j05641n7963j0977K9028N8380P6414Q4421Q4026P6218
36659A926114O1679M1814J9417j442j6118k0461j2229P523L4237O1693Q5199J03875
36647B291301J20178J37128J55431J72580J84001J84918J71511J41173R2607K6619
36637C677447n2653j37257k16650k80227l19675l30352l11927k68677k08945j43097
$$ plain form
36712 2901816 3111117 3356307 3597585 3800099 3938602 3999124 3978033 3879313 3711150 3483264
36702 3483264 3206466 2894939 2569483 2258301 1992739 1798855 1689123 1658997 1690205 1758773
36692 1758773 1843438 1930545 2014138 2092847 2166587 2235129 2298402 2357089 2412435 2465464 2516501
36681 2516501 2565398 2611690 2653601 2686054 2699528 2681769 2622273 2517045 2370977 2196977 2013057
36670 2013057 1838826 1692208 1586567 1528604 1517627 1546655 1605035 1681449 1765870 1849896 1926114
36659 1926114 1987793 2029607 2049024 2047582 2031464 2011003 1998774 2006297 2040534 2102227 2187426 2291301
36647 2291301 2411479 2548607 2704038 2876618 3060619 3245537 3417048 3558221 3650828 3677447
36637 3677447 3624794 3487537 3270887 2990660 2670985 2340633 2028706 1760029 1551084 1407987
36627A407987q0464k6866J5934M8843P3309R0052R9163J00913R5893Q4282O5247
36616A974293L7384j25m6622r9574j54354k04378k42248k61728k59462k35603
36606E07583j93709j40366q4317l4558K240K3690L1943L2141K9951K9515L2774
36595B36887M0239N2270O9973R5342J30790J77993K36233L01133L65198M20443
36585B126501M61593M87707N01508N07488N10327N13949N20857N31434N43503
36576F704867N52503N52111N34979M93455M20581L11868J67965k807j83919l53671
36566I197932m91254n83081o26378o28508o02820n63156n19696m77828m39953
36557D265258m07992l84261l70140l64013l60460l51613l30011k91412k35861
$$ plain form
36627 1407987 1327523 1300657 1316591 1365434 1438743 1528795 1627958 1728871 1824764 1909046 1974293
36616 1974293 2011677 2011552 1964930 1865356 1711002 1506624 1264376 1002648 743186 507583
36606 507583 313874 173508 89191 54633 56873 80563 112506 144647 174598 204113 236887
36595 236887 277126 329396 399369 494711 625501 803494 1039727 1340860 1706058 2126501
36585 2126501 2588094 3075801 3577309 4084797 4595124 5109073 5629930 6161364 6704867
36576 6704867 7257370 7809481 8344460 8837915 9258496 9570364 9738329 9735522 9551603 9197932
36566 9197932 8706678 8123597 7497219 6868711 6265891 5702735 5183039 4705211 4265258
36557 4265258 3857266 3473005 3102865 2738852 2378392 2026779 1696768 1405356 1169495
36548A169495j66734q8886p625P1096J40501J94045K27442K40283K36097K20909
36538B236623K01156J81857J65689J53172J43692J36461J30456J23450J11580
36529C584136R0807N9956K3146j0325k8800k2272J4027P7783J60388K50335L37700
36518D536881M17258M88723N54506O16966O77063P35126P92646Q52813R18528
36509A0590510R89257J059778J122225J169450J196305J197784J166044J089760
36501A9581113R57418P63342N12940K23647p9415l70529o29243q42574j004182
36492A9112517j112691j170649j184068j161785j114185j051649r83181r15587
36484A0418722q52978p96363p43603o90468o33076n70613n06368m46086l94779
$$ plain form
36548 1169495 1002761 913875 906250 977346 1117847 1311892 1539334 1779617 2015714 2236623
36538 2236623 2437779 2619636 2785325 2938497 3082189 3218650 3349106 3472556 3584136
36529 3584136 3674943 3734899 3758045 3747720 3718920 3696648 3710675 3788458 3948846 4199181 4536881
36518 4536881 4954139 5442862 5997368 6614334 7291397 8026523 8819169 9671982 10590510
36509 10590510 11579767 12639545 13761770 14931220 16127525 17325309 18491353 19581113
36501 19581113 20538531 21301873 21814813 22038460 21959045 21588516 20959273 20116699 19112517
36492 19112517 17999826 16829177 15645109 14483324 13369139 12317490 11334309 10418722
36484 10418722 9565744 8769381 8025778 7335310 6702234 6131621 5625253 5179167 4784388
36475D784388l54159l22138k93886k63432k25361j76741j18846n7649k318L7753
36465C007611N6032N0780K5343j3049n5374r3126j20304j34663j37679j33066
36455B452505j24373j13353j00174q5043o9328n5082m3584l4556k6604j7920o477
36444A776011R945L2938O1958R3400J21214J38722J40770J25576R5723N7554J8853
36433B672664j3932l7088m9302n0956m4386l4650k9095l4875n5452q8233j25061
36422B109634j55464j71069j68808j51407j25170r6566o9506m4411j9112R288
36412A117409M2392P9163J15898J47694J70390J81564J80142J65737J38857J01724
36402B440970N8428J4122k6077n7916p8834q8764r0119q6517q1092p5609p0495
$$ plain form
36475 4784388 4430229 4108091 3814205 3550773 3325412 3148671 3029825 2972176 2969858 3007611
36465 3007611 3063643 3114423 3139766 3126717 3071343 2978217 2857913 2723250 2585571 2452505
36455 2452505 2328132 2214779 2114605 2029562 1960234 1905152 1861568 1827012 1800408 1782488 1776011
36444 1776011 1785956 1818894 1880852 1974252 2095466 2234188 2374958 2500534 2596257 2653811 2672664
36433 2672664 2658732 2621644 2572342 2521386 2477000 2442350 2413255 2378380 2322928 2234695 2109634
36422 2109634 1954170 1783101 1614293 1462886 1337716 1241150 1171644 1127233 1108121 1117409
36412 1117409 1159801 1238964 1354862 1502556 1672946 1854510 2034652 2200389 2339246 2440970
36402 2440970 2499398 2513520 2487443 2429527 2350693 2261929 2171810 2085293 2004201 1928592 1858097
36391A858097o5232n8706m9770l8202k5486j4604q556q273j1539j4099j2417n567
36379A545646N691K2061M8134R1625J59576K54096L70356M97987O24751P40363
36369D360286Q38640R17739R79079J025800J060891J084847J093026J074175J012635
36360A3447118Q95159P19488M98831K58415K5986j77558l42527m69352n64622
36351A4290938o36779o92669p35520p64908p78579p75092p55651p24021o84922
36342G742797o42553o00442n62212n31526n10661m98864m92372m86217m76102
36333B941848m58721m30761l88374l28620k52449j66921q4547j9519J7341K2376
36323H51653Pl9454q3819j23145j52323j71388j83646j92677k00038k05252k07796
$$ plain form
36391 1858097 1792865 1734159 1684389 1646187 1620701 1606097 1597541 1589268 1577729 1563630 1551213 1545646
36379 1545646 1551337 1573398 1621532 1713157 1872733 2126829 2497185 2995172 3619923 4360286
36369 4360286 5198926 6116665 7095744 8121544 9182435 10267282 11360308 12434483 13447118
36360 13447118 14342277 15061765 15560596 15819011 15844997 15667439 15324912 14855560 14290938
36351 14290938 13654159 12961490 12225970 11461062 10682483 9907391 9151740 8427719 7742797
36342 7742797 7100244 6499802 5937590 5406064 4895403 4396539 3904167 3417950 2941848
36333 2941848 2483127 2052366 1663992 1335372 1082923 916002 831455 811936 829277 851653
36323 851653 851660 812206 728387 605242 452919 281531 97885 -94792 -294830 -500082 -707878
36312g07878k08734k09893k11317k09891k00741j80014j46530j01510m7447J2831
36302b211124P6610J41204K03320K58375L00782L25511L29810L13741K79337K29480
36292B47046J67590R8127K6837m0199r8453j46394j85294k17499k44477k65868
36282f58584k79792k83853k76221k56455k25843j87142j43788r9016n5302j4480
36272b480476K1626N0681P0194P9029P9195P6434P8469R1570J17663J53994J95459
36261a466162K37400K76588L09920L32493L37326L17475K69384J95346J03627
36252I13397O384q3242j53693j96744k08630j90506j48168r1026l0549K1680N6248
36241a04849O7895N6602K7449j0575m6752p1846q1276p6480o3102m7143l1857
$$ plain form
36312 -707878 -916612 -1126505 -1337822 -1547713 -1748454 -1928468 -2074998 -2176508 -2223955 -2211124
36302 -2211124 -2134514 -1993310 -1789990 -1531615 -1230833 -905322 -575512 -261771 17566 247046
36292 247046 414636 512763 539600 499401 400948 254554 69260 -148239 -392716 -658584
36282 -658584 -938376 -1222229 -1498450 -1754905 -1980748 -2167890 -2311678 -2410694 -2465996 -2480476
36272 -2480476 -2458850 -2408169 -2337975 -2258946 -2179751 -2103317 -2024848 -1933278 -1815615 -1661621 -1466162
36261 -1466162 -1228762 -952174 -642254 -309761 27565 345040 614424 809770 913397
36252 913397 919781 836539 682846 486102 277472 86966 -61202 -152228 -182777 -161097 -104849
36241 -104849 -36954 19648 47097 36522 -10230 -82076 -163352 -239832 -302934 -350077 -381934
36230c81934j7233j688J5808L4561N2277O6389P5974Q3302R3681J13288J45899
36219B80324J90291K39584K82949L08960L09560K83122K35210J76216J16649O2483
36209B485348J3443l4629q5134j37112j84971k21057k38951k35598k12047j73213
36199I76079j26950q2219m6436k3144j1511q201j0255j6724k7869m3037n9416
36188E20317p2930q0617q2355q0252p6068o8826n5008l1350K097M1183P9203J08962
36176B04356J24271J21188R9609O4149K3147j4099m0257n1750m9324l7730k4586
36165D18974j8298k5459m8479q4237j24373j57502j72950j64452j32109q1813
36155e90698k2856L4871Q3102J16517J33146J33779J20706R6668O4656K8443p223
$$ plain form
36230 -381934 -399167 -400855 -385047 -350486 -298209 -231820 -155846 -72544 21137 134425 280324
36219 280324 470615 710199 993148 1302108 1611668 1894790 2130000 2306216 2422865 2485348
36209 2485348 2498791 2464162 2379028 2241916 2056945 1835888 1596937 1361339 1149292 976079
36199 976079 849129 766910 720474 697330 685819 677618 667363 650639 622770 579733 520317
36188 520317 447387 366770 284415 204163 128095 59269 4261 -27089 -24992 16191 95394 204356
36176 204356 328627 449815 549424 613573 636720 622621 582364 530614 481290 443560 418974
36165 418974 400676 375217 326738 242501 118128 -39374 -212324 -376776 -508885 -590698
36155 -590698 -613554 -578683 -495581 -379064 -245918 -112139 8567 105235 169891 198334 191111
36144A91111l7336n7800o6109o1258m3459j4251K2922O2411R7045J20038J27198
36133C40512J18203R6088O5400L0290o655m4487q3011j21179j55649j80718j90100
36122a31306j79718j49948j06125n7027j1906K2478M3265N0736M6562L2678J1305
36111d29006j4728m2157o7966r0004j07301j20027j29062j35283j39155j40965
36101a415654j41506j42388j45295j50409j55146j54584j44017j22060r1936n9805
36091b722800l1510j0217L934J2860J9535K7332L9327N7197P9765J02000J15887
36080b306690J13875R3480N9757K3366m668j7822j5745k723J5143L2366M5384
36069a964277N2758N4515N1464M5065L7719L2539L2160L7232M5739N3542N5623
$$ plain form
36144 191111 153775 95975 29866 -31392 -74851 -89102 -66180 -3769 93276 213314 340512
36133 340512 458715 554803 620203 650493 643838 599351 516340 395161 239512 58794 -131306
36122 -131306 -311024 -460972 -567097 -624124 -636030 -613552 -570287 -519551 -472989 -440311 -429006
36111 -429006 -443734 -485891 -553857 -643861 -751162 -871189 -1000251 -1135534 -1274689 -1415654
36101 -1415654 -1557160 -1699548 -1844843 -1995252 -2150398 -2304982 -2448999 -2571059 -2662995 -2722800
36091 -2722800 -2754310 -2764527 -2760593 -2747733 -2728198 -2700866 -2661539 -2604342 -2524577 -2422577 -2306690
36080 -2306690 -2192815 -2099335 -2039578 -2016212 -2020880 -2038702 -2054447 -2057170 -2042027 -2009661 -1964277
36069 -1964277 -1911519 -1857004 -1805540 -1760475 -1722756 -1690217 -1658057 -1620825 -1575086 -1521544 -1465921
36058a465921M7336K5756q830n1819r4841j28434j45685j44752j28710j03301
36048b199201p4378m6568k3322p454j222n891k1074m4197p0415r3333j06595j05786
36036b799436q9604n9767k0102K4415O8399J06826J35980J54313J62742J64056
36026b152178J61640J58055J54258J49872J43982J35668J23934J07517Q5145N6440
36016h75667K2726j2936m6815p5949r8950j15646j26072j29854j26401j15750
36006a701314r9418q0728o4095n3351m9828n1515n3784n1207l9455j6662J5872
35995b245485N3787R0791J20612J39030J44889J39731J26602J09267R2221Q0655
35985a147900P9297R0440J12768J42034J72822J99908K18678K25155K16181J89480
$$ plain form
36058 -1465921 -1418585 -1392829 -1401659 -1453478 -1548319 -1676753 -1822438 -1967190 -2095900 -2199201
36048 -2199201 -2273579 -2320147 -2343469 -2350923 -2352145 -2358036 -2379110 -2423307 -2493722 -2587055 -2693650 -2799436
36036 -2799436 -2889040 -2948807 -2968909 -2944494 -2876095 -2769269 -2633289 -2478976 -2316234 -2152178
36026 -2152178 -1990538 -1832483 -1678225 -1528353 -1384371 -1248703 -1124769 -1017252 -932107 -875667
36016 -875667 -852941 -865877 -912692 -988641 -1087591 -1203237 -1329309 -1459163 -1585564 -1701314
36006 -1701314 -1800732 -1881460 -1945555 -1998906 -2048734 -2100249 -2154033 -2205240 -2244695 -2261357 -2245485
35995 -2245485 -2191698 -2100907 -1980295 -1841265 -1696376 -1556645 -1430043 -1320776 -1228555 -1147900
35985 -1147900 -1068603 -978163 -865395 -723361 -550539 -350631 -131953 93202 309383 498863
35975D98863J43674P8472m595j01377k04972l06465l96398m66481n11032n27695
35965a798006n17191m82400m27506l57606k78688j97474j20666n3693M20M1181
35955d191629O9590Q6659R2552Q7038P0919M7264K1521K97j0503p314J0188L9024
35943c684394P3889J08926J39566J63320J79099J85976J82779J68922J45535J15699
35933b220683Q3426N2202K4066m61k2085m2496o4019q8600j16281j44156j67093
35922b706180j80104j81030j71678j56808j41585j29080j19218j09677r8143q4070
35912d077573o8475n1984l3105q612K4216O5410J11856J58380J99375K30296K48844
35901c201372K55426K52440K42808K28739K11387J91078J67770J41809J14886
$$ plain form
35975 498863 642537 721009 716414 615037 410065 103600 -292798 -759279 -1270311 -1798006
35965 -1798006 -2315197 -2797597 -3225103 -3582709 -3861397 -4058871 -4179537 -4233230 -4232810 -4191629
35955 -4191629 -4122039 -4035380 -3942828 -3855790 -3784871 -3737607 -3716086 -3715789 -3726292 -3733606 -3723418 -3684394
35943 -3684394 -3610505 -3501579 -3362013 -3198693 -3019594 -2833618 -2650839 -2481917 -2336382 -2220683
35933 -2220683 -2137257 -2085055 -2060989 -2061450 -2083535 -2126031 -2190050 -2278650 -2394931 -2539087 -2706180
35922 -2706180 -2886284 -3067314 -3238992 -3395800 -3537385 -3666465 -3785683 -3895360 -3993503 -4077573
35912 -4077573 -4146048 -4198032 -4231137 -4239749 -4215533 -4150123 -4038267 -3879887 -3680512 -3450216 -3201372
35901 -3201372 -2945946 -2693506 -2450698 -2221959 -2010572 -1819494 -1651724 -1509915 -1395029
35892a395029R0247P1365N9770N3964N0519M6335M0175L2564K4833J8310J3953
35881h92994J2210J3152J6788K3114L1390L9132M2290L7179K2883K027k0627m0324
35869g13780n3540n8210n3868m2113k6632j2103k094K792N325J0172K1183L9104
35857h83764O0881Q0755R2125Q9197O8275K8867k5484q7439j47747j98008k32784
35846a155126k49666k47751k26153j83922j21320m1420M8992J39625K18274K73696
35836a544771K98988K93761K63858K18510J66506J13347O0697P921m5601r8933
35826b65717j49321j92865k25444k43744k46287k34169k10935j81562j50951j22707
35816b223702r8672p9326o4499n3817m6546m1300l6121k8926j7829j337K1052
$$ plain form
35892 -1395029 -1304782 -1233417 -1173647 -1119683 -1069164 -1022829 -982654 -950090 -925257 -906947 -892994
35881 -892994 -880784 -867632 -850844 -827730 -796340 -757208 -714918 -677739 -654856 -652829 -673456 -713780
35869 -713780 -767320 -825530 -879398 -921511 -948143 -960246 -962340 -959548 -954223 -944051 -922868 -883764
35857 -883764 -822883 -742128 -650003 -560806 -492531 -463664 -489148 -576587 -724334 -922342 -1155126
35846 -1155126 -1404792 -1652543 -1878696 -2062618 -2183938 -2225358 -2176366 -2036741 -1818467 -1544771
35836 -1544771 -1245783 -952022 -688164 -469654 -303148 -189801 -129104 -121183 -166784 -265717
35826 -265717 -415038 -607903 -833347 -1077091 -1323378 -1557547 -1768482 -1950044 -2100995 -2223702
35816 -2223702 -2322374 -2401700 -2466199 -2520016 -2566562 -2607862 -2643983 -2672909 -2690738 -2692075 -2671023
35805b671023M7897P5480R9042J15119J23195J25375J24564J22579J19344J13196
35795a605232J01863Q3662N8652K9320K79k3129l6759l9105l1524j7358o64J4859
35783a465136K6389L1981L0235K0173J697k3670n2666q1164j05461j22999j32241
35772a872862j32126j21586r9413o4790j8562L5574R1284J41493J80623K05446
35762a654919K14343K06267J80709J38623Q3259K0181m3616j01111j46860j78271
35752a281395j95990k02945k02537j97143j87824j74933j58616j38655j14019
35743b854057q3045m4731n78M4449Q3207J09838J23205J27641J30211J36446J47181
35732b080233J57892J60329J45917J09996N5093q856o7862j09302j26536j20355
$$ plain form
35805 -2671023 -2623126 -2547646 -2448604 -2333485 -2210290 -2084915 -1960351 -1837772 -1718428 -1605232
35795 -1605232 -1503369 -1419707 -1361055 -1331735 -1331456 -1354585 -1391344 -1430449 -1461973 -1479331 -1479995 -1465136
35783 -1465136 -1438747 -1406766 -1376531 -1356358 -1354661 -1378331 -1430997 -1512161 -1617622 -1740621 -1872862
35772 -1872862 -2004988 -2126574 -2225987 -2290777 -2309339 -2273765 -2182481 -2040988 -1860365 -1654919
35762 -1654919 -1440576 -1234309 -1053600 -914977 -831718 -811537 -855153 -956264 -1103124 -1281395
35752 -1281395 -1477385 -1680330 -1882867 -2080010 -2267834 -2442767 -2601383 -2740038 -2854057
35743 -2854057 -2937102 -2981833 -2982411 -2937962 -2854755 -2744917 -2621712 -2494071 -2363860 -2227414 -2080233
35732 -2080233 -1922341 -1762012 -1616095 -1506099 -1451006 -1459862 -1527724 -1637026 -1763562 -1883917
35722a883917r6741o2312k0650K7953Q3500J43087K00312K47458K78329K90003
35712g92978K83323K62604K34520K06053J82105J64046J50075J37043J22540J06048
35702A055379Q8802P2786N9620M9999M3801M0599M0062M2148M7023N4587O3357
35691A658163O9238O5574M5528N881n0517j15641j80008k36669k83224l21101
35681F57224l53016l80217m00946m10866m04959l79885l35865k77382k12204j48949
35671b647065r4537n2810k4597q280l91L389O532R988J1661P518o098k9966o0580
35658b885236r0865j12840j20627j12081q8706n4711j5911K1533N2520P4133Q5972
35647c246819Q9700Q8052Q3515P7293O9309N9682N0518M6306N2051P0232R8799
$$ plain form
35722 -1883917 -1980658 -2042970 -2063620 -2035667 -1952167 -1809080 -1608768 -1361310 -1082981 -792978
35712 -792978 -509655 -247051 -12531 193522 375627 539673 689748 826791 949331 1055379
35702 1055379 1144181 1216967 1276587 1326586 1370387 1410986 1451048 1493196 1540219 1594806 1658163
35691 1658163 1727401 1792975 1838503 1844384 1793867 1678226 1498218 1261549 978325 657224
35681 657224 304208 -76009 -476955 -887821 -1292780 -1672665 -2008530 -2285912 -2498116 -2647065
35671 -2647065 -2741602 -2794412 -2819009 -2827289 -2827680 -2824291 -2817759 -2807771 -2796110 -2788592 -2794690 -2824656 -2885236
35658 -2885236 -2976101 -3088941 -3209568 -3321649 -3410355 -3465066 -3480977 -3459444 -3406924 -3332791 -3246819
35647 -3246819 -3157119 -3069067 -2985552 -2908259 -2838950 -2779268 -2728750 -2682444 -2630393 -2560161 -2461362
35636b461362J31581J60772J79857J85451J77530J58392J31139R8465O2379K5006
35626a150790j0171l7849n1975m8029k5127J3311O0659J09314J53089J88688K15594
35615e83286K34616K46331K50752K48225K40035K27734K11777J91254J65119J33571
35605A566128R8171O1076K4644q388l5211n4238o6225p3869q0114q6890r5317
35594A249767j06479j21253j39050j56801j69506j72227j62205j39973j09189
35585b6916p5435m4478k0832p425o397j9718m8308q9839j37246j79818k06869
35574h63281k12020j95775j65083j30159j00200p9945o8683o1697n3080l8288
35564a968211j5446J4765N0044Q7331J23142J53560J74663J83592J79690J64847
$$ plain form
35636 -2461362 -2329781 -2169009 -1989152 -1803701 -1626171 -1467779 -1336640 -1238175 -1175796 -1150790
35626 -1150790 -1160961 -1198810 -1250785 -1298814 -1323941 -1310630 -1249971 -1140657 -987568 -798880 -583286
35615 -583286 -348670 -102339 148413 396638 636673 864407 1076184 1267438 1432557 1566128
35605 1566128 1664299 1725375 1750019 1741631 1706420 1652182 1585957 1512088 1431974 1345084 1249767
35594 1249767 1143288 1022035 882985 726184 556678 384451 222246 82273 -26916
35585 -26916 -102351 -146829 -167661 -175086 -181483 -201201 -249509 -339348 -476594 -656412 -863281
35574 -863281 -1075301 -1271076 -1436159 -1566318 -1666518 -1746463 -1815146 -1876843 -1929923 -1968211
35564 -1968211 -1983657 -1968892 -1918848 -1831517 -1708375 -1554815 -1380152 -1196560 -1016870 -852023
35554h52023J42789J17906R4178P4479O0082N0478M3675L7056K8537J7601N662
35543a79580m647j1033j2923j1654r409q092r149j4156k4880m2010o3424q3563
35531d74520r4928r1083o9678l3875Q391M7115P3659Q3358P6133N5018K3738j5069
35519d11741o0071j09983j61919k10778k50333k75450k83753k75480k51934k14227
35509b505669j63373j01303l1467M1505J12577J76798K29381K65876K82838K79022
35499a413815K56568K21135J80311J40901J06884P9555N9289M6752M2178M3720
35489b36522M7269M8603M6054M1054L6109L2285K8447K2450J2935L97j2787k3296
35477D2998k8534k8240k4967k2997k6373l7211n4956p6732r8568j16876j29428
$$ plain form
35554 -852023 -709234 -591328 -497150 -422671 -362589 -312111 -268436 -231380 -202843 -185242 -179580
35543 -179580 -184227 -195260 -208183 -219837 -229246 -237338 -246487 -260643 -285523 -327533 -390957 -474520
35531 -474520 -569448 -660531 -730209 -764084 -755693 -708578 -634919 -551561 -475428 -420410 -396672 -411741
35519 -411741 -471812 -581795 -743714 -954492 -1204825 -1480275 -1764028 -2039508 -2291442 -2505669
35509 -2505669 -2669042 -2770345 -2801812 -2760307 -2647730 -2470932 -2241551 -1975675 -1692837 -1413815
35499 -1413815 -1157247 -936112 -755801 -614900 -508016 -428461 -369172 -322420 -280242 -236522
35489 -236522 -189253 -140650 -94596 -53542 -17433 14852 43299 65749 78684 79081 66294 42998
35477 42998 14464 -13776 -38743 -61740 -88113 -125324 -180280 -257012 -355580 -472456 -601884
35466f01884j35611j36437j34627j34152j38733j49906j65972j82420j93179j92196
35456b165117j75345j42200r6601m5353M060M5327P4092Q8101Q7145P2998M9473
35445b203420K2406j323j6108k0022j4993m301J0237K8630N0529P3027R0740R8137
35433a886461R2406P4906N0308K3886j292k5205m9357p4286r8202j17457j27853
35422b138607j25611j07693p2107j8831M8838J23641J95532K54652K94448L13133
35412a232605L12865K97862K72842K42383K10609J80742J54697J33270J16973
35403F89638J06634J02854J04477J07525J06151R5632P5435M9946K5818P501o030
35392A465581k0738m3634p8560j24756j78593k35969k93061l45513l87867m14330
$$ plain form
35466 -601884 -737495 -873932 -1008559 -1142711 -1281444 -1431350 -1597322 -1779742 -1972921 -2165117
35456 -2165117 -2340462 -2482662 -2579263 -2624616 -2620556 -2575229 -2501137 -2413036 -2325891 -2252893 -2203420
35445 -2203420 -2181014 -2182337 -2198445 -2218467 -2233460 -2237761 -2227524 -2198894 -2148365 -2075338 -1984598 -1886461
35433 -1886461 -1794055 -1719149 -1668841 -1644955 -1646247 -1671452 -1720809 -1795095 -1893297 -2010754 -2138607
35422 -2138607 -2264218 -2371911 -2444018 -2462849 -2414011 -2290370 -2094838 -1840186 -1545738 -1232605
35412 -1232605 -919740 -621878 -349036 -106653 103956 284698 439395 572665 689638
35403 689638 796272 899126 1003603 1111128 1217279 1312911 1388346 1438292 1464110 1471611 1465581
35392 1465581 1444843 1401209 1322649 1197893 1019300 783331 490270 144757 -243110 -657440
35382f57440m20313m03735l65663l10389k44785j76922j14434o3471k8586j2862
35372b798600j7494m0673p6860j17413j52566j73573j74156j51412j06706m6088
35362c855541K0956Q4725J38743J81113K13040K36170K50839K56220K51531K37124
35352a985080K14850J88111J61907J42502J35835J45001J68324J99733K31230
35343c97587K55611K67869K65275K47188K15067J72321J23548P3231K4369k2296
35333A224596o7827j13617j59732k04210k43421k72838k87722k84349k61936k24568
35323h95624j81369j44250j24040j27012j53295j97678k51792l06261l52023l81151
35313c114495l87783l68993l25015k58714j75228q2085J0879R2604J52702J83507
$$ plain form
35382 -657440 -1077753 -1481488 -1847151 -2157540 -2402325 -2579247 -2693681 -2757152 -2785738 -2798600
35372 -2798600 -2816094 -2856767 -2933627 -3051040 -3203606 -3377179 -3551335 -3702747 -3809453 -3855541
35362 -3855541 -3834585 -3749860 -3611117 -3430004 -3216964 -2980794 -2729955 -2473735 -2222204 -1985080
35352 -1985080 -1770230 -1582119 -1420212 -1277710 -1141875 -996874 -828550 -628817 -397587
35343 -397587 -141976 125893 391168 638356 853423 1025744 1149292 1222523 1246892 1224596
35333 1224596 1156769 1043152 883420 679210 435789 162951 -124771 -409120 -671056 -895624
35323 -895624 -1076993 -1221243 -1345283 -1472295 -1625590 -1823268 -2075060 -2381321 -2733344 -3114495
35313 -3114495 -3502278 -3871271 -4196286 -4455000 -4630228 -4712313 -4701434 -4608830 -4456128 -4272621
35303d272621J82002J51629J02924N1421J2779k546P946L9590Q3578J30157J71009
35292c342132K00757K17710K23700K22987K20472K19878K22572K27567K32719
35283a353770K36268K37478K35931K30290K18203J97783J69342J35528R9566O3164
35273D69783K6059j2466n1562q8058j17430j35690j40961j34315j19594j02214
35263d06448q7036p6587p1067o9991p3575q2083r3818j04115j06806r7223p4655
35252a343404m2597o710K8226O0364R0451J19673J47562J71633J88578J95914
35242c90310J93143J81947J65427J46724J27807J09107Q9785O8267M3081J4057
35232G49035j6677m5048o7073q1364r0061r7065j04515j10310j09000r5845p0882
$$ plain form
35303 -4272621 -4090619 -3938990 -3836066 -3784645 -3771866 -3774412 -3766466 -3726876 -3643298 -3513141 -3342132
35292 -3342132 -3141375 -2923665 -2699965 -2476978 -2256506 -2036628 -1814056 -1586489 -1353770
35283 -1353770 -1117502 -880024 -644093 -413803 -195600 2183 171525 307053 406619 469783
35273 469783 495842 483376 431814 343756 226326 90636 -50325 -184640 -304234 -406448
35263 -406448 -493484 -570071 -641138 -711129 -784704 -866787 -960605 -1064720 -1171526 -1268749 -1343404
35252 -1343404 -1386001 -1392711 -1364485 -1304121 -1213670 -1093997 -946435 -774802 -586224 -390310
35242 -390310 -197167 -15220 150207 296931 424738 533845 623630 691897 734978 749035
35232 749035 732358 687310 620237 538873 448812 351747 247232 136922 27922 -67923 -138805
35221a38805l9743j0770R013J6266J1145m227k7057n4287q2575j08429j28645
35210e58114j40610j42247j32156j10337p9132m3315q836J9363L9316N2845O4430
35199a038793P8554R6971J17680J36150J47685J49316J40442J22493R8209P1171
35189A19878M5477K5296J3904J2804K1482L7685N7510P5486Q5750Q4516P1903
35178F51691N1097K5309m713m0314q2247j28210j72510k07960k28480k30989k15977
35167e83303j86952j49108j07533o5645k4835J4299N0032P8492R4759R5868Q3824
35156g00102O6095N2332M9100N6519O9206Q0256Q4959Q2208P3883O3268N3126
35145C0850M4214L5025K2903N518j8157m7371p9250j09002j31007j40599j35581
$$ plain form
35221 -138805 -178548 -189318 -180305 -164039 -152894 -157121 -184178 -238465 -321040 -429469 -558114
35210 -558114 -698724 -840971 -973127 -1083464 -1162596 -1205911 -1214747 -1195384 -1156068 -1103223 -1038793
35199 -1038793 -960239 -863268 -745588 -609438 -461753 -312437 -171995 -49502 48707 119878
35189 119878 165355 190651 204555 217359 238841 276526 334036 409522 495272 579788 651691
35178 651691 702788 728097 723384 683070 600823 472613 300103 92143 -136337 -367326 -583303
35167 -583303 -770255 -919363 -1026896 -1092541 -1117376 -1103077 -1053045 -974553 -879794 -783926 -700102
35156 -700102 -634007 -581675 -532575 -476056 -406850 -326594 -241635 -159427 -85544 -22276 30850
35145 30850 75064 110089 132992 138510 120353 72982 -6268 -115270 -246277 -386876 -522457
35134e22457j17039q9136n7622k7311R1K5859N1618P6172R4589J00737R1602P0278
35122c02619M5220K5847J7258J7501J9152J3906k849l0271o3472r6558j25123
35111d82008j47271j63198j73839j79122j76859j63147j34377q9607l1941L1572
35101a709797R1496J38612J66800J74843J66269J47599J26280J08797R8876R6211
35091c94014R6738R4784Q5845O8422M4393J8341l882j7060j8390q262J0255L2936
35079A0106N6134P7960R8132J16478J31354J39636J38487J27405J08885Q7355
35069A091932O7406N2318M3409M0074M0195M0610L7670K8237J1002j2713l9473
35058A400667o5181q6306j00356j05890j02616r1450p4282n3724l2980j5748n656
$$ plain form
35134 -522457 -639496 -728632 -786254 -813565 -813474 -787615 -735997 -659825 -565236 -464499 -372897 -302619
35122 -302619 -257399 -231552 -214294 -196793 -177641 -163735 -166584 -196855 -260327 -356885 -482008
35111 -482008 -629279 -792477 -966316 -1145438 -1322297 -1485444 -1619821 -1709428 -1741369 -1709797
35101 -1709797 -1618301 -1479689 -1312889 -1138046 -971777 -824178 -697898 -589101 -490225 -394014
35091 -394014 -297276 -202492 -116647 -48225 -3832 14509 10627 -6433 -24823 -33085 -22830 10106
35079 10106 66240 144200 242332 358810 490164 629800 768287 895692 1004577 1091932
35069 1091932 1159338 1211656 1255065 1295139 1335334 1375944 1413614 1441851 1452853 1440140 1400667
35058 1400667 1335486 1249180 1148824 1042934 940318 848868 774586 720862 687882 672134 666478
35047F66478n212j4739l1898n2271p1064q4974r2855r4789r0926q1577o8357n4565
35035g6749m3961l8957l9530m3084m5110m0862k8167r540Q441J8602J6806L221
35023c18890j8695m3850o6571q1485q4658p4526n2020j9942J7867N7197R4059
35012e91514J25177J48223J61696J64588J56101J35515J02577N8501P148m4710
35002D23302q8743j17591j27172j17759r3440o0424k4922Q305L5972N5166O2576
34991d4730N5329L2895j696m2683q3998j21338j52515j76078j89860j91045j77998
34980a093717j52303j19049q4828n4849l1205j3241P98J2330K2043L0299L7573
34969a446149M4494N1461N8077O2791O3039N6033L9955J5191j4887m4137o5060
$$ plain form
35047 666478 661266 646527 614629 562358 491294 406320 313465 218676 127750 46173 -22184 -76749
35035 -76749 -120710 -159667 -199197 -242281 -287391 -328253 -356420 -365960 -357519 -338917 -322111 -318890
35023 -318890 -337585 -381435 -448006 -529491 -614149 -688675 -740695 -760637 -742770 -685573 -591514
35012 -591514 -466337 -318114 -156418 8170 164271 299786 402363 460864 468012 423302
35002 423302 334559 216968 89796 -27963 -121403 -181827 -206749 -198444 -162472 -107306 -44730
34991 -44730 10599 43494 41798 -885 -84883 -206221 -358736 -534814 -724674 -915719 -1093717
34980 -1093717 -1246020 -1365069 -1449897 -1504746 -1535951 -1549192 -1548394 -1536064 -1514021 -1483722 -1446149
34969 -1446149 -1401655 -1350194 -1292117 -1229326 -1166287 -1110254 -1070299 -1055108 -1069995 -1114132 -1179192
34958a179192p1284n9937l2687N020M5843Q2528J09375J23012J22514J09112Q6030
34947f59666N8429L2927J5941J1354J8880L4239N1100O3668O8860O7209O2186
34936a74873N8194N8133O1747O5499O4129N3206L1346P31l4477p0704j06571j42257
34924a35897j77186k08073k29220k35237k24341j99634j67483j34292j04097p8254
34914a893714n6658l9083k5703j6749j1579p753q65J4249M1210P9938J25969J71626
34902a619112K08377K29347K31016K13777J81326J39310R3756M9661J0164k3614
34892b85992n2084p6506r8316j18338j35832j48163j51862j44817j27842j04419
34882a444171p9042n5598l6459k2028j0857q62Q765J6525J9719J6790Q899l97
$$ plain form
34958 -1179192 -1250476 -1310413 -1343100 -1338080 -1292237 -1209709 -1100334 -977322 -854808 -745696 -659666
34947 -659666 -601237 -568310 -552369 -541015 -522135 -487896 -436796 -373128 -304268 -237059 -174873
34936 -174873 -116679 -58546 3201 68700 132829 186035 217381 218112 183635 112931 6360 -135897
34924 -135897 -313083 -521156 -750376 -985613 -1209954 -1409588 -1577071 -1711363 -1815460 -1893714
34914 -1893714 -1950372 -1989455 -2015158 -2031907 -2043486 -2051239 -2052104 -2037855 -1996645 -1916707 -1790738 -1619112
34902 -1619112 -1410735 -1181388 -950372 -736595 -555269 -415959 -322203 -272542 -262378 -285992
34892 -285992 -338076 -414582 -512898 -631236 -767068 -915231 -1067093 -1211910 -1339752 -1444171
34882 -1444171 -1523213 -1578811 -1615270 -1637298 -1648155 -1649017 -1640252 -1623727 -1604008 -1587218 -1578319 -1578716
34870a578716o415m472R290L6704P6070J21687J65514K00233K21689K29157K23914
34859c05345K07520J80891J44126R6903L9325k7002r8404j69393k33624k85134
34849d50137l19481l34580l30710l09805k74708k28973j76901j22963p0779k2465
34839b641502K1198O0215R4809J24547J47089J57662J50583J22490P5123J5515
34829a672271m6527j01866j44494j72200j85753j87241j78274j58903j27760q3488
34819c058777k6595L9259J07348J69418K17750K46636K52835K35870J98864J49188
34809a468204R7267N3307K4034J1555J4446K9324N1975P8286J05253J31343J55592
34798g15822J76266J90338J94320J85786J64587J33128R5526N6099J8298j5284
$$ plain form
34870 -1578716 -1585131 -1589603 -1580313 -1543609 -1467539 -1345852 -1180338 -980105 -758416 -529259 -305345
34859 -305345 -97825 83066 227192 324095 363420 336418 238014 68621 -165003 -450137
34849 -450137 -769618 -1104198 -1434908 -1744713 -2019421 -2248394 -2425295 -2548258 -2619037 -2641502
34839 -2641502 -2620304 -2560089 -2465280 -2340733 -2193644 -2035982 -1885399 -1762909 -1687786 -1672271
34829 -1672271 -1718798 -1820664 -1965158 -2137358 -2323111 -2510352 -2688626 -2847529 -2975289 -3058777
34819 -3058777 -3085372 -3046113 -2938765 -2769347 -2551597 -2304961 -2052126 -1816256 -1617392 -1468204
34809 -1468204 -1370937 -1317630 -1293596 -1282041 -1267595 -1238271 -1186296 -1108010 -1002757 -871414 -715822
34798 -715822 -539556 -349218 -154898 30888 195475 328603 424129 480228 498526 483242
34788D83242m2561o2164p4449q2023q8952r8752j12413j27382j38374j39849j28946
34777f12623j06943p8413m9206k5010j0792r994k3092m6653p4284r9007j15335
34766a251352j19805j10650q7840n3781j3579K6406O1366R0223J15091J38265
34756a205656J59196J74204J79153J72740J58006J41318J29774J28472J38797
34747A76004J58427J82735K06361K23922K30363K22104J99041J65630J29379R7222
34737A991188P2270N2961L4771J2959j5051m8332q2139j08923j20893j13596q8749
34726A586466n4349k1584l65L936q757l4255o5820r6307j20556j36995j46990
34715I04424j52211j52459j46022j31995j12133r0523p1878n9824n6045o0157
$$ plain form
34788 483242 440681 378517 304068 222045 133093 34341 -78072 -205454 -343828 -483677 -612623
34777 -612623 -719566 -797979 -847185 -872195 -882987 -892981 -916073 -962726 -1037010 -1136017 -1251352
34766 -1251352 -1371157 -1481807 -1569647 -1623428 -1637007 -1610601 -1549235 -1459012 -1343921 -1205656
34756 -1205656 -1046460 -872256 -693103 -520363 -362357 -221039 -91265 37207 176004
34747 176004 334431 517166 723527 947449 1177812 1399916 1598957 1764587 1893966 1991188
34737 1991188 2063458 2116419 2151190 2164149 2149098 2100766 2018627 1909704 1788811 1675215 1586466
34726 1586466 1532117 1510533 1510168 1514104 1505347 1471092 1405272 1308965 1188409 1051414 904424
34715 904424 752213 599754 453732 321737 209604 119081 47203 -12621 -68666 -128823
34705a28823p0207q3663r8194j11726j21962j26322j22544j09571q8093o0626
34695a121731l1081l549J9424L8126N5390P4759R8269J25186J52340J75563J91213
34684b26091J96846J90859J71943J39465R4846M2955q018m8697p1761p4639o0276
34673C47432l5649q849J3795K9167L6960L8106L3239K2057L661k2400n4767q9223
34661C13529j19053j37509j41502j33986j22861j16769j20531j33134j48794j59601
34651a020211j57989j38712j00626m7860J0734O4513J05154J29677J40768J44523
34641h70029J47111J52218J60116J68272J72728J69641J56773J34527J05992P5523
34631E72872M6499J9665o782l5398o7232j00422j30500j52059j60922j55632j37768
$$ plain form
34705 -128823 -199030 -282693 -380887 -492613 -614575 -740897 -863441 -973012 -1061105 -1121731
34695 -1121731 -1152812 -1156361 -1136937 -1098811 -1043421 -968662 -870393 -745207 -592867 -417304 -226091
34684 -226091 -29245 161614 333557 473022 567868 610823 602805 554108 482347 407708 347432
34673 347432 311783 302934 316729 345896 382856 420962 454201 476258 479919 457519 402752 313529
34661 313529 194476 56967 -84535 -218521 -341382 -458151 -578682 -711816 -860610 -1020211
34651 -1020211 -1178200 -1316912 -1417538 -1465398 -1454664 -1390151 -1284997 -1155320 -1014552 -870029
34641 -870029 -722918 -570700 -410584 -242312 -69584 100057 256830 391357 497349 572872
34631 572872 619371 639036 632254 596856 529624 429202 298702 146643 -14279 -169911 -307679
34620c07679j11216q0879n1441k6517q368J951M248j051j2844k8977m5826n8451
34608g27050o1793n2626l1223j610K9974N7551P7426Q8604R1667Q7269P5568N6833
34596c09410L2383M926k2026m5137o1967p0945p0781o0098l7979n345L3970P3595
34584e38814J06545J27712J35523J31853J20557J05573Q9789P4758O0904M7746
34574D62146L4421K0580P279k856o572j707J1081K7591M1025M4317L2846O146
34562F76297l1966p4966j15950j49473j71998j81289j76140j57131j27613r3518
34552f03747o1582l6937k1252j2501o661n97N691R070N212r075l4340o7784j03243
34539i37746j32190j45855j37750j05670n2758J2641P8836J34316J71460J88360
$$ plain form
34620 -307679 -418895 -499774 -551215 -577732 -586100 -584149 -579901 -580952 -593796 -622773 -668599 -727050
34608 -727050 -788843 -841469 -872692 -874302 -844328 -786777 -709351 -620747 -529080 -441811 -366243 -309410
34596 -309410 -277027 -272101 -294127 -339264 -401231 -472176 -542957 -603055 -641034 -646379 -612409 -538814
34584 -538814 -432269 -304557 -169034 -37181 83376 188949 278738 353496 414400 462146
34574 462146 496567 517147 524426 521570 514998 513291 524372 551963 592988 637305 670151 676297
34562 676297 644331 569365 453415 303942 131944 -49345 -225485 -382616 -510229 -603747
34552 -603747 -665329 -702266 -723518 -736019 -742680 -743277 -737586 -728516 -723304 -732379 -766719 -834503 -937746
34539 -937746 -1069936 -1215791 -1353541 -1459211 -1511969 -1499328 -1420492 -1286176 -1114716 -926356
34529i26356J87740J74061J50979J20616Q4823M6950J2556j1936k1917j7147k500
34518b02131J3761K3699K3320J3649j469j8931l8294o0982q8137j19049j50930
34507f05494j79618k01035k13032k16717k16117k16114k20147k29222k42373k57668
34497b797537k72921k86091k95343k98494k91936k70117k26919j58912o8515L5444
34487d931341J40509K35003L11382L66935M02382M19976M22314M11919L91168
34478a829753L62363L27942K90529K52673K16429J83291J54516J31186J13561
34469B02737J00414Q9202P7218O2732M5177K4412k53l0631o9384j18779j78585
34458B04260k44282l07182l57057l85887l90057l69629l26012k60504j74989p3642
$$ plain form
34529 -926356 -738616 -564555 -413576 -292960 -208137 -161187 -148631 -160567 -182484 -199631 -202131
34518 -202131 -188370 -164671 -141351 -127702 -129171 -148102 -186396 -247378 -335515 -454564 -605494
34507 -605494 -785112 -986147 -1199179 -1415896 -1632013 -1848127 -2068274 -2297496 -2539869 -2797537
34497 -2797537 -3070458 -3356549 -3651892 -3950386 -4242322 -4512439 -4739358 -4898270 -4966785 -4931341
34487 -4931341 -4790832 -4555829 -4244447 -3877512 -3475130 -3055154 -2632840 -2220921 -1829753
34478 -1829753 -1467390 -1139448 -848919 -596246 -379817 -196526 -42010 89176 202737
34469 202737 303151 392353 469571 532303 577480 601892 601639 571008 501624 382845 204260
34458 204260 -40022 -347204 -704261 -1090148 -1480205 -1849834 -2175846 -2436350 -2611339 -2684981
34448b684981L6210J44911K42526L21004L75501M04271M07374L85363L39241K71714
34438B43134J88425R7655Q492p1189j35634j81150k06072k11109j99174j74063
34428f40685j38753r4997m4619Q896O0211J03497J33992J48716J46369J26988
34418a90385R1972M4506r878o3428j07677j36121j46532j41529j27005j09736
34408h95813r5586q8777r1357j02252j16366j25214j19604r3225m4991K0976R7244
34397a654965J75344K47285L05977L45233L60258L49128L14482K63797K07326
34388I13865J54510J11071P8370N4908L8131K5153J2666k485k1515m2198n9581
34377A262895o9010o9163o2800n4863m9533m8332n0369n4383o0781p1579q8024
$$ plain form
34448 -2684981 -2648771 -2503860 -2261334 -1940330 -1564829 -1160558 -753184 -367821 -28580 243134
34438 243134 431559 529214 537706 466517 330883 149733 -56339 -267448 -466622 -640685
34428 -640685 -779438 -874435 -919054 -910158 -849947 -746450 -612458 -463742 -317373 -190385
34418 -190385 -98413 -53907 -63785 -127213 -234890 -371011 -517543 -659072 -786077 -895813
34408 -895813 -991399 -1080176 -1171533 -1273785 -1390151 -1515365 -1634969 -1728194 -1773185 -1752209 -1654965
34397 -1654965 -1479621 -1232336 -926359 -581126 -220868 128260 442742 706539 913865
34388 913865 1068375 1179446 1257816 1312724 1350855 1376008 1388674 1386189 1364674 1322476 1262895
34377 1262895 1193885 1124722 1061922 1007059 957526 909194 858825 804442 743661 672082 584058
34366E84058j07969j25662j34443j30387j14317r1205o7580m8327l4607k4204
34356b94643j4110l480N395Q725L987q319k5081m2551n8463p2852q7152j02395
34344f90939j17943j31713j41793j48171j53377j61550j76611k00646k33183k71214
34334b427140l09520l41326l59563l58550l35430k90841k28840j56304q1841j4130
34324d903485M0106P7826J00257J11667J16808J18787J19052J19350J23268J35438
34314c840926J58951J93303K34479K76633L13919L41624L56213L54532L33150
34305a278122K89103K22334J38015M6414m0005j10302j57364j78278j73896j48669
34295a390770j10715p0963m0524k6971l1829n1044p8074j07174j34656j58105
$$ plain form
34366 584058 476089 350427 215984 85597 -28720 -119925 -187505 -235832 -270439 -294643
34356 -294643 -308753 -312233 -306838 -298113 -294126 -302445 -327526 -370077 -428540 -501392 -588544 -690939
34344 -690939 -808882 -940595 -1082388 -1230559 -1383936 -1545486 -1722097 -1922743 -2155926 -2427140
34334 -2427140 -2736660 -3077986 -3437549 -3796099 -4131529 -4422370 -4651210 -4807514 -4889355 -4903485
34324 -4903485 -4863379 -4785553 -4685296 -4573629 -4456821 -4338034 -4218982 -4099632 -3976364 -3840926
34314 -3840926 -3681975 -3488672 -3254193 -2977560 -2663641 -2322017 -1965804 -1611272 -1278122
34305 -1278122 -989019 -766685 -628670 -582256 -622261 -732563 -889927 -1068205 -1242101 -1390770
34295 -1390770 -1501485 -1572448 -1612972 -1639943 -1671772 -1722816 -1800890 -1908064 -2042720 -2200825
34285b200825j75050j82585j78291j61947j36808j09145q5412o8401n5325l9873
34275c393662j7105J2525M3051O6575P7811P6709O8221N9867N8528O7800Q6852
34264b792828J10825J32325J43343J37474J12223P0546K0506k7370o3940q4595
34254b241491r0174q5591p7197p0247o7232o7569o8621o7468o2131n1639l5413
34243b984773j3099J4787M6464P9197J10101J36607J56742J69464J74939J74434
34233a935137J69974J64248J60483J61634J68666J79150J87155J85070J66656
34224c92101J29924P8088J7737m4670j05667j65358k25714k87907l50138m07176
34214a752982m51855m77454m79381m55262m04567l29046k33965j28757k5606O3847
$$ plain form
34285 -2200825 -2375875 -2558460 -2736751 -2898698 -3035506 -3144651 -3230063 -3298464 -3353789 -3393662
34275 -3393662 -3410767 -3398242 -3355191 -3288616 -3210805 -3134096 -3065875 -3006008 -2947480 -2879680 -2792828
34264 -2792828 -2682003 -2549678 -2406335 -2268861 -2156638 -2086092 -2065586 -2092956 -2156896 -2241491
34254 -2241491 -2331665 -2417256 -2494453 -2564700 -2631932 -2699501 -2768122 -2835590 -2897721 -2949360 -2984773
34243 -2984773 -2997872 -2983085 -2936621 -2857424 -2747323 -2610716 -2453974 -2284510 -2109571 -1935137
34233 -1935137 -1765163 -1600915 -1440432 -1278798 -1110132 -930982 -743827 -558757 -392101
34224 -392101 -262177 -184089 -166352 -211022 -316689 -482047 -707761 -995668 -1345806 -1752982
34214 -1752982 -2204837 -2682291 -3161672 -3616934 -4021501 -4350547 -4584512 -4713269 -4738875 -4675028
34204d675028J31972J76680K00236K06715K00322J85321J66215J46654J27394
34195c133519J05397P5410L3352k0637q1330j40085j87767k17287k24934k10983
34185d002383j80148j41271j05243q1310p3658q0301r4729j08993j16548j13743
34175e098327r9919p6555m6148j1377K5287O1701R6188J27793J56491J83135K09014
34164d472717K35084K61204K85707L05634L17507L18099L04972K77125K35983
34155a931402J85926J33346Q4280M2266P947j9716m1984n9584p2807q1953q7866
34144a841547r2002r5771r9525j02276j02849j01810j02458j09517j25842j49453
34134b923050j73156j87278j83712j59062j15556n9764K15N7857J09871J55595
$$ plain form
34204 -4675028 -4543056 -4366376 -4166140 -3959425 -3759103 -3573782 -3407567 -3260913 -3133519
34195 -3133519 -3028122 -2952712 -2919360 -2939997 -3021327 -3161412 -3349179 -3566466 -3791400 -4002383
34185 -4002383 -4182531 -4323802 -4429045 -4510355 -4584013 -4664314 -4759043 -4868036 -4984584 -5098327
34175 -5098327 -5198246 -5274801 -5320949 -5332326 -5307039 -5245338 -5149150 -5021357 -4864866 -4681731 -4472717
34164 -4472717 -4237633 -3976429 -3690722 -3385088 -3067581 -2749482 -2444510 -2167385 -1931402
34155 -1931402 -1745476 -1612130 -1527850 -1485584 -1477637 -1497353 -1539337 -1598921 -1671728 -1753681 -1841547
34144 -1841547 -1933549 -2029320 -2128845 -2231121 -2333970 -2435780 -2538238 -2647755 -2773597 -2923050
34134 -2923050 -3096206 -3283484 -3467196 -3626258 -3741814 -3801578 -3801363 -3743506 -3633635 -3478040
34124c478040J94888K26409K47406K54900K47221K25105J91631J51147J07985
34115a631348O5963K8661l48j7890k1961j2430Q407L5869O3921Q6980J01276J04986
34103a187914R7424P8487M8773R983l4917q1713j25088j59184j79137j83293j74758
34092a891337j60616j48695j43508j43947j43812j34646j09424o5670o669N9844
34082b888480J24646J79700K19427K40948K44236K32082K09240J80973J51843
34073a105385J25157J02705Q4363O7966M9912K6714l073l7435p0879r6230j07585
34062i63770j03058q5829o2720m1105k6111j9798k2207l2426m8501o6774q2131
34051a554430q9560q6080p1968n0670k7292o371R598J9889K4010K0907R876p628
$$ plain form
34124 -3478040 -3283152 -3056743 -2809337 -2554437 -2307216 -2082111 -1890480 -1739333 -1631348
34115 -1631348 -1565385 -1536724 -1537072 -1554962 -1576923 -1589353 -1580946 -1545077 -1481156 -1394176 -1292900 -1187914
34103 -1187914 -1090490 -1012003 -963230 -953247 -988164 -1069877 -1194965 -1354149 -1533286 -1716579 -1891337
34092 -1891337 -2051953 -2200648 -2344156 -2488103 -2631915 -2766561 -2875985 -2941655 -2948324 -2888480
34082 -2888480 -2763834 -2584134 -2364707 -2123759 -1879523 -1647441 -1438201 -1257228 -1105385
34073 -1105385 -980228 -877523 -793160 -725194 -675282 -648568 -651641 -689076 -759955 -856185 -963770
34062 -963770 -1066828 -1152657 -1215377 -1256482 -1282593 -1302391 -1324598 -1357024 -1405525 -1472299 -1554430
34051 -1554430 -1643990 -1730070 -1802038 -1852708 -1880000 -1886371 -1876773 -1856884 -1832874 -1811967 -1802091 -1809719
34039a809719k7145m2474m8437m3364k9548j1431O806K2395L3788M0390M2881
34028a865858M3237M3580M4549M4653M1338L2938K0223O437m284r228q684n652
34016a616751l959o125j2186j9877k5579k5193j4725Q792M5603R1536J38162J75393
$$ plain form
34039 -1809719 -1836864 -1879338 -1927775 -1971139 -2000687 -2012118 -2005312 -1982917 -1949129 -1908739 -1865858
34028 -1865858 -1822621 -1779041 -1734492 -1689839 -1648501 -1615563 -1595340 -1588903 -1593187 -1602415 -1611099 -1616751
34016 -1616751 -1620710 -1626835 -1639021 -1658898 -1684477 -1709670 -1724395 -1715603 -1670000 -1578464 -1440302 -1264909
$$ [...]
##END NTUPLES=NMR SPECTRUM
##END=
