##TITLE=31Pdec_E3d2512-1
 CDCl3
  24 sc
 26.12.2023
##JCAMPDX= 6.0         $$ Bruker NMR JCAMP-DX V2.0
##DATA TYPE= NMR SPECTRUM
##DATA CLASS= NTUPLES
##ORIGIN= UXNMR, Bruker Analytische Messtechnik GmbH
##OWNER= root
$$ XWIN-NMR		Version 3.5
$$ Tue Dec 26 15:35:12 2023 Russian Standard Time (UT+4h)  she@DPX200
##.OBSERVE FREQUENCY= 81.013821
##.OBSERVE NUCLEUS= ^31P
##.ACQUISITION MODE= SIMULTANEOUS
##.ACQUISITION SCHEME= undefined
##.AVERAGES= 24
##.DIGITISER RES= 16
##SPECTROMETER/DATA SYSTEM= spect
##.PULSE SEQUENCE= zgpg30
##.SOLVENT NAME= CD2Cl2
##.SHIFT REFERENCE= (INTERNAL, CD2Cl2, 0, 248.564)
##AUDIT TRAIL= $$ (NUMBER, WHEN, WHO, WHERE, WHAT)
$$ ##TITLE= Audit trail, XWIN-NMR		Version 3.5
$$ ##JCAMPDX= 5.01
$$ ##ORIGIN= Bruker BioSpin GmbH
$$ ##OWNER= she
$$ F:/spectra/data/she/nmr/P31/1/pdata/1/auditp.txt
$$ ##AUDIT TRAIL=  $$ (NUMBER, WHEN, WHO, WHERE, WHAT)
(   1,<2023-12-26 15:34:00.53 +0400>,<she>,<DPX200>,
      <created by zg, POWCHK disabled, PULCHK disabled
       configuration hash MD5:
       00 E9 B6 7A A2 85 ED C7 34 08 36 98 17 FE 4E 26
       data hash MD5: 32K
       53 63 86 D8 9A 41 FF 5B 62 29 73 45 B9 EA 45 9E>)
(   2,<2023-12-26 15:34:02.93 +0400>,<she>,<DPX200>,
      <Start of raw data processing
       efp BC_mod = 2 LB = 10 FT_mod = 6 PKNL = 1 PHC0 = -12720.95 PHC1 = 1381.694 SI = 64K 
       data hash MD5: 64K
       89 28 D4 8E 95 23 75 2E D8 86 7F 67 2D 8C D8 23>)
(   3,<2023-12-26 15:34:20.46 +0400>,<she>,<DPX200>,
      <pk PHC0 = 0.2825507 PHC1 = 0 
       data hash MD5: 64K
       BA 63 DA E3 FA 32 D1 C8 8E 55 0E 2D 73 D3 2A E9>)
(   4,<2023-12-26 15:34:23.87 +0400>,<she>,<DPX200>,
      <abs ABSG = 5 
       data hash MD5: 64K
       24 D2 39 3E 66 8F DC 22 47 CC 64 F5 68 2C 85 70>)
$$ ##END=
$$ 
$$ hash MD5
$$ C8 B6 BA 3C AA 28 04 8F 2F 74 4B 8B 80 10 D1 4A
##$RELAX= 
##$RELAX= 
##$RELAX= 
##$RELAX= 
##$RELAX= 
##$RELAX= 
##$RELAX= 
##$RELAX= 
##$RELAX= 
$$ Bruker specific parameters
$$ --------------------------
##$DU= <F:/spectra>
##$EXPNO= 1
##$NAME= <P31>
##$PROCNO= 1
##$TYPE= <nmr>
##$USER= <she>
##$AMP= (0..31)
100 100 100 100 100 100 100 100 100 100 100 100 100 100 100 100 100 100 
100 100 100 100 100 100 100 100 100 100 100 100 100 100 
##$AQSEQ= 0
##$AQ_mod= 1
##$AUNM= <au_zg>
##$AUTOPOS= <>
##$BF1= 81.014009
##$BF2= 200.13
##$BF3= 200.13
##$BF4= 200.13
##$BF5= 200.13
##$BF6= 200.13
##$BF7= 200.13
##$BF8= 200.13
##$BYTORDA= 1
##$CFDGTYP= 0
##$CFRGTYP= 5
##$CHEMSTR= <none>
##$CNST= (0..31)
1 1 145 1 1 1 1 1 1 1 1 1 1 1 1 1 1 1 1 1 1 1 1 1 1 1 1 1 1 1 1 1 
##$CPDPRG= <waltz16>
##$CPDPRG1= <>
##$CPDPRG2= <waltz16>
##$CPDPRG3= <>
##$CPDPRG4= <mlev>
##$CPDPRG5= <mlev>
##$CPDPRG6= <mlev>
##$CPDPRG7= <mlev>
##$CPDPRG8= <mlev>
##$CPDPRGB= <>
##$CPDPRGT= <>
##$D= (0..31)
0 1 0 0 0 0 0 0 0 0 0 0.03 2e-05 3e-06 0 0 0 0 0 0 0 0 0 0 0 0 0 0 0 0 
0 0 
##$DATE= 1703590439
##$DBL= (0..7)
120 120 120 11 120 120 24 19 
##$DBP= (0..7)
150 150 150 150 150 150 150 150 
##$DBP07= 0
##$DBPNAM0= <>
##$DBPNAM1= <>
$$ [...]
##$SUBNAM3= <"">
##$SUBNAM4= <"">
##$SUBNAM5= <"">
##$SUBNAM6= <"">
##$SUBNAM7= <"">
##$SUBNAM8= <"">
##$SUBNAM9= <"">
##$SW= 501.771253377433
##$SWIBOX= (0..15)
0 1 3 0 0 0 0 0 0 0 0 0 0 0 0 0 
##$SW_h= 40650.406504065
##$TD= 32768
##$TD0= 1
##$TE= 0
##$TE2= 300
##$TE3= 300
##$TEG= 300
##$TL= (0..7)
0 120 53 12 22 120 120 120 
##$TP= (0..7)
150 150 150 150 150 150 150 150 
##$TP07= 0
##$TPNAME0= <>
##$TPNAME1= <>
##$TPNAME2= <>
##$TPNAME3= <>
##$TPNAME4= <>
##$TPNAME5= <>
##$TPNAME6= <>
##$TPNAME7= <>
##$TPOAL= (0..7)
0.5 0.5 0.5 0.5 0.5 0.5 0.5 0.5 
##$TPOFFS= (0..7)
0 0 0 0 0 0 0 0 
##$TUNHIN= 0
##$TUNHOUT= 0
##$TUNXOUT= 0
##$USERA1= <user>
##$USERA2= <user>
##$USERA3= <user>
##$USERA4= <user>
##$USERA5= <user>
##$V9= 5
##$VALIST= <valist>
##$VCLIST= <CCCCCCCCCCCCCCC>
##$VD= 0
##$VDLIST= <DDDDDDDDDDDDDDD>
##$VPLIST= <PPPPPPPPPPPPPPP>
##$VTLIST= <TTTTTTTTTTTTTTT>
##$WBST= 1024
##$WBSW= 4
##$XGAIN= (0..3)
0 0 0 0 
##$XL= 0
##$YL= 0
##$YMAX_a= 13072
##$YMIN_a= -12948
##$ZGOPTNS= <>
##$ZL1= 120
##$ZL2= 120
##$ZL3= 120
##$ZL4= 120
##$ABSF1= 248.5645
##$ABSF2= -253.2056
##$ABSG= 5
##$ABSL= 3
##$ALPHA= 0
##$AQORDER= 0
##$ASSFAC= 0
##$ASSFACI= 0
##$ASSFACX= 0
##$ASSWID= 0
##$AUNMP= <proc_1d>
##$AZFE= 0.1
##$AZFW= 0.5
##$BCFW= 0
##$BC_mod= 2
##$BYTORDP= 0
##$COROFFS= 0
##$CY= -3
##$DATMOD= 1
##$DC= 0
##$DFILT= <>
##$DTYPP= 0
##$F1P= 0
##$F2P= 0
##$FCOR= 1
##$FTSIZE= 65536
##$FT_mod= 6
##$GAMMA= 0
##$GB= 0
##$INTBC= 1
##$INTSCL= 6.047779e-11
##$ISEN= 30
##$LB= 10
##$LEV0= 0
##$LPBIN= 0
##$MAXI= 10000
##$MC2= 0
##$MEAN= 0
##$ME_mod= 0
##$MI= 50
##$NCOEF= 0
##$NC_proc= -5
##$NLEV= 6
##$NOISF1= 182.463
##$NOISF2= 159.3651
##$NSP= 0
##$NTH_PI= 0
##$NZP= 0
##$OFFSET= 248.5645
##$PC= 4
##$PHC0= -12720.67
##$PHC1= 1381.694
##$PH_mod= 1
##$PKNL= yes
##$PPARMOD= 0
##$PSCAL= 0
##$PSIGN= 0
##$REVERSE= no
##$SF= 81.0140089999694
##$SI= 65536
##$SIGF1= 159.3651
##$SIGF2= -187.1042
##$SINO= 113.3802
##$SIOLD= 16384
##$SREGLST= <1H.CDCl3>
##$SSB= 0
##$STSI= 65536
##$STSR= 0
##$SW_p= 40650.406504065
##$SYMM= 0
##$S_DEV= 0
##$TDeff= 32768
##$TDoff= 0
##$TI= <>
##$TILT= no
##$TM1= 0
##$TM2= 0
##$TOPLEV= 0
##$USERP1= <user>
##$USERP2= <user>
##$USERP3= <user>
##$USERP4= <user>
##$USERP5= <user>
##$WDW= 1
##$XDIM= 65536
##$YMAX_p= 301323403
##$YMIN_p= -2994268
$$ End of Bruker specific parameters
$$ ---------------------------------
##NTUPLES= NMR SPECTRUM
##VAR_NAME=  FREQUENCY,     SPECTRUM/REAL,   SPECTRUM/IMAG
##SYMBOL=    X,             R,               I
##VAR_TYPE=  INDEPENDENT,   DEPENDENT,       DEPENDENT
##VAR_FORM=  AFFN,          ASDF,            ASDF
##VAR_DIM=   65536,         65536,           65536
##UNITS=     HZ,            ARBITRARY UNITS, ARBITRARY UNITS
##FACTOR=    0.620285442955139, 1,           1
##FIRST=     20137.2065510682, 0,            0
##LAST=      -20513.1999529968, 0,           0
##MIN=       -20513.1999529968, -2994268,    0
##MAX=       20137.2065510682, 301323403,    0
$$ Real data points
##PAGE= N=1
##DATA TABLE= (X++(R..R)), XYDATA
$$ [...]
$$ plain form
40333 26586 38059 50721 64317 78767 93976 109581 124713 137979 147748 152705 152356 147223 138569
40320 138569 127840 116159 104070 91565 78279 63824 48149 31808 15913 1799 -9438
40309 -9438 -17263 -21724 -23184 -21816 -17154 -7959 7381 30127 60504 97471 139030 182823 226734
40296 226734 269206 309253 346237 379579 408503 431949 448689 457656 458356 451192 437486 419149
40284 419149 398161 376147 354320 333718 315430 300574 289992 283913 281838 282685 285168 288219 291307
40271 291307 294550 298628 304542 313262 325367 340745 358492 377088 394808 410262 422830 432812
40259 432812 441177 449061 457265 466037 475149 484082 492085 498093 500640 498032 488785 472158 448457 418951
40245 418951 385534 350351 315616 283524 256095 234896 220795 213908 213820 219863 231256 247078
$$ packed form
40333B6586J1473J2662J3596J4450J5209J5605J5132J3266R769M957l49n133q654
40320A38569j0729j1681j2089j2505j3286j4455j5675j6341j5895j4114j1237
40309i438p825m461j460J368M662R195J5340K2746L0377L6967M1559M3793M3911
40296B26734M2472M0047L6984L3342K8924K3446J6740Q967P00p164j3706j8337
40284D19149k0988k2014k1827k0602j8288j4856j0582o079k075Q47K483L051L088
40271B91307L243M078N914Q720J2105J5378J7747J8596J7720J5454J2568R982
40259D32812Q365P884Q204Q772R112Q933Q003O008K547k608r247j6627k3701k9506
40245D18951l3417l5183l4735l2092k7429k1199j4101o887q8O043J1393J5822
$$ plain form
40233 247078 266223 287477 309783 332505 355548 379141 403416 428001 451900 473711 492061
40222 492061 505992 515178 519947 521170 520025 517677 514951 512118 508908 504714 498951 491384 482386 473005
40208 473005 464773 459247 457466 459586 464880 472064 479657 486189 490258 490613 486371 477252 463704 446810
40194 446810 428080 409188 391760 377215 366731 361262 361537 367993 380657 399078 422302 448898
40182 448898 477027 504553 529203 548724 561100 564902 559694 546262 526500 502990 478564 455938
40170 455938 437424 424667 418469 418806 425068 436422 452144 471787 495160 522139 552428 585366
40158 585366 619825 654296 687087 716603 741557 761078 774700 782287 783933 779901 770674 757081
40146 757081 740368 722089 703833 686942 672322 660352 650814 642860 635082 625683 612733 594513
$$ packed form
40233B47078J9145K1254K2306K2722K3043K3593K4275K4585K3899K1811J8350
40222D92061J3931R186M769J223j145k348k726k833l210m194n763p567q998r381
40208D73005q232n526j781K120N294P184P593O532M069L55m242r119j3548j6894
40194D46810j8730j8892j7428j4545j0484n469K75O456J2664J8421K3224K6596
40182D48898K8129K7526K4650J9521J2376L802n208j3432j9762k3510k4426k2626
40170D55938j8514j2757o198L37O262J1354J5722J9643K3373K6979L0289L2938
40158E85366L4459L4471L2791K9516K4954J9521J3622P587J646m032r227j3593
40146G57081j6713j8279j8256j6891j4620j1970r538p954p778r399j2950j8220
$$ plain form
40134 594513 569897 538699 501749 460659 417433 374223 333296 297026 267679 246978 235656
40123 235656 233259 238347 249045 263741 281635 302887 328307 358730 394360 434350 476782 519035
40111 519035 558381 592564 620097 640252 652889 658255 656885 649547 637134 620507 600301 576789
40099 576789 549883 519290 484884 447130 407344 367550 330058 297018 270221 251025 240191
40088 240191 237603 242097 251612 263641 275857 286693 295728 303626 311575 320529 330646 341249 351169
40075 351169 359235 364678 367381 367927 367502 367672 370073 376008 386042 399695 415391 430669 442636 448529
40061 448529 446335 435271 415995 390468 361550 332553 306771 287050 275376 272598 278385 291441
40049 291441 309851 331419 353905 375231 393696 408265 418777 425931 430975 435253 439791 445029
$$ packed form
40134E94513k4616l1198l6950m1090m3226m3210m0927l6270k9347k0701j1322
40123B35656k397N088J0698J4696J7894K1252K5420L0423L5630L9990M2432M2253
40111E19035L9346L4183K7533K0155J2637N366j370p338j2413j6627k0206k3512
40099E76789k6906l0593l4406l7754l9786l9794l7492l3040k6797j9196j0834
40088B40191k588M494R515J2029J2216J0836R035P898P949Q954J0117J0603R920
40075C51169Q066N443K703N46m25J70K401N935J0034J3653J5696J5278J1967N893
40061D48529k194j1064j9276k5527k8918k8997k5782j9721j1674k778N787J3056
40049B91441J8410K1568K2486K1326J8465J4569J0512P154N044M278M538N238
$$ plain form
40037 445029 450662 455646 458453 457572 452028 441603 426712 408144 386888 364103 341064 319067 299271
40024 299271 282561 269373 259575 252517 247303 243092 239165 234718 228704 219922 207404 190790 170495
40011 170495 147640 123812 100739 79974 62698 49672 41189 37030 36464 38412 41777 45727 49831
39998 49831 54021 58537 63934 71102 81149 94997 112862 133906 156354 177961 196580 210650
39986 210650 219509 223537 223985 222531 220702 219427 218889 218678 218177 216987 215167 213238 211987 212231 214650
39971 214650 219748 227866 239185 253587 270460 288564 306104 320949 330897 333922 328411 313479
39959 313479 289314 257426 220618 182586 147247 118048 97474 86781 85927 93673 107864 125840
39947 125840 144860 162442 176657 186363 191367 192321 190315 186295 180594 172911 162745 150037 135608
$$ packed form
40037D45029N633M984K807q81n544j0425j4891j8568k1256k2785k3039k1997j9796
40024B99271j6710j3188r798p058n214m211l927m447o014q782j2518j6614k0295
40011A70495k2855k3828k3073k0765j7276j3026q483m159n66J948L365L950M104
39998D9831M190M516N397P168J0047J3848J7865K1044K2448K1607J8619J4070
39986B10650Q859M028M48j454j829j275n38k11n01j190j820j929j251K44K419
39971B14650N098Q118J1319J4402J6873J8104J7540J4845R948L025n511j4932
39959C13479k4165l1888l6808l8032l5339k9199k0574j0693q54P746J4191J7976
39947A25840J9020J7582J4215R706N004R54k006m020n701p683j0166j2708j4429
$$ plain form
39934 135608 121162 108861 100714 98077 101463 110577 124474 141695 160415 178668 194614 206798
39922 206798 214352 217117 215698 211438 206301 202580 202414 207255 217599 233086 252796 275417 299285
39909 299285 322510 343307 360414 373294 382097 387522 390685 393021 396085 401213 409170 419984 433192
39896 433192 448319 465228 483982 504362 525409 545444 562572 575374 583353 586932 587103 585054
39884 585054 581921 578691 576087 574416 573493 572697 571253 568643 565012 561385 559523 561438 568745 582114
39870 582114 600946 623359 646519 667300 683042 692063 693695 687879 674714 654235 626550 592147
39858 592147 552171 508502 463603 420130 380487 346506 319405 299936 288543 285318 289835 300988
39846 300988 317000 335649 354627 371963 386396 397562 405866 412098 417000 421015 424304 426947 429124
$$ packed form
39934A35608j4446j2301q147k637L386R114J3897J7221J8720J8253J5946J2184
39922B06798P554K765j419m260n137l721j66M841J0344J5487J9710K2621K3868
39909B99285K3225K0797J7107J2880Q803N425L163K336L064N128P957J0814J3208
39896D33192J5127J6909J8754K0380K1047K0035J7128J2802P979L579J71k049
39884E85054l133l230k604j671r23p96j444k610l631l627j862J915P307J3369
39870E82114J8832K2413K3160K0781J5742R021J632n816j3165k0479k7685l4403
39858E92147l9976m3669m4899m3473l9643l3981k7101j9469j1393l225M517J1153
39846C00988J6012J8649J8978J7336J4433J1166Q304O232M902M015L289K643K177
$$ plain form
39833 429124 431183 433466 435974 438114 438758 436671 431070 421951 409977 396052 380884 364857 348257
39820 348257 331563 315504 300879 288368 278480 271585 267850 267059 268492 271007 273333 274486 274144 272805
39806 272805 271689 272357 276258 284325 296754 312999 331925 352067 371932 390296 406395 419922
39794 419922 430901 439508 445959 450457 453246 454765 455858 457809 462093 469912 481788 497426 515847
39781 515847 535654 555302 573310 588443 599859 607214 610591 610183 605910 597215 583242 563320 537439
39768 537439 506468 472045 436260 401369 369588 342914 322851 310079 304321 304531 309315 317315
39756 317315 327380 338592 350293 362215 374647 388466 404924 425207 449946 478889 510862
39745 510862 544033 576382 606160 632175 653820 670929 683571 691862 695858 695567 691119 682905 671532
$$ packed form
39833D29124K059K283K508K140O44k087n601r119j1974j3925j5168j6027j6600
39820C48257j6694j6059j4625j2511r888o895l735p91J433K515K326J153l42j339
39806B72805j116O68L901Q067J2429J6245J8926K0142J9865J8364J6099J3527
39794D19922J0979Q607O451M498K789J519J093J951M284P819J1876J5638J8421
39781E15847J9807J9648J8008J5133J1416P355L377m08m273q695j3973j9922k5881
39768E37439l0971l4423l5785l4891l1781k6674k0063j2772n758K10M784Q000
39756C17315J0065J1212J1701J1922J2432J3819J6458K0283K4739K8943L1973
39745E10862L3171L2349K9778K6015K1645J7109J2642Q291L996k91m448q214j1373
$$ plain form
39732 671532 657567 641266 622510 600964 576328 548525 517789 484626 449634 413247 375639
39721 375639 336856 297104 256955 217424 179968 146430 118836 98976 87925 85690 91201 102652
39709 102652 118116 136169 156246 178545 203570 231601 262298 294547 326571 356252 381608
39698 381608 401334 415219 424335 430825 437297 446020 458260 474041 492336 511511 529838 545929
39686 545929 559046 569213 577157 584052 591146 599370 609001 619570 630001 638962 645268 648140 647281
39673 647281 642788 635053 624702 612567 599633 586886 575060 564396 554629 545320 536359 528246 521859
39660 521859 517908 516433 516686 517372 517099 514824 510172 503505 495745 488076 481673 477462 475867 476605 478688
39645 478688 480636 480758 477353 468896 454324 433353 406563 375195 340809 305020 269381 235321
$$ packed form
39732F71532j3965j6301j8756k1546k4636k7803l0736l3163l4992l6387l7608
39721C75639l8783l9752m0149l9531l7456l3538k7594j9860j1051k235N511J1451
39709A02652J5464J8053K0077K2299K5025K8031L0697L2249L2024K9681K5356
39698C81608J9726J3885R116O490O472Q723J2240J5781J8295J9175J8327J6091
39686E45929J3117J0167P944O895P094Q224R631J0569J0431Q961O306K872q59
39673F47281m493p735j0351j2135j2934j2747j1826j0664r767r309q961q113o387
39660E21859l951j475K53O86k73k275m652o667p760p669o403m211j595P38K083
39645D78688J948J22l405q457j4572k0971k6790l1368l4386l5789l5639l4060
$$ plain form
39633 235321 204139 177073 155368 140220 132561 132800 140750 155762 176944 203278 233556 266269
39621 266269 299647 331958 361929 389065 413701 436808 459654 483474 509263 537720 569229
39610 569229 603721 640461 677899 713803 745633 771026 788255 796538 796169 788483 775695 760657
39598 760657 746358 735165 727984 723863 720365 714616 704499 689433 670473 649780 629830 612639
39586 612639 599284 589803 583473 579318 576609 575047 574586 575084 576109 577044 577398 576995 575963 574584 573245
39571 573245 572514 573228 576354 582628 592160 604278 617705 630920 642527 651524 657505 660715 661909 662041
39557 662041 661969 662374 663805 666699 671276 677381 684422 691362 696775 698930 696015 686455 669260 644242
39543 644242 612057 574057 531998 487702 442742 398325 355374 314753 277459 244599 217169
$$ packed form
39633B35321l1182k7066k1705j5148p659K39P950J5012K1182K6334L0278L2713
39621B66269L3378L2311K9971K7136K4636K3107K2846K3820K5789K8457L1509
39610E69229L4492L6740L7438L5904L1830K5393J7229Q283l69p686j2788j5038
39598G60657j4299j1193p181m121l498n749j0117j5066j8960k0693j9950j7191
39586F12639j3355r481o330m155k709j562m61M98J025R35L54m03j032j379j339
39571E73245p31P14L126O274R532J2118J3427J3215J1607Q997N981L210J194J32
39557F62041p2M05J431K894M577O105P041O940N413K155k915r560j7195k5018
39543F44242l2185l8000m2059m4296m4960m4417m2951m0621l7294l2860k7430
$$ plain form
39532 217169 195783 180551 171167 167107 167758 172494 180665 191553 204286 217766 230739 242010 250711
39519 250711 256473 259471 260436 260617 261632 265190 272796 285536 303910 327550 354971 383548 409960
39506 409960 430976 444275 448908 445253 434545 418228 397459 373006 345519 315996 286023 257580
39494 257580 232455 211593 194820 181051 168887 157210 145530 133947 122866 112724 103942 97042
39482 97042 92761 91977 95477 103646 116236 132293 150337 168718 185983 201107 213606 223583 231682
39469 231682 238918 246431 255211 265836 278214 291403 303702 313073 317653 316093 307649 292183 270259
39456 270259 243307 213690 184560 159479 141938 134847 140115 158375 188862 229466 276996 327665
39444 327665 377734 424083 464520 497784 523405 541567 552975 558623 559460 556122 548899 537987
$$ packed form
39532B17169k1386j5232r384m060O51M736Q171J0888J2733J3480J2973J1271Q701
39519B50711N762K998R65J81J015L558P606J2740J8374K3640K7421K8577K6412
39506D09960K1016J3299M633l655j0708j6317k0769k4453k7487k9523k9973k8443
39494B57580k5125k0862j6773j3769j2164j1677j1680j1583j1081j0142q782o900
39482I7042m281p84L500Q169J2590J6057J8044J8381J7265J5124J2499R977Q099
39469B31682P236P513Q780J0625J2378J3189J2299R371M580j560q444j5466k1924
39456B70259k6952k9617k9130k5081j7541p091N268J8260L0487M0604M7530N0669
39444C27665N0069M6349M0437L3264K5621J8162J1408N648Q37l338p223j0912
$$ plain form
39432 537987 523816 507283 489769 473044 459131 450145 447994 453873 467704 487844 511276 534318
39420 534318 553567 566700 572803 572145 565592 554046 538207 518646 496041 471363 445960 421491
39408 421491 399744 382321 370270 363789 362136 363860 367347 371383 375460 379675 384374 389839 396126
39395 396126 403057 410288 417371 423885 429504 434023 437242 438824 438221 434847 428454 419530 409401 399965
39381 399965 393147 390408 392465 399276 410181 424066 439521 455052 469392 481866 492567 502233
39369 502233 511821 521996 532772 543430 552756 559468 562710 562412 559390 555075 550971 548007 546097 544121
39355 544121 540337 533024 521052 504170 483010 458994 434235 411370 393164 381945 379180 385440
39343 385440 400686 424600 456698 496187 541693 591048 641340 689359 732310 768485 797607
$$ packed form
39432E37987j4171j6533j7514j6725j3913q986k151N879J3831K0140K3432K3042
39420E34318J9249J3133O103o58o553j1546j5839j9561k2605k4678k5403k4469
39408D21491k1747j7423j2051o481j653J724L487M036M077M215M699N465O287
39395C96126O931P231P083O514N619M519L219J582o03l374o393q924j0129r436
39381C99965o818k739K057O811J0905J3885J5455J5531J4340J2474J0701R666
39369E02233R588J0175J0776J0658R326O712L242k98l022m315m104k964j910j976
39355E44121l784p313j1972j6882k1160k4016k4759k2865j8206j1219k765O260
39343C85440J5246K3914L2098L9489M5506M9355N0292M8019M2951L6175K9122
$$ plain form
39332 797607 820737 839748 856496 871992 885979 897191 904129 905824 902140 893639 881275 866247
39320 866247 849970 834019 819945 809041 802147 799567 801088 806109 813896 823837 835526 848577 862330
39307 862330 875737 887608 897094 904029 908898 912518 915681 918988 922903 927859 934293 942541 952599
39294 952599 963940 975493 985866 993609 997406 996218 989430 976987 959366 937370 911885 883818
39282 883818 854129 823855 794039 765625 739410 715963 695537 677979 662793 649341 637130
39271 637130 626018 616283 608463 603096 600433 600237 601691 603457 603904 601502 595181 584530 569737 551408
39257 551408 530346 507286 482651 456439 428384 398293 366369 333331 300371 269004 240926
39246 240926 217852 201336 192648 192682 201870 220031 246214 278616 314684 351437 385918 415623
$$ packed form
39332G97607K3130J9011J6748J5496J3987J1212O938J695l684q501j2364j5028
39320H66247j6277j5951j4074j0904o894k580J521N021P787R941J1689J3051J3753
39307H62330J3407J1871R486O935M869L620L163L307L915M956O434Q248J0058
39294I52599J1341J1553J0373P743L797j188o788j2443j7621k1996k5485k8067
39282H83818k9689l0274k9816k8414k6215k3447k0426j7558j5186j3452j2211
39271F37130j1112r735p820n367k663j96J454J766M47k402o321j0651j4793j8329
39257E51408k1062k3060k4635k6212k8055l0091l1924l3038l2960l1367k8078
39246B40926k3074j6516q688L4R188J8161K6183L2402L6068L6753L4481K9705
$$ plain form
39234 415623 438773 454410 462330 462916 456885 445025 427984 406166 379761 348906 313962 275755
39222 275755 235670 195406 156530 120050 86327 55380 27387 3051 -16374 -29370 -34560 -31052
39210 -31052 -18699 1824 29109 61258 96255 132333 168232 203244 237074 269621 300781 330337
39198 330337 357882 382888 404877 423660 439405 452492 463299 472067 478940 484036 487524 489679
39186 489679 490980 492198 494414 498909 506981 519690 537624 560630 587646 616676 645085 670127
39174 670127 689534 702026 707528 707028 702069 694115 684189 672944 660981 649074 638177 629274 623243
39161 623243 620702 621826 626176 632698 639965 646555 651341 653557 652716 648579 641307 631633 620858 610543
39147 610543 602062 596189 592912 591547 591125 590816 590178 589131 587723 585883 583233 579069 572607 563438 551962
$$ packed form
39234D15623K3150J5637P920N86o031j1860j7041k1818k6405l0855l4944l8207
39222B75755m0085m0264l8876l6480l3723l0947k7993k4336j9425j2996n190L508
39210c1052J2353K0523K7285L2149L4997L6078L5899L5012L3830L2547L1160K9556
39198C30337K7545K5006K1989J8783J5745J3087J0807Q768O873N096L488K155
39186D89679J301J218K216M495Q072J2709J7934K3006K7016K9030K8409K5042
39174F70127J9407J2492N502n00m959p954r926j1245j1963j1907j0897q903o031
39161F23243k541J124M350O522P267O590M786K216q41m137p272r674j0775j0315
39147F10543q481n873l277j365m22l09o38j047j408j840k650m164o462r169j1476
$$ plain form
39132 551962 539521 528080 519664 515811 517318 524325 536609 553843 575580 600981 628525 656044
39120 656044 681117 701607 716032 723675 724531 719160 708530 693872 676607 658345 640842 625798
39108 625798 614533 607689 605070 605731 608277 611318 613894 615736 617280 619395 622830 627623 632729 636117
39094 636117 635309 628120 613358 591247 563395 532290 500551 470331 443007 419138 398520 380368
39082 380368 363652 347563 331858 317020 304099 294305 288434 286409 287228 289420 291813 294187 297448
39069 297448 303200 312962 327503 346648 369481 394714 420969 446941 471574 494181 514405 532009
39057 532009 546633 557750 564859 567822 567090 563706 559081 554630 551414 549931 550132 551602 553749 555922
39043 555922 557493 558007 557384 556050 554885 554964 557189 561951 568965 577406 586331 595111 603616 612046 620577
$$ packed form
39132E51962j2441j1441q416l853J507P007J2284J7234K1737K5401K7544K7519
39120F56044K5073K0490J4425P643Q56n371j0630j4658j7265j8262j7503j5044
39108F25798j1265o844k619O61K546L041K576J842J544K115L435M793N106L388
39094F36117q08p189j4762k2111k7852l1105l1739l0220k7324k3869k0618j8152
39082C80368j6716j6089j5705j4838j2921r794n871k025Q19K192K393K374L261
39069B97448N752R762J4541J9145K2833K5233K6255K5972K4633K2607K0224J7604
39057E32009J4624J1117P109K963p32l384m625m451l216j483K01J470K147K173
39043E55922J571N14o23j334j165P9K225M762P014Q441Q925Q780Q505Q430Q531
$$ plain form
39028 620577 629094 637158 644208 649888 654354 658334 662815 668448 675090 681832 687513 691344 693279 693969
39014 693969 694411 695449 697336 699533 700860 699947 695768 688027 677260 664626 651544 639347 629139
39001 629139 621792 617927 617738 620822 626258 632938 639964 646818 653266 659157 664286 668291 670586 670307 666350
38986 666350 657578 643165 623017 598019 569943 540950 512972 487257 464309 444111 426425 411020
38974 411020 397781 386760 378248 372848 371461 375095 384462 399533 419263 441703 464427 485146
38962 485146 502214 514792 522781 526624 527142 525390 522457 519240 516291 513862 512121 511376 512122 514796
38948 514796 519384 525158 530820 535047 537108 537111 535648 533100 529155 522992 514017 502537 489841 477615
38934 477615 467181 459067 453130 449046 446822 447010 450524 458142 470003 485382 502859 520788 537791
$$ packed form
39028F20577Q517Q064P050N680M466L980M481N633O642O742N681L831J935O90
39014F93969M42J038J887K197J327r13m179p741j0767j2634j3082j2197j0208
39001F29139p347l865j89L084N436O680P026O854O448N891N129M005K295k79l957
38986F66350q772j4413k0148k4998k8076k8993k7978k5715k2948k0198j7686j5405
38974D11020j3239j1021q512n400j387L634R367J5071J9730K2440K2724K0719
38962D85146J7068J2578P989L843N18j752k933l217k949k429j741p45P46K674
38948E14796M588N774N662M227K061Lj463k548l945o163q975j1480j2696j2226
38934D77615j0434q114n937m084k224J88L514P618J1861J5379J7477J7929J7003
$$ plain form
38921 537791 553109 566734 579268 591601 604481 618186 632450 646643 660022 671930 681847 689388
38909 689388 694296 696532 696393 694573 692004 689602 688049 687772 689058 692177 697341 704469 712926 721437 728328
38894 728328 732007 731381 726004 716042 702168 685472 667311 649113 632220 617824 606985 600647 599633
38881 599633 604540 615508 631957 652553 675528 699161 722116 743443 762366 778117 789884 796865
38869 796865 798312 793607 782364 764560 740664 711682 679079 644577 609849 576281 544898 516446
38857 516446 491533 470649 454044 441544 432498 425995 421248 417900 416000 415638 416513 417809 418485 417806
38843 417806 415680 412574 409058 405305 400805 394376 384402 369282 348019 320833 289477 257084 227607
38830 227607 205069 192852 193137 206578 232195 267494 308799 351825 392441 427434 455005 474876
$$ packed form
38921E37791J5318J3625J2534J2333J2880J3705J4264J4193J3379J1908R917P541
38909F89388M908K236j39j820k569k402j553k77J286L119N164P128Q457Q511O891
38894G28328L679o26n377r962j3874j6696j8161j8198j6893j4396j0839o338j014
38881E99633M907J0968J6449K0596K2975K3633K2955K1327J8923J5751J1767O981
38869G96865J447m705j1243j7804k3896k8982l2603l4502l4728l3568l1383k8452
38857E16446k4913k0884j6605j2500r046o503m747l348j900l62Q75J296O76o79
38843D17806k126l106l516l753m500o429r974j5120k1263k7186l1356l2393k9477
38830B27607k2538j2217K85J3441K5617L5299M1305M3026M0616L4993K7571J9871
$$ plain form
38818 474876 488022 496201 501487 505909 511245 518907 529857 544545 562891 584305 607795 632123
38806 632123 656059 678644 699335 718044 735037 750784 765730 780098 793801 806516 817850
38795 817850 827479 835275 841482 846861 852641 860193 870546 883963 899789 916567 932452 945733 955300
38782 955300 960795 962403 960435 954929 945500 931488 912357 888132 859654 828467 796503 765718
38770 765718 737859 714241 695502 681366 670556 661030 650499 637112 619980 599296 576035 551458
38758 551458 526744 502865 480648 460893 444475 432354 425461 424517 429884 441495 458839 480979
38746 480979 506622 534313 562748 591074 619040 646833 674659 702243 728573 752002 770647
38735 770647 782833 787365 783566 771210 750500 722148 687488 648425 607201 566099 527250 492576
$$ packed form
38818D74876J3146Q179N286M422N336P662J0950J4688J8346K1414K3490K4328
38806F32123K3936K2585K0691J8709J6993J5747J4946J4368J3703J2715J1334
38795H17850R629P796O207N379N780P552J0353J3417J5826J6778J5885J3281R567
38782I55300N495J608j968n506r429j4012j9131k4225k8478l1187l1964l0785
38770G65718k7859k3618j8739j4136j0810r526j0531j3387j7132k0684k3261k4577
38758E51458k4714k3879k2217j9755j6418j2121o893r44N367J1611J7344K2140
38746D80979K5643K7691K8435K8326K7966K7793K7826K7584K6330K3429J8645
38735G70647J2186M532l799j2356k0710k8352l4660l9063m1224m1102l8849l4674
$$ plain form
38723 492576 463699 441748 427096 419219 416805 418112 421367 425065 428080 429661 429431 427417 424068 420190
38709 420190 416776 414751 414667 416451 419353 422224 424063 424581 424455 425156 428451 435847 448161 465290 486240
38694 486240 509401 533024 555623 576125 593758 607890 618048 624166 626865 627532 628131 630768 637188
38681 637188 648346 664239 684047 706426 729772 752324 772263 787877 797838 801474 798951 791306
38669 791306 780263 767797 755588 744571 734774 725442 715354 703268 688325 670307 649637 627216
38657 627216 604239 582068 562112 545638 533546 526195 523338 524136 527196 530701 532715 531643 526624
38644 526624 517659 505424 490949 475375 459790 445121 432033 420840 411502 403708 396995 390852
38632 390852 384786 378380 371389 363820 355953 348252 341223 335240 330373 326269 322193 317302 311069 303693
$$ packed form
38723D92576k8877k1951j4652p877k414J307L255L698L015J581k30k014l349l878
38709D20190l414k025q4J784K902K871J839N18j26P01L295P396J2314J7129K0950
38694D86240K3161K3623K2599K0502J7633J4132J0158O118K699O67N99K637O420
38681F37188J1158J5893J9808K2379K3346K2552J9939J5614R961L636k523p645
38669G91306j1043j2466j2209j1017r797r332j0088j2086j4943j8018k0670k2421
38657F27216k2977k2171j9956j6474j2092p351k857P98L060L505K014j072n019
38644E26624q965j2235j4475j5574j5585j4669j3088j1193r338p794o713o143
38632C90852o066o406o991p569p867p701p029n983m867m104m076m891o233p376
$$ plain form
38618 303693 296241 290398 287862 289678 295882 305666 317871 331480 345826 360503 375125 389116 401675
38605 401675 411938 419245 423362 424532 423404 420876 417937 415490 414134 413986 414659 415491 415910 415685 414898
38590 414898 413719 412202 410276 407903 405224 402603 400550 399580 400039 402008 405365 410021 416136 424093 434208
38575 434208 446351 459815 473472 486024 496169 502767 505210 503979 501010 499382 502257 511558 527144
38562 527144 546929 567811 586867 602252 613562 621649 628048 634234 641055 648540 656068 662713 667555
38549 667555 669895 669424 666344 661377 655597 650052 645315 641222 636928 631296 623364 612657 599319 584087
38535 584087 568225 553357 541210 533268 530434 532809 539660 549578 560815 571686 580986 588293 594127
38522 594127 599849 607324 618384 634259 655200 680437 708458 737432 765604 791485 813837 831572
$$ packed form
38618C03693p452n843k536J816O204R784J2205J3609J4346J4677J4622J3991J2559
38605D01675J0263P307M117J170j128k528k939k447j356j48O73Q32M19k25p87
38590D14898j179j517j926k373k679k621k053r70M59J969L357M656O115P957J0115
38575D34208J2143J3464J3657J2552J0145O598K443j231k969j628K875R301J5586
38562E27144J9785K0882J9056J5385J1310Q087O399O186O821P485P528O645M842
38549F67555K340m71l080m967n780n545m737m093m294n632p932j0707j3338j5232
38535E84087j5862j4868j2147p942k834K375O851R918J1237J0871R300P307N834
38522E94127N722P475J1060J5875K0941K5237K8021K8974K8172K5881K2352J7735
$$ plain form
38510 831572 843744 849732 849483 843610 833317 820186 806006 792564 781289 772857 767011 762820 759278
38497 759278 755878 752877 751172 751900 755879 763120 772614 782603 791215 797115 799888 799991 798425 796342 794687
38482 794687 794007 794455 795936 798364 801856 806756 813475 822207 832597 843515 853052 858882 858944 852221 839164
38467 839164 821549 801806 782237 764463 749304 736958 727379 720591 716865 716626 720135 727141 736787
38454 736787 747941 759757 772159 785885 802057 821494 844124 868720 893044 914286 929666
38443 929666 937094 935711 926084 909927 889401 866396 842116 817122 791677 766099 740980 717243
38431 717243 696136 679139 667751 663116 665664 674959 689814 708484 728794 748194 763927 773398
38419 773398 774679 766871 750183 725715 695113 660307 623382 586466 551573 520406 494212 473748
$$ packed form
38510H31572J2172N988k49n873j0293j3131j4180j3442j1275q432n846m191l542
38497G59278l400l001j705P28L979P241R494R989Q612N900K773J03j566k083j655
38482G94687o80M48J481K428L492M900O719Q732J0390J0918R537N830O2o723j3057
38467H39164j7615j9743j9569j7774j5159j2346r579o788l726k39L509P006R646
38454G36787J1154J1816J2402J3726J6172J9437K2630K4596K4324K1242J5380
38443I29666P428j383r627j6157k0526k3005k4280k4994k5445k5578k5119k3737
38431G17243k1107j6997j1388m635K548R295J4855J8670K0310J9400J5733R471
38419G73398J281p808j6688k4468l0602l4806l6925l6916l4893l1167k6194k0464
$$ plain form
38407 473748 459349 451065 448769 452150 460575 472965 487889 503899 519963 535686 551256 567150
38395 567150 583813 601390 619603 637740 654787 669646 681394 689509 694007 695507 695212 694783 696074
38382 696074 700785 710160 724816 744756 769472 798017 829025 860754 891264 918750 941902 960138
38370 960138 973621 983116 989796 995065 1000361 1006845 1015051 1024639 1034520 1043244 1049452 1052129 1050710 1045145
38356 1045145 1035992 1024431 1012109 1000847 992262 987427 986640 989364 994391 1000092 1004694 1006526 1004233
38343 1004233 997024 984850 968410 948852 927269 904239 879682 853129 824179 792865 759794
38332 759794 726063 693082 662348 635235 612818 595725 584051 577321 574512 574144 574486 573840 570849
38319 570849 564785 555698 544410 532272 520754 511014 503609 498510 495375 493941 494314 496987 502557 511318
$$ packed form
38407D73748j4399q284k296L381Q425J2390J4924J6010J6064J5723J5570J5894
38395E67150J6663J7577J8213J8137J7047J4859J1748Q115M498J500k95m29J291
38382F96074M711R375J4656J9940K4716K8545L1008L1729L0510K7486K3152J8236
38370I60138J3483R495O680N269N296O484Q206R588R881Q724O208K677j419n565
38356A045145r153j1561j2322j1262q585m835p87K724N027N701M602J832k293
38343A004233p209j2174j6440j9558k1583k3030k4557k6553k8950l1314l3071
38332G59794l3731l2981l0734k7113k2417j7093j1674o730k809l68L42o46k991
38319E70849o064r087j1288j2138j1518r740p405n099l135j434L73K673N570Q761
$$ plain form
38305 511318 522907 536202 549486 560799 568317 570602 566728 556358 539782 517882 492010 463826
38293 463826 435176 408035 384467 366574 356375 355538 364963 384412 412402 446492 483727 521101
38281 521101 555862 585773 609329 625917 635911 640700 642622 644733 650240 661640 679919 704230
38269 704230 732275 761203 788495 812452 832162 847146 857003 861325 859940 853260 842455 829273
38257 829273 815660 803257 792992 784847 777896 770656 761560 749389 733569 714382 693051 671503
38245 671503 651816 635477 622899 613426 605773 598590 590825 581761 570896 557842 542409 524767
38233 524767 505617 486148 467749 451540 438000 426895 417543 409184 401210 393193 384807 375843 366376
38220 366376 357024 349102 344507 345258 352876 367908 389854 417403 448716 481597 513637 542502 566305
$$ packed form
38305E11318J1589J3295J3284J1313P518K285l874j0370j6576k1900k5872k8184
38293D63826k8650k7141k3568j7893j0199q37R425J9449K7990L4090L7235L7374
38281E21101L4761K9911K3556J6588R994M789J922K111N507J1400J8279K4311
38269G04230K8045K8928K7292K3957J9710J4984R857M322j385o680j0805j3182
38257H29273j3613j2403j0265q145o951p240r096j2171j5820j9187k1331k1548
38245F71503j9687j6339j2578r473p653p183p765r064j0865j3054j5433j7642
38233E24767j9150j9469j8399j6209j3540j1105r352q359p974q017q386q964r467
38220C66376r352p922m595P51P618J5032K1946K7549L1313L2881L2040K8865K3803
$$ plain form
38207 566305 583853 594624 598548 595834 586985 572977 555482 536930 520282 508492 503817 507229
38195 507229 518165 534706 554110 573521 590558 603646 612035 615583 614439 608784 598733 584424
38183 584424 566183 544634 520693 495500 470378 446843 426642 411699 403944 404999 415751 435967
38171 435967 464175 497905 534219 570239 603464 631886 654095 669375 677717 679572 675497 665990
38159 665990 651584 633120 611876 589477 567607 547668 530474 516124 504109 493594 483681 473521
38147 473521 462315 449374 434239 416818 397518 377311 357733 340666 327877 320497 318692 321687
38135 321687 328106 336437 345381 354029 361927 369084 376010 383669 393379 406636 424902 449266 479990
38122 479990 516146 555525 594972 630958 660268 680575 690809 691248 683334 669267 651469 632082
$$ packed form
38207E66305J7548J0771L924k714q849j4008j7495j8552j6648j1790m675L412
38195E07229J0936J6541J9404J9411J7037J3088Q389L548j144n655j0051j4309
38183E84424j8241k1549k3941k5193k5122k3535k0201j4943p755J055J0752K0216
38171D35967K8208L3730L6314L6020L3225K8422K2209J5280Q342J855m075r507
38159F65990j4406j8464k1244k2399k1870j9939j7194j4350j2015j0515r913j0160
38147D73521j1206j2941j5135j7421j9300k0207j9578j7067j2789p380j805K995
38135C21687O419Q331Q944Q648P898P157O926P659R710J3257J8266K4364L0724
38122D79990L6156L9379L9447L5986K9310K0307J0234M39p914j4067j7798j9387
$$ plain form
38110 632082 612699 594403 577938 563817 552281 543260 536458 531531 528215 526267 525286 524544 523016
38097 523016 519682 513925 505797 495996 485639 475991 468234 463289 461704 463639 468927 477086 487242 498051
38083 498051 507804 514844 518157 517805 514944 511422 509189 509769 513901 521420 531346 542193 552328 560254
38069 560254 564735 564832 559980 550148 535953 518573 499459 480025 461455 444688 430404 418981 410469
38056 410469 404641 401201 399993 401109 404774 411077 419687 429784 440205 449753 457502 463017 466433 468349
38042 468349 469600 470989 473118 476307 480670 486242 493089 501238 510425 519870 528319 534434 537373 537213
38028 537213 534911 531838 529119 527228 526067 525363 525057 525372 526634 529056 532703 537631 544031 552254 562741
38013 562741 575928 592175 611675 634278 659354 685812 712362 737930 762019 784787 806806
$$ packed form
38110F32082j9383j8296j6465j4121j1536r021o802m927l316j948r81p42j528
38097E23016l334n757q128r801j0357r648p757m945j585J935N288Q159J0156J0809
38083D98051R753P040L313l52k861l522k233N80M132P519R926J0847J0135P926
38069E60254M481R7m852r832j4195j7380j9114j9434j8570j6767j4284j1423q512
38056D10469n828l440j208J116L665O303Q610J0097J0421R548P749N515L416J916
38042D68349J251J389K129L189M363N572O847Q149R187R445Q449O115K939j60
38028E37213k302l073k719j891j161p04l06L15J262K422L647M928O400Q223J0487
38013E62741J3187J6247J9500K2603K5076K6458K6550K5568K4089K2768K2019
$$ plain form
38002 806806 828660 850634 872580 893933 913840 931358 945691 956374 963394 967243 968902 969674
37990 969674 970839 973239 977001 981545 985854 988898 990044 989245 986951 983821 980440 977214 974495 972801
37976 972801 973001 976235 983613 995832 1012908 1034144 1058249 1083571 1108337 1130914 1149985 1164626
37964 1164626 1174254 1178504 1177163 1170293 1158432 1142697 1124664 1106078 1088543 1073275 1060845 1050992
37952 1050992 1042555 1033646 1022104 1006038 984314 956769 924210 888270 851196 815441 783078 755262
37940 755262 732028 712533 695529 679814 664484 648936 632707 615323 596302 575298 552246
37929 552246 527467 501741 476268 452409 431251 413214 398044 385176 374193 365153 358608 355407
37917 355407 356353 361924 372158 386695 404820 425419 446918 467436 485197 499040 508715 514837
$$ packed form
38002H06806K1854K1974K1946K1353J9907J7518J4333J0683P020L849J659P72
37990I69674J165K400L762M544M309L044J146p99k294l130l381l226k719j694
37976I72801K00L234P378J2219J7076K1236K4105K5322K4766K2577J9071J4641
37964A164626R628M250j341o870j1861j5735j8033j8586j7535j5268j2430r853
37952A050992q437q909j1542j6066k1724k7545l2559l5940l7074l5755l2363k7816
37940G55262k3234j9495j7004j5715j5330j5548j6229j7384j9021k1004k3052
37929E52246k4779k5726k5473k3859k1158j8037j5170j2868j0983r040o545l201
37917C55407R46N571J0234J4537J8125K0599K1499K0518J7761J3843R675O122
$$ plain form
37905 514837 518632 521673 525652 532141 542220 556143 573236 592163 611435 629842 646568 660987
37893 660987 672352 679656 681774 677779 667294 650663 628849 603096 574582 544236 512804 481068
37881 481068 450067 421207 396155 376541 363613 358042 359929 368904 384186 404588 428529 454106
37869 454106 479224 501819 520111 532860 539545 540438 536523 529267 520204 510518 500812 491217 481763
37856 481763 472734 464766 458649 454991 453903 454895 456981 458990 459967 459440 457405 454088 449676 444203 437569
37841 437569 429604 420042 408518 394663 378348 359943 340407 321138 303634 289179 278689 272768
37829 272768 271888 276560 287349 304673 328458 357842 391152 426226 460926 493572 523086 548901
37817 548901 570795 588826 603295 614693 623562 630374 635462 639002 640983 641172 639124 634359 626626
$$ packed form
37905E14837L795L041L979O489J0079J3923J7093J8927J9272J8407J6726J4419
37893F60987J1365P304K118l995j0485j6631k1814k5753k8514l0346l1432l1736
37881D81068l1001k8860k5052j9614j2928n571J887Q975J5282K0402K3941K5577
37869D54106K5118K2595J8292J2749O685Q93l915p256r063r686r706r595r454
37856D81763r029p968o117l658j088R92K086K009R77n27k035l317m412n473o634
37841D37569p965r562j1524j3855j6315j8405j9536j9269j7504j4455j0490n921
37829B72768q80M672J0789J7324K3785K9384L3310L5074L4700L2646K9514K5815
37817E48901K1894J8031J4469J1398Q869O812N088L540J981J89k048m765p733
$$ plain form
37804 626626 616167 603763 590585 577980 567306 559810 556513 558128 565019 577213 594409 615993
37792 615993 641101 668648 697278 725282 750666 771402 785791 792754 792008 784158 770698 753861
37780 753861 736254 720289 707626 698865 693628 690945 689656 688642 686971 684004 679539 673852 667557
37767 667557 661332 655632 650567 645982 641649 637478 633692 630961 630397 633313 640839 653570 671422 693683
37753 693683 719151 746322 773598 799545 823073 843475 860365 873617 883355 889972 894007 895891
37741 895891 895733 893353 888619 881841 873865 865785 858382 851682 844913 836967 827087 815377 802809 790747
37727 790747 780266 771676 764475 757709 750470 742203 732737 722071 710159 696813 681753 664730 645596
37714 645596 624334 601133 576563 551747 528327 508103 492462 481867 475667 472317 469979 467183
$$ packed form
37804F26626j0459j2404j3178j2605j0674p496l297J615O891J2194J7196K1584
37792F15993K5108K7547K8630K8004K5384K0736J4389O963p46p850j3460j6837
37780G53861j7607j5965j2663q761n237k683j289j014j671k967m465n687o295
37767F67557o225n700n065m585m333m171l786k731n64K916P526J2731J7852K2261
37753F93683K5468K7171K7276K5947K3528K0402J6890J3252R738O617M035J884
37741H95891j58k380m734o778p976q080p403o700o769p946r880j1710j2568j2062
37727G90747j0481q590p201o766p239q267r466j0666j1912j3346j5060j7023j9134
37714F45596k1262k3201k4570k4816k3420k0224j5641j0595o200l350k338k796
$$ plain form
37702 467183 463303 458692 454515 452382 453795 459567 469383 481718 494192 504272 510075 510983 507758 502156
37688 502156 496245 491726 489517 489679 491731 495242 500346 507837 518751 533747 552683 574619 598204
37675 598204 622228 646054 669733 693746 718575 744395 771092 798475 826448 854890 883349
37664 883349 910812 935732 956291 970757 977859 977148 969197 955536 938246 919390 900536 882503
37652 882503 865362 848631 831546 813301 793190 770637 745199 716639 685043 650963 615443
37641 615443 579871 545724 514236 486131 461536 440081 421155 404226 389089 376032 365757
37630 365757 359172 357100 360075 368225 381237 398397 418757 441307 465133 489503 513957 538386
37618 538386 562988 588064 613770 639997 666408 692547 717904 741943 764099 783771 800312
$$ packed form
37702D67183l880m611m177k133J413N772R816J2335J2474J0080N803R08l225n602
37688E02156n911m519k209J62K052L511N104P491J0914J4996J8936K1936K3585
37675E98204K4024K3826K3679K4013K4829K5820K6697K7383K7973K8442K8459
37664H83349K7463K4920K0559J4466P102p11p951j3661j7290j8856j8854j8033
37652H82503j7141j6731j7085j8245k0111k2553k5438k8560l1596l4080l5520
37641F15443l5572l4147l1488k8105k4595k1455j8926j6929j5137j3057j0275
37630C65757o585k072K975Q150J3012J7160K0360K2550K3826K4370K4454K4429
37618E38386K4602K5076K5706K6227K6411K6139K5357K4039K2156J9672J6541
$$ plain form
37607 800312 813065 821458 825136 824029 818293 808184 794036 776388 756155 734660 713444 693950
37595 693950 677216 663680 653215 645320 639420 635048 631874 629654 628225 627507 627478 628061 628966 629597 629075
37580 629075 626459 621106 612985 602793 591765 581306 572602 566368 562782 561573 562211 564109 566775 569836
37566 569836 572924 575549 577101 577010 574952 570944 565289 558434 550835 542873 534843 527002 519629 513038 507523
37551 507523 503218 499949 497192 494243 490580 486282 482281 480262 482133 489257 501792 518583 537610
37538 537610 556761 574505 590231 604187 617079 629469 641263 651552 658827 661476 658366 649326
37526 649326 635361 618498 601253 585861 573547 564179 556498 548856 540004 529582 518078 506499
37514 506499 495939 487246 480823 476586 474020 472310 470515 467787 463648 458151 451868 445631 440142 435680
$$ packed form
37607H00312J2753Q393L678j107n736j0109j4148j7648k0233k1495k1216j9494
37595F93950j6734j3536j0465p895n900m372l174k220j429p18k9N83R05O31n22
37580F29075k616n353q121j0192j1028j0459q704o234l586j209O38J898K666L061
37566E69836L088K625J552r1k058m008n655o855p599p962q030p841p373o591n515
37551E07523m305l269k757k949l663m298m001k019J871P124J2535J6791J9027
37538E37610J9151J7744J5726J3956J2892J2390J1794J0289P275K649l110r040
37526F49326j3965j6863j7245j5392j2314r368p681p642q852j0422j1504j1579
37514E06499j0560q693o423m237k566j710j795k728m139n497o283o237n489m462
$$ plain form
37500 435680 431978 428284 423508 416420 405930 391429 373092 351981 329974 309615 293874 285749
37488 285749 287650 300754 324642 357479 396664 439569 483903 527667 568952 605913 636991 661178
37476 661178 678132 688083 691617 689502 682628 672012 658721 643705 627615 610764 593240 575062
37464 575062 556282 536990 517266 497119 476485 455361 434099 413676 395703 382044 374208 372911
37452 372911 378064 389083 405208 425656 449637 476331 504827 533989 562371 588252 609852 625654
37440 625654 634769 637241 634161 627523 619895 613961 612003 615391 624321 637926 654741 673306 692598
37427 692598 712170 732010 752315 773370 795570 819387 845102 872448 900383 927209 950960
37416 950960 969859 982638 988583 987369 978867 963112 940418 911469 877301 839211 798673 757327
$$ packed form
37500D35680l702l694m776p088j0490j4501j8337k1111k2007k0359j5741q125
37488B85749J901J3104K3888L2837L9185M2905M4334M3764M1285L6961L1078K4187
37476F61178J6954R951L534k115o874j0616j3291j5016j6090j6851j7524j8178
37464E75062j8780j9292j9724k0147k0634k1124k1262k0423j7973j3659p836j297
37452C72911N153J1019J6125K0448K3981K6694K8496K9162K8382K5881K1600J5802
37440F25654R115K472l080o638p628n934j958L388Q930J3605J6815J8565J9292
37427F92598J9572J9840K0305K1055K2200K3817K5715K7346K7935K6826K3751
37416I50960J8899J2779N945j214q502j5755k2694k8949l4168l8090m0538m1346
$$ plain form
37404 757327 717004 679754 647688 622611 605529 596280 593517 595045 598385 601342 602368 600647 596000
37391 596000 588676 579109 567640 554325 538985 521419 501582 479650 455990 431192 406085 381704
37379 381704 359150 339457 323520 312088 305727 304706 308943 318089 331737 349514 370953 395296
37367 395296 421448 448129 474014 497787 518253 534626 546867 555772 562659 568793 574857 580803
37355 580803 586125 590307 593157 594797 595452 595246 594209 592465 590475 589135 589698 593559 601984 615774 634971
37340 634971 658713 685388 713009 739644 763779 784505 801496 814708 823972 828781 828471 822716
37328 822716 812008 797794 782176 767353 755157 746838 742994 743548 747845 754944 763955 774199 785142
37315 785142 796340 807565 818970 831078 844602 860142 877943 897739 918755 939883 959909
$$ packed form
37404G57327m0323l7250l2066k5077j7082r249k763J528L340K957J026j721m647
37391E96000p324r567j1469j3315j5340j7566j9837k1932k3660k4798k5107k4381
37379C81704k2554j9693j5937j1432o361j021M237R146J3648J7777K1439K4343
37367C95296K6152K6681K5885K3773K0466J6373J2241Q905O887O134O064N946
37355E80803N322M182K850J640O55k06j037j744j990j340N63L861Q425J3790J9197
37340F34971K3742K6675K7621K6635K4135K0726J6991J3212R264M809l10n755
37328H22716j0708j4214j5618j4823j2196q319l844N54M297P099R011J0244J0943
37315G85142J1198J1225J1405J2108J3524J5540J7801J9796K1016K1128K0026
$$ plain form
37304 959909 977803 992970 1005435 1015801 1025009 1033983 1043335 1053157 1062957 1071758 1078367 1081706 1081074
37291 1081074 1076294 1067717 1056117 1042455 1027683 1012642 998080 984748 973505 965355 961337 962306
37279 962306 968709 980483 997087 1017585 1040760 1065233 1089588 1112475 1132700 1149318 1161719 1169686
37267 1169686 1173403 1173379 1170291 1164759 1157190 1147665 1135930 1121450 1103657 1082318 1057907 1031724 1005588
37254 1005588 981203 959575 940838 924610 910581 898911 890231 885348 884854 888840 896828 907902
37242 907902 920863 934302 946656 956416 962475 964394 962451 957494 950701 943329 936577 931581 929453
37229 929453 931151 937181 947341 960751 976073 991792 1006479 1019025 1028839 1035911 1040723 1043974 1046243
37216 1046243 1047780 1048629 1049020 1049735 1052088 1057535 1067088 1080965 1098699 1119693 1143802 1171438 1203038
$$ packed form
37304I59909J7894J5167J2465J0366R208Q974R352R822R800Q801O609L339o32
37291A081074m780q577j1600j3662j4772j5041j4562j3332j1243q150m018R69
37279I62306O403J1774J6604K0498K3175K4473K4355K2887K0225J6618J2401P967
37267A169686L717k4l088n532p569r525j1735j4480j7793k1339k4411k6183k6136
37254A005588k4385k1628j8737j6228j4029j1670q680m883m94L986P988J1074
37242I07902J2961J3439J2354R760O059J919j943m957o793p372o752m996k128
37229I29453J698O030J0160J3410J5322J5719J4687J2546R814P072M812L251K269
37216A046243J537Q49L91P15K353N447R553J3877J7734K0994K4109K7636L1600
$$ plain form
37203 1203038 1238359 1276195 1314799 1352689 1389301 1425124 1461279 1498839 1538272 1579185 1620393
37192 1620393 1660097 1696096 1725981 1747361 1758221 1757402 1745092 1723049 1694472 1663449 1634121 1609817
37180 1609817 1592500 1582769 1580191 1583676 1591629 1602099 1613086 1622965 1630812 1636430 1640070 1642017 1642358
37167 1642358 1641151 1638837 1636489 1635596 1637489 1642742 1650792 1659914 1667617 1671398 1669520 1661481 1647981 1630480
37153 1630480 1610578 1589524 1568067 1546591 1525304 1504328 1483794 1464068 1445998 1430940 1420498
37142 1420498 1416121 1418782 1428860 1446183 1470048 1499070 1531040 1563148 1592672 1617767 1637856 1653413
37130 1653413 1665356 1674464 1681097 1685338 1687366 1687748 1687447 1687595 1689230 1693118 1699673 1708995 1720920 1735015
37116 1735015 1750587 1766871 1783379 1800135 1817552 1836061 1855861 1876905 1899025 1922028 1945695
$$ packed form
37203A203038L5321L7836L8604L7890L6612L5823L6155L7560L9433M0913M1208
37192A620393L9704L5999K9885K1380J0860q19j2310k2043k8577l1023k9328k4304
37180A609817j7317r731k578L485P953J0470J0987R879P847N618L640J947L41
37167A642358j207k314k348q93J893N253Q050R122P703L781j878q039j3500j7501
37153A630480j9902k1054k1457k1476k1287k0976k0534j9726j8070j5058j0442
37142A420498m377K661J0078J7323K3865K9022L1970L2108K9524K5095K0089J5557
37130A653413J1943R108O633M241K028L82l01J48J635L888O555R322J1925J4095
37116A735015J5572J6284J6508J6756J7417J8509J9800K1044K2120K3003K3667
$$ plain form
37105 1945695 1969776 1993973 2017979 2041556 2064669 2087662 2111429 2137406 2167215 2202022 2241962
37094 2241962 2285948 2331932 2377402 2419953 2457741 2489621 2514972 2533417 2544690 2548740 2546036 2537862
37082 2537862 2526442 2514678 2505502 2501132 2502562 2509527 2520968 2535833 2553802 2575461 2601907 2634077
37070 2634077 2672307 2716164 2764468 2815520 2867496 2918845 2968462 3015655 3060087 3101801 3141285
37059 3141285 3179545 3218145 3259166 3305061 3358463 3421920 3497468 3586149 3687778 3801138 3924447
37048 3924447 4055664 4192477 4332059 4470726 4603720 4725320 4829373 4910203 4963735 4988576
37038 4988576 4986594 4962531 4922746 4873838 4821804 4771805 4728125 4694175 4672518 4664830 4671652 4692058
37026 4692058 4723608 4762736 4805439 4848045 4887807 4923140 4953458 4978809 4999596 5016424 5030107
$$ packed form
37105A945695K4081K4197K4006K3577K3113K2993K3767K5977K9809L4807L9940
37094B241962M3986M5984M5470M2551L7788L1880K5351J8445J1273M050k704q174
37082B537862j1420j1764r176m370J430O965J1441J4865J7969K1659K6446L2170
37070B634077L8230M3857M8304N1052N1976N1349M9617M7193M4432M1714L9484
37059C141285L8260L8600M1021M5895N3402O3457P5548Q8681J01629J13360J23309
37048C924447J31217J36813J39582J38667J32994J21600J04053Q0830N3532K4841
37038D988576j982k4063l9785m8908n2034m9999m3680l3950k1657p688O822K0406
37026D692058L1550L9128M2703M2606L9762L5333L0318K5351K0787J6828J3683
$$ plain form
37015 5030107 5041863 5053677 5068443 5089603 5120433 5163354 5219530 5288800 5369901 5460934 5559775
37004 5559775 5664197 5771897 5880586 5988195 6093013 6193816 6290132 6382490 6472392 6562016
36994 6562016 6653799 6749959 6852061 6960861 7076577 7199281 7328983 7465438 7608077 7756259
36984 7756259 7909661 8068555 8233842 8406722 8588169 8778587 8978009 9186578 9404861
36975 9404861 9633866 9874919 10129497 10399023 10684782 10988042 11310144 11652280 12015198
36966 12015198 12399238 12804717 13232366 13683688 14161180 14668129 15207972 15783658 16397663
36957 16397663 17052436 17750706 18495480 19290005 20137858 21043154 22011003 23048235 24163922
36948 24163922 25369244 26676960 28101088 29656792 31360212 33228464 35280197 37536446
$$ packed form
37015E030107J1756J1814J4766K1160L0830M2921N6176O9270Q1101R1033R8841
37004E559775J04422J07700J08689J07609J04818J00803R6316R2358Q9902Q9624
36994F562016R1783R6160J02102J08800J15716J22704J29702J36455J42639J48182
36984G756259J53402J58894J65287J72880J81447J90418J99422K08569K18283
36975I404861K29005K41053K54578K69526K85759L03260L22102L42136L62918
36966A2015198L84040M05479M27649M51322M77492N06949N39843N75686O14005
36957A6397663O54773O98270P44774P94525Q47853R05296R67849J037232J115687
36948B4163922J205322J307716J424128J555704J703420J868252K051733K256249
$$ plain form
36940 37536446 40021260 42762254 45791523 49146590 52870908 57014117 61632662 66790412
36932 66790412 72558676 79015788 86246771 94342604 103398247 113509607 124769796 137263202
36924 137263202 151054576 166170820 182573405 200119031 218508514 237230266 255512968
36917 255512968 272312845 286374096 296399295 301323403 300606663 294409843 283553923
36910 283553923 269282494 252947587 235751236 218607646 202115921 186600273 172178275
36903 172178275 158832203 146471415 134982679 124267703 114264274 104947704 96316608
36896 96316608 88374125 81114376 74517103 68548402 63164663 58317282 53956326 50032765
36888 50032765 46499988 43315014 40439037 37837324 35479117 33337822 31390910 29619307
$$ packed form
36940C7536446K484814K740994L029269L355067L724318M143209M618545N157750
36932F6790412N768264O457112P230983Q095833R055643J0111360J1260189J2493406
36924A37263202J3791374J5116244J6402585J7545626J8389483J8721752J8282702
36917B55512968J6799877J4061251J0025199M924108p16740o196820j0855920
36910B83553923j4271429j6334907j7196351j7143590j6491725j5515648j4421998
36903A72178275j3346072j2360788j1488736j0714976j0003429r316570q631096
36896I6316608p942483p259749o597273n968701n383739m847381m360956l923561
36888E0032765l532777l184974k875977k601713k358207k141295j946912j771603
$$ plain form
36880 29619307 28006649 26538655 25202452 23985957 22877696 21867032 20944248 20100416
36872 20100416 19327445 18618332 17967250 17369280 16820224 16316644 15855891 15436045 15055943
36863 15055943 14715202 14413893 14152017 13929236 13745037 13598891 13490258 13418682 13384097 13387011
36853 13387011 13428440 13509781 13632756 13799220 14010870 14269181 14575684 14932341 15341798 15807630
36843 15807630 16334570 16928442 17595749 18343131 19176839 20102188 21122918 22240663 23454494
36834 23454494 24760254 26149418 27607548 29112376 30631659 32121352 33525060 34775731
36826 34775731 35800159 36526512 36894365 36865249 36430548 35613843 34466790 33059978 31471623
36817 31471623 29777207 28042232 26318719 24644741 23045855 21537444 20127233 18817545
$$ packed form
36880B9619307j612658j467994j336203j216495j108261j010664r22784q43832
36872B0100416p72971p09113o51082n97970n49056n03580m60753m19846l80102
36863A5055943l40741l01309k61876k22781j84199j46146j08633p1576l4585K914
36853A3387011M1429Q1341J22975J66464K11650K58311L06503L56657M09457M65832
36843A5807630N26940N93872O67307P47382Q33708R25349J020730J117745J213831
36834B3454494J305760J389164J458130J504828J519283J489693J403708J250671
36826C4775731J024428P26353L67853k9116m34701q16705j147053j406812j588355
36817C1471623j694416j734975j723513j673978j598886j508411j410211j309688
$$ plain form
36809 18817545 17607179 16492999 15471143 14537655 13688568 12919792 12227081 11606085 11052448
36800 11052448 10561972 10130798 9755397 9432299 9157712 8927251 8735818 8577660 8446602
36791 8446602 8336339 8240612 8153388 8069396 7985157 7900030 7816604 7740176 7677527 7635549 7620192
36780 7620192 7635980 7686020 7772276 7896000 8058182 8259813 8501572 8782835 9100228 9445976
36770 9445976 9806351 10160691 10481972 10739945 10906958 10964937 10910638 10756514 10526565 10249313
36760 10249313 9951258 9653093 9368991 9107911 8875722 8677165 8516967 8399995 8330707
36751 8330707 8312407 8346449 8431412 8562257 8729558 8918814 9110038 9278183 9395263 9434653
36741 9434653 9376936 9215139 8956723 8621075 8233709 7820077 7401291 6992389 6602477 6235970
$$ packed form
36809A8817545j210366j114180j021856r33488q49087p68776o92711o20996n53637
36800A1052448m90476m31174l75401l23098k74587k30461j91433j58158j31058
36791H446602j10263r5727q7224q3992q4239q5127q3426p6428o2649m1978j5357
36780G620192J5788N0040Q6256J23724J62182K01631K41759K81263L17393L45748
36770I445976L60375L54340L21281K57973J67013N7979n4299j54124k29949k77252
36760A0249313k98055k98165k84102k61080k32189j98557j60198j16972o9288
36751H330707j8300L4042Q4963J30845J67301J89256J91224J68145J17080L9390
36741I434653n7717j61797k58416l35648l87366m13632m18786m08902l89912l66507
$$ plain form
36731 6235970 5894318 5577693 5286172 5020307 4781067 4569347 4385350 4228228 4096187
36722 4096187 3986864 3897739 3826527 3771511 3731656 3706421 3695398 3697994 3713218 3739626 3775499
36711 3775499 3819211 3869448 3924974 3983936 4043011 4096769 4137654 4157041 4147321 4104274 4028516
36700 4028516 3925376 3803315 3671745 3539109 3411786 3293916 3187816 3094516 3014119 2945970
36690 2945970 2888777 2840858 2800616 2767030 2739864 2719480 2706451 2701174 2703525 2712535 2726163 2741420
36678 2741420 2754840 2763140 2763885 2755966 2739776 2717004 2690107 2661637 2633646 2607398 2583419 2561846
36666 2561846 2542788 2526521 2513439 2503831 2497562 2493790 2490893 2486649 2478600 2464510 2442775 2412717
36654 2412717 2374592 2329347 2278212 2222346 2162676 2099951 2035002 1968992 1903437 1839985 1780097
$$ packed form
36731F235970l41652l16625k91521k65865k39240k11720j83997j57122j32041
36722D096187j09323q9125p1212n5016l9855k5235j1023K596J5224K6408L5873
36711C775499M3712N0237N5526N8962N9075N3758M0885J9387r720m3047p5758
36700D028516j03140j22061j31570j32636j27323j17870j06100r3300q0397o8149
36690B945970n7193m7919m0242l3586k7166k0384j3029n277K351R010J3628J5257
36678B741420J3420Q300P45p919j6190k2772k6897k8470k7991k6248k3979k1573
36666B561846j9058j6267j3082r608o269l772k897m244q049j4090k1735l0058
36654B412717l8125m5245n1135n5866n9670o2725o4949o6010o5555o3452n9888
$$ plain form
36643 1780097 1724865 1674937 1630507 1591390 1557130 1527067 1500309 1475776 1452390 1429358 1406328
36632 1406328 1383372 1360794 1338953 1318170 1298798 1281308 1266243 1253966 1244377 1236749 1229743 1221647
36620 1221647 1210893 1196709 1179592 1161257 1144152 1130788 1123114 1122039 1127185 1136953 1148900 1160366
36608 1160366 1169203 1174375 1176175 1175999 1175853 1177800 1183444 1193492 1207602 1224609 1243059 1261818 1280569
36595 1280569 1300030 1321822 1347949 1380104 1419038 1464201 1513839 1565687 1618050 1670727 1725181
36584 1725181 1783917 1849466 1923556 2006860 2099477 2201870 2315684 2443929 2590445 2759081
36574 2759081 2952972 3174095 3423046 3698850 3998513 4316203 4642228 4962262 5257385
36565 5257385 5505594 5685103 5778960 5779319 5689478 5522746 5298851 5039563 4765055 4491793
$$ packed form
36643A780097n5232m9928m4430l9117l4260l0063k6758k4533k3386k3032k3030
36632A406328k2956k2578k1841k0783j9372j7490j5065j2277r589p628p006q096
36620A221647j0754j4184j7117j8335j7105j3364p674j075N146R768J1947J1466
36608A160366Q837N172J800j76j46J947N644J0048J4110J7007J8450J8759J8751
36595A280569J9461K1792K6127L2155L8934M5163M9638N1848N2363N2677N4454
36584A725181N8736O5549P4090Q3304R2617J02393J13814J28245J46516J68636
36574B759081J93891K21123K48951K75804K99663L17690L26025L20034K95123
36565E257385K48209J79509R3857L59q9841j66732k23895k59288k74508k73262
$$ plain form
36555 4491793 4231841 3993044 3779534 3592299 3429881 3289203 3166432 3057699 2959545 2868996
36545 2868996 2783367 2699999 2616248 2529772 2439023 2343724 2245141 2145936 2049566 1959429 1878177
36534 1878177 1807452 1748033 1700252 1664387 1640867 1630123 1632151 1646085 1669989 1701029 1735964
36523 1735964 1771807 1806373 1838502 1868023 1895624 1922724 1951263 1983425 2021372 2067008 2121742
36512 2121742 2186309 2260831 2345197 2439614 2545077 2663585 2798024 2951793 3128336 3330878
36502 3330878 3562406 3825875 4124454 4461690 4841508 5267896 5744214 6272161 6850541
36493 6850541 7474099 8132568 8810002 9484292 10127006 10704304 11179852 11520137 11701075
36484 11701075 11713552 11565500 11279468 10886810 10420979 9912329 9385486 8858966 8346025
$$ packed form
36555D491793k59952k38797k13510j87235j62418j40678j22771j08733r8154r0549
36545B868996q5629q3368q3751q6476r0749r5299r8583r9205r6370r0137q1252
36534A878177p0725n9419m7781l5865k3520j0744K028J3934K3904L1040L4935
36523A735964L5843L4566L2129K9521K7601K7100K8539L2162L7947M5636N4734
36512B121742O4567P4522Q4366R4417J05463J18508J34439J53769J76543K02542
36502C330878K31528K63469K98579L37236L79818M26388M76318N27947N78380
36493F850541O23558O58469O77434O74290O42714N77298M75548L40285J80938
36484A1701075J2477j48052k86032l92658m65831n08650n26843n26520n12941
$$ plain form
36475 8346025 7855742 7393736 6962424 6561230 6187242 5836426 5504979 5190279 4891186
36466 4891186 4607819 4341083 4092262 3862773 3653956 3466731 3301182 3156325 3030198
36457 3030198 2920200 2823476 2737222 2658887 2586268 2517592 2451649 2387940 2326645 2268398 2213927
36446 2213927 2163756 2118008 2076363 2038167 2002582 1968737 1935819 1903234 1870902 1839525 1810657
36435 1810657 1786454 1769162 1760531 1761361 1771370 1789366 1813638 1842505 1874866 1910467 1949602 1992419
36423 1992419 2038299 2085726 2132639 2176994 2217211 2252340 2281906 2305635 2323326 2334884 2340442
36412 2340442 2340374 2335225 2325501 2311390 2292571 2268397 2238397 2202851 2163048 2121206 2080106 2042583
36400 2042583 2010995 1986857 1970705 1962163 1960125 1963084 1969494 1977994 1987504 1997291 2007109 2017276 2028547
$$ packed form
36475H346025m90283m62006m31312m01194l73988l50816l31447l14700k99093
36466D891186k83367k66736k48821k29489k08817j87225j65549j44857j26127
36457C030198j09998r6724q6254p8335p2619o8676o5943o3709o1295n8247n4471
36446B213927n0171m5748m1645l8196l5585l3845l2918l2585l2332l1377k8868
36435A810657k4203j7292q631Q30J0009J7996K4272K8867L2361L5601L9135M2817
36423A992419M5880M7427M6913M4355M0217L5129K9566K3729J7691J1558N558
36412B340442o8n149r724j4111j8819k4174l0000l5546l9803m1842m1100l7523
36400B042583l1588k4138j6152q542k038K959O410Q500R510R787R818J0167J1271
$$ plain form
36387 2028547 2041909 2058417 2079105 2104941 2136836 2175667 2222225 2277065 2340426 2412299 2492592
36376 2492592 2581201 2678012 2782831 2895367 3015315 3142643 3277984 3422855 3579577 3751037
36366 3751037 3940546 4151886 4389548 4659061 4967227 5322050 5732405 6207906 6759126
36357 6759126 7397937 8137612 8992631 9978208 11109400 12399699 13859031 15490784 17287218
36348 17287218 19222986 21247488 23277743 25195282 26852908 28096700 28801342 28905565
36340 28905565 28429603 27465080 26144055 24604159 22964033 21313067 19711638 18196405
36332 18196405 16786835 15490927 14309369 13238314 12271299 11400587 10618069 9915793 9286212
36323 9286212 8722040 8215793 7759513 7345075 6965014 6613314 6285781 5979905 5694422
$$ packed form
36387B028547J3362J6508K0688K5836L1895L8831M6558N4840O3361P1873Q0293
36376B492592Q8609R6811J04819J12536J19948J27328J35341J44871J56722J71460
36366C751037J89509K11340K37662K69513L08166L54823M10355M75501N51220
36357F759126O38811P39675Q55019R85577J131192J290299J459332J631753J796434
36348A7287218J935768K024502K030255J917539J657626J243792P04642J04223
36340B8905565m75962r64523j321025j539896j640126j650966j601429j515233
36332A8196405j409570j295908j181558j071055r67015q70712p82518p02276o29581
36323I286212n64172n06247m56280m14438l80061l51700l27533l05876k85483
$$ plain form
36314 5694422 5428799 5182854 4956524 4749668 4561806 4391844 4238040 4098271 3970416
36305 3970416 3852646 3743510 3641853 3546720 3457303 3372869 3292643 3215668 3140868 3067321 2994683
36294 2994683 2923448 2854999 2791378 2734822 2687153 2649161 2620279 2598645 2581478 2565639 2548200
36283 2548200 2526939 2500608 2468880 2431995 2390341 2344289 2294363 2241606 2187735 2134906 2085208
36272 2085208 2040119 2000226 1965286 1934564 1907279 1882922 1861314 1842450 1826284 1812616 1801130
36261 1801130 1791597 1784124 1779235 1777605 1779548 1784519 1791020 1796987 1800449 1800124 1795641 1787377 1776047 1762334
36247 1762334 1746750 1729753 1711951 1694165 1677312 1662201 1649421 1639300 1631907 1627037 1624296 1623295
36235 1623295 1623819 1625862 1629449 1634406 1640229 1646227 1651867 1657122 1662549 1668997 1677183 1687460 1699853 1714164
$$ packed form
36314E694422k65623k45945k26330k06856j87862j69962j53804j39769j27855
36305C970416j17770j09136j01657r5133q9417q4434q0226p6975p4800p3547p2638
36294B994683p1235o8449o3621n6556m7669l7992k8882k1634j7167j5839j7439
36283B548200k1261k6331l1728l6885m1654m6052m9926n2757n3871n2829m9698
36272B085208m5089l9893l4940l0722k7285k4357k1608j8864j6166j3668j1486
36261A801130r533p473m889j630J943M971O501N967L462l25m483q264j1330j3713
36247A762334j5584j6997j7802j7786j6853j5111j2780j0121p393m870k741j001
36235A623295N24K043L587M957N823N998N640N255N427O448Q186J0277J2393J4311
$$ plain form
36221 1714164 1729973 1746532 1762711 1777084 1788145 1794620 1795829 1791956 1784091 1773948 1763365 1753852
36209 1753852 1746406 1741652 1740146 1742542 1749501 1761382 1777981 1798384 1820918 1843158 1862089 1874582
36197 1874582 1878152 1871673 1855699 1832203 1803910 1773563 1743422 1714986 1688884 1664905 1642174 1619471
36185 1619471 1595558 1569371 1540099 1507181 1470376 1429941 1386875 1343041 1301025 1263771 1234165
36174 1234165 1214728 1207411 1213430 1233047 1265348 1308077 1357611 1409255 1457875 1498810 1528722 1546114
36162 1546114 1551277 1545763 1531705 1511350 1486962 1460970 1435991 1414596 1398844 1389839 1387532 1390840
36150 1390840 1398026 1407181 1416695 1425599 1433724 1441589 1449966 1459290 1469243 1478715 1486114 1489771 1488263 1480706
36136 1480706 1467063 1448353 1426486 1403640 1381462 1360498 1340163 1319203 1296379 1271065 1243531
$$ packed form
36221A714164J5809J6559J6179J4373J1061O475J209l873p865j0143j0583r513
36209A753852p446m754j506K396O959J1881J6599K0403K2534K2240J8931J2493
36197A874582L570o479j5974k3496k8293l0347l0141k8436k6102k3979k2731k2703
36185A619471k3913k6187k9272l2918l6805m0435m3066m3834m2016l7254k9606
36174A234165j9437p317O019J9617L2301M2729M9534N1644M8620M0935K9912J7392
36162A546114N163n514j4058k0355k4388k5992k4979k1395j5752r005k307L308
36150A390840P186R155R514Q904Q125P865Q377R324R953R472P399L657j508p557
36136A480706j3643j8710k1867k2846k2178k0964k0335k0960k2824k5314k7534
$$ plain form
36125 1243531 1214837 1186453 1159810 1135914 1115129 1097195 1081505 1067507 1055009 1044209 1035463
36114 1035463 1028997 1024682 1021953 1019869 1017294 1013152 1006670 997575 986195 973422 960559 949083 940422
36101 940422 935753 935796 940666 949761 961770 974826 986792 995684 1000090 999478 994329 986040 976603 968150
36087 968150 962508 960979 964271 972517 985319 1001966 1021792 1044480 1070022 1098285 1128463 1158857
36075 1158857 1187111 1210748 1227693 1236565 1236781 1228583 1213103 1192402 1169427 1147685 1130592 1120649
36063 1120649 1118808 1124427 1135835 1151216 1169335 1189827 1212988 1239230 1268510 1299991 1332081 1362703
36051 1362703 1389656 1410931 1424976 1430869 1428353 1417796 1400187 1377186 1351099 1324545 1299800 1278154
36039 1278154 1259662 1243454 1228408 1213738 1199214 1185000 1171361 1158481 1146521 1135834 1127117
$$ packed form
36125A243531k8694k8384k6643k3896k0785j7934j5690j3998j2498j0800q746
36114A035463o466m315k729k084k575m142o482r095j1380j2773j2863j1476q661
36101I40422m669M3M870R095J2009J3056J1966Q892M406o12n149q289r437q453
36087I68150n642j529L292Q246J2802J6647J9826K2688K5542K8263L0178L0394
36075A158857K8254K3637J6945Q872K16q198j5480k0701k2975k1742j7093r943
36063A120649j841N619J1408J5381J8119K0492K3161K6242K9280L1481L2090L0622
36051A362703K6953K1275J4045N893k516j0557j7609k3001k6087k6554k4745k1646
36039A278154j8492j6208j5046j4670j4524j4214j3639j2880j1960j0687q717
$$ plain form
36028 1127117 1121384 1119746 1123151 1132209 1147145 1167776 1193400 1222570 1252871 1280939 1302911 1315219
36016 1315219 1315483 1303105 1279389 1247209 1210380 1172983 1138716 1110408 1089748 1077292 1072622 1074488
36004 1074488 1080887 1089222 1096714 1100971 1100454 1094620 1083836 1069253 1052687 1036423 1022799 1013676 1009967
35991 1009967 1011500 1017263 1025851 1035818 1045799 1054491 1060710 1063513 1062323 1056907 1047317 1033852 1017061
35978 1017061 997749 976908 955600 934866 915681 898983 885694 876637 872327 872725 877110 884165
35966 884165 892284 899972 906226 910708 913717 915947 918180 921020 924759 929377 934637 940216 945777 950949
35952 950949 955198 957765 957794 954681 948466 940009 930797 922438 916096 912093 909861 908167 905529 900655 892837
35937 892837 882129 869294 855465 841768 828991 817424 806785 796275 784852 771690 756639
$$ packed form
36028A127117n733j638L405R058J4936K0631K5624K9170L0301K8068K1972J2308
36016A315219K64j2378k3716l2180l6829l7397l4267k8308k0660j2456m670J866
36004A074488O399Q335P492M257n17n834j0784j4583j6566j6264j3624r123l709
35991A009967J533N763Q588R967R981Q692O219K803j190n416r590j3465j6791
35978A017061j9312k0841k1308k0734j9185j6698j3289r057m310L98M385P055
35966H84165Q119P688O254M482L009K230K233K840L739M618N260N579N561N172
35952I50949M249K567K9l113o215q457r212q359o342m003k232j694k638m874p818
35937H92837j0708j2835j3829j3697j2777j1567j0639j0510j1423j3162j5051
$$ plain form
35926 756639 740379 724196 709526 697548 688941 683798 681633 681514 682403 683624 685219 687908 692614 699864
35912 699864 709441 720487 731857 742446 751328 757804 761416 761964 759447 753946 745524 734234 720182
35899 720182 703562 684621 663602 640758 616455 591262 565965 541514 518989 499621 484745
35888 484745 475632 473189 477670 488546 504616 524323 546120 568723 591221 613052 633941 653774
35876 653774 672418 689589 704845 717740 728008 735652 740893 744047 745446 745410 744174 741750 737840
35863 737840 731903 723333 711534 695837 675469 649820 618874 583540 545602 507360 471168 439026
35851 439026 412308 391654 377019 367922 363744 364036 368661 377764 391699 410913 435786 466336 501931
35838 501931 541154 581968 622088 659383 692276 720025 742837 761701 778003 793052 807695
$$ packed form
35926G56639j6260j6183j4670j1978q607n143k165j19Q89J221J595K689M706P250
35912F99864R577J1046J1370J0589Q882O476L612N48k517n501q422j1290j4052
35899G20182j6620j8941k1019k2844k4303k5193k5297k4451k2525j9368j4876
35888D84745r113k443M481J0876J6070J9707K1797K2603K2498K1831K0889J9833
35876F53774J8644J7171J5256J2895J0268P644N241L154J399l6j236k424l910
35863G37840n937q570j1799j5697k0368k5649l0946l5334l7938l8242l6192l2142
35851D39026k6718k0654j4635r097m178K92M625R103J3935J9214K4873L0550L5595
35838E01931L9223M0814M0120L7295L2893K7749K2812J8864J6302J5049J4643
$$ plain form
35827 807695 822065 835571 847101 855431 859614 859215 854265 845060 832038 815864 797686 779280 762884
35814 762884 750721 744491 745022 752179 764914 781332 798792 814128 824075 825872 817855 799848 773177
35801 773177 740317 704265 667877 633368 602043 574198 549197 525749 502387 478029 452390
35790 452390 426110 400574 377525 358581 344824 336570 333396 334416 338678 345477 354430 365296 377643
35777 377643 390563 402547 411642 415879 413868 405297 391098 373234 354318 337239 324820 319344
35765 319344 321960 332162 347753 365421 381691 393856 400520 401683 398497 392805 386630 381755 379509
35752 379509 380844 386565 397519 414538 438126 468084 503278 541695 580706 617468 649362 674391
35740 674391 691494 700720 703197 700856 695882 690090 684537 679575 675289 671965 670221 670751 673865 679283
$$ packed form
35827H07695J4370J3506J1530Q330M183l99m950r205j3022j6174j8178j8406j6396
35814G62884j2163o230N31P157J2735J6418J7460J5336R947J797q017j8007k6671
35801G73177l2860l6052l6388l4509l1325k7845k5001k3448k3362k4358k5639
35790D52390k6280k5536k3049j8944j3757q254l174J020M262O799Q953J0866J2347
35777C77643J2920J1984R095M237k011q571j4199j7864j8916j7079j2419n476
35765C19344K616J0202J5591J7668J6270J2165O664J163l186n692o175m875k246
35752C79509J335N721J0954J7019K3588K9958L5194L8417L9011L6762L1894K5029
35740F74391J7103R226K477k341m974n792n553m962m286l324j744N30L114N418
$$ plain form
35726 679283 686378 694775 704821 717522 733906 754169 777151 800489 821394 837550 847609 851105
35714 851105 847984 838157 821290 796866 764473 724187 676874 624276 568878 513669 461814 416260
35702 416260 379396 352939 338047 335359 344783 365143 394055 428212 464005 498174 528353 553472
35690 553472 573955 591555 608722 627630 649346 673553 698899 723621 746036 764746 778708
35679 778708 787295 790319 787895 780187 767171 748663 724585 695277 661598 624785 586241 547457
35667 547457 510125 476226 447877 426881 414218 409759 412332 420055 430756 442356 453162 462072
35655 462072 468614 472876 475347 476758 477906 479478 481911 485368 489847 495308 501657 508576 515327 520755
35641 520755 523576 522767 517829 508768 495939 479909 461430 441492 421373 402641 387059 376389
$$ packed form
35726F79283P095Q397J0046J2701J6384K0263K2982K3338K0905J6156J0059L496
35714H51105l121r827j6867k4424l2393m0286m7313n2598n5398n5209n1855m5554
35702D16260l6864k6457j4892k688R424K0360K8912L4157L5793L4169L0179K5119
35690E53472K0483J7600J7167J8908K1716K4207K5346K4722K2415J8710J3962
35679G78708Q587L024k424p708j3016j8508k4078k9308l3679l6813l8544l8784
35667E47457l7332l3899k8349k0996j2663m459K573P723J0701J1600J0806Q910
35655D62072O542M262K471J411J148J572K433L457M479N461O349O919O751N428
35641E20755K821q09m938r061j2829j6030j8479j9938k0119j8732j5582j0670
$$ plain form
35629 376389 372190 375686 387684 408419 437267 472488 511289 550321 586465 617564 642770 662429
35617 662429 677575 689318 698385 704979 708835 709366 705826 697474 683743 664347 639374 609413 575748
35604 575748 540453 506275 476265 453291 439549 436205 443244 459547 483137 511479 541764 571229
35592 571229 597499 618885 634578 644645 649895 651640 651369 650371 649313 647954 645167 639302 628783
35579 628783 612706 591227 565627 538031 510900 486556 466878 453218 446371 446517 453151 465109
35567 465109 480765 498363 516438 534115 551216 568077 585208 602949 621308 640061 659022
35556 659022 678230 697915 718254 739082 759778 779396 796962 811814 823778 833172 840668 847098
35544 847098 853186 859265 865204 870623 875299 879426 883596 888605 895208 903865 914481 926253 937817
$$ packed form
35629C76389m199L496J1998K0735K8848L5221L8801L9032L6144L1099K5206J9659
35617F62429J5146J1743R067O594L856N31l540q352j3731j9396k4973k9961l3665
35604E75748l5295l4178l0010k2974j3742l344P039J6303K3590K8342L0285K9465
35592E71229K6270K1386J5693J0067N250J745k71r98j058j359k787n865j0519
35579F28783j6077k1479k5600k7596k7131k4344j9678j3660o847J46O634J1958
35567D65109J5656J7598J8075J7677J7101J6861J7131J7741J8359J8753J8961
35556F59022J9208J9685K0339K0828K0696J9618J7566J4852J1964R394P496O430
35544H47098O088O079N939N419M676M127M170N009O603Q657J0616J1772J1564
$$ plain form
35531 937817 947637 954475 957672 957191 953456 947125 938875 929192 918146 905186 889156 868616 842426
35518 842426 810293 772968 731966 689008 645538 602560 560771 520799 483388 449528 420470
35507 420470 397556 381834 373585 372051 375537 381889 389188 396353 403389 411126 420625 432515 446633
35494 446633 462094 477703 492474 505969 518325 530008 541447 552750 563595 573374 581474 587572
35482 587572 591752 594422 596129 597401 598682 600364 602877 606745 612563 620872 631997 645884 661991
35469 661991 679321 696580 712433 725722 735543 741194 742133 738026 728883 715182 697953 678785 659704
35456 659704 642841 629925 621797 618238 618128 619806 621507 621827 620194 617127 614062 612795 614811 620905
35442 620905 631167 645208 662400 681948 702836 723757 743185 759657 772109 780084 783624 782940
$$ packed form
35531I37817R820O838L197m81l735o331q250r683j1046j2960j6030k0540k6190
35518H42426l2133l7325m1002m2958m3470m2978m1789l9972l7411l3860k9058
35507D20470k2914j5722q249j534L486O352P299P165P036P737R499J1890J4118
35494D46633J5461J5609J4771J3495J2356J1683J1439J1303J0845R779Q100O098
35482E87572M180K670J707J272J281J682K513L868N818Q309J1125J3887J6107
35469F61991J7330J7259J5853J3289R821N651R39m107r143j3701j7229j9168j9081
35456F59704j6863j2916q128l559j10J678J701L20j633l067l065j267K016O094
35442F20905J0262J4041J7192J9548K0888K0921J9428J6472J2452P975L540o84
$$ plain form
35430 782940 778152 769364 757010 742228 726876 713126 702856 697172 696242 699421 705520 713126 720932
35417 720932 728012 733972 738944 743527 748728 755870 766340 781101 800192 822470 845746 867306 884574
35404 884574 895741 900149 898348 891833 882598 872671 863772 857130 853413 852699 854458 857547 860307 860814
35390 860814 857311 848667 834731 816490 796015 776212 760339 751373 751381 761112 779867 805659 835548
35377 835548 866148 894174 916957 932837 941403 943491 940868 935692 929979 925239 922277 921065 920694
35364 920694 919548 915734 907625 894328 875921 853465 828837 804455 782920 766620 757385 756273
35352 756273 763520 778549 799954 825521 852390 877516 898327 913335 922414 926716 928325 929808
35340 929808 933712 941933 955172 972725 992769 1013059 1031645 1047412 1060240 1070817 1080132 1088911
$$ packed form
35430G82940m788q788j2354j4782j5352j3750j0270n684r30L179O099P606P806
35417G20932P080N960M972M583N201P142J0470J4761J9091K2278K3276K1560J7268
35404H84574J1167M408j801o515r235r927q899o642l717p14J759L089K760N07
35390H60814l503q644j3936j8241k0475j9803j5873q966QR731J8755K5792K9889
35377H35548L0600K8026K2783J5880Q566K088k623n176n713m740k962j212l71
35364I20694j146l814q109j3297j8407k2456k4628k4382k1535j6300r235j112
35352G56273P247J5029K1405K5567K6869K5126K0811J5008R079M302J609J483
35340I29808L904Q221J3239J7553K0044K0290J8586J5767J2828J0577R315Q779
$$ plain form
35328 1088911 1097287 1104847 1110919 1114887 1116323 1114921 1110294 1101802 1088552 1069644 1044583 1013668 978127
35315 978127 939866 900973 863182 827552 794362 763165 732977 702543 670696 636687 600437
35304 600437 562668 524899 489270 458224 434066 418490 412109 414192 422733 434942 447981 459667
35292 459667 468835 475220 478990 480270 478975 475030 468762 461143 453699 448145 445967 448229 455634 468676
35278 468676 487623 512343 542205 576244 613486 653088 694220 735784 776298 814057 847489
35267 847489 875491 897534 913500 923436 927475 926037 920117 911402 901989 893796 887954 884493 882494
35254 882494 880613 877699 873210 867254 860279 852587 843935 833432 819725 801366 777241 747050 711754
35241 711754 673785 636753 604594 580427 565659 559750 560707 565988 573307 581012 588026 593649 597460
$$ packed form
35328A088911Q376P560O072L968J436j402m627q492j3250j8908k5061l0915l5541
35315I78127l8261l8893l7791l5630l3190l1197l0188l0434l1847l4009l6250
35304F00437l7769l7769l5629l1046k4158j5576o381K083Q541J2209J3039J1686
35292D59667R168O385L770J280j295l945o268p619p444n554k178K262P405J3042
35278D68676J8947K4720K9862L4039L7242L9602M1132M1564M0514L7759L3432
35267H47489K8002K2043J5966R936M039j438n920q715r413q193n842l461j999
35254H82494j881k914m489n956o975p692q652j0503j3707j8359k4125l0191l5296
35241G11754l7969l7032l2159k4167j4768n909R57N281P319P705P014N623L811
$$ plain form
35228 597460 599378 599702 598980 597795 596552 595397 594212 592649 590189 586326 580800 573830 566161 558874 552978
35213 552978 548987 546745 545591 544765 543766 542499 541198 540292 540265 541594 544680 549884 557651 568657 583746
35198 583746 603575 628078 656166 685864 714874 741207 763635 781814 796127 807369 816451 824283
35186 824283 831841 840173 850158 862045 875176 888191 899613 908428 914249 917005 916509 912275 903687
35173 903687 890375 872540 851120 827803 804897 784958 770279 762353 761562 767132 777344 789950
35161 789950 802745 814064 823010 829347 833246 835078 835377 834858 834371 834727 836473 839725 844218 849510 855272
35146 855272 861475 868363 876220 885043 894292 902933 909806 914149 915933 915772 914453 912419 909544 905282
35132 905282 899012 890269 878764 864231 846326 824715 799357 770877 740736 711068 684193 662065
$$ packed form
35228E97460J918L24p22j185j243j155j185j563k460l863n526o970p669p287n896
35213E52978l991k242j154q26r99j267j301r06k7J329L086N204P767J1006J5089
35198E83746J9829K4503K8088K9698K9010K6333K2428J8179J4313J1242R082P832
35186H24283P558Q332R985J1887J3131J3015J1422Q815N821K756m96m234q588
35173I03687j3312j7835k1420k3317k2906j9939j4679p926p91N570J0212J2606
35161G89950J2795J1319Q946O337L899J832K99n19m87L56J746L252M493N292N762
35146H55272O203O888P857Q823R249Q641O873M343J784j61j319k034k875m262
35132I05282o270q743j1505j4533j7905k1611k5358k8480l0141k9668k6875k2128
$$ plain form
35120 662065 645881 635946 631733 632064 635430 640388 645933 651659 657643 664108 671084 678286 685251 691582
35106 691582 697096 701773 705595 708432 710014 709922 707583 702294 693350 680239 662850 641633 617722 592929
35092 592929 569517 549738 535317 527132 525194 528829 536946 548288 561616 575791 589798 602772
35080 602772 614021 622914 628670 630233 626397 616189 599249 576044 547797 516252 483376 451175
35068 451175 421588 396428 377347 365824 363163 370316 387437 413357 445350 479446 511207 536726
35056 536726 553485 560810 559772 552623 542021 530313 519056 508914 499936 492078 485647 481425 480463
35043 480463 483677 491475 503515 518640 535067 550773 563987 573645 579676 583010 585297 588410 593911
35030 593911 602644 614622 629240 645650 663088 680942 698621 715379 730284 742418 751234 756932
$$ packed form
35120F62065j6184r935m213L31L366M958N545N726N984O465O976P202O965O331
35106F91582N514M677L822K837J582r2k339n289q944j3111j7389k1217k3911k4793
35092E92929k3412j9779j4421q185j938L635Q117J1342J3328J4175J4007J2974
35080F02772J1249Q893N756J563l836j0208j6940k3205k8247l1545l2876l2201
35068D51175k9587k5160j9081j1523k661P153J7121K5920L1993L4096L1761K5519
35056E36726J6759P325j038p149j0602j1708j1257j0142q978p858o431m222r62
35043D80463L214P798J2040J5125J6427J5706J3214R658O031L334K287L113N501
35030E93911Q733J1978J4618J6410J7438J7854J7679J6758J4905J2134Q816N698
$$ plain form
35018 756932 760576 763850 768505 775823 786316 799722 815167 831351 846693 859478 868049 871086 867890
35005 867890 858547 843897 825312 804372 782512 760661 739059 717339 694868 671124 645894 619282
34993 619282 591696 563903 537013 512256 490588 472363 457332 445007 435110 427792 423470 422421
34981 422421 424445 428779 434248 439560 443652 445999 446727 446479 446116 446504 448413 452484 459132 468397 479775
34966 479775 492112 503665 512381 516372 514400 506143 492185 473758 452418 429760 407256 386189
34954 386189 367586 352068 339698 330000 322282 316110 311708 310009 312381 320196 334482 355724 383774
34941 383774 417751 455985 496153 535654 572118 603823 629817 649789 663846 672382 675997 675399
34929 675399 671276 664248 655023 644683 634898 627878 625993 631197 644542 665969 694369 727823 763855
$$ packed form
35018G56932L644L274M655P318J0493J3406J5445J6184J5342J2785Q571L037l196
35005H67890r343j4650j8585k0940k1860k1851k1602k1720k2471k3744k5230k6612
34993F19282k7586k7793k6890k4757k1668j8225j5031j2325r897p318m322j049
34981D22421K024M334N469N312M092K347P28k48l63L88J909M071O648R265J1378
34966D79775J2337J1553Q716L991j972q257j3958j8427k1340k2658k2504k1067
34954C86189j8603j5518j2370r698p718o172m402j699K372P815J4286K1242K8050
34941C83774L3977L8234M0168L9501L6464L1705K5994J9972J4057Q536L615n98
34929F75399m123p028r225j0340r785p020j885N204J3345K1427K8400L3454L6032
$$ plain form
34916 763855 799752 833011 861833 885485 904303 919330 931773 942516 951900 959794 965794 969402
34904 969402 970045 967060 959731 947455 929957 907420 880500 850252 818021 785298 753490 723683
34892 723683 696492 672072 650199 630325 611568 592766 572669 550297 525331 498367 470912
34881 470912 445084 423138 406967 397694 395459 399465 408292 420367 434335 449223 464375 479289
34869 479289 493429 506050 516151 522648 524717 522096 515089 504247 489940 472129 450451 424584
34857 424584 394649 361496 326746 292594 261431 235372 215869 203527 198246 199566 207004 220175
34845 220175 238669 261812 288429 316776 344742 370386 392639 411769 429316 447517 468477
34834 468477 493436 522380 554091 586564 617566 645110 667717 684538 695350 700514 700872 697605
$$ packed form
34916G63855L5897L3259K8822K3652J8818J5027J2443J0743R384P894O000L608
34904I69402O43k985p329j2276j7498k2537k6920l0248l2231l2723l1808k9807
34892G23683k7191k4420k1873j9874j8757j8802k0097k2372k4966k6964k7455
34881D70912k5828k1946j6171r273k235M006Q827J2075J3968J4888J5152J4914
34869D79289J4140J2621J0101O497K069k621p007j0842j4307j7811k1678k5867
34857D24584k9935l3153l4750l4152l1163k6059j9503j2342n281J320P438J3171
34845B20175J8494K3143K6617K8347K7966K5644K2253J9130J7547J8201K0960
34834D68477K4959K8944L1711L2473L1002K7544K2607J6821J0812N164L58l267
$$ plain form
34822 697605 692063 685517 678954 672956 667722 663213 659321 656023 653483 652075 652307 654655 659337 666082
34808 666082 673965 681446 686678 688007 684481 676064 663517 648020 630781 612759 594534 576339 558259
34795 558259 540514 523699 508833 497223 490202 488800 493445 503864 519252 538647 561219 586298
34783 586298 613229 641259 669600 697608 724964 751717 778099 804138 829238 852030 870651
34772 870651 883365 889144 887829 879788 865340 844391 816514 781459 739727 692848 643200 593478
34760 593478 546103 502849 464757 432279 405524 384489 369132 359272 354379 353419 354909 357191 358809
34747 358809 358837 356986 353451 348589 342590 335286 326147 314448 299510 280940 258808 233742 206962
34734 206962 180333 156371 138120 128746 130878 145958 173895 213171 261312 315370 372258 428898
$$ packed form
34822F97605n542o546o563n998n234m509l892l298k540j408K32K348M682O745
34808F66082P883P481N232J329l526q417j2547j5497j7239j8022j8225j8195j8080
34795E58259j7745j6815j4866j1610p021j402M645J0419J5388J9395K2572K5079
34783E86298K6931K8030K8341K8008K7356K6753K6382K6039K5100K2792J8621
34772H70651J2714N779j315q041j4448k0949k7877l5055m1732m6879m9648m9722
34760E93478m7375m3254l8092l2478k6755k1035j5357r860m893r60J490K282J618
34747C58809K8j851l535m862n999p304r139j1699j4938j8570k2132k5066k6780
34734B06962k6629k3962j8251r374K132J5080K7937L9276M8141N4058N6888N6640
$$ plain form
34722 428898 482353 530059 570184 601886 625300 641187 650476 654003 652550 647030 638598 628589
34710 628589 618312 608836 600845 594594 589992 586757 584654 583693 584238 586918 592369 600921 612375 625928
34696 625928 640227 653556 664111 670323 671181 666432 656638 643095 627668 612552 599950 591675 588824
34683 588824 591709 599992 612880 629134 646993 664144 677983 686120 686954 680093 666447 647998 627323
34670 627323 607044 589326 575560 566294 561452 560733 563997 571448 583507 600433 621908 646795 673305
34657 673305 699487 723830 745607 764796 781676 796461 809195 819857 828455 834979 839328 841314
34645 841314 840750 837572 831897 824037 814477 803833 792819 782294 773374 767409 765728 769117 777317 788804
34631 788804 801009 810864 815454 812539 800836 780030 750675 714109 672391 628161 584342 543721
$$ packed form
34722D28898N3455M7706M0125L1702K3414J5887R289L527j453n520q432j0009
34710F28589j0277r476p991o251m602l235k103r61N45K680N451Q552J1454J3553
34696F25928J4299J3329J0555O212Q58m749r794j3543j5427j5116j2602q275k851
34683E88824K885Q283J2888J6254J7859J7151J3839Q137Q34o861j3646j8449k0675
34670F27323k0279j7718j3766r266m842p19L264P451J2059J6926K1475K4887K6510
34657F73305K6182K4343K1777J9189J6880J4785J2734J0662Q598O524M349J986
34645H41314n64l178n675p860r560j0644j1014j0525q920n965j681L389Q200J1487
34631G88804J2205R855M590k915j1703k0806k9355l6566m1718m4230m3819m0621
$$ plain form
34619 543721 508556 480321 459717 446895 441795 444328 454257 470910 493018 518883 546766 575227
34607 575227 603232 630062 655159 678062 698499 716531 732527 746854 759394 769240 774863 774735
34595 774735 768016 754891 736392 713971 689145 663350 637848 613573 590994 570185 551135 534082
34583 534082 519649 508727 502201 500736 504653 513919 528104 546347 567413 589941 612791 635334
34571 635334 657550 679915 703143 727895 754520 782912 812463 842076 870268 895457 916365
34560 916365 932391 943735 951198 955753 958072 958224 955688 949702 939692 925561 907695 886809 863783
34547 863783 839503 814669 789539 763792 736674 707450 675933 642744 609108 576315 545146
34536 545146 515660 487450 460172 434002 409753 388675 372136 361378 357386 360780 371699 389693
$$ packed form
34619E43721l5165k8235k0604j2822n100K533R929J6653K2108K5865K7883K8461
34607E75227K8005K6830K5097K2903K0437J8032J5996J4327J2540R846N623j28
34595G74735o719j3125j8499k2421k4826k5795k5502k4275k2579k0809j9050j7053
34583E34082j4433j0922o526j465L917R266J4185J8243K1066K2528K2850K2543
34571F35334K2216K2365K3228K4752K6625K8392K9551K9613K8192K5189K0908
34560I16365J6026J1344P463M555K319J52k536n986j0010j4131j7866k0886k3026
34547H63783k4280k4834k5130k5747k7118k9224l1517l3189l3636l2793l1169
34536E45146k9486k8210k7278k6170k4249k1078j6539j0758l992L394J0919J7994
$$ plain form
34524 389693 413688 442061 472791 503673 532598 557905 578694 595024 607911 619077 630523
34513 630523 644029 660761 681117 704794 730954 758446 786006 812400 836415 856776 872135
34502 872135 881221 883074 877231 863830 843677 818254 789630 760265 732755 709535 692538 682874
34490 682874 680620 684859 693864 705351 716733 725425 729262 726966 718504 705182 689353 673847 661257
34477 661257 653345 650764 653159 659540 668720 679653 691623 704262 717418 730961 744730 758603
34465 758603 772626 787015 802011 817709 833936 850173 865529 878781 888504 893271 891900 883750
34453 883750 869016 848864 825280 800674 777321 756830 739799 725818 713800 702480 690845
34442 690845 678364 664975 650895 636388 621633 606730 591735 576615 561161 545010 527844
$$ packed form
34524C89693K3995K8373L0730L0882K8925K5307K0789J6330J2887J1166J1446
34513F30523J3506J6732K0356K3677K6160K7492K7560K6394K4015K0361J5359
34502H72135R086J853n843j3401k0153k5423k8624k9365k7510k3220j6997r664
34490F82874k254M239R005J1487J1382Q692L837k296q462j3322j5829j5506j2590
34477F61257p912k581K395O381R180J0933J1970J2639J3156J3543J3769J3873
34465G58603J4023J4389J4996J5698J6227J6237J5356J3252R723M767j371q150
34453H83750j4734k0152k3584k4606k3353k0491j7031j3981j2018j1320j1635
34442F90845j2481j3389j4080j4507j4755j4903j4995j5120j5454j6151j7166
$$ plain form
34431 527844 509700 491176 473449 458091 446758 440852 441230 447935 460056 475766 492682 508505
34419 508505 521684 531794 539432 545786 552111 559341 567908 577762 588587 600115 612331 625393 639356
34406 639356 653894 668271 681529 692751 701264 706772 709366 709436 707467 703796 698467 691283 682080 671074
34392 671074 659022 647135 636739 628947 624424 623262 625003 628854 634062 640248 647488 656075 666172
34379 666172 677618 689891 702210 713642 723267 730380 734755 736781 737359 737500 737794 738064 737472 735073
34365 735073 730463 724101 717128 710821 706014 702769 700383 697718 693720 687913 680660 673077 666679 662991
34351 662991 663316 668704 679978 697651 721676 751186 784412 818902 851996 881373 905466 923585
34339 923585 935748 942324 943706 940153 931892 919415 903758 886575 869879 855634 845417 840326
$$ packed form
34431E27844j8144j8524j7727j5358j1333n906L78O705J2121J5710J6916J5823
34419E08505J3179J0110P638O354O325P230Q567R854J0825J1528J2216J3062J3963
34406F39356J4538J4377J3258J1222Q513N508K594P0j969l671n329p184r203j1006
34392F71074j2052j1887j0396p792m523j162J741L851N208O186P240Q587J0097
34379F66172J1446J2273J2319J1432R625P113M375K026N78J41K94K70n92k399
34365G35073m610o362o973o307m807l245k386k665l998n807p253p583o398l688
34351F62991L25N388J1274J7673K4025K9510L3226L4490L3094K9377K4093J8119
34339I23585J2163O576J382l553q261j2477j5657j7183j6696j4245j0217n091
$$ plain form
34327 840326 840988 847506 859260 874732 891604 907221 919293 926510 928805 927119 922855 917265 910995
34314 910995 903907 895139 883396 867362 846134 819536 788168 753199 715970 677674 639299 601849
34302 601849 566555 534840 507992 486801 471452 461739 457432 458508 465046 476852 493038 511840
34290 511840 530828 547411 559367 565229 564487 557646 546140 532033 517509 504245 492905 483017
34278 483017 473353 462723 450702 437872 425328 413750 402699 390579 375332 355336 330042 300041
34266 300041 266727 231821 196979 163588 132683 105012 81160 61725 47420 39045 37277 42396
34254 42396 54105 71535 93440 118435 145198 172547 199447 225024 248734 270640 291581 313003
34242 313003 336447 363014 393126 426637 463052 501650 541401 580863 618140 651002 677189
$$ packed form
34327H40326O62O518J1754J5472J6872J5617J2072P217K295j686m264n590o270
34314I10995p088q768j1743j6034k1228k6598l1368l4969l7229l8296l8375l7450
34302F01849l5294l1715k6848k1191j5349r713m307J076O538J1806J6186J8802
34290E11840J8988J6583J1956N862p42o841j1506j4107j4524j3264j1340r888
34278D83017r664j0630j2021j2830j2544j1578j1051j2120j5247j9996k5294l0001
34266C00041l3314l4906l4842l3391l0905k7671k3852j9435j4305q375j768N119
34254D2396J1709J7430K1905K4995K6763K7349K6900K5577K3710K1906K0941K1422
34242C13003K3444K6567L0112L3511L6415L8598L9751L9462L7277L2862K6187
$$ plain form
34231 677189 694815 702707 700501 688524 667621 639127 604922 567416 529319 493253 461291 434610
34219 434610 413323 396641 383287 372043 362221 353913 347933 345523 347896 355855 369578 388614 412006
34206 412006 438495 466781 495782 524823 553660 582334 610966 639593 668056 695943 722482
34195 722482 746502 766518 781031 788952 789973 784717 774607 761539 747468 734091 722642 713839
34183 713839 707952 704883 704176 704932 705737 704815 700416 691313 677148 658469 636466 612578 588143 564273
34169 564273 541926 522041 505573 493345 485806 482877 483996 488374 495285 504173 514539 525682 536528
34156 536528 545711 551937 554413 553132 548793 542417 534869 526562 517491 507514 496701 485536 474888
34143 474888 465776 459061 455203 454145 455371 458127 461790 466258 472137 480609 492945 509928 531429
$$ packed form
34231F77189J7626P892k206j1977k0903k8494l4205l7506l8097l6066l1962k6681
34219D34610k1287j6682j3354j1244r822q308n980k410K373P959J3723J9036K3392
34206D12006K6489K8286K9001K9041K8837K8674K8632K8627K8463K7887K6539
34195G22482K4020K0016J4513P921J021n256j0110j3068j4071j3377j1449q803
34183G13839n887l069p07P56Q05r22m399r103j4165j8679k2003k3888k4435k3870
34169E64273k2347j9885j6468j2228p539k929J119M378O911Q888J0366J1143J0846
34156E36528R183O226K476j281m339o376p548q307r071r977j0813j1165j0648
34143D74888r112o715l858j058J226K756L663M468N879Q472J2336J6983K1501
$$ plain form
34130 531429 556350 582906 609081 633033 653323 668915 679100 683485 682135 675714 665473 653001
34118 653001 639874 627382 616347 607038 599106 591608 583213 572598 559006 542715 525170 508661
34106 508661 495653 488069 486776 491389 500406 511601 522527 531017 535602 535824 532331 526661 520714 516116
34092 516116 513762 513668 515062 516633 516861 514405 508424 498747 485813 470509 454018 437741 423296 412523
34078 412523 407389 409766 421056 441758 471150 507264 547184 587561 625129 657140 681666 697764
34066 697764 705424 705306 698448 686171 670263 653221 638180 628334 626020 631927 644879 662344 681434
34053 681434 699922 716806 732221 746841 761163 775072 787849 798437 805763 808940 807392 801005
34041 801005 790210 775917 759278 741451 723535 706655 692044 680983 674589 673561 678014 687499
$$ packed form
34130E31429K4921K6556K6175K3952K0290J5592J0185M385j350o421j0241j2472
34118F53001j3127j2492j1035r309p932p498q395j0615j3592j6291j7545j6509
34106E08661j3008p584j293M613R017J1195J0926Q490M585K22l493n670n947m598
34092E16116k354r4J394J571K28k456n981r677j2934j5304j6491j6277j4445j0773
34078D12523n134K377J1290K0702K9392L6114L9920M0377L7568L2011K4526J6098
34066F97764P660j18o858j2277j5908j7042j5041r846k314N907J2952J7465J9090
34053F81434J8488J6884J5415J4620J4322J3909J2777J0588P326L177j548o387
34041H01005j0795j4293j6639j7827j7916j6880j4611j1061o394j028M453R485
$$ plain form
34029 687499 701150 717911 736636 756061 774700 790878 803004 809981 811526 808194 801154 791885
34017 791885 782002 773187 767117 765301 768785 777878 791983 809689 829118 848372 865946 880939 893062
34004 893062 902451 909386 913951 915766 913905 907126 894409 875566 851582 824418 796354 769265 744141
33991 744141 721045 699337 677999 655908 632101 606048 577877 548440 519166 491773 467918
33980 467918 448862 435213 426833 423012 422766 425163 429582 435893 444466 455880 470440 487755 506671
33967 506671 525569 542822 557269 568535 577176 584551 592380 602095 614179 627754 640680 650173
33955 650173 653750 650152 639926 625469 610452 598847 593890 597412 609635 629357 654248 681200
33943 681200 706753 727671 741569 747409 745670 738184 727726 717509 710631 709549 715625 728962 748527
$$ packed form
34029F87499J3651J6761J8725J9425J8639J6178J2126O977J545l332p040r269
34017G91885r883q815o070j816L484R093J4105J7706J9429J9254J7574J4993J2123
34004H93062R389O935M565J815j861o779j2717j8843k3984k7164k8064k7089k5124
33991G44141k3096k1708k1338k2091k3807k6053k8171k9437k9274k7393k3855
33980D67918j9056j3649q380l821k46K397M419O311Q573J1414J4560J7315J8916
33967E06671J8898J7253J4447J1266Q641P375P829R715J2084J3575J2926R493
33955F50173L577l598j0226j4457j5017j1605m957L522J2223J9722K4891K6952
33943F81200K5553K0918J3898N840j739p486j0458j0217o878j082O076J3337J9565
$$ plain form
33930 748527 772519 798786 825174 849761 871002 887758 899275 905185 905594 901160 892981 882190
33918 882190 869460 854749 837470 816954 792897 765595 735884 704860 673495 642343 611527
33907 611527 580926 550418 520026 490029 461029 433914 409610 388753 371500 357597 346588
33896 346588 338023 331620 327317 325175 325129 326775 329447 332632 336480 342043 351035 365212 385691 412495
33882 412495 444429 479259 514083 545850 571960 590760 601744 605409 602912 595762 585650 574413
33870 574413 564011 556478 553742 557235 567378 583281 602916 623812 643894 662092 678415 693525
33858 693525 707979 721529 732946 740557 743194 740969 735419 729029 724442 723699 727772 736493 748877
33845 748877 763622 779595 796059 812667 829210 845351 860485 873841 884674 892369 896382 896200
$$ packed form
33930G48527K3992K6267K6388K4587K1241J6756J1517N910M09m434q179j0791
33918H82190j2730j4711j7279k0516k4057k7302k9711l1024l1365l1152l0816
33907F11527l0601l0508l0392k9997k9000k7115k4304k0857j7253j3903j1009
33896C46588q565o403m303k142m6J646K672L185L848N563Q992J4177K0479K6804
33882D12495L1934L4830L4824L1767K6110J8800J0984L665k497p150j0112j1237
33870E74413j0402p533k736L493J0143J5903J9635K0896K0082J8198J6323J5110
33858F93525J4454J3550J1417P611K637k225n550o390m587p43M073Q721J2384
33845G48877J4745J5973J6464J6608J6543J6141J5134J3356J0833P695M013j82
$$ plain form
33833 896200 891424 881968 868176 850789 830793 809320 787596 766954 748783 734349 724492 719333
33821 719333 718207 719947 723362 727645 732471 737798 743581 749559 755154 759467 761367 759675 753407 741985
33807 741985 725308 703710 677846 648656 617466 586166 557254 533572 517771 511718 516069 530124
33795 530124 551934 578632 606971 633996 657658 677140 692766 705546 716593 726671 736088 744859
33783 744859 752938 760297 766817 772167 775798 777073 775395 770256 761225 747918 730007 707315 679964
33770 679964 648566 614336 579072 544926 514013 487935 467433 452382 442116 435884 433105 433343
33758 433343 436071 440401 444876 447467 445952 438618 424992 406183 384632 363490 345964 334881 332419
33745 332419 339867 357279 383171 414560 447596 478564 504768 524847 538544 546257 548725 546936
$$ packed form
33833H96200m776r456j3792j7387j9996k1473k1724k0642j8171j4434r857n159
33821G19333j126J740L415M283M826N327N783N978N595M313J900j692o268j1422
33807G41985j6677k1598k5864k9190l1190l1300k8912k3682j5801o053M351J4055
33795E30124K1810K6698K8339K7025K3662J9482J5626J2780J1047J0078R417Q771
33783G44859Q079P359O520N350L631J275j678n139r031j3307j7911k2692k7351
33770F79964l1398l4230l5264l4146l0913k6078k0502j5051j0266o232k779K38
33758D33343K728M330M475K591j515p334j3626j8809k1551k1142j7526j1083k462
33745C32419P448J7412K5892L1389L3036L0968K6204K0079J3697P713K468j789
$$ plain form
33733 546936 542129 535730 529172 523634 519801 517758 517058 517002 516980 516780 516617 516927 518018 519804 521725 522806
33717 522806 521861 517772 509836 498056 483195 466580 449772 434239 421168 411392 405333 402899 403418
33704 403418 405674 408207 409768 409718 408173 405812 403578 402442 403363 407251 414817 426260 440994 457565
33690 457565 473853 487536 496688 500352 498830 493480 486134 478422 471361 465264 459902 454740 449204 442860
33676 442860 435504 427137 417876 407877 397207 385780 373397 359976 345872 332041 319856 310663
33664 310663 305331 304039 306353 311424 318085 324870 330136 332400 330794 325317 316696 305962 294009 281368
33650 281368 268268 254908 241790 229890 220585 215343 215351 221198 232705 248964 268599 290143 312401
33637 312401 334595 356318 377397 397830 417843 438020 459293 482700 508964 538118 569378
$$ packed form
33733E46936m807o399o558n538l833k043p00n6k2k00j63L10J091J786J921J081
33717E22806r45m089p936j1780j4861j6615j6808j5533j3071r776o059k434N19
33704D03418K256K533J561n0j545k361k234j136R21L888P566J1443J4734J6571
33690D57565J6288J3683R152L664j522n350p346p712p061o097n362n162n536o344
33676D42860p356q367r261r999j0670j1427j2383j3421j4104j3831j2185r193
33664C10663n332j292K314N071O661O785N266K264j606n477q621j0734j1953j2641
33650B81368j3100j3360j3118j1900r305n242QN847J1507J6259J9635K1544K2258
33637C12401K2194K1723K1079K0433K0013K0177K1273K3407K6264K9154L1260
$$ plain form
33626 569378 601271 631956 659627 682921 701184 714492 723460 728960 731912 733120 733085 731808 728669
33613 728669 722522 712026 696139 674598 648200 618762 588851 561428 539512 525884 522676 530906
$$ packed form
33626E69378L1893L0685K7671K3294J8263J3308Q968N500K952J208l5j277l139
33613G28669o147j0496j5887k1541k6398k9438k9911k7423k1916j3628l208Q230
$$ [...]
##END NTUPLES=NMR SPECTRUM
##END=
