##TITLE=31Pdec_E3d1306M
 CDCl3, 24 sc
 14.6.2023
##JCAMPDX= 6.0         $$ Bruker NMR JCAMP-DX V2.0
##DATA TYPE= NMR SPECTRUM
##DATA CLASS= NTUPLES
##ORIGIN= UXNMR, Bruker Analytische Messtechnik GmbH
##OWNER= root
$$ XWIN-NMR		Version 3.5
$$ Wed Jun 14 11:35:06 2023 Russian Standard Time (UT+4h)  she@DPX200
##.OBSERVE FREQUENCY= 81.013821
##.OBSERVE NUCLEUS= ^31P
##.ACQUISITION MODE= SIMULTANEOUS
##.ACQUISITION SCHEME= undefined
##.AVERAGES= 24
##.DIGITISER RES= 16
##SPECTROMETER/DATA SYSTEM= spect
##.PULSE SEQUENCE= zgpg30
##.SOLVENT NAME= CDCl3
##.SHIFT REFERENCE= (INTERNAL, CDCl3, 0, 248.564)
##AUDIT TRAIL= $$ (NUMBER, WHEN, WHO, WHERE, WHAT)
$$ ##TITLE= Audit trail, XWIN-NMR		Version 3.5
$$ ##JCAMPDX= 5.01
$$ ##ORIGIN= Bruker BioSpin GmbH
$$ ##OWNER= she
$$ F:/spectra/data/she/nmr/P31/1/pdata/1/auditp.txt
$$ ##AUDIT TRAIL=  $$ (NUMBER, WHEN, WHO, WHERE, WHAT)
(   1,<2023-06-14 11:33:32.01 +0400>,<she>,<DPX200>,
      <created by zg, POWCHK disabled, PULCHK disabled
       configuration hash MD5:
       00 E9 B6 7A A2 85 ED C7 34 08 36 98 17 FE 4E 26
       data hash MD5: 32K
       ED 37 33 D1 07 3C 9F F5 E4 1C 89 FB 73 14 34 31>)
(   2,<2023-06-14 11:33:35.96 +0400>,<she>,<DPX200>,
      <Start of raw data processing
       efp BC_mod = 2 LB = 1 FT_mod = 6 PKNL = 1 PHC0 = -10707.33 PHC1 = 136.2848 SI = 64K 
       data hash MD5: 64K
       03 06 25 F8 1A 6B B4 3C F0 0C 5D DD 09 DF B2 9B>)
(   3,<2023-06-14 11:34:20.65 +0400>,<she>,<DPX200>,
      <pk PHC0 = 4.043282 PHC1 = 0 
       data hash MD5: 64K
       64 FA 35 D5 E1 63 5D 01 74 E7 86 30 EB E8 18 59>)
(   4,<2023-06-14 11:34:23.95 +0400>,<she>,<DPX200>,
      <abs ABSG = 5 
       data hash MD5: 64K
       3F 53 2A 21 47 07 16 A9 BB FC 49 83 5B 12 5D 68>)
$$ ##END=
$$ 
$$ hash MD5
$$ 03 88 16 A7 49 D8 7F 21 3F D2 CA 1B 65 E7 4E 24
##$RELAX= 
##$RELAX= 
##$RELAX= 
##$RELAX= 
##$RELAX= 
##$RELAX= 
##$RELAX= 
##$RELAX= 
##$RELAX= 
$$ Bruker specific parameters
$$ --------------------------
##$DU= <F:/spectra>
##$EXPNO= 1
##$NAME= <P31>
##$PROCNO= 1
##$TYPE= <nmr>
##$USER= <she>
##$AMP= (0..31)
100 100 100 100 100 100 100 100 100 100 100 100 100 100 100 100 100 100 
100 100 100 100 100 100 100 100 100 100 100 100 100 100 
##$AQSEQ= 0
##$AQ_mod= 1
##$AUNM= <au_zg>
##$AUTOPOS= <>
##$BF1= 81.014009
##$BF2= 200.13
##$BF3= 200.13
##$BF4= 200.13
##$BF5= 200.13
##$BF6= 200.13
##$BF7= 200.13
##$BF8= 200.13
##$BYTORDA= 1
##$CFDGTYP= 0
##$CFRGTYP= 5
##$CHEMSTR= <none>
##$CNST= (0..31)
1 1 145 1 1 1 1 1 1 1 1 1 1 1 1 1 1 1 1 1 1 1 1 1 1 1 1 1 1 1 1 1 
##$CPDPRG= <waltz16>
##$CPDPRG1= <>
##$CPDPRG2= <waltz16>
##$CPDPRG3= <>
##$CPDPRG4= <mlev>
##$CPDPRG5= <mlev>
##$CPDPRG6= <mlev>
##$CPDPRG7= <mlev>
##$CPDPRG8= <mlev>
##$CPDPRGB= <>
##$CPDPRGT= <>
##$D= (0..31)
0 1 0 0 0 0 0 0 0 0 0 0.03 2e-05 3e-06 0 0 0 0 0 0 0 0 0 0 0 0 0 0 0 0 
0 0 
##$DATE= 1686728011
##$DBL= (0..7)
120 120 120 11 120 120 24 19 
##$DBP= (0..7)
150 150 150 150 150 150 150 150 
##$DBP07= 0
##$DBPNAM0= <>
##$DBPNAM1= <>
$$ [...]
##$SUBNAM3= <"">
##$SUBNAM4= <"">
##$SUBNAM5= <"">
##$SUBNAM6= <"">
##$SUBNAM7= <"">
##$SUBNAM8= <"">
##$SUBNAM9= <"">
##$SW= 501.771253377433
##$SWIBOX= (0..15)
0 1 3 0 0 0 0 0 0 0 0 0 0 0 0 0 
##$SW_h= 40650.406504065
##$TD= 32768
##$TD0= 1
##$TE= 0
##$TE2= 300
##$TE3= 300
##$TEG= 300
##$TL= (0..7)
0 120 53 12 22 120 120 120 
##$TP= (0..7)
150 150 150 150 150 150 150 150 
##$TP07= 0
##$TPNAME0= <>
##$TPNAME1= <>
##$TPNAME2= <>
##$TPNAME3= <>
##$TPNAME4= <>
##$TPNAME5= <>
##$TPNAME6= <>
##$TPNAME7= <>
##$TPOAL= (0..7)
0.5 0.5 0.5 0.5 0.5 0.5 0.5 0.5 
##$TPOFFS= (0..7)
0 0 0 0 0 0 0 0 
##$TUNHIN= 0
##$TUNHOUT= 0
##$TUNXOUT= 0
##$USERA1= <user>
##$USERA2= <user>
##$USERA3= <user>
##$USERA4= <user>
##$USERA5= <user>
##$V9= 5
##$VALIST= <valist>
##$VCLIST= <CCCCCCCCCCCCCCC>
##$VD= 0
##$VDLIST= <DDDDDDDDDDDDDDD>
##$VPLIST= <PPPPPPPPPPPPPPP>
##$VTLIST= <TTTTTTTTTTTTTTT>
##$WBST= 1024
##$WBSW= 4
##$XGAIN= (0..3)
0 0 0 0 
##$XL= 0
##$YL= 0
##$YMAX_a= 6111
##$YMIN_a= -5509
##$ZGOPTNS= <>
##$ZL1= 120
##$ZL2= 120
##$ZL3= 120
##$ZL4= 120
##$ABSF1= 248.5645
##$ABSF2= -253.2056
##$ABSG= 5
##$ABSL= 3
##$ALPHA= 0
##$AQORDER= 0
##$ASSFAC= 0
##$ASSFACI= 0
##$ASSFACX= 0
##$ASSWID= 0
##$AUNMP= <proc_1d>
##$AZFE= 0.1
##$AZFW= 0.5
##$BCFW= 0
##$BC_mod= 2
##$BYTORDP= 0
##$COROFFS= 0
##$CY= -3
##$DATMOD= 1
##$DC= 0
##$DFILT= <>
##$DTYPP= 0
##$F1P= 0
##$F2P= 0
##$FCOR= 1
##$FTSIZE= 65536
##$FT_mod= 6
##$GAMMA= 0
##$GB= 0
##$INTBC= 1
##$INTSCL= 6.047779e-11
##$ISEN= 30
##$LB= 1
##$LEV0= 0
##$LPBIN= 0
##$MAXI= 10000
##$MC2= 0
##$MEAN= 0
##$ME_mod= 0
##$MI= 50
##$NCOEF= 0
##$NC_proc= -5
##$NLEV= 6
##$NOISF1= 182.463
##$NOISF2= 159.3651
##$NSP= 0
##$NTH_PI= 0
##$NZP= 0
##$OFFSET= 248.5645
##$PC= 4
##$PHC0= -10703.29
##$PHC1= 136.2848
##$PH_mod= 1
##$PKNL= yes
##$PPARMOD= 0
##$PSCAL= 0
##$PSIGN= 0
##$REVERSE= no
##$SF= 81.0140089999694
##$SI= 65536
##$SIGF1= 159.3651
##$SIGF2= -187.1042
##$SINO= 113.3802
##$SIOLD= 16384
##$SREGLST= <1H.CDCl3>
##$SSB= 0
##$STSI= 65536
##$STSR= 0
##$SW_p= 40650.406504065
##$SYMM= 0
##$S_DEV= 0
##$TDeff= 32768
##$TDoff= 0
##$TI= <>
##$TILT= no
##$TM1= 0
##$TM2= 0
##$TOPLEV= 0
##$USERP1= <user>
##$USERP2= <user>
##$USERP3= <user>
##$USERP4= <user>
##$USERP5= <user>
##$WDW= 1
##$XDIM= 65536
##$YMAX_p= 325541749
##$YMIN_p= -223152657
$$ End of Bruker specific parameters
$$ ---------------------------------
##NTUPLES= NMR SPECTRUM
##VAR_NAME=  FREQUENCY,     SPECTRUM/REAL,   SPECTRUM/IMAG
##SYMBOL=    X,             R,               I
##VAR_TYPE=  INDEPENDENT,   DEPENDENT,       DEPENDENT
##VAR_FORM=  AFFN,          ASDF,            ASDF
##VAR_DIM=   65536,         65536,           65536
##UNITS=     HZ,            ARBITRARY UNITS, ARBITRARY UNITS
##FACTOR=    0.620285442955139, 1,           1
##FIRST=     20137.2065510682, 0,            0
##LAST=      -20513.1999529968, 0,           0
##MIN=       -20513.1999529968, -223152657,  0
##MAX=       20137.2065510682, 325541749,    0
$$ Real data points
##PAGE= N=1
##DATA TABLE= (X++(R..R)), XYDATA
$$ [...]
39889E14271p6349l42501k66935J84098M84507J99465l39735m24860q536J64408
$$ 514271 437922 95421 -171514 12584 497091 696556 356821 -68039 -76575 87833
39879H7833k99745p16171l04147N25086P13206J99255k7552L77833N38845o2440
$$ 87833 -211912 -928083 -1232230 -707144 6062 205317 177765 555598 1094443 1032003
39869A032003n90050k67027K39184k5426n71046k83563N38832N48121l76194q29187
$$ 1032003 441953 174926 414110 388684 -182362 -465925 72907 621028 244834 -584353
39859e84353j32688O29063M27303j88752k52314K7585r7551m56527k90288L75441
$$ -584353 -717041 -87978 339325 150573 -101741 -74156 -171707 -628234 -918522 -543081
39849e43081P56480N35850J54883n8144k43461m55727m55340j86898O8343J38765
$$ -543081 213399 749249 904132 845988 602527 146800 -308540 -495438 -427095 -288330
39839b88330J43098J68486J49979R4300P2009O855j84022l19004k02437k6969
$$ -288330 -145232 23254 173233 267533 339542 346397 162375 -156629 -359066 -386035
39829c86035p3777j48944J08291M41874K13952m98634p99702k43843M83426N78241
$$ -386035 -459812 -608756 -500465 -58591 155361 -343273 -1142975 -1386818 -903392 -325151
39819c25151K02496Q719Q1640L7758j16957K8147M79640O61851K17620m51535
$$ -325151 -122655 -113936 -32296 5462 -111495 -83348 396292 1058143 1275763 824228
39809H24228o78486l22087J32360J66779k02329m69894k52820K27595M32688K19881
$$ 824228 145742 -176345 -43985 122794 -79535 -549429 -802249 -574654 -141966 77915
39799G7915l3359n9769n7143k20972l30306j37756J58659K33051J53055J62084
$$ 77915 44556 -15213 -72356 -293328 -623634 -761390 -602731 -369680 -216625 -54541
39789e4541J84969K1091j72591j01098J23135J82484J58309L44814N65282L52406
$$ -54541 130428 151519 -21072 -122170 965 183449 341758 686572 1251854 1604260
39779A604260j83109l78874m8634K08633l9807m49512n44510l68783j33932K06676
$$ 1604260 1421151 1042277 993643 1202276 1162469 712957 168447 -200336 -334268 -127592
39769a27592N98678O25862J13207m32210m85553k37480j64769k33571r5885K04686
$$ -127592 471086 1096948 1210155 777945 292392 54912 -109857 -343428 -439313 -234627
39759b34627L17990K00226R6545M4597r4196k16798r1198J71238K04358q0248
$$ -234627 83363 283589 380134 424731 330535 113737 22539 193777 398135 317887
39749C17887m11460n34982l57705J20452O73138Q58664N50166K04267J81098J38675
$$ 317887 -93573 -628555 -986260 -865808 -192670 665994 1216160 1420427 1601525 1740200
39739A740200l31047q22110o32858O6332M38368K52380N1070M3325j86042o67018
$$ 1740200 1409153 587043 -45815 20517 458885 711265 762335 805660 619618 -47400
39729d7400p32430j25287M44343L71053L9870N8421K59806J41852k06217l09094
$$ -47400 -779830 -905117 -460774 -89721 -49851 8570 268376 410228 204011 -105083
39719a05083q9468J68015L51874M69075L30939j48086n56764m26540R1685M40177
$$ -105083 -194551 -26536 325338 794413 1125352 977266 420502 -6038 85647 525824
39709E25824L63922L723m60436p94777o21557R0569O56794M13014l01223n31102
$$ 525824 889746 893469 433033 -361744 -983301 -892732 -235938 177076 -124147 -655249
39699f55249l8658M12459K08562k95198l85172K2882L64496K03000k53322m20144
$$ -655249 -693907 -281448 -72886 -368084 -753256 -730374 -365878 -162878 -416200 -836344
39689h36344m4070M51103M81223J05863o7721J36164J57378k73758m57948K11414
$$ -836344 -880414 -429311 51912 157775 90054 226218 383596 109838 -348110 -136696
39679a36696J008335O96604n83519j333566p47721K74592N55949J62124j25659
$$ -136696 871639 1568243 984724 -348842 -1096563 -821971 -266022 -103898 -229557
39670b29557j16815j57197k07448J15286O58262P00820j419p23637o69013n937
$$ -229557 -346372 -503569 -711017 -595731 62531 763351 761932 38295 -630718 -636655
39660f36655L99578J42677k76461k62245M6610J24948m1824o510K32958J15233
$$ -636655 -237077 -94400 -370861 -633106 -586496 -461548 -503372 -509882 -276924 -161691
39650a61691m34381o05746P1608P92200N98059j02860j96947L15860M28711m2530
$$ -161691 -596072 -1201818 -1130210 -338010 260049 157189 -39758 276102 704813 662283
39640F62283j63501L26161L97998m31581j024890m00456N57941M67805l21303
$$ 662283 498782 824943 1222941 791360 -233530 -633986 -76045 391760 70457
39631G0457l59522N10604R58414L05266n84314p97619n18089k54581J4398L67134
$$ 70457 -289065 221539 1179953 1485219 900905 103286 -414803 -669384 -654986 -287852
39621b87852M49258P1520l17061k95127r6979r7467j61262o632K12937K12286
$$ -287852 161406 232926 -84135 -379262 -476241 -573708 -734970 -741602 -528665 -316379
39611c16379J10870J57239K12612K5727k05569q1632L05951M24074L9007m78075
$$ -316379 -205509 -48270 164342 190069 -15500 -97132 208819 632893 671900 193825
39601A93825o31484l24363J23933L14625J46575n8571O5173L76429L44069j38539
$$ 193825 -437659 -762022 -638089 -323464 -176889 -235460 -170287 206142 550211 411672
39591D11672m54694j18071M37493M27388j47987n20206k54549K33431L61712R4106
$$ 411672 -43022 -161093 276400 703788 555801 35595 -218954 14477 376189 470295
39581D70295k31660m14091m68740m23422k63500n52K94326M66887L47101L025
$$ 470295 238635 -175456 -644196 -1067618 -1331118 -1331670 -1037344 -570457 -223356 -220331
39571b20331j73226Q8381M68709L99693j21717m73878k73474J23613K03129o327
$$ -220331 -393557 -305176 163533 563226 441509 -32369 -305843 -182230 20899 14572
39561A4572j28014m2574O4469P9590M4075k2310q2152J5075K80749L62510m6473
$$ 14572 -113442 -156016 -91547 -11957 32118 9808 -72344 -57269 223480 585990 539517
39550E39517o20408o54648k127O34757N66853j9902l65536j34772K38224K30522
$$ 539517 -80891 -735539 -737666 -102909 463944 444042 78506 -56266 181958 412480
39540D12480n3269q3017K80269M94540N1992p15388r28359l01429M19789M28608
$$ 412480 359211 276194 556463 1051003 1102995 387607 -540752 -842181 -422392 6216
39530F216p7247k58799J22861M28115J74970k33623j50582L51233O03587K54834
$$ 6216 -71031 -329830 -206969 221146 396116 162493 11911 363144 966731 1221565
39520A221565l43492o26782m05230L7028K35350k9670m53717m62403Q7381O24836
$$ 1221565 878073 251291 -153939 -116911 118439 88769 -364948 -827351 -739970 -115134
39510a15134N35275n2821m83983m43601j88342K6399K41149M28472L36088p2830
$$ -115134 420141 367320 -116663 -560264 -748606 -722207 -481058 -52586 283502 210672
39500B10672m13188l70547q3101J84469L91074M94351K83370k07888m99253k99676
$$ 210672 -202516 -573063 -656164 -471695 -80621 413730 697100 489212 -10041 -309717
39490c09717J5281L3259N397K85551M69835j8366p06897n19290M88755R83555
$$ -309717 -294436 -261177 -255780 29771 499606 481240 -225657 -744947 -256192 727363
39480G27363L24295m43958k64239K88066Q0735o16716n86580K45872N95762j42585
$$ 727363 1051658 607700 343461 631527 712262 95546 -491034 -245162 350600 208015
39470B08015r08898n77422M15044Q00796K41109m45008n35879j71404J26354J56254
$$ 208015 -700883 -1278305 -863261 -62465 178644 -266364 -802243 -973647 -847293 -691039
39460f91039R9801J59847L09374L46971J52012j54302l57284l76951k17666J58850
$$ -691039 -591238 -431391 -122017 224954 376966 222664 -134620 -511571 -729237 -570387
39450e70387O25753P05802P5445p47414q03633K1284O87824L52792m81743p08230
$$ -570387 55366 761168 836613 89199 -714434 -693150 -5326 347466 -134277 -842507
39440h42507j34318L92877K45362k42914l78488K2216N48497P07215L82028q4919
$$ -842507 -976825 -583948 -338586 -581500 -959988 -937772 -389275 317940 699968 615049
39430F15049k47208n9766J01313K6808k507K56847M84384K50818k29037l66214
$$ 615049 367841 308075 409388 436196 433689 690536 1174920 1425738 1196701 830487
39420H30487j21132l2658k79566l59528O2409N46798N00014J1369l38649k67322
$$ 830487 709355 676697 397131 37603 100012 646810 1146824 1158193 819544 552222
39410E52222j0791J14704N2697o1874j00085n5740l5202q8359p3183J51441M15613
$$ 552222 541431 656135 708832 646958 546873 491133 455931 367572 294389 445830 861443
39399H61443L72877j994l15739k64329M886J59181P8200j38774l38965l63144
$$ 861443 1234320 1232326 916587 652258 657144 816325 894525 755751 416786 53642
39389E3642j41044J47758K22096Q3816k326L5210j1410j60712j15648J87882L47417
$$ 53642 -87402 60356 282452 366268 363942 399152 387742 227030 111382 299264 646681
39378F46681J16871j54814j01419L0544j71997n10877m26966J12755N39061M76091
$$ 646681 763552 608738 507319 537863 365866 -145011 -571977 -459222 79839 555930
39368E55930J37607j08043j64266j20931n0438L1395J68854L85036M80084J48500
$$ 555930 693537 585494 421228 300297 249859 281254 450108 835144 1315228 1463728
39358A463728m69322o88308j43535N50595N41891r6601n62381n03494k90172j80218
$$ 1463728 994406 306098 162563 713158 1255049 1158448 596067 92573 -197599 -377817
39348c77817J675K60910K67240k299j33246o843O577j83483j58567J54719J86612
$$ -377817 -376142 -115232 152008 149709 16463 9620 16197 -167286 -325853 -171134 15478
39337A5478k61503m88955m375N65378M54322J0121K5675L05778J7841p32384q55182
$$ 15478 -246025 -734980 -739355 -173977 280345 290466 316141 621919 639760 -92624 -947806
39326i47806L8643R33968Q07942k4446m76219j15202M83157N85300J18584l38769
$$ -947806 -909163 24805 832747 808301 332082 216880 700037 1285337 1403921 1065152
39316A065152k51257K21193M02402K2598l64648k09085J65097Q6155l41559l98126
$$ 1065152 813895 1035088 1437490 1460088 1095440 886355 1051452 1137607 796048 397922
39306C97922M7288L17024L8668l02362k04706J28619K56545J15597j58318m82168
$$ 397922 445210 762234 800902 498540 293834 422453 678998 794595 636277 154109
39296A54109n94889j61803N34510O34499j03073p57940m78567L00195N56220J35000
$$ 154109 -440780 -602583 -68073 566426 463353 -294587 -773154 -472959 83261 218261
39286B18261k76057l08579k15976j55300K9179K72603K32219r9388k65796J0314
$$ 218261 -57796 -366375 -582351 -737651 -708472 -435869 -203650 -303038 -568834 -558520
39276e58520M63001O80385N47540K28860l5278j03721q3767k00698l88795l09167
$$ -558520 -95519 584866 1132406 1361266 1325988 1222267 1138500 937802 549007 239840
39266B39840J6888N5971l67958n91775j06995M89200L59015j88379j82840L91831
$$ 239840 256728 312699 -55259 -647034 -754029 -264829 94186 -94193 -277033 114798
39256A14798N97202J06409l82096m25036l87431m46024j73101M49965O72532J87545
$$ 114798 712000 818409 436313 11277 -376154 -822178 -995279 -545314 127218 314763
39246C14763k69828j44465O7816j43317l46619p7453J89798n6198k86953J48213
$$ 314763 44935 -99530 -31714 -175031 -521650 -599103 -409305 -465503 -752456 -604243
39236f04243P02598M39247l46834n85543j77339K1354k11711k20725J46910K13955
$$ -604243 98355 537602 190768 -394775 -572114 -550760 -762471 -983196 -836286 -622331
39226f22331k28081m69075j01423L50376M41281M65099O08535M01224l30209p91193
$$ -622331 -850412 -1319487 -1420910 -1070534 -629253 -164154 444381 845605 515396 -275797
39216b75797l16884M67764M55869l46302q79553n30294K03003N84328N33276M07676
$$ -275797 -592681 -124917 330952 -15350 -894903 -1425197 -1222194 -637866 -104590 303086
39206C03086L27874R5565l17653n37938k47823K46412K63331l13938p35953l69395
$$ 303086 630960 726525 408872 -129066 -376889 -130477 132854 -181084 -917037 -1286432
39196a286432L63256N64303J50321j24380J13546L61369J38718k88777m12484
$$ -1286432 -923176 -358873 -208552 -332932 -219386 141983 280701 -8076 -420560
39187d20560j98017N4005J87926K25493K07547K22760L31634L48199J8635n10572
$$ -420560 -618577 -564572 -376646 -151153 56394 279154 610788 958987 977622 467050
39177D67050p81889o35504l07816O9735N16915P45555L68981k98103m37050K7538
$$ 467050 -314839 -950343 -1258159 -1188424 -671509 74046 443027 144924 -292126 -264588
39167b64588K26658k26383n38221q3877M52509J78353m96388n31019M9434L07205
$$ -264588 -37930 -264313 -802534 -886411 -433902 -255549 -751937 -1282956 -1233522 -926317
39157i26317J9874n0483M02784O44119J32108n41348n17534R3803M52881J89492
$$ -926317 -906443 -956926 -554142 89977 222085 -319263 -836797 -742994 -290113 -100621
39147a00621j86711q6105L32845L89536j30353n46295j50340O88130Q59234L9745
$$ -100621 -287332 -373437 -40592 348944 218591 -327704 -478044 210086 1069320 1109065
39137A109065p78469o48199O4223L57960N6010j73030J3357K28174R4552k61959
$$ 1109065 330596 -317603 -253380 104580 160590 -12440 917 229091 323643 61684
39127F1684n22283m92656j16089M08914N97754K10737k96366l15840P2268L21977
$$ 61684 -460599 -953255 -1069344 -660430 -62676 148061 -148305 -464145 -391877 -69900
39117f9900K90589K47174J63752k35640p27492o95093j26342K51693P0081j72537
$$ -69900 220689 467863 631615 395975 -331517 -1026610 -1152952 -901259 -831178 -1003715
39107a003715k0736K09308P2102k07712j31624K60084N01570L90032J15746j26656
$$ -1003715 -1024451 -815143 -743041 -950753 -1082377 -822293 -320723 69309 185055 58399
39097E8399k73615k55344m8598J88260K57736J51042M338p2102k8544J15337K09084
$$ 58399 -215216 -470560 -519158 -330898 -73162 77880 82218 10116 -18428 96909 305993
39086C05993Q3411j93223l44542k45888o3285L5968R5414J90723K38862J15621
$$ 305993 389404 196181 -148361 -394249 -457534 -421566 -326152 -135429 103433 219054
39076B19054j61059m31030m74603j40239M15770O83476L04768l52184m71743K09185
$$ 219054 57995 -373035 -847638 -987877 -572107 111369 416137 63953 -407790 -198605
39066a98605R65413Q83489m6066q71295p31653J61851P37795L08336n79523q23075
$$ -198605 766808 1650297 1604231 732936 1283 163134 900929 1209265 629742 -193333
39056a93333j85513M73327M74635J70344J39546J93996j40630o30712o42233j72947
$$ -193333 -378846 94481 569116 739460 879006 1073002 932372 301660 -340573 -513520
39046e13520K26799L69075M41117K79063m17162j167152j018374M9689R49437
$$ -513520 -286721 82354 523471 802534 385372 -781780 -1800154 -1750465 -801028
39037h01028R64200N36806K99048K03340K5102q9542n7047j37399l55870l24690
$$ -801028 163172 699978 999026 1202366 1227468 1137926 1080879 943480 587610 262920
39027B62920p917R4651j00920r494M54610M56635l25257q60050k91438O03346
$$ 262920 255003 349654 248734 239240 693850 1150485 825228 -34822 -326260 277086
39017B77086O12132j1004j37682K93409L50829j43602l78865p6012Q6742k19546
$$ 277086 889218 878214 740532 1033941 1384770 1241168 862303 786291 873033 653487
39007F53487m31347j89951N8665m4865j98237j56113j73702l22556k00228K18980
$$ 653487 222140 32189 90854 45989 -152248 -308361 -482063 -804619 -1004847 -785867
38997g85867K86572k08195m64534P4824O71057M12522k29606r8406P20584R10974
$$ -785867 -499295 -707490 -1172024 -1097200 -426143 -13621 -243227 -341633 378951 1289925
38987A289925n2673j045442q99666J7492M88947J26232l66435l18172J97940P09035
$$ 1289925 1237252 191810 -707856 -690364 -201417 -75185 -441620 -759792 -561852 147183
38977A47183Q39461M37633l19998q68291p12422o7086L36065J91929m9343K5612
$$ 147183 986644 1424277 1104279 235988 -476434 -543520 -207455 -15526 -64869 -39257
38967c9257J63192l0730l54805l22672L7120K37224Q7446j01194n2579J55439
$$ -39257 123935 93205 -261600 -584272 -547152 -309928 -222482 -323676 -376255 -220816
38957b20816L19897L18888J13012j67520k42938q0164m5663k97293l66509R8708
$$ -220816 99081 417969 530981 363461 120523 40359 -5304 -302597 -669106 -570398
38947e70398N40665K22644n11790o54582r0735L08509J75353Q0663K74570K11374
$$ -570398 -29733 192911 -318879 -973461 -1064196 -755687 -580334 -499671 -225101 -13727
38937a3727k32107k77513L53925P02833R5117o19565l84165L67049M79833r3350
$$ -13727 -245834 -523347 -169422 533411 628528 8963 -375202 -8153 471680 378330
38927C78330m26640j54917K39481L89674L16503O070m12300m11165J55045M75937
$$ 378330 -48310 -203227 36254 425928 742431 748501 336201 -74964 80081 556018
38917E56018n4367o50618k75007N58518N31196k77180n30490R7038M71731L7332
$$ 556018 501651 -148967 -423974 134544 665740 388560 -141930 -44892 426839 464171
38907D64171l38730m6659K54466P48k58945l9194R8547l14835n91713k4670P64643
$$ 464171 125441 78782 333248 333996 75051 35857 134404 -180431 -772144 -796814 -32171
38896c2171P29042J8145l85522j90446P5287J31132J56958J27807j65832n02670
$$ -32171 696871 715016 329494 139048 214335 345467 502425 630232 464400 -38270
38886c8270m10233M8498L17872J77018m0987n3695N2688J18604R9089l2342k14718
$$ -38270 -448503 -400005 -82133 94885 53898 203 52891 171495 270584 238242 23524
38875B3524k10538P3432L03813J31300k47512l36486m1601K70517L29037J87220
$$ 23524 -187014 -113582 190231 321531 74019 -262467 -304068 -33551 295486 482706
38865D82706k9716k24038k36378k5464J33095j685j85248k8358K90770K09819
$$ 482706 452990 228952 -7426 -32890 100205 98520 -86728 -115086 175684 385503
38855C85503k67313m18162J25295O97296M77452l10599o94222l23083J18668J6710
$$ 385503 118190 -299972 -174677 522619 1000071 689472 -4750 -327833 -209165 -192455
38845a92455k83078j18267M08457O21193L35597K5249p2916k63378n96979n51639
$$ -192455 -475533 -593800 -185343 435850 771447 796696 723780 460402 -136577 -688216
38835f88216L8207M41790Q1415m67878l41121K21699L07829j38627k98164Q9516
$$ -688216 -650009 -208219 -126804 -594682 -935803 -714104 -406275 -544902 -843066 -753550
38825g53550L74338K00452l144K347j64864n70613n97282l7138L80152J72584
$$ -753550 -379212 -178760 -181904 -179557 -344421 -915034 -1512316 -1549454 -1169302 -996718
38815i96718p1951K17345N46597K84953j22640P9522N64749M44573j94126m49927
$$ -996718 -1068669 -851324 -304727 -19774 -142414 -62892 501857 946430 752304 302377
38805C02377j27228N9747j99117l98518k73797k29273m12278l15345K44970N75783
$$ 302377 175149 234896 35779 -362739 -636536 -865809 -1278087 -1593432 -1348462 -772679
38795g72679J21352n89970o44512J8417O51413P22941L80296L4564q2889M029
$$ -772679 -651327 -1241297 -1885809 -1867392 -1215979 -493038 -112742 -78178 -161067 -157038
38785a57038Q6178m5170l01814l12283Q3390N17683N12299Q0113l41389m55754
$$ -157038 -70860 -116030 -417844 -730127 -646737 -129054 383245 463358 121969 -333785
38775c33785l29434j02676K03873N18550O09048L19331j82219n20066m54620p6336
$$ -333785 -663219 -765895 -562022 -43472 565576 884907 702688 182622 -271998 -348334
38765c48334K76751K79289q4500m31578l34020J41278M27230J68066k66404k85481
$$ -348334 -71583 207706 123206 -308372 -642392 -501114 -73884 94182 -172222 -457703
38755d57703P1115K44670O6652k6081J81845K76084j7179k43549N3525M95454
$$ -457703 -386588 -141918 -75266 -101347 80498 356582 339403 95854 149379 644833
38745F44833M28362k0699j90403K0376Q1445k22029n22341n51940l93850n7506
$$ 644833 1073195 1052496 862093 882469 963914 741885 219544 -332396 -726246 -783752
38735g83752M64097P24557K42397n43738o35819M9345N20056K74207k2895J45064
$$ -783752 -319655 404902 647299 103561 -532258 -482913 37143 311350 288455 433519
38725D33519K41919k21049o65612l99946K06481M20462L28897L71339L22741k02586
$$ 433519 675438 454389 -211223 -611169 -404688 15774 344671 716010 1038751 836165
38715H36165p42047n95731p3902j4105l42800k88576J51414J99950k41817l62498
$$ 836165 94118 -501613 -575515 -589620 -932420 -1220996 -1069582 -869632 -1111449 -1473947
38705a473947J29428M98717K61052p7605k4298R5157r2588k22541J64579P70046
$$ -1473947 -1344519 -845802 -584750 -662355 -686653 -591496 -684084 -906625 -742046 28000
38695B8000R48482N61740n5162n74194p05429k19230N70256P84578K7566q81797
$$ 28000 976482 1538222 1483060 908866 203437 -15793 554463 1339041 1366607 484810
38685D84810q50095L3960O41569L32669l25103n00873j74256Q3754J7947q5862
$$ 484810 -365285 -331325 310244 642913 317810 -183063 -357319 -273565 -255618 -341480
38675c41480M1755K96910M55425M44392K38186j90703o04119n23592J09951N99123
$$ -341480 -299725 -2815 452610 897002 1135188 944485 340366 -183226 -73275 525848
38665E25848L22971l21862m62041p6968M7499k88571l48484K07699O63965M71484
$$ 525848 848819 526957 64916 -12052 35447 -253124 -601608 -393909 270056 741540
38655G41540J54560K43773K36208l91743r46160m97822M88484Q07848L86752J37963
$$ 741540 896100 1139873 1376081 984338 38178 -459644 28840 836688 1223440 1361403
38645A361403K16918r3155p80416r01650k29041K97745J65273K7071L40361N14880
$$ 1361403 1578321 1485166 704750 -196900 -425941 -128196 37077 64148 404509 919389
38635I19389R6738l23536j75543Q6110j20256m33865k54972J66707K14886o0256
$$ 919389 1016127 692591 517048 603158 482902 49037 -205935 -39228 175658 115402
38625A15402j88421j11586o3657k3490R8265J34817M2693J14698L38153J72109
$$ 115402 -73019 -184605 -248262 -271752 -173487 -38670 4023 118721 456874 628983
38615F28983m78480p94164k56117M06932L47559l2096J23847N73028M41913j47749
$$ 628983 150503 -643661 -899778 -492846 -145287 -177383 -53536 519492 961405 813656
38605H13656k36726L00725N20488j9032n80689m56903P2977L75072L20777J33280
$$ 813656 576930 877655 1398143 1379111 798422 341519 414496 789568 1110345 1243625
38595A243625p3768k71735l96796m23472l00402R0641N62359N10807k31422p71269
$$ 1243625 1169857 898122 501326 77854 -222548 -131907 430452 941259 709837 -61432
38585f1432k37064P50997P61066l18197j026165m95817L26599K43883m33827n72168
$$ -61432 -298496 452501 1213567 895370 -130795 -626612 -300013 -56130 -489957 -1062125
38575a062125M5313O15038N96544K47699k597n1683J4850J07966J47860J26619
$$ -1062125 -1016812 -401774 194770 442469 439872 388189 403039 511005 658865 785484
38565G85484R7550Q668k22494l98183j97772K17614K62658j63352l96335j9142
$$ 785484 883034 891702 669208 271025 73253 290867 553525 390173 -6162 -25304
38555b5304M39931L59568Q140l4880M6153l00161q19365o88568J02589O02908
$$ -25304 414627 774195 782335 747455 793608 493447 -325918 -1014486 -911897 -308989
38545c08989L31579m9196J22854M91816L76829j12911l31209j16038R9737N5131
$$ -308989 22590 -26606 96248 588064 964893 851982 520773 404735 504472 559603
38535E59603l9535K0210J18718R9903M8433J32498L18921L71199J12894l28143
$$ 559603 520068 540278 658996 758899 807332 939830 1258751 1629950 1742844 1414701
38525A414701n76930m05694m1385R3886o5639j98273j43161j16237k31153k12784
$$ 1414701 837771 432077 390692 484578 418939 220666 77505 -38732 -269885 -482669
38515d82669J10395L94502K74224k5290n4521J12006M9329k42733l52493j99470
$$ -482669 -372274 22228 296452 271162 216641 328647 377976 135243 -217250 -416720
38505d16720j21525j73102j3030L48161L87603l8821l12233K8M08634K80787j41223
$$ -416720 -538245 -711347 -724377 -376216 11387 -27434 -339667 -339639 68995 349782 208559
38494B08559j72733K00664L59824M4153l53221m46470k56580M6538L14997L38049
$$ 208559 35826 236490 596314 640467 287246 -159224 -415804 -369266 -54269 283780
38484B83780K9374l08180l05024n7618O4943L1170P9801J54957r986k79491k15159
$$ 283780 313154 4974 -300050 -357668 -292725 -261555 -181754 -26797 -36783 -316274 -531433
38473e31433J52685K83445j346k18898k2358K72874K52500J518j79273k48348
$$ -531433 -378748 -95303 -96649 -315547 -337905 -65031 187469 188987 9714 -238634
38463b38634l12725l66485l63654k64539O9617O32687R16520L90549n57169q63355
$$ -238634 -551359 -917844 -1281498 -1546037 -1476420 -843733 72787 463336 -93833 -957188
38453i57188k21203M66949M26141J9679q8444K798q0486j22670J88351M41257
$$ -957188 -1178391 -711442 -285301 -265622 -354066 -351268 -431754 -554424 -366073 75184
38443G5184J32071k83056J078P14623P96720P1068m62426k07454J84236l0538
$$ 75184 207255 -75801 -74723 639900 1436620 1507688 1045262 837808 1022044 991506
38433I91506n42740n94611j29849K76972K79896J3352k94981n08529m98478k45230
$$ 991506 448766 -145845 -275694 1278 281174 294526 -455 -508984 -1007462 -1252692
38423a252692J8840L4508j32567j59809J12188M73188N90801L78333N1174j58943
$$ -1252692 -1233852 -1199344 -1331911 -1491720 -1379532 -906344 -315543 62790 113964 -44979
38413d4979k37588k69997k34124j06592l9250j05494J0078N68527J061003O45125
$$ -44979 -282567 -552564 -786688 -893280 -932530 -1038024 -1027946 -459419 601584 1246709
38403A246709n14274j149152n88317K50995K71163j73064m8143N38732N51986
$$ 1246709 732435 -416717 -1005034 -754039 -482876 -655940 -704083 -165351 386635
38394C86635j78197o77245m21392q789M0239O1538L92942O79030N47217K27236
$$ 386635 208438 -468807 -890199 -898988 -858749 -797211 -404269 274761 821978 1049214
38384A049214L0116j20059k46625j10419J89371J44904k51170l42380J9627P7095
$$ 1049214 1079330 959271 712646 602227 791598 936502 685332 342952 362579 439674
38374D39674m73046p32054n5857O98743M75251k38732k57511L07001L45122k61446
$$ 439674 -33372 -765426 -821283 -122540 352711 113979 -143532 163469 508591 247145
38364B47145m70152P3911M72117J71845j61931R3710M75196L22332j27843k51647
$$ 247145 -223007 -149096 323021 494866 332935 426645 901841 1224173 1096330 844683
38354H44683l7529Q1037m8694k82076n17411o17169l67425R3288K17646j65725
$$ 844683 807154 888191 839497 557421 40010 -577159 -944584 -851296 -633650 -799375
38344g99375m33680j1526P32900R60905M66747j87228m56826k99820n101J09553
$$ -799375 -1233055 -1244581 -511681 449224 915971 728743 271917 -27903 -33004 76549
38334G6549n2934j97157O0419N46609O05083Q5005k89808q860L44256R945o27926
$$ 76549 23615 -173542 -113123 433486 1038569 1123574 833766 824906 1169162 1179107 551181
38323E51181n75532J58092N09068l4015p24184p07988q8828M88294O60519M34298
$$ 551181 -24351 133741 642809 608794 -115390 -823378 -912206 -423912 236607 670905
38313F70905J7267j64637J70746N84730L38017m28205p32975k76446L9637l42785
$$ 670905 688172 523535 694281 1279011 1617028 1188823 455848 179402 219039 -123746
38303a23746o08234J7572P58541M41891m94723o17617J88075N83039J2362m82751
$$ -123746 -731980 -714408 44133 486024 -8699 -626316 -438241 144798 157160 -325591
38293c25591j31009L22292J7777n36298m00094K07921L57072m8403k21366K07077
$$ -325591 -456600 -134308 -116531 -652829 -1052923 -845002 -487930 -536333 -757699 -550622
38283e50622P27857P78855L61047j90553n54449n44372k47429K1573J28260K39263
$$ -550622 177235 956090 1317137 1126584 572135 27763 -219666 -198093 -69833 169430
38273A69430L35351Q2421m42462m96784K36927Q76306M86159m59866p53867k65987
$$ 169430 504781 587202 144740 -352044 -115117 761189 1247348 787482 33615 -232372
38263b32372M6982j93393l46523q1564R7922p018J70559P43447Q25943k1886p97490
$$ -232372 -185390 -378783 -725306 -806870 -708948 -715966 -545407 198040 1023983 1002097 204607
38252B04607m57995M67054P23257J98423k00441j60174k46286o57195q20046m09053
$$ 204607 -253388 213666 936923 1135346 934905 774731 528445 -128750 -948796 -1357849
38242a357849J37914L75872L92046L46745J41236j81731k87395p9557J18523J39011
$$ -1357849 -1219935 -844063 -452017 -105272 35964 -145767 -433162 -512719 -394196 -255185
38232b55185K05606L64418K49847k44967n97195l75021J18734L61167L47818L29267
$$ -255185 -49579 314839 564686 319719 -277476 -652497 -533763 -172596 175222 504489
38222E04489K06074k10248o01499m61123J01528M70861L92351J60854l5248l29992
$$ 504489 710563 500315 -101184 -562307 -460779 10082 402433 563287 528039 198047
38212A98047o44479n79114r9756K30006N9087j90745p293L87477M35552J61793
$$ 198047 -446432 -1025546 -1125302 -895296 -836209 -1026954 -1034247 -646770 -211218 -49425
38202d9425N8733J87275P9257l79696o20599k47410K81855K81838j58931l22355
$$ -49425 9308 196583 275840 -103856 -724455 -971865 -690010 -408172 -567103 -889458
38192h89458Q2557N15654L97043q4475k63763Q2142M77328M38933Q5981j56608
$$ -889458 -806901 -291247 105796 21321 -242442 -160300 317028 755961 841942 685334
38182F85334k03552k76475l35989o2877M67947O32069J41370l68027j87437L53743
$$ 685334 481782 205307 -130682 -193559 274388 906457 1047827 679800 492363 846106
38172H46106L42616l02348o96921l52316J73554K79758J63384J66991L9440m46847
$$ 846106 1188722 886374 189453 -162863 10691 290449 453833 620824 660264 213417
38162B13417p49723k96871M36012N24426L0915j58349J45406J69289l71888o53220
$$ 213417 -536306 -833177 -397165 127261 158176 -173 145233 314522 -57366 -710586
38152g10586q5638O27606N27298j59203m58416j29723J83699J27716Q1967L05891
$$ -710586 -796224 -168618 358680 199477 -258939 -388662 -204963 -77247 4720 310611
38142C10611L95297l2320o13992o90829k44374J04991K5709n0606L73225R82592
$$ 310611 705908 673588 59596 -631233 -875607 -770616 -744907 -795513 -422288 560304
38132E60304R27544n975r52607r73083j95950M39345L95705K0643j44644l7765
$$ 560304 1487848 1481873 529266 -443817 -639767 -200422 195283 215926 71282 33517
38122C3517P6667L6668j26649k51689r1848M03262P87591N02017k97039p37040
$$ 33517 110184 146852 20203 -231486 -323334 79928 867519 1369536 1072497 335457
38112C35457l20577L92816N47274Q2761l61752l86588j96010j18332j82753k16780
$$ 335457 14880 407696 954970 1037731 675979 289391 93381 -24951 -207704 -424484
38102d24484j10783N8057P0431j86915m66862l65450J25365N47094N94342M58488
$$ -424484 -535267 -477210 -406779 -593694 -1060556 -1426006 -1300641 -753547 -159205 299283
38092B99283L51614J21253k96982m65806l3162N39991M60790k76076q27314n91757
$$ 299283 650897 772150 475168 9362 -23800 516191 976981 700905 -126409 -718166
38082g18166J27523O40405O35424K94444m3529j82488j98833l11856n24722n23953
$$ -718166 -590643 49762 685186 979630 936101 753613 554780 242924 -281798 -805751
38072h05751j34578L04311L25523l0563k89418j61579K09654N19156N34360J91643
$$ -805751 -940329 -636018 -310495 -341058 -630476 -792055 -582401 -63245 471115 662758
38062F62758k50670l22805Q8922M96267M53449J55041q925j18737l79270m80647
$$ 662758 412088 89283 178205 674472 1127921 1282962 1274037 1155300 776030 295383
38052B95383o2554M34302K53819m34756o89050k17779K64191K49225Q9762J69004
$$ 295383 232829 667131 920950 486194 -202856 -420635 -156444 92781 182543 351547
38042C51547K85336K29466K00869K70061J45939j80301l06041k39207m83566r37546
$$ 351547 636883 866349 1067218 1337279 1483218 1302917 996876 757669 274103 -663443
38032f63443p28624K86477R38425M76264j66019J07144P20498M56838m12346n82775
$$ -663443 -1392067 -1105590 -167165 309099 143080 250224 970722 1427560 1015214 432439
38022D32439P4450L72636j49020n75693k72782J73751J44070m0385Q3282K66422
$$ 432439 506889 879525 730505 154812 -117970 55781 199851 159466 242748 509170
38012E09170J05876k53660m90257n73304m68864j3311N53739O15276J34605j32396
$$ 509170 615046 361386 -128871 -702175 -1171039 -1184350 -630611 -15335 119270 -13126
38002a3126J59313L09348k33092p99036m87691L36563N42281m2128m08488R1078
$$ -13126 146187 455535 222443 -576593 -1064284 -727721 -185440 -227568 -636056 -544978
37992e44978Q51971R37243K84097l74362m66561j34392Q2634p7383l20322k25400
$$ -544978 306993 1244236 1528333 1153971 687410 553018 635652 558269 237947 12547
37982A2547J54455L61375J83539j11867k75351l86578m82379l27123J23694M38240
$$ 12547 167002 528377 711916 600049 324698 -61880 -544259 -871382 -747688 -309448
37972c09448K86757l7543r0450O7283J43187J96990L94233M70855R9700l89509
$$ -309448 -22691 -60234 -150684 -83401 59786 256776 651009 1121864 1221564 832055
37962H32055l54533J53909M18225J20351k82558l60975k49316j86476j15853M070
$$ 832055 477522 631431 1049656 1170007 887449 526474 277158 90682 -25171 -21101
37952b1101L0061L6641L37992P98800P21636j10146q29146n62913K82930N57897
$$ -21101 8960 45601 383593 1182393 1904029 1793883 964737 401824 684754 1242651
37942A242651l9504o82871o93790l09462j5563J55605L12359K95839N2559n7996
$$ 1242651 1203147 520276 -173514 -482976 -498539 -342934 -30575 265264 317823 259827
37932B59827J43440J54588m69634j156853q90995K83511J142818Q79614Q4834
$$ 259827 403267 557855 88221 -1068632 -1959627 -1676116 -533298 346316 431150
37923D31150k43453j1895K05526J94011J78287J77494J0831j66660j2806L20663
$$ 431150 187697 175802 381328 575339 753626 931120 941951 775291 762485 1083148
37913A083148K82922k18305o17175m87075n6698K11687J39013j80575n05725n03471
$$ 1083148 1366070 1147765 530590 43515 -13183 198504 337517 156942 -348783 -852254
37903h52254q4066L20846K63480j9712J0158K36005R6997k80710j54862M71664
$$ -852254 -936320 -615474 -351994 -371706 -361548 -125543 -28546 -309256 -464118 7546
37893G546O56463P1437l76525q3516K25029j40655n17345o7965O08026L81149
$$ 7546 664009 735446 358921 275405 500434 359779 -157566 -225531 382495 763644
37883G63644m98872p99642k55634K44779K39084J35516J18400j23151m76980l81053
$$ 763644 264772 -534870 -790504 -545725 -306641 -171125 -52725 -175876 -652856 -1033909
37873a033909J22826L59108J82701J49052L90615L73823l4954k84493j36370K5274
$$ -1033909 -911083 -551975 -369274 -220222 170393 544216 509262 224769 88399 113673
37863A13673N2101K04151L38041N986n02875m05791J33916J36734l96503l32974
$$ 113673 165774 369925 707966 713952 211077 -194714 -60798 75936 -320567 -653541
37853f53541N22204Q55943O7755o02009j78621L98756K2380o27485m01060K44792
$$ -653541 -131337 724606 792361 190352 11731 410487 432867 -194618 -595678 -350886
37843c50886J64866m09649m30476N6946K31600J36241L43259N01810o8484p49974
$$ -350886 -186020 -595669 -1026145 -969199 -737599 -601358 -258099 243711 175227 -574747
37833e74747l86602N97301O91865j85482n86817n0633K42264k72508n44183J15100
$$ -574747 -961349 -364048 327817 142335 -444482 -495115 -252851 -525359 -1069542 -954442
37823i54442P68542N06999q8652j57372J2465j66816l64200p6948K66026N4122
$$ -954442 -185900 321099 232447 75075 87540 -79276 -443476 -520424 -254398 -200276
37813b00276l37269j92249K86421L94928J75245K31029N65829N59192K0491n23448
$$ -200276 -537545 -729794 -443373 -48445 126800 357829 923658 1482850 1503341 979893
37803I79893o11189l24048K5635K21065J75084m187l9535J63185L32774K28784
$$ 979893 368704 44656 70291 291356 466440 462253 422718 585903 918677 1147461
37793A147461k244j09343j14274j31866q0411J13490K36534L1145m09936p12729
$$ 1147461 1145217 1035874 921600 789734 709323 822813 1059347 1090492 680556 -32173
37783c2173n92199p2625M98248O56356K94318j19949j22036Q0562j139k39101
$$ -32173 -624372 -696997 -198749 457607 751925 631976 509940 590502 589363 350262
37773C50262q9276L51771L64663j66748m79590k11377J759k76384m32916R5700
$$ 350262 260986 612757 977420 810672 331082 119705 121464 -154920 -587836 -492136
37763d92136O96622M78502l10442p26956n43101k44416J7942M33632O95793K44250
$$ -492136 204486 682988 372546 -354410 -897511 -1141927 -1123985 -690353 5440 249690
37753B49690o19716q64817j90576N08912M58474J7974n7191K38995L28014R577
$$ 249690 -370026 -1234843 -1425419 -916507 -458033 -440059 -497250 -258255 69759 79336
37743G9336l07025k60264r438M5369j88708l75845j76323K96085N70909L94969
$$ 79336 -227689 -487953 -497391 -452022 -640730 -1016575 -1192898 -896813 -325904 69065
37733F9065L9459q2011N5422J33311k2521k29075k42505q4991M0840Q3344J98735
$$ 69065 108524 26513 81935 215246 192725 -36350 -278855 -363846 -323006 -239662 -40927
37722d0927L96048L43957j49915n94708l05433M74483O58532q6868o23435K6176
$$ -40927 355121 699078 549163 -45545 -350978 123505 782037 695169 71734 97910
37712I7910J045885R50080j39805p23887k67998J97440l520k33837k3343j7241
$$ 97910 1143795 2093875 1954070 1230183 962185 1159625 1156105 922268 898925 881684
37702H81684o15020r76037m22792K78428J93423j90405O7359N96984L49028n18495
$$ 881684 266664 -709373 -1132165 -853737 -660314 -850719 -783360 -186376 162652 -355843
37692c55843q13607j54717O32007Q78463P06241L21248k64347p37920o38361j16028
$$ -355843 -1169450 -1324167 -692160 186303 892544 1213792 949445 211525 -426836 -542864
37682e42864K01225J27612M3548J71433L72581N36171N60691J91562m87849p77264
$$ -542864 -341639 -214027 -170479 954 373535 909706 1470397 1661959 1174110 396846
37672C96846l13376J60130j22259o00177k57875N82477O87650p1526n60428k53580
$$ 396846 83470 243600 121341 -478836 -736711 -154234 533416 461890 -98538 -352118
37662c52118J40345J15056P5771K77321L00846J0156r3901J12577P6111l32910
$$ -352118 -211773 -96717 -20946 256375 557221 567377 473476 586053 662164 329254
37652C29254m92334j98434o5068l15877l02736K57209O78908N09765K30814J76428
$$ 329254 -163080 -361514 -426582 -742459 -1045195 -787986 -109078 400687 631501 807929
37642H07929p8526n78392m72803M88583J135698N69698m23061p37606o27296p57007
$$ 807929 729403 151011 -321792 166791 1302489 1872187 1449126 711520 84224 -672783
37632f72783o69912K40451J098025O64474m50179n44327M56030R14543J81583
$$ -672783 -1342695 -1102244 -4219 660255 210076 -334251 121779 1036322 1217905
37623A217905n03640k44054J36246k37976p15816l30655M63507M97221k80738
$$ 1217905 714265 470211 606457 368481 -347335 -677990 -214483 282738 2000
37614B000q19307n32394J25903N62107O76054N22329N9652n15177p04088l11922
$$ 2000 -817307 -1349701 -1223798 -661691 14363 536692 596344 81167 -622921 -934843
37604i34843K08025L39028J99438K65099N20362M15922j89268n93998k13239M30126
$$ -934843 -726818 -387790 -188352 76747 597109 1013031 823763 229765 16526 446652
37594D46652L55602m01309p86286l00558K84938J84925k23722j46928L04501L81327
$$ 446652 802254 400945 -385341 -685899 -400961 -216036 -439758 -586686 -282185 99142
37584I9142l9911l25131j38529J38536J19196r1198k40859k60952j27771J58944
$$ 99142 59231 -265900 -404429 -265893 -146697 -237895 -478754 -739706 -867477 -708533
37574g08533L74846K78780O7659J43321L75176J83216m66994p90126k83125M53773
$$ -708533 -333687 -54907 12752 156073 531249 714465 247471 -542655 -825780 -372007
37564c72007N45231Q1649j34126J44337L43542R4810k26714k55567k60480n24168
$$ -372007 173224 254873 120747 265084 608626 703436 476722 221155 -39325 -563493
37554e63493o35199j06741O15478O17866o3557m07605R437L48035p5523o12819
$$ -563493 -1198692 -1305433 -689955 -72089 -135646 -543251 -533814 -185779 -261302 -874121
37544h74121l62326K96058L41967j56834k09864L43765N65189P3456l01050K2217
$$ -874121 -1236447 -940389 -598422 -755256 -965120 -621355 -56166 17290 -283760 -261543
37534b61543M11799K03605j36256J21986O81030O96986O3809n80500p63646m50548
$$ -261543 150256 353861 217605 339591 1020621 1717607 1781416 1200916 437270 -13278
37524a3278J74204N99525J92930q16530j164817j88940R79172Q89352r7334m32737
$$ -13278 160926 760451 953381 136851 -1027966 -1216906 -237734 651618 554284 121547
37514A21547J98246N71772P9791l45876N0320N52124K24801n25676o37157l5102
$$ 121547 319793 891565 971356 625480 675800 1227924 1452725 927049 289892 254790
37504B54790L77866J10259l67187m31096n0676L76056N32826L89602R6347j95136
$$ 254790 632656 742915 375728 -55368 -106044 270012 802838 1192440 1288787 1093651
37494A093651m03382m46927k43532J00710K79963J91244J38765L16978L64423
$$ 1093651 690269 243342 -190 100520 380483 571727 710492 1027470 1391893
37485A391893o3460n35433l74843J81878K39364k78990m06582K73496Q20867L76150
$$ 1391893 1328433 793000 418157 600035 839399 560409 153827 427323 1248190 1624340
37475A624340m53833n33423J03540M86837K48565j00628k44465l78717m52233
$$ 1624340 1170507 637084 740624 1227461 1476026 1375398 1130933 752216 299983
37466B99983r3082N10018N74390p6868o00038l79041N2905n4096m42691l36253
$$ 299983 206901 716919 1291309 1214441 614403 235362 288267 234171 -208520 -544773
37456e44773K48660N31941J90067k37294k41736K701Q0831p5750k82528m04198
$$ -544773 -296113 235828 425895 188601 -53135 -50434 30397 -45353 -327881 -732079
37446g32079l38788j2688M01358N39370L22528J26929K68768N42463M93470q140
$$ -732079 -1070867 -1083555 -682197 -142827 179701 306630 575398 1117861 1611331 1603191
37436A603191o40360r40396o54344K1634M79772K61904l16792m47607J17885O96658
$$ 1603191 962831 22435 -631909 -610275 -130503 131401 -185391 -632998 -515113 181545
37426A81545N99966R907m12844m02527j49067J59676L76106K71405j24147l24183
$$ 181545 781511 791418 378574 -23953 -173020 -13344 362762 634167 510020 185837
37416A85837k8022L28446K09580j46267j40393J79348K72169N7161r1960j55780
$$ 185837 157815 486261 695841 549574 409181 588529 860698 917859 825899 670119
37406F70119m02674n94732k16251M57896N19033j48853n64838j02408O39789Q22956
$$ 670119 267445 -327287 -543538 -85642 433391 284538 -280300 -382708 257081 1080037
37396A080037M39207k0614k74840k53079k6408J0667m28844p94709k94025O64966
$$ 1080037 1519244 1498630 1223790 970711 944303 954970 526126 -268583 -562608 102358
37386A02358P72139j51452p36565k08105M58038L06167r3915K6243J70703k34235
$$ 102358 874497 723045 -13520 -221625 236413 542580 448665 474908 645611 411376
37376D11376m48177K31716Q38657K29947p21822m25472O36604O15440n59264j060287
$$ 411376 -36801 194915 1033572 1263519 541697 116225 752829 1368269 809005 -251282
37366b51282k37930M84682K13466j06750K61131M93190o4762n50531j74188L21290
$$ -251282 -489212 -4530 208936 102186 363317 856507 791745 241214 67026 388316
37356C88316O4241l67241j24792K75722l3957n46718k39103M99215M32044l79820
$$ 388316 452557 85316 -39476 236246 202289 -344429 -583532 -84317 347727 -32093
37346c2093o27291Q7222O65108L57103j54884n9692K88028J21519m26960n91065
$$ -32093 -659384 -572162 92946 450049 295165 235473 523501 645020 218060 -373005
37336c73005j85055J82878M6724l25874m02782j00049J91978J59303o8457j29423
$$ -373005 -558060 -375182 -328458 -654332 -1057114 -1157163 -965185 -805882 -874339 -1003762
37326a003762J18086M49087N39288L05972j2461j03206N6433J29537j42627m99858
$$ -1003762 -885676 -436589 102699 408671 396210 293004 349437 478974 336347 -163511
37316a63511m57523m0007K22718J53959K10316N75978O28023p5385q39006p12669
$$ -163511 -621034 -661041 -438323 -284364 -74048 501930 1129953 1054568 215562 -497107
37306d97107O3537M69578L02759K44295L98094M3433q66754j209224l31396Q21599
$$ -497107 -433570 36008 338767 583062 981156 1024589 157835 -1051389 -1382785 -561186
37296e61186J025876M41939P0988J40585K5253n09593r31504q14263l61268O2997
$$ -561186 464690 906629 977617 1118202 1143455 633862 -297642 -1111905 -1473173 -1410176
37286a410176L87884O56362P64001N74949J34932l20885n08854k91127J64697
$$ -1410176 -1022292 -365930 398071 973020 1107952 787067 278213 -12914 151783
37277A51783M59896K97227k38370p09924o38952O4046Q68827J019496L65060l97197
$$ 151783 611679 908906 670536 -39388 -678340 -614294 254533 1274029 1639089 1241892
37267A241892n47557j68894J52466J36694r8485m25198o45705l67142M15250R11466
$$ 1241892 694335 525441 677907 814601 716116 290918 -354787 -721929 -306679 604787
37257F04787M73840l32280m74424k3052Q1720l11150l91499M2135J94495j88258
$$ 604787 1078627 746347 271923 248871 330591 19441 -372058 -329923 -135428 -323686
37247c23686k46648L99735P65265R9233p13865m57031N14451Q44810J66952n79214
$$ -323686 -570334 -170599 594666 693899 -19966 -476997 37454 882264 1049216 470002
37237D70002n81028J0299N72330O38202J21484n63484p57166l14756J70092K22440
$$ 470002 -111026 -100727 471603 1109805 1231289 667805 -89361 -404117 -234025 -11585
37227a1585J04801J78321K23573l0180k52370q5536R9428k01216o39849m62201
$$ -11585 93216 271537 495110 464930 212560 127024 226452 25236 -614613 -1076814
37217a076814K72958P31853N11901R1223P538J79695K15658L421k06225j67095
$$ -1076814 -803856 -72003 439898 531121 538659 718354 934012 937433 731208 564113
37207E64113J4053k1484l27618m11914O7518N83968L71027l39071n46579l199
$$ 564113 578166 556682 229064 -182850 -115332 468636 839663 500592 -45987 -49186
37197d9186M58189L24073R4479J86737K04621j26444l02158q710J85441j49684
$$ -49186 409003 733076 827555 1014292 1218913 1092469 790311 781601 967042 817358
37187H17358m91843l45791j22546k11223j28079M59181Q16745L44650k19985j4036
$$ 817358 325515 -20276 -142822 -354045 -482124 -22943 793802 1138452 918467 904431
37177I04431L86972k8179q61955r33588k24223K58651J83784P8865J22721P8297
$$ 904431 1291403 1263224 401269 -532319 -756542 -497891 -314107 -235242 -112521 -34224
37167c4224J41010N74976Q18735K34635o05020p03955l05282l35110o19758k94022
$$ -34224 106786 681762 1500497 1735132 1130112 426157 120875 -214235 -833993 -1128015
37157a128015L51502K55764l29418r0004R16363J082682q3582j051825p09319
$$ -1128015 -776513 -520749 -850167 -940171 -23808 1058874 975292 -76533 -785852
37148g85852M9279O5364k94250j54898K85446L03501p1679k69168q3405K62235
$$ -785852 -736573 -671209 -965459 -1120357 -834911 -531410 -603089 -872257 -955662 -693427
37138f93427M61471K27827l60991n78592P7310Q23610N09002m90460o78226J94816
$$ -693427 -231956 -4129 -365120 -943712 -866402 -42792 466210 -24250 -702476 -507660
37128e07660P50229K59793l59181l36581j72243k71457r0922M98932N72680j57014
$$ -507660 242569 502362 143181 -193400 -365643 -637100 -728022 -229090 343590 186576
37118A86576n26898J25083O92207J85267n69983m81258o6022k66680o23873k67884
$$ 186576 -340322 -215239 476968 662235 92252 -389006 -455028 -721708 -1345581 -1613465
37108a613465L27567K71208J0847M36246J030860P07852j67588m10741j34353
$$ -1613465 -1285898 -1014690 -1003843 -567597 463263 1171115 1003527 592786 458433
37099D58433l58954q94458n67721N54435J073094N03512j28293j48494m9606j41897
$$ 458433 99479 -794979 -1362700 -808265 264829 768341 640048 491554 441948 300051
37089C00051K3375M51421L96325k21907m42651J21330N59987J93704l51436l12488
$$ 300051 323426 774847 1171172 949265 506614 627944 1187931 1381635 1030199 717711
37079G17711K5860R2334M5367K10107K83637o8085m51861l70335p3700n4566j69037
$$ 717711 743571 835905 881272 1091379 1375016 1306931 855070 484735 411035 356469 187432
37068A87432m405K67316J68186j96494k51853J31755M54611L45627L1584n0194
$$ 187432 183027 450343 618529 422035 170182 301937 756548 1102175 1133759 1083565
37058A083565J87726M08808K28460l29223p46119n38894J17596N52082M24190
$$ 1083565 1271291 1680099 1908559 1579336 833217 294323 411919 964001 1388191
37049A388191O0418j25135j34135j00851O6263L96403N37438J73963m14693o43007
$$ 1388191 1448609 1323474 1189339 1088488 1154751 1551154 2088592 2262555 1847862 1204855
37039A204855l76443j1187J44507J57801J21859n1112l29640m11201j21661K71970
$$ 1204855 828412 817225 961732 1119533 1241392 1190280 860640 449439 327778 599748
37029E99748M01476K60190O5726j39264l90025m50790m5944N49153O60622J22069
$$ 599748 1001224 1261414 1327140 1187876 797851 347061 301117 850270 1510892 1632961
37019A632961m49422n34305l83607m31326n04896j94944L06532M10375N4176k11436
$$ 1632961 1183539 649234 265627 -165699 -670595 -865539 -559007 -148632 -94456 -305892
37009c05892o3169K28471L30813K49975J14378j4991m4013Q1319J92678J34719
$$ -305892 -369061 -140590 190223 440198 554576 539585 495572 576891 769569 904288
36999I04288R2480K78426M46977K36712j53506k38250p1645j07925l15788k16050
$$ 904288 996768 1275194 1722171 1958883 1805377 1567127 1495482 1387557 1071769 855719
36989H55719J76407K75848p3940l22871j42063J28757J87919J94134K49652J79975
$$ 855719 1032126 1307974 1234034 911163 769100 897857 1085776 1279910 1529562 1709537
36979A709537N0111J71221L97616K11271k84420l37322K00038N21414J72594k16969
$$ 1709537 1759648 1930869 2328485 2539756 2255336 1918014 2118052 2639466 2812060 2595091
36969B595091k1157M18000M89556K22129p7207l98021o89413n97372p3272L32096
$$ 2595091 2573934 2991934 3481490 3703619 3626412 3228391 2538978 1941606 1868334 2200430
36959B200430K37698m5016r7312O2196K53226L57461J70079k90096l97801K66642
$$ 2200430 2438128 2393112 2295800 2357996 2611222 2968683 3138762 2848666 2450865 2717507
36949B717507R14019N25077l69003l56780N19565Q52893L38936J73886P32176
$$ 2717507 3631526 4156603 3787600 3430820 3950385 4803278 5142214 5316100 6048276
36940F048276R85570O82095Q32701J434676J166913J31622K42251J868401K931177
$$ 6048276 7033846 7715941 8548642 9983318 11150231 11281853 11524104 13392505 16323682
36931A6323682K575088K669109M140464N167655M905901N390848P477808Q905804
$$ 16323682 18898770 21567879 25708343 30875998 35781899 41172747 48650555 57556359
36923E7556359R146998J1561812J7239446K2288185K6235896L6036400N2508303
$$ 57556359 66703357 78265169 95504615 117792800 144028696 180065096 232573399
36916B32573399N8483025L4485325j3113205n2660459o0750548m5196023k9240701
$$ 232573399 291056424 325541749 312428544 259768085 199017537 153821514 124580813
36909A24580813k3173183k0676099j5698956j0533045q341787p654114o344807
$$ 124580813 101407630 80731531 65032575 54499530 46157743 38503629 32158822
36902C2158822m948733m146223l170034j956546j597088j950371j637488o92479
$$ 32158822 27210089 23063866 19893832 17937286 16340198 14389827 12752339 12059860
36894A2059860n27013j178536j238866n58303m32872j031560j129767n13086k70000
$$ 12059860 11532847 10354311 9115445 8557142 8124270 7092710 5962943 5449857 5179857
36885E179857n67278m18540J93272J84282m61280n34176J53264M08873j69656
$$ 5179857 4612579 4194039 4387311 4571593 4110313 3576137 3729401 4138274 3968618
36876C968618n94097l55693r3159j13813M7034L53645J95121k34446p9470N27889
$$ 3968618 3374521 3018828 2925669 2811856 2858890 3212535 3407656 3173210 3093740 3621629
36866C621629N59100q0085m22867k17843j91354m54824l19315J84447K58890q1266
$$ 3621629 4180729 4100644 3677777 3459934 3268580 2813756 2494441 2678888 2937778 2856512
36856B856512n0842K23566j57098r35918q12184K64165Q44255M17188J50582O55056
$$ 2856512 2805670 3029236 2872138 1936220 1124036 1388201 2232456 2649644 2800226 3455282
36846C455282R47314L92890j33756P7855L85401K19003J92834Q16152J438946
$$ 3455282 4402596 4795486 4661730 4739585 5124986 5343989 5536823 6352975 7791921
36837G791921J439006J253927J367115J442483J297292J567105K529569L317740
$$ 7791921 9230927 10484854 11851969 13294452 14591744 16158849 18688418 22006158
36829B2006158L113329K153105Q98886p00315k427139l408402l303529k890479
$$ 22006158 25119487 27272592 28171478 27471163 25044024 21635622 18332093 15441614
36821A5441614k773917k520263j730569r04302n33629l60715j80675l28216p66029
$$ 15441614 12667697 10147434 8416865 7512563 6978934 6618219 6437544 6109328 5343299
36812E343299q31773m92840n98532j235145j234475j47782P45264M32358k32596
$$ 5343299 4511526 4018686 3420154 2185009 950534 802752 1548016 1980374 1747778
36803A747778j21936L07036J17951l18885j50979K87704J33209m16923n58061
$$ 1747778 1625842 1932878 2050829 1731944 1580965 1868669 2001878 1584955 1026894
36794A026894k91767j23626K0985L90806N72188J99828j89098r9311n0293m66671
$$ 1026894 735127 611501 632486 1023292 1595480 1795308 1606210 1506899 1456606 989935
36784I89935n79633K12694Q99029L61381n94604n02438K63377K19082n88562p87958
$$ 989935 410302 622996 1522025 1883406 1288802 786364 1049741 1268823 680261 -107697
36774a07697j94323N2095k25022M926P56865P22428l45607r61240l15001M71879
$$ -107697 -302020 -249925 -474947 -470021 286844 1009272 663665 -297575 -612576 -140697
36764a40697L37773j38864j09826Q0396j21545k90977O5557M43267K35891j74439
$$ -140697 197076 58212 -51614 28782 -92763 -383740 -318183 125084 360975 186536
36754A86536j87427l1606j18179j34153K62527N50457J45098m80801m54493J57938
$$ 186536 -891 -32497 -150676 -284829 -22302 528155 673253 192452 -262041 -104103
36744a04103N67603M53983J25485j76164l74172k78383Q1464J76443k73951o43913
$$ -104103 463500 917483 1042968 866804 492632 214249 295713 472156 198205 -445708
36734d45708k48893M88393N60074j54939p76809o80989j02311M62097P38450N93680
$$ -445708 -694601 -206208 353866 198927 -577882 -1258871 -1361182 -899085 -160635 433045
36724D33045J42129q7337K62488O79976L72452m95298r44725o07677j33777O686
$$ 433045 575174 487837 750325 1430301 1802753 1307455 362730 -244947 -378724 -372038
36714c72038J80324O27406P57081J27418n66239l85473L75333N60996j26906p15673
$$ -372038 -191714 435692 1192773 1320191 753952 368479 743812 1304808 1177902 462229
36704D62229m15410L13997N36199J15800k75796j46026K85525M74817J76119l39204
$$ 462229 46819 360816 897015 1012815 737019 590993 876518 1351335 1527454 1188250
36694A188250n58849k56625K19855L16027m8127l89392l42825j33006j36037k47270
$$ 1188250 629401 372776 592631 908658 860531 471139 128314 -4692 -140729 -387999
36684c87999o9864L83701N99405K41857l77948o58623l62961K00239N49935M90421
$$ -387999 -457863 -74162 525243 767100 389152 -269471 -632432 -432193 117742 608163
36674F08163K09476l2841k14719m24734n17221k24176L19536N62555K84338l3708
$$ 608163 817639 784798 570079 145345 -371876 -596052 -276516 286039 570377 536669
36664E36669N9136K64985O3766l62455l92798J6247K99508K29271J45115J64202
$$ 536669 595805 860790 924556 562101 169303 185550 485058 714329 859444 1023646
36654A023646n2024n06131o02335p9484M44820L53289q8133k52184q5803N5015
$$ 1023646 971622 465491 -136844 -216328 228492 581781 493648 241464 155661 210676
36644B10676J21199K82486L73775Q2567m01153n12818j26737K39000J43672k09205
$$ 210676 331875 614361 988136 1070703 669550 156732 29995 268995 412667 203462
36634B03462k90673P3606N06737N33958J53350j58059p4000J45769J01116r0059
$$ 203462 -87211 -13605 493132 1027090 1180440 1022381 948381 1094150 1195266 1105207
36624A105207m2610J34637k4935m35329m28717J58531O08360L72270j84666m87290
$$ 1105207 1062597 1197234 1172299 736970 308253 466784 1075144 1447414 1262748 775458
36614G75458n15564m19412q6819L61366L77853p7653j80792M24164P66078K9273
$$ 775458 259894 -159518 -246337 115029 492882 415229 234437 658601 1424679 1453952
36604A453952q91058o23406M50526P18187j46642p78467l48376L25097L23050
$$ 1453952 562894 -60512 390014 1108201 961559 183092 -165284 159813 482863
36595D82863n1568j44300n8233j50532k42419m6660K34914L34942L96186N31070
$$ 482863 431295 286995 228762 78230 -164189 -210849 24065 359007 755193 1286263
36585A286263M60708O7153k34463j28043J34335L09722O07177J087977J282194
$$ 1286263 1746971 1814124 1579661 1451618 1585953 1895675 2502852 3590829 4873023
36576D873023J007394R46482J648578K421867K059227M31686j363656k292154
$$ 4873023 5880417 6826899 8475477 10897344 12956571 13388257 12024601 9732447
36568I732447k207233j568147r63090q21986j053141j034801m16287K57007K38006
$$ 9732447 7525214 5957067 4993977 4171991 3118850 2084049 1667762 1924769 2162775
36559B162775l11898n50824j89278K00745J43312j47523k88429k44921r9527J74997
$$ 2162775 1850877 1300053 1110775 1311520 1454832 1307309 1018880 773959 674432 849429
36549H49429M31835L01481k34647n99176l27500K57961M74513J82365j50282j83141
$$ 849429 1281264 1582745 1348098 748922 421422 679383 1153896 1336261 1185979 1002838
36539A002838p3416o6568j05036l6333M9584m0459k41299k82631j07265J9556
$$ 1002838 929422 862854 757818 721485 771069 730610 489311 206680 99415 118971
36529A18971p5419j65957O2274N21168P88334O25277J88759k64339o06155p19181
$$ 118971 43552 -122405 -60131 461037 1249371 1874648 2063407 1799068 1192913 473732
36519D73732m65146M1431L77285K80884J3851l413K27755L74467L40229L52674
$$ 473732 8586 50017 427302 708186 722037 718624 946379 1320846 1661075 2013749
36509B013749M64384L94002N8212j11762K63579Q71673J083744Q90509R54714
$$ 2013749 2478133 2872135 2930347 2818585 3082164 3953837 5037581 5928090 6882804
36500F882804J595528K181661J871529O67137o53062j465334j744623j687553
$$ 6882804 8478332 10659993 12531522 13198659 12545597 11080263 9335640 7648087
36492G648087j395984j022341q00140p39325o01324l35376k21420l91841n45058
$$ 7648087 6252103 5229762 4429622 3690297 3088973 2753597 2532177 2140336 1595278
36483A595278m02243j56264j38158k66764k05293O8811K28696J05418q8038r2985
$$ 1595278 1193035 1036771 898613 631849 426556 495367 724063 829481 741443 648458
36473F48458M8642P3174j49922l90356k63471K39794N88160L67909m4979K4303
$$ 648458 697100 770274 620352 229996 -33475 206319 794479 1162388 1117409 1141712
36463A141712M39370L47395m43450r99855o29510P9331K73144J69898M44864Q25719
$$ 1141712 1581082 1928477 1485027 485172 -144338 -65007 208137 378035 822899 1648618
36453A648618M56273n51691j090060o42835J07721M29187L71851K23823K693j95184
$$ 1648618 2104891 1553200 463140 -179695 -71974 357213 729064 952887 955580 760396
36443G60396j06527J23416j64m04255l68207K92261P78028N10285j2514j32550
$$ 760396 653869 777285 777121 372866 4659 296920 1074948 1585233 1572719 1440169
36433A440169l6009j27604j13955L86386Q37446M07468o47590j191166p56856
$$ 1440169 1404160 1276556 1162601 1548987 2386433 2793901 2146311 955145 198289
36424A98289l4577K58862J92175R9472k9156k60236l47402j00324J90253J20011
$$ 198289 163712 422574 614749 714221 685065 424829 77427 -22897 167356 287367
36414B87367k03319k93312m498K45168Q9434k29184j88305K43902N14693K46873
$$ 287367 84048 -209264 -213762 31406 120840 -108344 -296649 -52747 461946 708819
36404G08819k26207l27437j8523K03068j2045m88217p97505o68052j68865L13460
$$ 708819 482612 155175 136652 339720 327675 -160542 -958047 -1626099 -1794964 -1481504
36394a481504L92576J67761J75849O05683Q92068N19055j16807k56341P4817K15230
$$ -1481504 -1088928 -921167 -745318 -139635 752433 1271488 1154681 898340 973157 1188387
36384A188387J6949k655L17306M67695J64695k13052l21025k77167j72172J27809
$$ 1188387 1205336 1202681 1519987 1987682 2152377 1939325 1618300 1341133 1168961 1296770
36374A296770M46796L09209k30457m97889k14104J69649M13184Q60401J496467
$$ 1296770 1743566 2052775 1822318 1324429 1110325 1279974 1693158 2553559 4050026
36365D050026J614345R90950N06474R94428K328729M145350O320558P982698P381559
$$ 4050026 5664371 6655321 7161795 8156223 10484952 14630302 20950860 28933558 36315117
36356C6315117M024903o7587k645365l890199n269919o593489o242916m067851
$$ 36315117 40340020 40272433 37627068 33736869 28466950 21873461 15630545 11562694
36348A1562694j966811j275705j325868j106745p92413q69080j033747q51504
$$ 11562694 9595883 8320178 6994310 5887565 5095152 4226072 3192325 2340821
36340B340821n92077o18883o54584l28172J32990L09693J81210q5155l98225n13130
$$ 2340821 1748744 1129861 475277 147105 280095 589788 770998 685843 287618 -225512
36330b25512j70123K90608K01700k82491k16733N65569R56716L02636m19617j18581
$$ -225512 -395635 -105027 96673 -185818 -402551 163018 1119734 1422370 1002753 884172
36320H84172O02060L84205p08998j313520q41433j18537J25204J72593L84349
$$ 884172 1486232 1870437 1161439 -152081 -993514 -1112051 -986847 -814254 -429905
36311d29905M16883l4677m93250l77028R1213K86034J23579j3800l4279j65288
$$ -429905 -13022 -47699 -540949 -917977 -826764 -540730 -417151 -430951 -465230 -630518
36301f30518l34665j79175K63156M65523K09936n9095L0701J87818K5915k05611
$$ -630518 -965183 -1144358 -881202 -415679 -205743 -264838 -234137 -46319 -20404 -226015
36291b26015l7667L65457M44377J87754R7079K19004K8214n37796p58822k53332
$$ -226015 -263682 101775 546152 733906 830985 1049989 1078203 540407 -218415 -471747
36281d71747L27876K91137o0965n3899K43072L10922J68657J91521K12535k51895
$$ -471747 -143871 147266 86301 32402 275474 586396 755053 946574 1159109 907214
36271I07214r51826j017510k63961M41269L89470o9574j84573J74165N29533M82349
$$ 907214 -44612 -1062122 -1326083 -884814 -495344 -564918 -749491 -575326 -45793 436556
36261D36556O4680l72193m38586n6053M03091N07081K55361n0008k80503m72711
$$ 436556 501236 129043 -309543 -365596 37495 544576 799937 749929 469426 -3285
36251c285m90341j69680K53275L48659J25464k799J16939K18616J33820j1370
$$ -3285 -493626 -663306 -410031 -61372 64092 61293 178232 396848 530668 519298
36241E19298j43260l11617l86370j62309J93327K65606K901k37431k46324j18534
$$ 519298 376038 64421 -321949 -484258 -290931 -25325 -22424 -259855 -506179 -624713
36231f24713P6313K75269J98395k58920n52540j26737N92910O92886K09095P4502
$$ -624713 -548400 -273131 -74736 -333656 -886196 -1012933 -420023 272863 481958 556460
36221E56460N19053O25084j36170r58057q94500j78279L14325K68591k2999k93158
$$ 556460 1075513 1700597 1564427 606370 -288130 -466409 -152084 116507 93508 -199650
36211a99650m19828l32061j85902k00912j33899M24696J069721Q38808k03052
$$ -199650 -619478 -951539 -1137441 -1338353 -1472252 -1047556 22165 860973 657921
36202F57921p32325j14295N67477K82274k97914r6800M30374J50067o64196p59765
$$ 657921 -74404 -188699 378778 661052 363138 266338 696712 846779 182583 -577182
36192e77182q1853J54464m24723p56184j60134O34634P84050M84725K56088M6121
$$ -577182 -659035 -504571 -929294 -1685478 -1845612 -1210978 -426928 57797 313885 360006
36182C60006l00706m61418j70116K36612L44654K41390J41253m8051l43230l74316
$$ 360006 59300 -402118 -572234 -335622 9032 250422 391675 343624 394 -373922
36172c73922M5371M44040K80774k88171o51815m99367K511N07611O57911K66492
$$ -373922 -328551 115489 396263 108092 -543723 -1043090 -1040579 -532968 124943 391435
36162C91435l42622m97325k3693M05513J64554m18151n47285j05374K69928J65097
$$ 391435 48813 -448512 -472205 -66692 97862 -320289 -867574 -972948 -703020 -537923
36152e37923j19148j35396J01561K44163P7187k75482m53731j71080M04725O71191
$$ -537923 -657071 -792467 -690906 -446743 -369556 -645038 -1098769 -1269849 -865124 -193933
36142a93933K66622l60335m35649J00792M99143K54606k31398l20897k2774K28101
$$ -193933 72689 -287646 -723295 -622503 -123360 131246 -100152 -421049 -443823 -215722
36132b15722L34110N03777O15192K51652n38318j062762q08327o6481M83584N04195
$$ -215722 118388 622165 1237357 1489009 950691 -112071 -920398 -986879 -503295 900
36122I00J21360l39944n01708j47766M13719N10920m0220n54965l54581K62416
$$ 900 122260 -217684 -719392 -867158 -453439 57481 17261 -537704 -892285 -629869
36112f29869M35978m7006n31839m56594Q703L81076M63474L38729R5053k17431
$$ -629869 -193891 -240897 -772736 -1229330 -1220627 -839551 -376077 -37348 57705 -159726
36102a59726m93640n57581k44308L84157Q63105O73877k8408m13185n2955M05901
$$ -159726 -653366 -1210947 -1455255 -1071098 -207993 465884 437476 24291 -28664 377237
36092C77237J70715m88244o65567j97825K09109J45482l9832l330J32189K13729
$$ 377237 547952 59708 -605859 -803684 -594575 -449093 -488925 -492255 -360066 -146337
36082a46337K76239K13062j19451m08626j97222K73306L09844r4553k46785L0358
$$ -146337 129902 342964 223513 -185113 -382335 -109029 200815 106262 -140523 -110165
36072a10165J58042l0843L0562M54862N21161n381l01799R6045M01365o7073o58362
$$ -110165 47877 17034 47596 502458 1023619 1018238 716439 812484 1213849 1146776 488414
36061D88414n01730M8214J50638j05166j45973j06430l87070n76205o3686O64200
$$ 488414 -13316 34898 185536 80370 -65603 -172033 -559103 -1135308 -1198994 -534794
36051e34794O01376j40071m73206j1928N15054N10206J58065j90713l87048k37620
$$ -534794 66582 -73489 -546695 -558623 -43569 466637 624702 433989 46941 -190679
36041a90679K80862O16746K53804l91787n07989j42283m428j78992o4996M33978
$$ -190679 90183 706929 960733 568946 60957 -81326 -85754 -264746 -329742 104236
36031A04236O92960M28641N1116j38444k38874k05629J01134L23527o716m96732
$$ 104236 797196 1225837 1276953 1138509 899635 694006 795140 1118667 1111951 615219
36021F15219l24119L39289M61722j59153n44945j81993J85794p9924m53103k23693
$$ 615219 291100 630389 1092111 932958 388013 206020 391814 311890 -141213 -364906
36011c64906L51063N88079L89747P8938k14052m54752m76847k85350j53274j42097
$$ -364906 -13843 574236 963983 1042921 828869 374117 -102730 -388080 -541354 -683451
36001f83451k5475J44143L3277k41922j31926L77991O23838L61099J47295K85238
$$ -683451 -708926 -564783 -531506 -773428 -905354 -527363 96475 457574 604869 890107
35991H90107K89412j39611m94567l54361p2224j8723M1578K34226Q9318n36636
$$ 890107 1179519 1039908 545341 190980 118756 100033 141611 375837 465155 -71481
35981g1481q62033k93425N51808P25959K45361k36130m34144l76258K4372N53409
$$ -71481 -933514 -1226939 -675131 50828 296189 60059 -374085 -750343 -725971 -172562
35971a72562M93529l15986q51934k77114O59950O58094j82503n99133p9790O14106
$$ -172562 320967 4981 -846953 -1124067 -464117 193977 11474 -587659 -667449 -53343
35961e3343P58497M58731P9913k28787l32687j43897P4678M20k10711j95108m050
$$ -53343 705154 1163885 1243798 1015011 682324 538427 613105 613525 402814 207706 203656
35950B03656R4839J56290K78481J45812m06426p50574k82044M48080M29371k13846
$$ 203656 298495 454785 733266 879078 472652 -277922 -559966 -111886 317485 103639
35940A03639m45954k7844K20100n2122j90247J41669K94887j58794n76780k86890
$$ 103639 -342315 -370159 -150059 -202181 -392428 -250759 44128 -114666 -691446 -978336
35930i78336L35594N54469L84713K85952K57405p277l88562m63645k04481N183
$$ -978336 -642742 -88273 296440 582392 839797 832520 443958 -19687 -224168 -218985
35920b18985l5319j69686k39096k46013j93955m1274J87180M01552N20497M67980
$$ -218985 -254304 -423990 -663086 -909099 -1103054 -1144328 -957148 -555596 -35099 432881
35910D32881K12441j21291l18019l09916k14021j18309M979J71586L33074M19771
$$ 432881 645322 524031 206012 -103904 -317925 -436234 -431255 -259669 73405 493176
35900D93176L06585r8186n26593m09116L45344R34956O20901j40128k78675K93831
$$ 493176 799761 701575 174982 -234134 111210 1046166 1667067 1526939 1248264 1542095
35890A542095N96949J67288k95173k19912p7735l55641n32149J0396P16694N67147
$$ 1542095 2139044 2306332 2011159 1791247 1713512 1357871 825722 836118 1552812 2119959
35880B119959l08785p91389m16635J32043K15571n497j87871l34940m15741j94005
$$ 2119959 1811174 1019785 603150 735193 950764 945267 757396 422456 6715 -187290
35870a87290K11996K73340o0672j01517M53330Q25508K96639n40484n97211J4789
$$ -187290 24706 298046 237374 135857 589187 1414695 1711334 1170850 573639 588428
35860E88428J88971l52083o12032l514O23463L11901m88878o52607r1319K72288
$$ 588428 777399 425316 -186716 -190230 433233 745134 256256 -396351 -487670 -215382
35850b15382L5748j95839N1302L94765L44249P5245L896Q5701J4901k06671l42295
$$ -215382 -179634 -375473 -324171 70594 414843 490088 493984 579685 594586 387915 45620
35839D5620l44694l25990k63546p2950J48479K50621K95916M13601M81807K54443
$$ 45620 -299074 -625064 -888610 -961560 -813081 -562460 -266544 147057 628864 883307
35829H83307k12849n24624l93151K1678K77174J18436k09195j69646M09349R55590
$$ 883307 670458 145834 -247317 -225639 51535 169971 -39224 -208870 200479 1156069
35819A156069P16060k45513r66590p15619Q5366L89818j76337q90952q26951O4885
$$ 1156069 1872129 1626616 660026 -55593 29773 419591 243254 -647698 -1474649 -1409764
35809a409764Q93286Q27435O1906m15198q5947M13189K32531l96356m89257J66701
$$ -1409764 -516478 310957 372863 -42335 -128282 284907 517438 121082 -368175 -201474
35799b01474O66843L75424j78701k53361m393N666j64365o8246K35034L01999
$$ -201474 465369 840793 662092 408731 404338 410004 245639 177393 412427 714426
35789G14426J17117O2287J73170R0028k61898n17749m26085r4857K90376N66743
$$ 714426 831543 893830 1067000 1157028 895130 377381 -48704 -143561 146815 713558
35779G13558M93654J2803m55244m24822k060K80749J85646r1534l51572m96444
$$ 713558 1207212 1220015 764771 339949 337889 618638 804284 712750 361178 -135266
35769a35266l56977Q9461M74525M88067L51861L34075J49105m43475q23833k87628
$$ -135266 -492243 -402782 71743 559810 911671 1245746 1394851 951376 127543 -160085
35759a60085N87401N37283m07226q25851r2886O64892M17035j98081j02635M15146
$$ -160085 427316 964599 557373 -268478 -361364 303528 720563 522482 419847 834993
35749H34993L23752l60110o69204k92977R1156O0609k6390J13822K22864J51302
$$ 834993 1158745 798635 129431 -163546 -72390 -11781 -38171 75651 298515 449817
35739D49817J91871M06990L06949l25598q33849n06851L19791O18081M3317o22963
$$ 449817 641688 1048678 1355627 1030029 196180 -310671 9120 627201 670518 47555
35729D7555n35439J67203O64741N17889N1190k34292k49695k20098k70033l02046
$$ 47555 -487884 -320681 344060 861949 913139 678847 429152 209054 -60979 -363025
35719c63025j76581J19664M27650N03785K66947m0881j19058j8676k5857j52480
$$ -363025 -539606 -419942 7708 511493 778440 737559 618501 599825 573968 421488
35709D21488j39580j8874j39668m42013l27251L46336P65261K64261o06839q50959
$$ 421488 281908 263034 123366 -318647 -645898 -299562 465699 729960 123121 -727838
35699g27838m07268N4499L09634N74787O42896J44369m71311m03212P9106l0416
$$ -727838 -1135106 -1080607 -770973 -196186 446710 591079 119768 -283444 -204338 -234754
35689b34754o24440m51194O68826J183194J95854r55265p15639L10280M91383
$$ -234754 -859194 -1310388 -641562 541632 737486 -217779 -933418 -623138 -131755
35680a31755k12249m58014J11214M40371N185l77519l3528N22842N41788J18659
$$ -131755 -344004 -802018 -690804 -250433 -245248 -622767 -656295 -133453 408335 526994
35670E26994j85769j42990J14553L38580K08222l56990q18938n55349J54708L93550
$$ 526994 341225 198235 312788 651368 859590 502600 -316338 -871687 -716979 -323429
35660c23429k9660l08509J0776L14831M3236l26427j23938L47364L28285j44066
$$ -323429 -353089 -661598 -650822 -335991 -292755 -619182 -743120 -395756 -67471 -211537
35650b11537l59547q8534J92294J66926N2548M4331M843j43983k13812j16965
$$ -211537 -571084 -659618 -467324 -300398 -247850 -203519 -198676 -342659 -556471 -673436
35640f73436n5411j63884k66209j52963J23696L55173M02201K60548P2311O8763
$$ -673436 -728847 -892731 -1158940 -1311903 -1188207 -833034 -430833 -170285 -97974 -29211
35630b9211K96128M33263J50069l72863n97967l23729J06791L28091L14400J48379
$$ -29211 266917 700180 850249 477386 -120581 -444310 -337519 -9428 304972 453351
35620D53351j46264l78326k25337K53055N24329K83252j34994l24919l48116l35651
$$ 453351 307087 -71239 -296576 -43521 480808 764060 629066 304147 -43969 -379620
35610c79620p4810M56707O44626P3497n82213l97562L27821M61967j68899n17023
$$ -379620 -454430 2277 646903 720400 138187 -259375 68446 530413 361514 -155509
35600a55509j3375O03857N63575J14329k39271n60483q72440o73550J22683O22100
$$ -155509 -168884 434973 998548 1112877 873606 313123 -559317 -1232867 -1110184 -488084
35590d88084K39847k49379K5876N18627K54385l52679j67776O08981O87954j24529
$$ -488084 -248237 -497616 -471740 46887 301272 -51407 -219183 389798 1077752 953223
35580I53223o29219k78664P6396j23525k29997K15601N33636J54096l44716k95091
$$ 953223 324004 45340 121736 -1789 -231786 -16185 517451 671547 326831 31740
35570C1740k9574n4051o3408L10103O06640L38850p0695r3990j06265n80608r70747
$$ 31740 2166 -51885 -115293 194810 801450 1140300 1069605 975615 869350 288742 -682005
35559f82005n34654K85928N02389J68411J13633M05347L48821j21677l19306r6728
$$ -682005 -1216659 -930731 -428342 -259931 -146298 259049 607870 486193 166887 70159
35549G0159o1324l55450l63363J07170M24771K74539J95430N13053O56422J40034
$$ 70159 8835 -346615 -709978 -602808 -178037 96502 291932 804985 1461407 1601441
35539A601441n32853o25522k57031o1601j71361k00842o362J39699O4664o9967
$$ 1601441 1068588 443066 186035 124434 -46927 -247769 -254131 -114432 -49768 -119735
35529a19735p7169M655K8491l4441m1111J32274L36859K44904j58702l96049j03375
$$ -119735 -196904 -192249 -163758 -198199 -239310 -107036 229823 474727 316025 -80024 -183399
35518a83399L81587M53187J13372q6075Q9827L01168K65070Q4965j44777m92296
$$ -183399 198188 651375 764747 678672 768499 1069667 1334737 1419702 1274925 782629
35508G82629p73392n56130J30327N93980L57593j60078k44210J33680L68354J07202
$$ 782629 9237 -546893 -416566 177414 535007 374929 130719 264399 632753 739955
35498G39955l20004l92598p3750J58857l8944l39771j38148M79893O51481j9918
$$ 739955 419951 27353 -46397 112460 73516 -266255 -404403 75490 726971 707053
35488G07053o61388k85434O21567O67941l41189j000925l44280P52073Q57671
$$ 707053 45665 -239769 381798 1049739 708550 -292375 -636655 115418 973089
35479I73089q5739r17515q51337j56993M67966N60874J01295m39398m24351J86031
$$ 973089 887350 -30165 -881502 -1038495 -570529 -9655 91640 -347758 -772109 -586078
35469e86078O61029M62815N292l3224K49457K66941l8978k05854j08870o2900
$$ -586078 74951 537766 543058 509834 759291 1026232 987254 781400 672530 609630
35459F09630j13710L6760L35783L17118r9262l87620k39979k9783j43867l66624
$$ 609630 495920 532680 868463 1185581 1086319 698699 458720 428937 285070 -81554
35449h1554l10475l7534J66197K94436M44209M07345l1421n15222m03705K84509
$$ -81554 -392029 -429563 -263366 31070 475279 882624 851203 335981 -67724 216785
35439B16785P29620L59763l58232n67876j97839M9499j59195k89262J34514O53390
$$ 216785 946405 1306168 947936 380060 182221 231720 72525 -216737 -82223 571167
35429E71167N07256j70604n11004j97018J61531Q5488j02543j8785P9956j16676
$$ 571167 1078423 907819 396815 199797 361328 446816 344273 325488 405444 288768
35419B88768k86030o3914J62113j35643n71893l35482M41224P92240M17931O1863
$$ 288768 2738 -61176 100937 -34706 -606599 -942081 -500857 291383 709314 771177
35409G71177J77979K39497j75256n44832l20017Q5257J8093k77116j27258L59477
$$ 771177 949156 1188653 1013397 468565 148548 233805 251898 -25218 -152476 207001
35399B07001M78521J24285j18296n3119j50694n79527p68472k96980L91067O01801
$$ 207001 685522 809807 691511 638392 487698 -91829 -860301 -1157281 -766214 -164413
35389a64413L09164L9635R6376K66715J95837j83516n61929n41091r6633L19035
$$ -164413 144751 184386 280762 547477 743314 559798 -2131 -543222 -639855 -320820
35379c20820L27826J34583J56767L17205K11584j16090k07474k1166j071j72126
$$ -320820 7006 141589 298356 615561 827145 711055 503581 482415 481344 309218
35369C09218O324N61496O65647o5248p68705n97238l0922J7608k49122l1124M69877
$$ 309218 315542 877038 1542685 1477437 708732 111494 80572 98180 -150942 -182066 287811
35358B87811L27918l99100o52396j70481R8082k69234m01003K62548Q60477N15046
$$ 287811 615729 216629 -435767 -606248 -508166 -777400 -1178403 -915855 -55378 459668
35348D59668j91373k10833K90700L95630J4636j72774j8753L637j34312M1000
$$ 459668 268295 57462 348162 743792 758428 585654 566901 570538 436226 477226
35338D77226M68469M64498j38136o20206m24379J13239L64998J89109j45119l46089
$$ 477226 945695 1410193 1272057 651851 227472 340711 705709 894818 749699 403610
35328D03610k24547J59625L71693N7671m25638l58627K72330O43655K47258l87603
$$ 403610 179063 338688 710381 768052 342414 -16213 256117 899772 1147030 759427
35318G59427m68192M749L59929J78505k65691m07895m4794M10695L70464j58608
$$ 759427 291235 295984 655913 834418 568727 160832 116038 526733 897197 738589
35308G38589m83427j61489L04356J99601k86156l90397k7540J75836O8643J88158
$$ 738589 255162 93673 398029 597630 311474 -78923 -106463 69373 138016 326174
35298C26174N78977M59374m35523j132808p57665J71821N81401L51835J30046
$$ 326174 905151 1364525 929002 -203806 -961471 -789650 -208249 143586 273632
35289B73632J16234j4396k49475k15552O3688J66769J2402q7796r4153k75120
$$ 273632 389866 375470 125995 -89557 -25869 140900 153302 65506 -28647 -303767
35279c03767n37548l90296K58130Q16917P49187K02068k65381k93319K3408K59147
$$ -303767 -841315 -1231611 -973481 -156564 592623 794691 529310 235991 259399 518546
35269E18546N5117m07039n06196l0084L94861J82334k62597j67067L02774K74704
$$ 518546 573663 166624 -339572 -369656 25205 207539 -55058 -222125 80649 355353
35259C55353l30810n62665M3025O89057N69089M4853j17897L41j58583m72815
$$ 355353 24543 -538122 -495097 193960 763049 807902 690005 690346 531763 58948
35249E8948l13785K68994M50641j38889q09940p39084j888O53929P39334L97225
$$ 58948 -254837 14157 464798 325909 -484031 -1223115 -1225003 -571074 168260 565485
35239E65485L1378j26382j02359l3058L268L9683J16955J65493O6463j70255l70859
$$ 565485 596863 470481 368122 335064 338332 378015 494970 660463 726926 556671 185812
35228A85812l68057j57630J24374L23560L47640J90878n3030k20182k06278j04880
$$ 185812 -182245 -339875 -215501 108059 455699 646577 593547 373365 167087 62207
35218F2207j20788k51346j82968K59287O45923L45523n01711r15918l38934N04352
$$ 62207 -58581 -309927 -492895 -233608 412315 757838 256127 -659791 -998725 -494373
35208d94373N91183P6978m1983M12871N07180k28241r42762p53605n0488K46674
$$ -494373 96810 173788 131805 544676 1051856 823615 -119147 -872752 -923240 -676566
35198f76566P5707r802L3597j26915k49928J87903Q36741P54163l6490m24253
$$ -676566 -600859 -610661 -577064 -703979 -953907 -766004 70737 824900 788410 364157
35188C64157J7614L12641k39533p77141k54926P45270Q29303n4197o06949k42418
$$ 364157 381771 694412 454879 -322262 -577188 168082 997385 943188 336239 93821
35178I3821J47959k15726p74064o09033J40528N95591M24245R6513L2126J03107
$$ 93821 241780 26054 -748010 -1357043 -1216515 -620924 -196679 -100166 -68040 35067
35168C5067K0975j96440k88224j06023J82177K30230r8602n04885n62175k41923
$$ 35067 56042 -140398 -428622 -534645 -352468 -122238 -220840 -725725 -1287900 -1529823
35158a529823R0643K16261K92146M44895M75419K04119j51622k37777m9783J06901
$$ -1529823 -1439180 -1222919 -930773 -485878 -10459 193660 42038 -195739 -245522 -138621
35148a38621N3747q7242j16915L291J27338Q8367o1546l0047L19679O38795M88590
$$ -138621 -84874 -172116 -289031 -285740 -158402 -70035 -131581 -161628 158051 796846 1285436
35137A285436K4008j84614n8514j30486n36093n93124J00184P84013N19390l79645
$$ 1285436 1309444 1124830 1066316 935830 399737 -193387 -93203 690810 1210200 830555
35127H30555p86269m10539n1298j95356l35690K9777N43367N96388K08476j64464
$$ 830555 44286 -366253 -417551 -612907 -948597 -918820 -375453 220935 429411 264947
35117B64947k69965j11634K46709N52271M09093j59098n36774l11302R5194M7004
$$ 264947 -5018 -116652 130057 682328 1091421 932323 395549 84247 179441 226445
35107B26445l54394m88499j90409R2659Q3776M1852K27170M66787M58581J86004
$$ 226445 -127949 -616448 -806857 -714198 -630422 -588570 -361400 105387 563968 749972
35097G49972j58764m09957m22856r0844M11086O04988K15990l93296n78055k03542
$$ 749972 591208 181251 -241605 -332449 78637 683625 899615 506319 -71736 -275278
35087b75278J84393P7435l43679m92019j71243K10545K46766O4145P2944L59534
$$ -275278 -90885 -13450 -357129 -849148 -1020391 -809846 -563080 -498935 -425991 -66457
35077f6457N67084L63798j37624m85489l72144J7866K03314Q288j70499P6934
$$ -66457 500627 864425 726801 241312 -130832 -112966 90348 98636 -71863 5071
35067E071M78803L76012k67850o95430m16775J14017K74265J83584K69775L99102
$$ 5071 483874 859886 592036 -103394 -520169 -406152 -131887 51697 321472 720574
35057G20574J84190j71550j78185j0728k48126p31439o64710M1155N25431L46180
$$ 720574 904764 733214 555029 544301 296175 -435264 -1099974 -1058819 -533388 -187208
35047a87208J03943K69216L52909j15569o21994m72351P4848L02184J64227J06468
$$ -187208 -83265 185951 538860 423291 -198703 -671054 -596206 -294022 -129795 -23327
35037b3327J48344j8520k81577k53964o172O6068l0879K8453J98575J28606j51730
$$ -23327 125017 106497 -175080 -429044 -435216 -369148 -400027 -371574 -172999 -44393 -196123
35026a96123k45372n2859J41254J86567J40893n3557m05783n39340j42461L85925
$$ -196123 -441495 -494354 -353100 -166533 -25640 -79197 -484980 -1024320 -1166781 -780856
35016g80856M05556J7784j34308Q4273K48520K62192L85567M12422j33305q61456
$$ -780856 -375300 -357516 -491824 -407551 -159031 103161 488728 901150 767845 -93611
35006i3611p19249L29891R75801M56020l27818l36085K7306j24759n19233l13087
$$ -93611 -812860 -482969 492832 948852 621034 284949 312255 187496 -331737 -644824
34996f44824K60767K26770m03485o08746r6712K49384n3096k93327J01448N18661
$$ -644824 -384057 -157287 -560772 -1169518 -1266230 -1016846 -1069942 -1363269 -1261821 -743160
34986g43160K45894k28329Q557P24015Q22330M4021o35292m63937R7943K42958
$$ -743160 -497266 -725595 -717038 6977 829307 873328 238036 -225901 -127958 115000
34976A15000q582p5253J65704K87087R8920q5792l5496N4916j9888j26773j09472
$$ 115000 106418 31165 196869 483956 582876 497084 461588 516504 496616 369843 260371
34965B60371j09035k50005k82632N7743M96056M72100o8018n48353n06828j05118
$$ 260371 151336 -98669 -381301 -323558 172498 644598 576580 28227 -478601 -583719
34955e83719K24408L06421K11983Q419k29069l43484k69697j51636j00570q73
$$ -583719 -359311 -52890 159093 167512 -61557 -405041 -674738 -826374 -926944 -927817
34945i27817K22827L28618P5546k81839k18594K94591O43882L79600j57665l25429
$$ -927817 -704990 -376372 -300826 -582665 -801259 -506668 137214 516814 359149 33720
34935C3720o3921J19313k9995j82651m3274J40372P121k80727k63171R2956L55416
$$ 33720 -30201 89112 59117 -123534 -166808 -26436 -19315 -300042 -563213 -470257 -114841
34924a14841L08084K10809K58688K21434j16260m92333m85966j04607K53763L00284
$$ -114841 193243 404052 662740 884174 767914 275581 -210385 -314992 -61229 239055
34914B39055O7475k48915m14673k50618J42329L60199J51113k14986k93121o0611
$$ 239055 306530 57615 -357058 -607676 -465347 -105148 45965 -169021 -462142 -522753
34904e22753J38106J44960J19698J36524L4997k27916l94053k42557Q8226K73467
$$ -522753 -384647 -239687 -119989 16535 51532 -176384 -570437 -812994 -724768 -451301
34894d51301J75980o7928k56541l15056k86426j83891O0248M12198N96595L75694
$$ -451301 -275321 -343249 -599790 -914846 -1201272 -1385163 -1324915 -912717 -316122 59572
34884E9572l7130j55144J07830K93262Q6624k36856l01008j59624p519K25240
$$ 59572 22442 -132702 -24872 268390 355014 118158 -182850 -342474 -349993 -124753
34874a24753N58843O39563K58248j54550j35654M3974j13252l88037k29863J49280
$$ -124753 434090 1073653 1331901 1177351 1041697 1085671 972419 584382 354519 503799
34864E03799K9938n17507o09589K1320N55661L65897j20751k62445j09652K7471
$$ 503799 533737 16230 -593359 -572039 -16378 349519 228768 -33677 -143329 -115858
34854a15858K19560N60191P15018L72320k48640p12176p86784l59045M66097R84477
$$ -115858 103702 663893 1378911 1751231 1502591 790415 3631 -355414 110683 1095160
34844A095160M36467p15867j001029J9597R35946N19010m53054n23518J63301
$$ 1095160 1531627 815760 -185269 -165672 770274 1289284 836230 312712 476013
34835D76013L40808j85227m14496l9312J33806k02328k96815J97814N20184J52866
$$ 476013 816821 631594 217098 177786 311592 109264 -187551 10263 530447 683313
34825F83313k54065m9453K77403k0931o39075o96561p7406N38095P09023N73222
$$ 683313 429248 379795 657198 636267 -2808 -699369 -776775 -238680 470343 1043565
34815A043565L09263q7189m99182o45357m04907N8518M44635M58423K9434m48186
$$ 1043565 1352828 1265639 766457 121100 -283807 -225289 219346 677769 707203 259017
34805B59017m14590R8898L96532Q5791l42008l16252q0578j70118m14706k61888
$$ 259017 -155573 -56675 339857 425648 83640 -232612 -313190 -483308 -898014 -1159902
34795a159902J54993J88725j26095l7001N64020P45271J0872p20398m10439M73290
$$ -1159902 -1004909 -816184 -942279 -979280 -415260 330011 340883 -379515 -789954 -316664
34785c16664O19665j80008q17557n79544k8144J11825J6476J65878M01544K97560
$$ -316664 303001 122993 -694564 -1274108 -1302252 -1190427 -1173951 -1008073 -606529 -308969
34775c08969J9390N9104L49341L57240k2487l21785k53091j6520J88237L70016
$$ -308969 -289579 -230475 118866 476106 453619 131834 -121257 -137777 50460 420476
34765D20476L82084k4060n84452n82970J39287P73892N66259j90037o36595m66081
$$ 420476 802560 778500 194048 -388922 -249635 524257 1090516 900479 263884 -202197
34755b02197o1996J99665K62253J50752r1491k62831j66639R7817K54073J88671
$$ -202197 -264193 -64528 197725 348477 256986 -5845 -172484 -74667 179406 368077
34745C68077l252j56805q1215K64386M91484J02890o61731q65245j96969L80742
$$ 368077 364825 208020 126805 391191 882675 985565 323834 -541411 -738380 -357638
34735c57638J3603o29812l49168N99329Q08976k5935n71032L9430Q57389O68027
$$ -357638 -344035 -973847 -1323015 -723686 85290 59355 -511677 -472247 385142 1053169
34725A053169j57979m15466P149J37307l95095q09035m55064K28747M22309L6237
$$ 1053169 895190 479724 486873 624180 229085 -579950 -1035014 -806267 -383958 -347721
34715c47721l20393k34320M2454L9457k38001k75667K21083P82844O97490K2817
$$ -347721 -668114 -902434 -859980 -820523 -1058524 -1334191 -1113108 -330264 367226 390043
34705C90043l93216n8730M84881M80012J8616k33910j04684o1741l36604n24031
$$ 390043 -3173 -61903 422978 902990 921606 687696 583012 521271 184667 -339364
34695c39364k53816K05559L36284R7456p8842O6735K76408J64575k15676l91911
$$ -339364 -593180 -387621 -51337 46119 -32723 34012 310420 474995 259319 -132592
34685a32592q5877L70752M18529j2554m23936m03342p7485J87622K42376J16531
$$ -132592 -218469 152283 570812 558258 134322 -269020 -346505 -158883 83493 200024
34675B00024j91384n76928o69465j89902N62586R16089N91502K6721j64645J07101
$$ 200024 8640 -568288 -1237753 -1427655 -865069 51020 642522 669243 504598 611699
34665F11699L74952K07197k90276o04991m10515P3679L73823K97992L3803j80596
$$ 611699 986651 1193848 903572 298581 -111934 -38255 335568 633560 667363 486767
34655D86767k45327j27275R5675J38787j87020n57477m39965J00991L92164J31631
$$ 486767 241440 114165 209840 348627 161607 -395870 -835835 -734844 -342680 -211049
34645b11049j52574N3304M66723N25833K30760p1302l37936o43975o82947j76304
$$ -211049 -363623 -310319 156404 682237 912997 841695 503759 -140216 -823163 -999467
34635i99467M40111M89534Q6868o3757J68680K08463j52199m00195k25680l472
$$ -999467 -559356 -69822 17046 -46711 121969 330432 178233 -221962 -447642 -451114
34625d51114n2665j35577l1027P2866J07904L49969P15248N77523j77822o48904
$$ -451114 -503779 -639356 -670383 -597517 -489613 -139644 575604 1153127 975305 326401
34615C26401j62259O09389N87067j53118o38474m66074j02982P2678J42651J33006
$$ 326401 164142 773531 1360598 1207480 569006 102932 -50 72628 215279 348285
34605C48285o5345k64115j64821O3893N9675k0504J78800L51235o8152p19812
$$ 348285 282940 18825 -145996 -82103 -22428 -42932 135868 487103 418951 -300861
34595c00861o43546J10411L95130j77510n46406J9384O61875L84560k71308j89275
$$ -300861 -944407 -833996 -438866 -616376 -1162782 -1143398 -481523 -96963 -368271 -557546
34585e57546M33869N02102r6173l85434J1263L60905J58307j43353q5087M1217
$$ -557546 -123677 378425 282252 -103182 -91919 268986 427293 283940 198853 240070
34575B40070j54263m53887m45183j32865K25858M74255M85774J80008j71573j25857
$$ 240070 85807 -368080 -813263 -946128 -720270 -246015 239759 419767 248194 122337
34565A22337K31415K83021j67180n05730k37352K47278L10150J845k02326k31671
$$ 122337 353752 636773 469593 -36137 -273489 -26211 283939 285784 83458 -148213
34555a48213l56429n20278l79197N2089L56048L48459K77674L04462K23502j08558
$$ -148213 -504642 -1024920 -1404117 -1352028 -995980 -647521 -369847 -65385 158117 49559
34545D9559m00046k54823K57096N96560L60466k22608n28065k83257J08558J70103
$$ 49559 -350487 -605310 -348214 248346 608812 386204 -141861 -425118 -316560 -146457
34535a46457N8195K50796O23068M66762l73130j023053p10369J31441N05714K48220
$$ -146457 -88262 162534 785602 1252364 879234 -143819 -854188 -722747 -217033 31187
34525C1187M0192J88971K24214j58362m98121k99217J57935K20236j94657n19803
$$ 31187 71379 260350 484564 326202 -171919 -471136 -313201 -92965 -287622 -807425
34515h07425l23222K01796N73050N72231L31469M2326k02373k97313j06301K83414
$$ -807425 -1130647 -928851 -355801 216430 547899 590225 387852 90539 -15762 267652
34505B67652M71825J94667k25711k26789K06384N06920L49479M3976o1402o3335
$$ 267652 739477 934144 708433 481644 688028 1194948 1544427 1588403 1527001 1463666
34495A463666j07932m4478J15295p0850p21733j106843n89630L04654N88123K61486
$$ 1463666 1355734 1311256 1426551 1355701 633968 -472875 -1062505 -757851 -169728 91758
34485I1758J19045L09254K00487k87766l98242J13281M52544J25821k11562O9850
$$ 91758 210803 520057 720544 432778 34536 147817 600361 726182 514620 584470
34475E84470M59855K30717k66517k21249K40636L20186j01839l92404l03085k02964
$$ 584470 1044325 1275042 1008525 787276 1027912 1348098 1246259 853855 550770 347806
34465C47806j89491P9299N25156N20738p9013n52137l60631O1745M9758k87524
$$ 347806 158315 237614 762770 1283508 1204495 652358 291727 353472 403230 115706
34455A15706l51836m813L16593K73214l8289l47440m51737k41665J97912N11142
$$ 115706 -236130 -240943 75650 348864 310575 -36865 -488602 -730267 -532355 -21213
34445b1213L70194j01528m19667l18778n6543k2973j90282j64901K10559N43010
$$ -21213 348981 247453 -172214 -490992 -547535 -570508 -760790 -925691 -715132 -172122
34435a72122L76189j26444l11145Q8104N45614M61471r731k50247j23315r0085
$$ -172122 204067 77623 -233522 -145418 400196 861667 851936 601689 478374 388289
34425C88289l52887m57927m3536M73219M36358o8710l22757k9381K84596J14708
$$ 388289 35402 -422525 -466061 7158 443516 374806 52049 22668 307264 421972
34415D21972k50612k18866J35700J62078l14309o25470k41787L53995K99865l85540
$$ 421972 171360 -47506 88194 250272 -64037 -689507 -931294 -577299 -277434 -662974
34405f62974q11713m77902J22169L62043L36052M33286N56434L62623n011p5190
$$ -662974 -1474687 -1952589 -1830420 -1468377 -1132325 -699039 -142605 220018 215007 139817
34395A39817J65115K59157O2638o3953M7155P5373j51960k75347j3204K98537
$$ 139817 304932 564089 626727 562774 609929 685302 533342 257995 244791 543328
34385E43328K20647q3798j57020j5499o1765l38867m38553j94432N1944L3940
$$ 543328 763975 680177 523157 507658 445893 107026 -331527 -525959 -474015 -440075
34375d40075m2260P5070K44460K46663K25830L95447N13026J67615m47345o19625
$$ -440075 -482335 -407265 -162805 83858 309688 705135 1218161 1385776 938431 318806
34365C18806j55908K07581j57378p47774n77599L39035R20352N55789n4979l7485
$$ 318806 162898 370479 213101 -534673 -1112272 -773237 147115 702904 647925 610440
34355F10440L37476K01357m41461p12073k83539J23842m6924l14703m1786M58813
$$ 610440 947916 1149273 707812 -4261 -287800 -163958 -210882 -525585 -567371 -108558
34345a08558M47009o872j56715J69391L12162q1276m49108k37625J86977J28349
$$ -108558 338451 331579 174864 344255 656417 575141 126033 -111592 75385 203734
34335B03734l19010m04818J27110O50844N49362Q201l44162k59039p35J58011
$$ 203734 -115276 -520094 -392984 257860 807222 815423 471261 212222 211487 369498
34325C69498K06653J80046O318k91549m68648l46426j14692j06869k97397k86141
$$ 369498 576151 756197 762515 470966 2318 -344108 -458800 -565669 -863066 -1149207
34315a149207J23553N72028N77983J73987j59728j35209O2552J59663J48875J21045
$$ -1149207 -1025654 -453626 124357 298344 138616 3407 65959 225622 374497 495542
34305D95542O369k73484n44015n21566j71285K57664N04854M59778J48432k41524
$$ 495542 501911 228427 -315588 -837154 -1008439 -750775 -245921 213857 362289 120765
34295A20765m01936k05399P9400J13496k0992M0796L21783L96466L9173l78349
$$ 120765 -281171 -486570 -407170 -293674 -314666 -273870 47913 444379 483552 105203
34285A05203l83940l2635K50070K54878J05152p9740k95682m65187m49412k80416
$$ 105203 -278737 -311372 -61302 193576 298728 218988 -76694 -541881 -991293 -1271709
34275a271709j31302k2403J95277N05153O33143M25768J06849l3419n2616k18645
$$ -1271709 -1403011 -1425414 -1230137 -724984 -91841 333927 440776 407357 354741 136096
34265A36096n19944n92156k28142K52674L57071N3213j98121p3404K17271L06766
$$ 136096 -383848 -976004 -1204146 -951472 -594401 -541188 -739309 -812713 -595442 -288676
34255b88676J97494J44915J82966J09890j15745l11933l88567l75458j61370L55300
$$ -288676 -91182 53733 236699 346589 230844 -81089 -469656 -845114 -1006484 -651184
34245f51184Q24199O86138J7644m25841k72188m4284k18869m03572o5573M52065
$$ -651184 173015 859153 876797 450956 178768 134484 -84385 -487957 -553530 -101465
34235a01465M34015k9986k16545N9848K81836J73243j019r2995k43831l37756
$$ -101465 332550 302564 86019 145867 427703 600946 599927 506932 263101 -74655
34225g4655p0237L34628K79504j80650l06996J08870L83393J19202j67559n9231
$$ -74655 -144892 189736 469240 288590 -18406 90464 473857 593059 425500 366269
34215C66269K9294k61122m63364j53134J69829o4827m05345j01685N64642O89122
$$ 366269 395563 134441 -328923 -482057 -312228 -377055 -782400 -884085 -319443 369679
34205C69679J82871j71770M5867M67262O42189M26528j89517r18763j053803k85149
$$ 369679 552550 380780 426647 893909 1536098 1962626 1773109 854346 -199457 -484606
34195d84606N77463N39011j51469m32297p2127J97236P5160R567O8710k13609
$$ -484606 92857 631868 480399 48102 -24025 173211 248371 257938 326648 113039
34185A13039o20408k28514Q97223J314316K92470q95237p89767J33276L70933
$$ 113039 -507369 -735883 161340 1475656 1768126 872889 83122 216398 587331
34176E87331l00798p72350m83674l2480P2818R1371K55539K50883j24851m62632
$$ 587331 286533 -485817 -969491 -1001971 -929153 -837782 -582243 -331360 -456211 -918843
34166i18843l14906J68192N03939M75714K19128o1254k50050l15023k65433r0827
$$ -918843 -1233749 -1065557 -561618 -85904 133224 71970 -178080 -493103 -758536 -849363
34156h49363K08041M58566L58861j13097m83259k70195L58499P03675L52082l28253
$$ -849363 -641322 -182756 176105 63008 -420251 -690446 -331947 371728 723810 395557
34146C95557o01787j90095M04790M64717o2129m50727j52865M08084M25315j04284
$$ 395557 -206230 -396325 8465 473182 411053 -39674 -192539 215545 640860 536576
34136E36576m17631j78730J22971J15549O0803J01325j34926o39539o11541K72680
$$ 536576 118945 -59785 63186 178735 239538 340863 205937 -433602 -1045143 -772463
34126g72463R66248M44926o23158p82264M3110N76828K22450k66285k37767J1517
$$ -772463 193785 638711 15553 -766711 -723601 -146773 75677 -190608 -428375 -416858
34116d16858J38035L27575N46952K94674l86566o49536j74634K09009r4428m20688
$$ -416858 -278823 48752 595704 890378 503812 -145724 -320358 -111349 -205777 -626465
34106f26465n8149M16819J01213o28134o80181R231N15298M61267L18162K60725
$$ -626465 -684614 -267795 -166582 -794716 -1474897 -1465666 -950368 -489101 -170939 89786
34096H9786n7343m82235l09857M29207P33423J49255m75197l58169K6008q0819
$$ 89786 32443 -449792 -759649 -330442 402981 552236 77039 -281130 -255122 -335941
34086c35941l58555l9266O17222O13772j72256p28035l83311L34262O02883L51388
$$ -335941 -694496 -733762 -116540 497232 324976 -403059 -786370 -452108 150775 502163
34076E02163L0600j03082o3827R9275K29364O6967l35367n01118j67941K62880
$$ 502163 532763 429681 365854 465129 694493 761460 426093 -75025 -242966 19914
34066A9914K98725Q9382J10549L26383K45244k27414n61487l58091J22135L83642
$$ 19914 318639 408021 518570 844953 1090197 862783 301296 -56795 65340 448982
34056D48982K98678P9181p3145q0824L1922J00365o3374l80807n14801k78818
$$ 448982 747660 826841 753696 672872 704794 805159 741785 360978 -153823 -432641
34046d32641J39858M39953M78915K41268j77666m75951l68331l4407K0971k78634
$$ -432641 -292783 147170 626085 867353 689687 213736 -154595 -189002 -168031 -446665
34036d46665l98651l6865L14208R0531m34789n24684l3910M82419O06713M49893
$$ -446665 -845316 -882181 -567973 -477442 -912231 -1436915 -1470825 -988406 -381693 68200
34026F8200K27024j8956j83641o2162K81180M44393J71658l11166n67926m12428
$$ 68200 295224 276268 92627 30465 311645 756038 927696 616530 48604 -363824
34016c63824m0102K02457J83524J41364L28242N15869K33923l87179n66116j1144
$$ -363824 -403926 -201469 -17945 123419 451661 967530 1201453 814274 248158 237014
34006B37014M88307J94353m17937m33143M0143J83089o2374o992L79409L31098
$$ 237014 725321 919674 501737 68594 108737 291826 229452 222460 601869 932967
33996I32967k66192n37678j25653J63048j99797n09057j04724M05156J73060m47350
$$ 932967 666775 129097 3444 166492 -33305 -542362 -647086 -241930 -68870 -516220
33986e16220n55549j85419k8334j12639J12401O02952P07766K91405o2460k4132
$$ -516220 -1071769 -1257188 -1285522 -1398161 -1285760 -682808 24958 316363 253903 229771
33976B29771R8507K9475j04171j56021j49510n2610J49399K23073P712j93065
$$ 229771 328278 357753 253582 97561 -51949 -104559 44840 267913 275625 82560
33966H2560o3039J19825n3905l22547j59481K42691K45365j17907k13923M8989
$$ 82560 19521 139346 85441 -237106 -396587 -153896 91469 -26438 -240361 -191372
33956a91372J24157p1863K0703M74794N73251P963n26659m13145l390O8652k05260
$$ -191372 -67215 -139078 -118375 356419 929670 937633 410974 -2171 -5561 63091 -142169
$$ [...]
##END NTUPLES=NMR SPECTRUM
##END=
