##TITLE=31Pdec_E3d1007-4
 CDCl3, 24 sc
 11.7.2023
##JCAMPDX= 6.0         $$ Bruker NMR JCAMP-DX V2.0
##DATA TYPE= NMR SPECTRUM
##DATA CLASS= NTUPLES
##ORIGIN= UXNMR, Bruker Analytische Messtechnik GmbH
##OWNER= root
$$ XWIN-NMR		Version 3.5
$$ Tue Jul 11 14:02:06 2023 Russian Standard Time (UT+4h)  she@DPX200
##.OBSERVE FREQUENCY= 81.013821
##.OBSERVE NUCLEUS= ^31P
##.ACQUISITION MODE= SIMULTANEOUS
##.ACQUISITION SCHEME= undefined
##.AVERAGES= 24
##.DIGITISER RES= 16
##SPECTROMETER/DATA SYSTEM= spect
##.PULSE SEQUENCE= zgpg30
##.SOLVENT NAME= CDCl3
##.SHIFT REFERENCE= (INTERNAL, CDCl3, 0, 248.564)
##AUDIT TRAIL= $$ (NUMBER, WHEN, WHO, WHERE, WHAT)
$$ ##TITLE= Audit trail, XWIN-NMR		Version 3.5
$$ ##JCAMPDX= 5.01
$$ ##ORIGIN= Bruker BioSpin GmbH
$$ ##OWNER= she
$$ F:/spectra/data/she/nmr/P31/1/pdata/1/auditp.txt
$$ ##AUDIT TRAIL=  $$ (NUMBER, WHEN, WHO, WHERE, WHAT)
(   1,<2023-07-11 14:01:08.65 +0400>,<she>,<DPX200>,
      <created by zg, POWCHK disabled, PULCHK disabled
       configuration hash MD5:
       00 E9 B6 7A A2 85 ED C7 34 08 36 98 17 FE 4E 26
       data hash MD5: 32K
       FA 6E DB C4 92 F2 5C 1F 66 2F 32 FF E1 BE FA C0>)
(   2,<2023-07-11 14:01:11.01 +0400>,<she>,<DPX200>,
      <Start of raw data processing
       efp BC_mod = 2 LB = 1 FT_mod = 6 PKNL = 1 PHC0 = -10619.3 PHC1 = -76.51532 SI = 64K 
       data hash MD5: 64K
       E2 FE 31 DD 6D 01 70 D5 A4 40 5B 44 AB 39 5A 08>)
(   3,<2023-07-11 14:01:31.71 +0400>,<she>,<DPX200>,
      <pk PHC0 = 69.12962 PHC1 = -154.2 
       data hash MD5: 64K
       0E B8 D1 F4 09 1D 14 83 F4 C5 D9 15 CE 76 03 E6>)
(   4,<2023-07-11 14:01:42.75 +0400>,<she>,<DPX200>,
      <abs ABSG = 5 
       data hash MD5: 64K
       C4 93 6F 56 4A 0B 03 93 10 15 29 BD C5 D0 4D 8F>)
$$ ##END=
$$ 
$$ hash MD5
$$ 07 DC FB E9 A5 51 62 B2 DC A3 30 2C AE 54 7F 23
##$RELAX= 
##$RELAX= 
##$RELAX= 
##$RELAX= 
##$RELAX= 
##$RELAX= 
##$RELAX= 
##$RELAX= 
##$RELAX= 
$$ Bruker specific parameters
$$ --------------------------
##$DU= <F:/spectra>
##$EXPNO= 1
##$NAME= <P31>
##$PROCNO= 1
##$TYPE= <nmr>
##$USER= <she>
##$AMP= (0..31)
100 100 100 100 100 100 100 100 100 100 100 100 100 100 100 100 100 100 
100 100 100 100 100 100 100 100 100 100 100 100 100 100 
##$AQSEQ= 0
##$AQ_mod= 1
##$AUNM= <au_zg>
##$AUTOPOS= <>
##$BF1= 81.014009
##$BF2= 200.13
##$BF3= 200.13
##$BF4= 200.13
##$BF5= 200.13
##$BF6= 200.13
##$BF7= 200.13
##$BF8= 200.13
##$BYTORDA= 1
##$CFDGTYP= 0
##$CFRGTYP= 5
##$CHEMSTR= <none>
##$CNST= (0..31)
1 1 145 1 1 1 1 1 1 1 1 1 1 1 1 1 1 1 1 1 1 1 1 1 1 1 1 1 1 1 1 1 
##$CPDPRG= <waltz16>
##$CPDPRG1= <>
##$CPDPRG2= <waltz16>
##$CPDPRG3= <>
##$CPDPRG4= <mlev>
##$CPDPRG5= <mlev>
##$CPDPRG6= <mlev>
##$CPDPRG7= <mlev>
##$CPDPRG8= <mlev>
##$CPDPRGB= <>
##$CPDPRGT= <>
##$D= (0..31)
0 1 0 0 0 0 0 0 0 0 0 0.03 2e-05 3e-06 0 0 0 0 0 0 0 0 0 0 0 0 0 0 0 0 
0 0 
##$DATE= 1689069667
##$DBL= (0..7)
120 120 120 11 120 120 24 19 
##$DBP= (0..7)
150 150 150 150 150 150 150 150 
##$DBP07= 0
##$DBPNAM0= <>
##$DBPNAM1= <>
$$ [...]
##$SUBNAM3= <"">
##$SUBNAM4= <"">
##$SUBNAM5= <"">
##$SUBNAM6= <"">
##$SUBNAM7= <"">
##$SUBNAM8= <"">
##$SUBNAM9= <"">
##$SW= 501.771253377433
##$SWIBOX= (0..15)
0 1 3 0 0 0 0 0 0 0 0 0 0 0 0 0 
##$SW_h= 40650.406504065
##$TD= 32768
##$TD0= 1
##$TE= 0
##$TE2= 300
##$TE3= 300
##$TEG= 300
##$TL= (0..7)
0 120 53 12 22 120 120 120 
##$TP= (0..7)
150 150 150 150 150 150 150 150 
##$TP07= 0
##$TPNAME0= <>
##$TPNAME1= <>
##$TPNAME2= <>
##$TPNAME3= <>
##$TPNAME4= <>
##$TPNAME5= <>
##$TPNAME6= <>
##$TPNAME7= <>
##$TPOAL= (0..7)
0.5 0.5 0.5 0.5 0.5 0.5 0.5 0.5 
##$TPOFFS= (0..7)
0 0 0 0 0 0 0 0 
##$TUNHIN= 0
##$TUNHOUT= 0
##$TUNXOUT= 0
##$USERA1= <user>
##$USERA2= <user>
##$USERA3= <user>
##$USERA4= <user>
##$USERA5= <user>
##$V9= 5
##$VALIST= <valist>
##$VCLIST= <CCCCCCCCCCCCCCC>
##$VD= 0
##$VDLIST= <DDDDDDDDDDDDDDD>
##$VPLIST= <PPPPPPPPPPPPPPP>
##$VTLIST= <TTTTTTTTTTTTTTT>
##$WBST= 1024
##$WBSW= 4
##$XGAIN= (0..3)
0 0 0 0 
##$XL= 0
##$YL= 0
##$YMAX_a= 5544
##$YMIN_a= -5199
##$ZGOPTNS= <>
##$ZL1= 120
##$ZL2= 120
##$ZL3= 120
##$ZL4= 120
##$ABSF1= 248.5645
##$ABSF2= -253.2056
##$ABSG= 5
##$ABSL= 3
##$ALPHA= 0
##$AQORDER= 0
##$ASSFAC= 0
##$ASSFACI= 0
##$ASSFACX= 0
##$ASSWID= 0
##$AUNMP= <proc_1d>
##$AZFE= 0.1
##$AZFW= 0.5
##$BCFW= 0
##$BC_mod= 2
##$BYTORDP= 0
##$COROFFS= 0
##$CY= -3
##$DATMOD= 1
##$DC= 0
##$DFILT= <>
##$DTYPP= 0
##$F1P= 0
##$F2P= 0
##$FCOR= 1
##$FTSIZE= 65536
##$FT_mod= 6
##$GAMMA= 0
##$GB= 0
##$INTBC= 1
##$INTSCL= 6.047779e-11
##$ISEN= 30
##$LB= 1
##$LEV0= 0
##$LPBIN= 0
##$MAXI= 10000
##$MC2= 0
##$MEAN= 0
##$ME_mod= 0
##$MI= 50
##$NCOEF= 0
##$NC_proc= -5
##$NLEV= 6
##$NOISF1= 182.463
##$NOISF2= 159.3651
##$NSP= 0
##$NTH_PI= 0
##$NZP= 0
##$OFFSET= 248.5645
##$PC= 4
##$PHC0= -10550.17
##$PHC1= -230.7153
##$PH_mod= 1
##$PKNL= yes
##$PPARMOD= 0
##$PSCAL= 0
##$PSIGN= 0
##$REVERSE= no
##$SF= 81.0140089999694
##$SI= 65536
##$SIGF1= 159.3651
##$SIGF2= -187.1042
##$SINO= 113.3802
##$SIOLD= 16384
##$SREGLST= <1H.CDCl3>
##$SSB= 0
##$STSI= 65536
##$STSR= 0
##$SW_p= 40650.406504065
##$SYMM= 0
##$S_DEV= 0
##$TDeff= 32768
##$TDoff= 0
##$TI= <>
##$TILT= no
##$TM1= 0
##$TM2= 0
##$TOPLEV= 0
##$USERP1= <user>
##$USERP2= <user>
##$USERP3= <user>
##$USERP4= <user>
##$USERP5= <user>
##$WDW= 1
##$XDIM= 65536
##$YMAX_p= 334935315
##$YMIN_p= -6263325
$$ End of Bruker specific parameters
$$ ---------------------------------
##NTUPLES= NMR SPECTRUM
##VAR_NAME=  FREQUENCY,     SPECTRUM/REAL,   SPECTRUM/IMAG
##SYMBOL=    X,             R,               I
##VAR_TYPE=  INDEPENDENT,   DEPENDENT,       DEPENDENT
##VAR_FORM=  AFFN,          ASDF,            ASDF
##VAR_DIM=   65536,         65536,           65536
##UNITS=     HZ,            ARBITRARY UNITS, ARBITRARY UNITS
##FACTOR=    0.620285442955139, 1,           1
##FIRST=     20137.2065510682, 0,            0
##LAST=      -20513.1999529968, 0,           0
##MIN=       -20513.1999529968, -6263325,    0
##MAX=       20137.2065510682, 334935315,    0
$$ Real data points
##PAGE= N=1
##DATA TABLE= (X++(R..R)), XYDATA
$$ [...]
42231 73925 -76361 -73756 76998 350143 671250 743175 347222 -195438 -297570 150232
42221 150232 700226 978515 987850 842363 659279 674589 992873 1259721 1063699 583803
42211 583803 293950 146515 -263702 -799736 -868833 -440042 -69015 216528 997604 2088675
42201 2088675 2234583 880266 -755058 -1269706 -911522 -796173 -1019434 -801461 -92853
42192 -92853 291916 80773 -95935 124527 319560 143772 -163660 -369147 -565194 -672712
42182 -672712 -366060 246661 564294 384570 193477 296277 346871 80697 -158723 -58789
42172 -58789 88662 -74385 -367508 -475401 -492005 -574828 -477028 46323 683073 913629
42162 913629 674531 260809 -162127 -527492 -612857 -273481 243554 590993 740773 798278
42152 798278 671248 301616 -47284 -163170 -290456 -692939 -1040722 -788113 -55688 418212
42142 418212 228448 -260534 -509496 -448611 -383422 -510221 -685466 -621086 -277886 1081
42132 1081 -70320 -211801 105402 783765 1083336 708554 305283 446306 723523 485703
42122 485703 -33972 -140399 120984 99418 -261287 -281287 329522 1027407 1291024 1207041
42112 1207041 995917 626984 186355 43695 325915 673389 773186 712162 598532 302205
42102 302205 -165936 -443083 -286002 64473 229017 127313 -82683 -214877 -115433 159592
42092 159592 200563 -294154 -884832 -766152 93118 766480 556936 -189305 -743769 -914610
42082 -914610 -921229 -842099 -652446 -475681 -400852 -318705 -218855 -318293 -633484 -805607 -626588
42071 -626588 -337922 -145044 92570 388524 393460 25911 -222112 -84445 -45406 -487147
42061 -487147 -905786 -724396 -372046 -650710 -1379456 -1645972 -1229258 -776430 -585222 -216450
42051 -216450 503400 1030332 1018186 912023 1163660 1459911 1246837 599693 74424 -46424
42041 -46424 55273 131882 121744 73408 36721 1787 -125568 -405740 -723020 -900486 -923198
42030 -923198 -869618 -697207 -347118 3912 93254 -63099 -247329 -411293 -625812 -730829
42020 -730829 -460383 86376 523409 735695 905523 968590 596703 -138355 -633059 -533044
42010 -533044 -173764 23543 132049 372840 617230 622972 436376 206269 -83801 -356545
42000 -356545 -268394 293005 857050 963922 818928 867536 1004337 803129 344006 137041
41990 137041 264464 270593 -17309 -216260 -129931 -136355 -499721 -832577 -684992 -255447
41980 -255447 -29913 -41520 -28841 -83038 -499381 -1063050 -1152918 -673462 -266005 -330136
41970 -330136 -401980 61345 738268 888805 507867 371161 915404 1645811 1822201 1287995
41960 1287995 414633 -384930 -824955 -760247 -356764 -46416 -39671 -58847 207716 604102
41950 604102 761171 666612 616152 687053 626798 279589 -163468 -390672 -268002 71901
41940 71901 290310 87802 -424701 -733464 -531852 -161152 -141436 -427801 -531641 -279555
41930 -279555 5627 65807 -11591 -117591 -266471 -326256 -74763 319859 334596 -177060
41920 -177060 -715791 -827876 -615931 -284316 298204 1113780 1539475 1047320 126276 -197656
41910 -197656 272983 679950 354778 -329019 -635085 -498742 -446856 -752039 -1110913 -1115022
41900 -1115022 -732766 -304122 -239667 -693898 -1356223 -1610766 -1126650 -291724 171329 48491
41890 48491 -182891 -106998 46860 -150171 -603020 -863487 -855486 -882889 -940750 -650994 -49985
41879 -49985 215440 -146761 -514029 -302111 54328 -184875 -764296 -769940 -120284 281870
41869 281870 15507 -212640 230402 901143 1048847 734086 520590 521748 442389 269319
41859 269319 253545 353974 280183 26584 -115344 -34284 112066 218479 276521 195255
41849 195255 -48690 -183351 50603 450685 589918 417545 252188 284244 473134 796282
41839 796282 1144712 1117654 473369 -303218 -494500 -173871 -43229 -213637 12273 868590
41829 868590 1495215 1141064 312219 -5479 222730 250025 -133191 -326351 41543 568974
41819 568974 751445 593203 332872 61365 -138663 -105612 74422 32122 -300344 -425326
41809 -425326 42618 741336 1032715 883166 774859 855086 744479 269742 -151741 -117665
41799 -117665 182708 343150 378670 558255 787276 667678 187944 -132708 16906 244464
41789 244464 22409 -500914 -678130 -281952 194070 283142 203561 437189 886284 943327
41779 943327 435082 -7194 172878 589668 446859 -236014 -581017 -149275 367293 144828
41769 144828 -592161 -970966 -730060 -389098 -275762 -121022 250710 500074 354128 92847
41759 92847 82663 231288 299895 403932 743297 1085523 1015052 587667 293175 389258
41749 389258 633660 684898 479444 205942 120696 332970 582337 377718 -387742 -1145200
41739 -1145200 -1301965 -992572 -772322 -767539 -693623 -603992 -903579 -1494787 -1621276 -914268
41729 -914268 -34303 178956 -211602 -466465 -164007 484444 1067706 1270732 931377 259753
41719 259753 -133147 130416 637319 701798 333770 173495 498169 884907 971995 959852
41709 959852 1082050 1104474 762150 302735 129454 185299 183333 227391 616253 1106217
41699 1106217 1023741 273902 -339604 -137697 523647 790656 450421 31983 -64693 12824
41689 12824 37433 57396 104643 5103 -219562 -131958 522690 1232812 1216997 432152 -375541
41678 -375541 -647398 -571076 -540631 -552944 -448840 -340039 -339965 -149886 532708 1313473 1413566
41667 1413566 739673 50195 -144537 -248496 -752083 -1285984 -1152629 -488046 -126130
41658 -126130 -352033 -550662 -268143 88501 289 -294921 -240579 104820 200849 -64226
41648 -64226 -203670 90818 504974 593313 359882 150688 169480 257052 81765 -458917
41638 -458917 -968790 -844529 -38281 671124 534048 -168233 -442207 111491 829171 950303
41628 950303 546015 206149 208700 369604 463555 435966 314308 154492 -2860 -227630
41618 -227630 -585293 -880801 -819230 -515670 -445690 -701254 -765039 -355224 -4950 -270479
41608 -270479 -747388 -567833 287592 888690 613045 -115497 -529843 -468954 -348239 -490285
41598 -490285 -761956 -785060 -407229 13606 -83858 -737089 -1263831 -1076479 -454595 -94228
41588 -94228 -109010 -44870 226809 310712 54112 -152220 -60210 30310 -155747 -399820 -419427
41577 -419427 -313328 -240091 -86677 169868 183173 -256697 -794731 -1013583 -1016967 -1063095
41567 -1063095 -993380 -592223 -196491 -271945 -579664 -489320 -45286 44310 -450067 -919834
41557 -919834 -931522 -862327 -1114696 -1342225 -1049972 -510030 -386444 -676438 -721820 -253212
41547 -253212 215223 189825 -120903 -202004 55781 356161 482824 479811 463241 496258 578522
41536 578522 582876 312788 -186374 -507057 -315234 208694 643389 909326 1190378 1360859
41526 1360859 1034861 297455 -177745 -41526 196634 -30087 -448337 -415230 29674 258624
41516 258624 61002 -146156 -131963 -196674 -533515 -838587 -819799 -623344 -502981 -487392
41506 -487392 -593335 -912705 -1238747 -1097627 -484662 -91447 -393588 -959293 -1132677 -972974
41496 -972974 -947313 -1063976 -989127 -780014 -769487 -818651 -424299 363167 801659 440712
41486 440712 -275494 -611847 -348273 202778 632013 705251 469957 216548 146691 118430
41476 118430 -30195 -79174 218546 557120 462404 156288 271491 664536 418107 -689874
41466 -689874 -1640769 -1611785 -1094833 -872328 -685489 88938 1027395 1122398 421770 23626
41456 23626 400114 824658 692167 379034 363104 390754 126011 -70571 282977 885443
41446 885443 993037 420929 -314599 -664304 -462115 87815 476714 225855 -478608 -820221
41436 -820221 -422310 35003 -192716 -745706 -738290 -185683 73195 -216571 -383224 -43836
41426 -43836 275939 88420 -308169 -485371 -564862 -711963 -616304 -118370 226727 -43704
41416 -43704 -402132 -83148 602371 645070 -104411 -723265 -651672 -412062 -580539 -845128
41406 -845128 -606406 45649 525049 586826 466800 385800 352892 366006 454387 547572 545819
41395 545819 489360 471919 434074 226328 -120231 -326809 -147797 286361 486021 122622
41385 122622 -446573 -458726 261394 927566 795144 210721 61642 413942 520492 167343
41375 167343 46682 499487 841371 512785 61385 188640 492975 122846 -775117 -1303809
41365 -1303809 -1260146 -1250026 -1413537 -1155673 -366734 123286 -242904 -928037 -1219861 -1234491
41355 -1234491 -1366650 -1376892 -839743 -113250 8971 -492026 -780098 -377740 214022 350593
41345 350593 152105 178905 528727 726458 455852 20424 -57128 310790 710287 755741
41335 755741 521172 414711 743374 1450040 2155062 2369706 1811538 697357 -321071
41326 -321071 -679492 -363762 224055 744466 1091508 1217206 1099226 894176 828642 851942
41316 851942 650553 126962 -369375 -461745 -222003 -26191 -36224 -36191 207678 574553 678600
41305 678600 333147 -149896 -238867 228852 876093 1237156 1167379 723481 -19318 -757760
41295 -757760 -923293 -342616 288912 179078 -436865 -611875 -98894 355826 294319 221021
41285 221021 533831 649510 -1326 -747686 -484422 586836 1108806 496847 -301127
41276 -301127 -287463 222755 296608 -174272 -443895 -52226 664501 1181569 1386564 1445195
41266 1445195 1424145 1266193 982532 681688 436512 240244 118427 190552 501297 793185
41256 793185 626190 -119322 -956565 -1225367 -802290 -176373 177842 226768 104485 -226523
41246 -226523 -736285 -989065 -510417 490846 1188504 1107625 699033 668711 993730 1017954
41236 1017954 433178 -298564 -598357 -440666 -159220 72294 253215 307634 203907 167919
41226 167919 375728 511509 60689 -925752 -1748376 -1829734 -1243324 -418824 295340 650200
41216 650200 483385 -56604 -545023 -744642 -790729 -787679 -581564 -141964 221492 322498
41206 322498 404742 637659 704236 359386 33194 270487 814264 924272 489496 110822
41196 110822 76870 13340 -274779 -352453 73545 535066 466228 66964 -51867 164679
41186 164679 167088 -339558 -968165 -1176005 -906687 -572403 -554560 -822593 -1004018 -812141
41176 -812141 -385576 -109391 -97519 -39324 336877 822074 928377 455336 -282362 -743147
41166 -743147 -599272 5356 529299 459139 -210988 -958547 -1238843 -938373 -325132 257671
41156 257671 550447 432595 21566 -369679 -517305 -446664 -222860 223553 854193 1279693
41146 1279693 1096484 458592 7259 138088 583134 866448 950222 1148579 1482185 1491467
41136 1491467 885034 121856 -38578 450086 784149 383600 -300270 -465195 -143674
41127 -143674 -75643 -460343 -580918 59256 876170 984486 388577 -195400 -412109 -504808
41117 -504808 -612635 -532058 -274195 -243905 -609038 -953248 -853330 -448408 -131795 27971
41107 27971 217829 437933 481316 266519 -89886 -476797 -832780 -1044453 -1028676 -889896
41097 -889896 -799722 -749099 -610317 -412003 -336239 -437599 -579965 -691861 -870036 -1134232
41087 -1134232 -1264702 -1046455 -592395 -279171 -360007 -699808 -897021 -672564 -170821 163852
41077 163852 89983 -113590 187 405722 581520 230318 -256518 -317890 -22430 28412
41067 28412 -409547 -818788 -597603 122837 636221 538269 140165 -47287 20155 -24940
41057 -24940 -359956 -703189 -727068 -527379 -459380 -584979 -562292 -162127 355005 574567
41047 574567 474297 371854 398121 323359 -35038 -487085 -697940 -586347 -352580 -208197
41037 -208197 -207769 -284774 -329423 -242297 4121 327480 561692 533153 184118 -310962 -617672
41026 -617672 -530505 -136795 371341 878122 1181512 930214 130798 -472736 -133348 766326
41016 766326 995932 117692 -854544 -885198 -345329 -300310 -850277 -1091203 -562894 171069
41006 171069 466703 325186 -21682 -521082 -972205 -921657 -311400 243971 237565 -79053
40996 -79053 -216344 -199371 -319971 -489614 -412394 -199784 -232470 -474122 -463404 -48015
40986 -48015 332468 254331 -120679 -264195 105044 738813 1093522 828469 160090 -328036
40976 -328036 -321541 -93806 -40783 -99425 68784 453714 666677 547614 405766 525012
40966 525012 764735 862970 879405 1051854 1324529 1300910 727415 -110301 -584312 -347775
40956 -347775 279744 658867 580992 473543 710507 975713 693888 -31558 -444812 -198541
40946 -198541 165130 105074 -61876 253805 824553 852181 248219 -116374 324204 1006788
40936 1006788 1126594 789285 651419 790474 703374 313536 186938 601045 1076740 1121699
40926 1121699 881689 714401 619332 493917 487318 605901 393324 -371694 -976719 -525367
40916 -525367 718917 1491297 1118356 287902 17982 434275 896960 912667 544585 158397
40906 158397 66837 318865 681053 891378 917301 832982 595573 235718 84139 355038
40896 355038 648675 447209 17012 97692 664617 849919 329899 -94031 242226 843689
40886 843689 934530 648992 562677 585111 197508 -539316 -1048465 -1108594 -935681 -604398
40876 -604398 -125163 98072 -307155 -897640 -870945 -295022 -59884 -509016 -937596 -698291
40866 -698291 -80125 267444 205865 19801 -103525 -148784 -131190 -142666 -299804 -502176
40856 -502176 -493455 -224027 129941 482772 793543 763793 112978 -793240 -1154735 -725983
40846 -725983 -73126 297094 478576 617737 470934 -72919 -550010 -510020 -190104 -125608
40836 -125608 -370353 -574387 -624170 -708572 -815501 -610497 73907 873330 1170970 734691
40826 734691 33636 -201827 176230 530485 306698 -165898 -195581 166679 215745 -231904
40816 -231904 -514271 -188403 301986 403566 273775 333655 500393 418925 118332 -78967
40806 -78967 -74530 -2720 71629 125462 73148 -29581 37923 217749 77330 -513564 -1002251
40795 -1002251 -850741 -256833 231017 448823 520592 413017 113224 -84478 -23497 -102927
40785 -102927 -658707 -1225698 -1090866 -368023 181644 259829 238001 319161 240537 -121467
40775 -121467 -529051 -883738 -1321903 -1676647 -1490961 -804602 -332980 -531934 -974672 -1020627
40765 -1020627 -687489 -446098 -456467 -456030 -260820 20357 253877 457160 634297 636857
40755 636857 341095 -78904 -210896 151391 697251 905178 638679 229322 -13200 -72252
40745 -72252 16161 269163 490332 335938 -137665 -450390 -474872 -682569 -1240628 -1510765
40735 -1510765 -1054018 -515142 -672301 -1106049 -839536 3493 332743 -177948 -664979
40726 -664979 -546437 -288229 -328796 -289216 166808 559968 374037 -63967 -181982 -109693
40716 -109693 -327903 -773849 -978469 -832042 -616084 -468212 -330060 -255194 -312711 -348656
40706 -348656 -238926 -167232 -247668 -133991 482366 1176068 1177063 421600 -335771 -544310
40696 -544310 -495346 -716141 -1100412 -1021087 -236119 635531 735400 -9381 -740918 -683895
40686 -683895 -51849 371746 348275 363069 724701 1096699 1112594 899262 684740 385632
40676 385632 -37906 -276780 -174802 -128049 -465053 -782557 -500935 176319 524086 391898
40666 391898 350858 705856 1005003 746980 93999 -395920 -438551 -194344 25953 56846
40656 56846 -2551 86787 343045 400336 -53350 -735488 -1004735 -674886 -245159 -189673
40646 -189673 -338809 -200586 315097 764780 698838 130123 -519673 -838874 -794320 -720570
40636 -720570 -910345 -1223042 -1213203 -692063 -21638 279970 132151 -98495 -157487 -212537
40626 -212537 -467302 -702112 -527684 -26274 258676 73258 -198325 -162783 -9359 -98822
40616 -98822 -304335 -295351 -242479 -569588 -1068599 -1003523 -240348 439059 452934 198060 280927
40605 280927 544309 432850 -72654 -482481 -505121 -205111 310319 838188 931869 383677
40595 383677 -276323 -333616 139264 433042 267546 71680 142711 196583 -4303 -166056
40585 -166056 12530 274317 207245 -83360 -165744 27862 169838 154057 274138 650319
40575 650319 879778 575158 13821 -176042 62855 76553 -546219 -1315051 -1501872 -1123365
40565 -1123365 -742534 -531564 -220840 83106 -131359 -752185 -808844 189226 1312393
40556 1312393 1314296 264486 -667270 -815959 -635853 -747087 -1086263 -1188846 -829344 -178012
40546 -178012 388346 541891 295195 29932 39821 173057 169316 121460 229088 315489 72486
40535 72486 -350236 -493743 -236616 175419 621850 1105161 1379787 1194764 855515 898350
40525 898350 1197961 1077883 382673 -272818 -483458 -550068 -724210 -684136 -203141 255279
40515 255279 132703 -439610 -902786 -996772 -856739 -678656 -590614 -583004 -393409 155423
40505 155423 598569 217044 -778963 -1192940 -431366 580749 727669 258011 140262
40496 140262 423488 343284 -197146 -418810 1663 449190 466629 385177 471193 318623
40486 318623 -323431 -830623 -556420 68128 99718 -482493 -730703 -147158 602321 670046
40476 670046 132919 -337637 -519738 -751235 -1106858 -1114126 -522494 129200 148942 -362359
40466 -362359 -686828 -513732 -269283 -360105 -601643 -639487 -518465 -482830 -504511 -389474
40456 -389474 -163332 7786 140464 335236 477649 400449 257013 342458 567806 518340
40446 518340 96456 -278506 -259133 -35705 -3398 -201214 -335727 -248671 -119838 -183371
40436 -183371 -381753 -404018 -87843 293417 297911 -107085 -450490 -376272 -119773 -104613
40426 -104613 -278531 -256758 -25007 130 -318609 -567673 -449763 -284393 -473814 -793138
40416 -793138 -694932 -185286 105441 -207743 -732660 -838462 -462861 -123949 -230476 -610280
40406 -610280 -746705 -347544 382003 968424 1097086 810583 358408 -44588 -280851 -274167
40396 -274167 -39285 207752 169701 -175059 -444273 -263641 220566 452281 158889 -266494
40386 -266494 -250495 221178 590997 435736 -59959 -414978 -432144 -310258 -297522 -419925
40376 -419925 -539000 -545341 -460901 -402738 -452996 -550115 -550922 -422871 -294432 -256030 -207273
40365 -207273 -19894 213348 256601 68272 -84519 84506 558579 1034623 1193948 927204
40355 927204 394609 -63706 -181598 -56343 -102006 -538581 -986927 -846727 -134513 380440
40345 380440 107880 -572613 -834632 -542886 -345621 -624235 -951022 -850668 -560369 -566388
40335 -566388 -775865 -731523 -420491 -237742 -238290 -98189 125797 -98533 -852003 -1371256
40325 -1371256 -1026678 -233941 121911 -149144 -504308 -600070 -662811 -916416 -1170069 -1164160
40315 -1164160 -971431 -822271 -741710 -578443 -289651 -7189 167545 293703 443484 484600
40305 484600 155167 -555019 -1208033 -1299711 -828128 -281791 -47216 -70193 -164050 -343398
40295 -343398 -647388 -875029 -776631 -387809 48892 380972 566239 545551 348555 215041
40285 215041 336698 540941 491106 154439 -190203 -381661 -535131 -745281 -885191 -785867
40275 -785867 -451195 -44606 214173 158226 -151405 -374837 -213526 200241 418428 219492
40265 219492 -126208 -179493 205254 764576 1060354 832706 239068 -261564 -356358 -167495
40255 -167495 -12545 -6923 -65618 -144347 -221161 -157312 103704 270637 9462 -491847 -670952
40244 -670952 -385626 -147035 -378242 -820831 -954706 -700762 -367535 -112603 164078 467996
40234 467996 589175 375568 -69979 -494960 -690854 -620760 -454222 -406408 -463324 -401494
40224 -401494 -181201 -96713 -312003 -471523 -143766 463614 679095 283442 -203077 -299381
40214 -299381 -181327 -219788 -295182 -57471 340011 332789 -214803 -773233 -899743 -775466
40204 -775466 -746274 -741264 -526222 -224143 -117575 -125498 18541 177989 -20547 -421760
40194 -421760 -393133 139392 342681 -386327 -1429612 -1701343 -1095201 -507079 -517291 -749203
40184 -749203 -668213 -391002 -342194 -512541 -500668 -138918 288142 451599 365766 296602
40174 296602 399332 546375 528538 353779 214017 148554 -37910 -383355 -542540 -248649
40164 -248649 177560 179280 -248616 -562713 -468814 -230736 -76264 167043 563855 702960
40154 702960 300263 -182613 -75834 519458 848320 568532 168145 202674 565442 750673
40144 750673 539956 169494 -17311 121792 462689 705963 606792 217795 -159462 -307528
40134 -307528 -266609 -147911 30284 200969 141694 -258300 -722983 -847110 -641359 -581063
40124 -581063 -1004980 -1634702 -1859667 -1441166 -784667 -498729 -780691 -1274148 -1465367 -1166947
40114 -1166947 -650105 -367052 -540608 -969350 -1216441 -1030089 -595994 -331886 -419456 -621759
40104 -621759 -622820 -443132 -364770 -490224 -585315 -412161 -25907 360449 618397 666720
40094 666720 405316 -57763 -278330 68262 655029 803965 345154 -217136 -480582 -628781
40084 -628781 -910140 -1090738 -846932 -392262 -228052 -434467 -656016 -671740 -543535 -310105
40074 -310105 -13104 45416 -400703 -1032308 -1233011 -967756 -801683 -959540 -1021261 -762273
40064 -762273 -597595 -797989 -905683 -469000 167125 412938 340890 375256 432984 133843
40054 133843 -334230 -345524 191479 690553 768771 641304 549762 406016 167364 26889
40044 26889 35528 -7501 -134467 -137343 -48439 -184858 -529174 -596582 -186677 236562 238146
40033 238146 4178 -134148 -290369 -650601 -921644 -743852 -382096 -371986 -620335 -517597
40023 -517597 35765 354344 -76368 -877206 -1313606 -1184606 -816866 -432563 36205 557195
40013 557195 831972 662787 241418 -101407 -275021 -374943 -395877 -275199 -175701 -393334
40003 -393334 -888817 -1202530 -1007078 -509074 -127168 -28337 -193327 -617769 -1094821 -1095599
39993 -1095599 -372206 476619 581178 -99634 -754345 -765384 -250523 419888 1001790 1167566
39983 1167566 621517 -273893 -616356 -122213 374059 57393 -712290 -956403 -430308
39974 -430308 201289 333971 -8170 -459769 -660408 -390610 182610 470460 103028 -487367
39964 -487367 -578872 -164397 87233 -133584 -361268 -132357 328360 487108 224494 -117786
39954 -117786 -211366 -26048 232915 305315 85176 -243438 -354238 -113650 299534 591177
39944 591177 569129 240218 -132148 -141126 348515 932737 1090621 861479 760701 964189
39934 964189 996988 486807 -129315 -102372 541854 893203 276012 -860381 -1445864 -1019647
39924 -1019647 -148126 345186 222101 -207406 -616730 -847884 -781584 -429384 -100312 -92817
39914 -92817 -224682 -66820 336886 472964 210845 104987 539947 1078080 1107102 726387
39904 726387 452522 363740 158653 -121135 -86935 300707 617090 609753 441601 238253
39894 238253 -98656 -503069 -635293 -337519 161879 602563 881067 840954 351762 -285514
39884 -285514 -532490 -417651 -608494 -1368751 -1982986 -1699805 -821595 -263046 -284135 -295126
39874 -295126 153439 790574 1137125 1113638 923655 669705 353640 81810 13717 128313
39864 128313 197609 38023 -273570 -492454 -502944 -430233 -397406 -300034 -12104 266028
39854 266028 176738 -218921 -369861 46190 591197 565468 -90154 -705354 -671313 -56678
39844 -56678 592046 830357 610577 178595 -170629 -276689 -155286 94276 399669 737910
39834 737910 1092517 1396047 1470277 1072564 167571 -816599 -1223926 -829793 -125937 238779
39824 238779 183043 130011 321196 532140 526011 455217 588570 841691 861055 516387 65304
39813 65304 -182872 -163056 18049 239545 366132 291943 122691 130615 349397 405461 16349
39802 16349 -510808 -647368 -416999 -342512 -598385 -749393 -524347 -302452 -441824 -602405
39792 -602405 -305727 163633 117117 -395523 -545065 48591 705625 627710 -27089 -410661
39782 -410661 -35594 808814 1506537 1636801 1136355 265883 -519683 -839987 -646064 -231698
39772 -231698 16635 -47171 -177132 2486 496086 844092 694412 285081 94865 191792
39762 191792 291415 314823 419594 535081 393094 62326 -74817 30856 22004 -159526
39752 -159526 -112134 239942 358814 -15159 -311885 -4318 527264 649342 504777 604555
39742 604555 749640 293303 -614920 -985070 -369849 483637 691965 337908 105544 246600
39732 246600 374122 101439 -468100 -868495 -737934 -177236 352933 557952 616982 791175
39722 791175 910532 611032 -12159 -434940 -415382 -234860 -135515 17095 289231 320143
39712 320143 -224965 -1080849 -1616167 -1543901 -1131614 -760667 -516478 -250802 100492 366168
39702 366168 320346 -26772 -410744 -592992 -507265 -104702 636506 1356229 1349378 404944
39692 404944 -643678 -769294 -32521 584045 556037 311051 256332 131651 -298172 -623270
39682 -623270 -428930 -37983 -3926 -242832 -284873 -93946 12655 68291 400117 911322
39672 911322 1058668 643361 107359 -96295 -2068 138163 242530 344269 444091 566206
39662 566206 725159 749085 402872 -201556 -580473 -426765 2523 197132 -33502 -411415
39652 -411415 -530579 -275754 64171 117193 -118543 -283508 -200862 -154973 -382790 -560737
39642 -560737 -230538 423726 750804 559887 322954 363174 409303 194624 -16122 129284
39632 129284 470037 571049 316526 -75801 -422072 -629780 -568120 -200191 267823 596882
39622 596882 722792 586564 50237 -728985 -1150824 -832055 -217176 -67258 -456290 -749405
39612 -749405 -534849 -97116 90909 -78053 -407060 -659895 -650381 -351339 6483 189608
39602 189608 305830 581682 846308 690836 191995 -48715 210140 432972 116416 -408582
39592 -408582 -433472 150134 798557 1080460 1044038 894523 738549 688525 865968 1182918
39582 1182918 1340547 1138622 658440 130557 -243392 -361668 -272398 -141795 -51113 114229
39572 114229 433645 718613 734111 581240 584899 797130 887569 605653 122748 -201261
39562 -201261 -220759 -58461 107815 193964 232396 334426 558335 753635 628391 71514
39552 71514 -631952 -1006091 -840858 -415749 -208730 -348082 -442493 -105398 416877 448162
39542 448162 -184584 -779079 -628814 16710 331906 105849 -43060 280831 598295 300171
39532 300171 -407970 -797459 -616117 -286490 -171062 -135643 37743 206441 102687 -208123
39522 -208123 -401732 -363522 -318252 -441133 -555145 -372348 85692 517204 755065 914992
39512 914992 1082397 1120455 957680 820611 900859 969419 683873 190806 7880 285202
39502 285202 605964 637112 560622 640789 747818 636728 409657 329551 372816 343477 287501
39491 287501 387704 508916 273555 -335967 -795203 -614696 102034 789511 964960 580015
39481 580015 -25285 -440404 -531194 -485867 -474427 -376226 -8549 479121 701182 528068
39471 528068 251365 215860 469214 796627 917907 640104 19230 -599115 -881687 -846002
39461 -846002 -703365 -446076 63234 601427 652560 149187 -284132 -146065 229625 185369
39451 185369 -283234 -541349 -214176 384805 746686 694909 348227 -82726 -327262 -193298
39441 -193298 142058 221426 -120560 -474389 -353489 190695 682350 819407 687010 444601
39431 444601 126996 -177260 -254522 -79558 4111 -285491 -639127 -430636 365658 902967
39421 902967 464000 -478967 -730636 59830 863478 621667 -353563 -904515 -669768 -435229
39411 -435229 -803430 -1304732 -1224458 -684657 -280628 -42773 476874 1208512 1448738 911740
39401 911740 228854 47101 155243 -16889 -419260 -507001 -176823 49329 -169733 -556246
39391 -556246 -774095 -934410 -1184847 -1173227 -450923 711984 1445846 1303605 730393 340169
39381 340169 157701 -67737 -161753 267391 1013823 1321413 933469 516039 651339 913683
39371 913683 561675 -172558 -298338 427218 1034854 702915 -113221 -440113 -146405 143210
39361 143210 170332 279155 580006 659162 326207 2751 31775 132421 -32568 -197465
39351 -197465 45469 435984 363927 -92596 -144178 535711 1234431 1175793 612129 409221
39341 409221 785368 1077004 774895 219083 16681 197315 325415 196295 5118 -64007
39331 -64007 -24221 103389 289231 301271 -83207 -597772 -651603 -148407 283528 138319
39321 138319 -311040 -557382 -635377 -834838 -979317 -665814 -74340 172518 -26030 -104597
39311 -104597 237748 635304 785121 888476 1031644 809451 66146 -592692 -653083 -534368
39301 -534368 -829443 -1149590 -689308 260365 451863 -514908 -1531210 -1532521 -860291 -477977
39291 -477977 -527337 -453214 -121860 68315 48806 226488 680761 915048 633748 193059
39281 193059 -17789 -143830 -428575 -638319 -437937 -79506 -134801 -603936 -840151 -454790
39271 -454790 174619 484418 410339 236521 96782 -37922 -102735 -25724 55419 -25535
39261 -25535 -173885 -224587 -290049 -541354 -728096 -381411 448907 1113130 1189590 1004906
39251 1004906 1084269 1410299 1547152 1292268 882789 643702 668482 799160 784140 546294
39241 546294 372208 640143 1240017 1527862 1085803 296295 -123629 28764 365641 510497
39231 510497 415385 179557 -72730 -159776 -23678 68379 -171590 -559881 -614490 -265004
39221 -265004 -19032 -290082 -869283 -1226093 -1079476 -517545 198142 744769 847686 503885
39211 503885 13209 -338914 -520064 -581513 -434142 9500 564784 856647 692628 251706
39201 251706 -116941 -235041 -223632 -298048 -461961 -502733 -337863 -202545 -314998 -497227
39191 -497227 -420186 -163031 -158657 -523989 -833749 -753305 -547101 -640554 -926901 -919443 -504003
39180 -504003 -124110 -142697 -360777 -371359 -179544 -195786 -640871 -1189335 -1317920 -901702
39170 -901702 -321807 -3313 9741 -18574 126967 427765 706414 778425 601649 358161
39160 358161 280084 306621 97103 -442937 -867795 -728355 -235250 17506 -98927 -165835
39150 -165835 -7146 -5009 -419544 -911024 -1084727 -1064159 -1071313 -827480 6768 993918
39140 993918 1223629 523070 -233064 -237608 296427 583172 276724 -331266 -855458 -1124789
39130 -1124789 -1056046 -647918 -156323 56156 -22887 6952 404906 867490 873077 335454
39120 335454 -310697 -630609 -570351 -311423 9472 316923 500595 465264 227750 -103129
39110 -103129 -369288 -373200 -25605 429211 550159 244390 -13190 233618 747009 827897
39100 827897 200641 -636906 -997427 -693403 -82848 346397 347506 53759 -151590 -16161
39090 -16161 303979 474177 456478 538031 863623 1182824 1164768 786872 309324 -4336
39080 -4336 -67559 17372 78370 65504 71842 78673 -141637 -633255 -952670 -643524 71261
39069 71261 512895 450892 305658 385692 443557 185536 -244040 -556819 -726683 -854643
39059 -854643 -956680 -1074269 -1233877 -1153839 -475052 505084 898956 376012 -316013 -406179
39049 -406179 -96932 44032 98854 448556 852448 757198 286501 59343 137498 222
39039 222 -448846 -685749 -479956 -236565 -248994 -302701 -232533 -226715 -327011 -218298 209826
39028 209826 609969 722785 674609 532967 125262 -444561 -659550 -288296 277121 667914
39018 667914 994137 1344990 1416155 1059357 678241 607628 578158 283993 -263 73119
39008 73119 243599 83268 -266573 -449747 -624732 -1098810 -1515119 -1247125 -493295 -131631
38998 -131631 -441833 -776665 -658967 -425120 -467980 -532965 -232747 241060 430934 321215
38988 321215 267254 410392 568887 603325 547260 424275 215852 -5942 -140381 -240732
38978 -240732 -424278 -590046 -451271 47703 516064 500593 26062 -444528 -607817 -648593
38968 -648593 -835703 -1027065 -885839 -465163 -174598 -152457 -104680 103016 146138 -189737
38958 -189737 -543642 -482509 -177015 -117068 -332165 -371645 -10741 441997 575751 313823
38948 313823 -101226 -344275 -273780 -124719 -279133 -664689 -679578 -43617 607929 480852
38938 480852 -269697 -763390 -571139 -61806 320282 470410 354216 5775 -173579 207279
38928 207279 807235 925598 631499 656276 1034934 912273 93833 -342343 272378 928910
38918 928910 417853 -699518 -886026 32221 687015 266994 -505243 -744274 -601062
38909 -601062 -584505 -596227 -321549 16484 -19950 -347437 -529391 -468917 -424267 -449539 -302362
38898 -302362 57641 268080 36990 -391076 -464086 4408 577414 725823 486367 344138
38888 344138 497038 598970 359787 8956 -118571 -96976 -114775 4291 452976 848580
38878 848580 629966 -35030 -394687 -196500 30079 -104228 -317301 -302412 -261510 -392340
38868 -392340 -395906 -11129 368635 183089 -433573 -811179 -632252 -192018 145783 291991
38858 291991 230826 -85454 -510351 -690716 -472977 -146255 -99798 -312189 -356590 31889
38848 31889 523689 536088 29763 -321599 14341 655525 786974 272443 -230919 -272083
38838 -272083 -146985 -262724 -501560 -545021 -408932 -285993 -178674 -33695 44782 33153
38828 33153 145609 445957 628480 513304 384852 447138 370745 -90939 -450810 -150832
38818 -150832 418604 370260 -330896 -808682 -600497 -200637 -85737 -21713 260472 419630
38808 419630 129037 -149799 300664 1364297 2135878 2029126 1380716 890973 817150 861989
38798 861989 648714 135675 -388440 -620589 -529686 -359508 -395967 -732079 -1189242 -1451656
38788 -1451656 -1374953 -1164360 -1078680 -972784 -478553 245647 428985 -265290 -1030641 -841700
38778 -841700 184433 1023431 1162077 984386 760340 173478 -841037 -1602360 -1547422
38769 -1547422 -1006146 -599185 -363806 -33289 252818 165007 -163415 -319504 -282342 -349161
38759 -349161 -514341 -484577 -269551 -220119 -434198 -592139 -474903 -251338 -136450 -87929
38749 -87929 39070 274732 538297 665673 459616 -50150 -460809 -414480 -109254 -32929
38739 -32929 -219251 -220917 105574 295003 3216 -391580 -302520 240769 714840 888361
38729 888361 1020197 1279546 1420660 1215397 882465 792057 898698 783609 262782 -321137
38719 -321137 -535682 -398898 -293605 -430421 -602495 -482508 -2819 602020 1015818 1071134
38709 1071134 860670 640641 543524 431524 178368 17935 325306 1003621 1396577 989703
38699 989703 -4972 -912888 -1230468 -849485 45797 991555 1372290 948258 215967 -86065
38689 -86065 184734 533752 594945 550540 686733 901777 904829 670812 412259 207969
38679 207969 -70835 -473974 -836196 -992349 -974975 -905521 -803990 -641092 -513713 -579217
38669 -579217 -777890 -805730 -498136 -107526 -5842 -185486 -290675 -143063 19993 -66501
38659 -66501 -270553 -202493 290119 889426 1080033 658471 -6229 -305647 -75092 200850
38649 200850 53432 -286032 -223511 288630 664722 543389 217523 57720 40958 127173
38639 127173 559102 1330096 1799780 1433078 656474 374814 768444 1143802 935255 314451
38629 314451 -226419 -404592 -186365 249292 475970 157693 -450653 -712025 -425592 -33169
38619 -33169 129860 306692 731808 1009233 598377 -273797 -737511 -362615 326667 588446
38609 588446 353997 90111 31932 -8355 -129241 -135166 -347 -60342 -394232 -447554 173357
38598 173357 851200 660614 -191158 -518653 91626 614591 117222 -887889 -1312922
38589 -1312922 -1056700 -854952 -1019321 -1221130 -1286469 -1343882 -1284673 -868319 -329094 -142264
38579 -142264 -204483 21420 537217 748939 461892 174845 204555 240321 23079 -193021
38569 -193021 -158334 -30279 31890 144467 305261 249877 -20559 -75373 298972 759114
38559 759114 948805 885831 601639 -9916 -700115 -852317 -355768 86531 -43562 -338147
38549 -338147 -214737 137203 165514 -115405 -249150 -123253 -57007 -267589 -683874 -1127150
38539 -1127150 -1360277 -1198220 -827594 -683458 -790531 -707013 -372722 -345172 -764296 -852623
38529 -852623 -141013 529136 168817 -741210 -892927 -100106 539078 349548 -155337 -332829
38519 -332829 -229148 -78390 143233 319000 89161 -468021 -665429 -108900 713196 1076570
38509 1076570 842061 357137 -59814 -261386 -234697 -160618 -251337 -420491 -407157 -238786
38499 -238786 -168084 -150057 97942 446597 362345 -235339 -698946 -539306 -93976 32501
38489 32501 -224480 -499116 -566935 -466589 -314802 -258414 -362888 -395384 -55928 450424
38479 450424 534835 119113 -129266 209672 620251 436564 -141288 -401636 -172421 94013
38469 94013 96495 -47447 -229025 -498713 -769274 -808807 -585318 -289412 -11417 294719
38459 294719 547116 558691 337429 84864 -107009 -292047 -412320 -294234 41994 305611
38449 305611 260783 -8356 -214348 -181650 -48921 -158167 -623606 -1016110 -738784 187000
38439 187000 1023318 1180834 837243 452637 109979 -223246 -199966 461037 1245500 1303013
38429 1303013 628563 94840 222386 602943 729877 703660 764128 743967 467390 204784
38419 204784 204136 158142 -306444 -927804 -1209381 -1287541 -1702172 -2364608 -2478272 -1650877
38409 -1650877 -480140 250124 469758 567730 643856 497666 181167 87142 441936 1002750
38399 1002750 1332976 1204347 702512 112452 -241009 -188794 130999 367311 277182 -57604
38389 -57604 -358516 -450331 -371957 -217782 -4464 209240 186336 -262802 -886298 -1102834
38379 -1102834 -704401 -221150 -274000 -710881 -799397 -262038 338951 388982 -25208 -397983
38369 -397983 -488492 -392533 -192984 90695 348802 490251 592072 702233 683786 523084
38359 523084 531062 854029 1035069 565366 -291799 -777828 -641016 -285030 7667 318119
38349 318119 524904 258133 -363562 -668711 -431346 -252564 -531106 -727996 -228737 632411
38339 632411 1081287 1006878 871060 858365 818083 793841 900350 860271 370738 -207591
38329 -207591 -247235 148192 280601 -38958 -292013 -207006 -112652 -166345 -13647 476573
38319 476573 834726 719393 406995 168226 -226695 -893583 -1292930 -929124 -205832 57328
38309 57328 -259115 -521133 -286237 204082 443620 189968 -388340 -804501 -603824 94704
38299 94704 565031 293379 -358299 -677596 -586909 -613203 -979937 -1293647 -1201220 -845495
38289 -845495 -491109 -135518 261047 522134 536430 521096 677246 787580 525385 46861
38279 46861 -135020 115556 342650 157538 -231478 -397970 -337467 -380616 -620000 -821161
38269 -821161 -866692 -876523 -829871 -495108 97905 525974 573038 582658 865041 1102977 813597
38258 813597 157573 -230303 -88358 293365 654546 1000451 1263468 1240587 942924 584994
38248 584994 201778 -280715 -607287 -384821 197279 414146 -29309 -598531 -718933 -461603
38238 -461603 -175630 71721 346440 540549 547276 430367 198812 -213111 -562000 -382872
38228 -382872 277279 726660 548518 130288 -76301 -227662 -538905 -654662 -214672 409198
38218 409198 618106 461636 345839 228894 -147714 -501102 -281451 412569 911443 902461
38208 902461 644392 360296 72974 -43559 170829 387499 139007 -387270 -558192 -256120
38198 -256120 48906 139212 206501 173691 -295249 -980564 -1155497 -707162 -408041 -728675
38188 -728675 -1134625 -991921 -483735 -120131 78616 360962 667313 797770 797566 736585
38178 736585 461574 -17718 -260150 52361 611526 943052 1043327 1127532 1069262 610402
38168 610402 -56172 -388176 -109857 580446 1285986 1639031 1453909 939561 586555 610734
38158 610734 717749 603399 370807 214983 77183 -57856 74227 510498 682138 110682
38148 110682 -739191 -895486 -104805 874268 1189876 684671 -225676 -1038829 -1435107 -1359841
38138 -1359841 -981349 -501554 -51688 214051 179825 55815 280071 893281 1340660 1205224
38128 1205224 805274 684133 829155 852758 670561 490211 337657 112168 -52244 15542
38118 15542 119467 -11199 -196571 -104382 114763 97332 6934 305566 870332 1097983
38108 1097983 902729 806011 907551 622655 -228940 -864262 -584618 208165 593787 299527
38098 299527 -227620 -554951 -559435 -265245 114708 157538 -300101 -793329 -718773 -93146
38088 -93146 527975 790001 827732 851831 825198 651507 421394 295641 240312 30978
38078 30978 -432146 -887197 -948708 -640447 -480064 -825269 -1330088 -1392207 -1011478 -751601
38068 -751601 -855937 -904978 -505565 118763 468296 375924 55155 -204594 -233459 -114505
38058 -114505 -188912 -615150 -920476 -473283 519350 1089522 808778 363885 455966 785212
38048 785212 712327 361058 305596 532830 523540 184631 -62147 -52647 -34570 -54711 127051
38037 127051 438779 449996 69806 -266618 -258458 -54954 234652 765471 1437568 1708401
38027 1708401 1304894 685893 377130 209597 -291304 -1008049 -1293236 -912290 -417831
38018 -417831 -390541 -643408 -510172 173620 739683 515088 -245441 -615871 -173559 495756
38008 495756 643915 302548 12348 -63272 -214529 -502950 -574986 -233605 254838 554086
37998 554086 609322 513506 360821 317355 493735 651692 383668 -300663 -897324 -1019198
37988 -1019198 -742948 -266880 346708 914419 1054203 647774 51169 -399118 -751982
37979 -751982 -1075940 -1134302 -789651 -389061 -312309 -387884 -208529 159621 269371 22870
37969 22870 -152006 90868 588763 956752 1050636 1011567 971782 833387 390862 -286001
37959 -286001 -713164 -491089 93918 344267 96828 -70697 218423 528437 362286 43141
37949 43141 218018 770294 930448 396073 -299783 -580185 -430095 -135124 69662 -20332
37939 -20332 -457490 -845980 -630477 127289 694615 610801 253947 179100 307769 197035
37929 197035 -170864 -361271 -164701 126761 180408 53281 24699 167111 244169 21044
37919 21044 -421498 -764841 -841979 -826466 -936651 -1073058 -949011 -538452 -166373 -111923
37909 -111923 -300153 -449415 -390054 -184250 -28867 -67193 -235639 -329659 -267458 -162283
37899 -162283 -52693 206991 594244 742865 467530 201170 420057 826267 722123 125999
37889 125999 -202531 57809 342951 205550 17865 211948 477672 339320 16099 -729
37879 -729 151024 -3863 -327149 -230720 269015 470434 77316 -364132 -366530 -193512 -284980
37868 -284980 -514380 -478498 -179282 38631 14557 -167876 -482708 -913529 -1187740 -983943
37858 -983943 -453201 -162723 -365512 -620431 -388818 181473 408641 606 -518637 -485098
37848 -485098 44409 403189 186177 -318113 -587964 -446451 -72054 285668 432949 311262
37838 311262 135274 233480 566160 655194 235114 -295117 -390972 -80390 226005 394775
37828 394775 529165 454497 -95837 -773147 -785106 12855 809310 946713 786193 1003084
37818 1003084 1475680 1498301 887864 247477 97387 237444 146997 -285816 -647637 -516741
37808 -516741 26137 442155 322968 -135814 -425629 -423458 -445370 -560136 -361112 291184
37798 291184 808026 666048 267644 350315 797397 820809 256873 -167522 -8111 279399
37788 279399 225678 90837 216256 288532 -84636 -542809 -460272 28854 229725 -60916
37778 -60916 -429017 -678326 -1015397 -1344630 -1172979 -481702 -653 -213547 -652264 -653031
37768 -653031 -348588 -339876 -697035 -915178 -746234 -481531 -358142 -196259 179691 531020
37758 531020 495988 105587 -246595 -284824 -82164 212853 658561 1318476 1862872 1723557
37748 1723557 831354 -86088 -298105 12673 83330 -269881 -430803 -43853 356264 160364
37738 160364 -393238 -645126 -507627 -449887 -692344 -972776 -1019666 -769273 -188168 644245
37728 644245 1322292 1438248 1097621 715906 414808 98648 -12478 424814 1148166 1433469
37718 1433469 1105619 765850 814395 897123 627765 238309 93787 94048 34115 106364 516546
37707 516546 943314 910828 469492 50193 -149598 -220183 -206636 -152904 -281407 -698177
37697 -698177 -1084973 -1094188 -882179 -834032 -925008 -807596 -417906 -48664 115926 139459
37687 139459 75736 -57378 -127057 -56906 -36925 -224320 -414027 -394095 -392298 -670711 -908816
37676 -908816 -620993 -40919 127071 -193026 -356367 -88753 111400 -102767 -346167 -217383
37666 -217383 57042 142620 191264 401787 473865 92197 -393199 -377462 115805 514456
37656 514456 535684 439162 501783 696171 903184 1070766 1123742 1004613 826011 754137
37646 754137 761556 710524 634839 711379 971655 1221406 1215880 808138 60650 -654112 -877311
37635 -877311 -595449 -306620 -301206 -207422 322495 815653 549616 -230903 -502484 2089
37625 2089 305786 -327558 -1167963 -1004677 116161 986988 882300 257179 -222829 -495954
37615 -495954 -660793 -482758 112054 577786 413307 -52690 -179456 -63514 -336551 -1013923
37605 -1013923 -1359533 -1029204 -562439 -427153 -324272 62404 304345 -82102 -692640
37596 -692640 -802954 -544183 -607106 -947527 -806810 -118606 142555 -562111 -1378122 -1208200
37586 -1208200 -203145 579963 577534 92814 -421626 -740095 -667365 -153202 379937 391722
37576 391722 -30680 -269120 -62379 213968 254045 258387 431780 557950 445897 381604
37566 381604 648195 876810 452021 -514011 -1175676 -1015120 -418592 236 183707 389693
37556 389693 560643 454277 204610 178089 309422 170390 -215924 -266699 195031 508385
37546 508385 182792 -229308 53439 773935 1027337 711684 642807 1162033 1567385 1254803
37536 1254803 619668 340179 412721 453385 426858 462793 360765 -69286 -457690 -315736
37526 -315736 143235 234969 -230025 -770231 -968406 -834371 -438631 251823 1045858 1497866
37516 1497866 1390851 946990 471574 90332 -116815 -75915 85257 115383 20853 83910
37506 83910 405292 724514 827255 859009 1055845 1358968 1472426 1199365 617358 -8749
37496 -8749 -449970 -697182 -879262 -971258 -791070 -428819 -365621 -809340 -1185547 -828705
37486 -828705 -49738 124852 -658385 -1576933 -1737112 -1233469 -775665 -700434 -762003 -631696
37476 -631696 -242857 211388 407533 199023 -83324 64402 571176 750857 271766 -260904
37466 -260904 -105141 576233 974387 720817 204090 -89345 -63210 130374 276251 115204
37456 115204 -427439 -979828 -1044140 -638798 -283228 -277888 -366473 -249153 -61370 -78242
37446 -78242 -207280 -112441 262519 606253 683126 598631 519826 357406 -30452 -416894
37436 -416894 -344385 191660 535490 180320 -441994 -462071 208845 740195 580004 181766
37426 181766 204139 539568 663230 534918 513934 617044 528216 253800 126886 153843
37416 153843 -33808 -496818 -834757 -850159 -816753 -897941 -824451 -404477 108630 422738
37406 422738 556970 547070 267968 -155804 -240453 185196 635903 691357 607375 746102
37396 746102 873587 635062 326203 452979 783947 635772 -7667 -451004 -360191 -106375
37386 -106375 39279 260171 549473 507987 129271 40732 490852 782946 332425 -303412
37376 -303412 -228387 361467 432790 -322351 -1018047 -789168 193829 1139978 1530915 1329646
37366 1329646 735315 89995 -205747 -2404 431204 682066 560440 165675 -264655
37357 -264655 -537572 -678080 -890014 -1155985 -996188 -20972 1276466 1795071 1121578
37348 1121578 103858 -218304 135716 377383 177735 -39928 33258 99904 -176223 -619814
37338 -619814 -851278 -780662 -510353 -69801 423544 622836 372090 69386 177847 507605
37328 507605 462694 -55839 -531796 -670892 -763068 -979175 -893486 -168387 711554 969180
37318 969180 567307 135421 -14922 -195446 -632805 -1035349 -1058203 -764869 -422576 -194780
37308 -194780 -198774 -483385 -749012 -489029 317603 1022886 1130064 932610 945766 1051001
37298 1051001 743019 34799 -459906 -338011 165959 593367 692813 405556 -160846 -635056
37288 -635056 -613758 -129885 375729 609647 650604 592826 386443 183876 404686 1141861
37278 1141861 1825877 1845399 1288433 712273 360283 26725 -382552 -620527 -520674 -263688
37268 -263688 -39932 244097 662740 914725 636432 -8141 -437722 -427293 -410057 -787613
37258 -787613 -1234072 -1063839 -179887 741116 1047979 765748 359527 168828 238407 428361
37248 428361 463889 82598 -629493 -1191817 -1220846 -842334 -456520 -264869 -208272 -181553
37238 -181553 -92975 113855 297290 195539 -115499 -138090 348812 815003 662789 145277
37228 145277 35647 494139 878848 723797 318810 140407 198172 213457 103797 19766
37218 19766 86655 264755 344384 81480 -474695 -868149 -727830 -281767 -44806 -108458
37208 -108458 -167278 -142020 -229642 -355063 -187158 206592 337222 95723 -39087 161345
37198 161345 258613 -61114 -352925 -59652 640671 1137496 1213622 1092292 925830 723293
37188 723293 627364 816854 1174354 1362487 1221135 922973 791583 1021531 1432161 1510120
37178 1510120 955003 153956 -242860 -182407 -177385 -436957 -631902 -597485 -584478 -634316
37168 -634316 -426370 5263 173233 61146 279553 872082 940724 119669 -559636 -184436
37158 -184436 546220 463324 -177152 -248898 310611 544780 216090 76422 399591 592135
37148 592135 443171 497108 861530 822772 113896 -474650 -299886 214736 436412 484422
37138 484422 692542 801569 406023 -257470 -603420 -466337 -105570 246495 443692 345126
37128 345126 26643 -212329 -298788 -478583 -748493 -684429 -147608 346207 378109 286063
37118 286063 588464 1133257 1356049 1113648 744455 488622 324056 247809 289998 329752
37108 329752 253872 206936 358342 530615 407032 42625 -168951 -26892 266119 434905
37098 434905 420692 299111 122188 -70725 -207640 -233602 -167617 -75130 8266 112032
37088 112032 271323 447027 577952 713416 957424 1244441 1366286 1305827 1290024 1368367
37078 1368367 1263320 888925 655081 873938 1208441 1197804 1002980 1023625 1073174 709329
37068 709329 213065 338539 1059971 1483548 1201458 836354 899450 984276 622861 177217
37058 177217 203583 511713 575189 451930 574139 910379 1042407 932433 984549 1385394
37048 1385394 1904372 2331283 2653499 2798990 2640376 2326180 2254210 2607050 3162019 3633190
37038 3633190 3968089 4192193 4139459 3539438 2399310 1193626 524349 531019 765503 772435
37028 772435 639541 748866 1116818 1322212 1090817 644762 404011 557405 957040 1258199
37018 1258199 1198493 909791 834970 1131287 1372773 1157743 758154 726563 1085681 1436930
37008 1436930 1671386 1937906 2040439 1605465 863404 537251 835337 1215801 1282785 1252370
36998 1252370 1351349 1411910 1318002 1278399 1396813 1465330 1385874 1335251 1388473 1449041 1589119
36987 1589119 1922252 2161062 1935833 1510235 1444470 1595047 1322403 704606 548803 1059993
36977 1059993 1536954 1615542 1728039 2014359 1939447 1474417 1489448 2292683 2845466 2259160
36967 2259160 1189314 877131 1503797 2291620 2652384 2537938 2166879 1971214 2329898
36958 2329898 2980365 3269732 3181176 3287360 3526387 3143290 2181246 1765238 2355092 2990103
36948 2990103 2951974 2898710 3526414 4339652 4681313 4862171 5343825 5847422 6113946 6493193
36938 6493193 7049925 7251243 7194972 7820490 9286717 10657339 11750622 13480504 15797137
36929 15797137 17521950 18967467 22114057 27221112 32247674 36807233 43164447 51835970
36921 51835970 60581895 69954455 84573469 105738908 129581512 158011689 202722646
36914 202722646 266131819 322672563 334935315 292498385 223826110 165231895 128242777
36907 128242777 102960010 81484694 65489596 56096215 49370136 42746212 37538429
36900 37538429 33817067 29105394 23246358 19194425 17820775 16517012 13973958 12067463
36892 12067463 11810236 11359300 9491177 7651087 7051455 6708143 5819046 5401946 6055114
36883 6055114 6437019 5475629 4106681 3474537 3196893 2653573 2341598 2729987 3189463
36874 3189463 3135003 2966851 3007791 2779996 2122933 1749217 1939122 1954953 1477978 1331948
36864 1331948 1994953 2636548 2471782 1943842 1748552 1739620 1595129 1586914 1923576 2226994
36854 2226994 2326913 2667851 3317735 3549890 3083158 2774011 3325909 4179483 4454283 4237941
36844 4237941 4211695 4652769 5434134 6379511 7086808 7073422 6597959 6648692 7658526 8964502
36834 8964502 9968318 10993357 12477740 14181074 15812626 17649088 19862839 21942487
36826 21942487 23398803 24342235 24763551 24017022 21759033 18762425 16078879 13934505
36818 13934505 12056142 10457831 9224958 8093486 6909315 5971358 5340029 4459362
36810 4459362 3132594 2176802 2290957 2884968 2925976 2424226 2126890 2165537 2038656 1691003
36800 1691003 1591307 1791836 1813209 1521610 1352377 1549374 1824089 1903657 1895628 1986659
36790 1986659 2190493 2463840 2730989 2795224 2554030 2264775 2269731 2498990 2554936 2247667
36780 2247667 1767930 1380039 1194022 1186477 1239127 1234092 1269581 1641851 2462299 3493589
36770 3493589 4541909 5742524 7153203 8260504 8287813 7044722 5268796 4018567
36762 4018567 3701434 3697214 3074911 1762039 714129 656025 1053830 921521 336151 282403
36752 282403 1040834 1719753 1658855 1393624 1743635 2671949 3598137 4266189 4780566 5280269
36742 5280269 6036881 7350926 8860955 9468967 8496739 6511504 4572859 3147677 2203582
36733 2203582 1759430 1701155 1536979 1002530 528615 525993 654623 458046 276634 746054
36723 746054 1677652 2209322 1926333 1201198 570559 326132 526126 878744 828485 248337
36713 248337 -230560 -52318 480231 784176 891467 1103366 1224067 944824 600186 663719
36703 663719 811448 424474 -222946 -277314 316783 739546 562092 154153 -153250 -367338
36693 -367338 -291805 328013 1043333 1076291 576441 484761 974299 1129935 509818 -80351
36683 -80351 123617 783275 1260655 1540628 1708100 1422371 690515 344650 870776 1462266
36673 1462266 1176551 423325 270271 750818 997347 775934 704567 977910 1014374 579201
36663 579201 263530 479997 805958 773093 629297 807446 1175163 1347300 1328149 1302392
36653 1302392 1124162 610448 131830 265462 880902 1174360 744270 103058 -127485
36644 -127485 -55832 -157898 -425829 -425265 -95926 46616 -377653 -1104925 -1613265 -1702946
36634 -1702946 -1480035 -1037329 -455357 14028 62909 -348633 -904340 -1155880 -828148 -58091
36624 -58091 606066 643069 123293 -333458 -266717 166041 538037 668240 603935 396758
36614 396758 168785 146095 350201 514231 571613 867602 1487525 1762466 1048938 -234524
36604 -234524 -1026733 -989110 -760692 -821245 -825099 -316383 484258 988154 972584 686579
36594 686579 459302 433481 525937 534609 418737 431800 742759 1051775 972685 692594 735611
36583 735611 1106734 1285389 1141615 1181625 1681529 2277262 2750778 3527040 4919888 6577014
36573 6577014 8319998 10840933 14535491 17979221 18779469 16206265 12136632 9018776
36565 9018776 7550014 6775435 5825135 4779424 4029451 3572295 3185908 2851014 2652618
36556 2652618 2468884 2086356 1563353 1191826 1082071 1050841 983469 1014318 1187346 1218459
36546 1218459 871180 382011 205339 435433 746884 816981 571610 146189 -142007 42106
36536 42106 613939 1002725 872513 643220 834502 1206789 1205253 984456 1134448 1519858
36526 1519858 1414541 870215 823452 1503291 1887746 1361294 805533 1129433 1669003 1234767
36516 1234767 93142 -403661 182790 1029271 1558476 2019216 2489136 2550389 2304631
36507 2304631 2626629 3891825 5323047 6160473 6752141 7910382 9833614 12283144 15221480
36498 15221480 18460990 20999026 21533568 19713757 16460641 13105704 10536291 8973022
36490 8973022 8048610 7065173 5574886 3852888 2626705 2314805 2655761 3029701 3000695
36481 3000695 2600213 2192361 2008678 1817598 1258945 511482 236107 666978 1185221
36472 1185221 1163382 854168 913077 1311105 1397884 984710 652379 810180 1074692 918913
36462 918913 448127 109859 1881 -48448 36978 486111 1120203 1405030 1148596 752595
36452 752595 621914 650241 497601 136420 -125519 -51717 275717 549961 486571 86950
36442 86950 -274198 -194527 236747 509249 431870 468316 996828 1548652 1351723 528162
36432 528162 99308 661850 1645245 2164378 2090452 1874827 1747479 1614485 1475121 1400037
36422 1400037 1242595 863025 526359 585256 850360 800280 392158 113984 186740 278201
36412 278201 129780 -94077 -257753 -467016 -567103 -55491 1064607 1899267 1710922
36403 1710922 924126 449861 368362 62514 -532052 -715995 -196010 337591 183099 -395057
36393 -395057 -630184 -332515 -15400 -98344 -419542 -581976 -497741 -418659 -478496 -372482
36383 -372482 301757 1354082 1960837 1593673 760196 401291 692521 981669 901366 888794
36373 888794 1357666 1938769 1986445 1461639 864202 553925 561624 852174 1320593 1645504
36363 1645504 1568701 1293025 1288857 1753791 2519218 3365089 4107633 4473355 4235311 3471887
36353 3471887 2473440 1491270 771692 582872 848400 984436 561914 -32769 -97710 356167
36343 356167 642089 402725 -22923 -255855 -292916 -191908 44655 145165 -250846 -917100
36333 -917100 -1171560 -873875 -609051 -631532 -416433 309725 883428 676606 86942 -155185
36323 -155185 -92383 -180719 -341286 -234383 -66007 -200860 -298533 180917 844175 799367
36313 799367 124462 -214257 29453 13347 -675198 -1250617 -995200 -355058 -139306 -370582
36303 -370582 -573668 -585213 -443759 -18904 611466 877743 432353 -253506 -573525 -635898
36293 -635898 -827579 -986391 -746101 -355760 -339193 -542730 -351790 209591 415935 -21668
36283 -21668 -480806 -327899 263153 659744 534140 47094 -433630 -615116 -473716 -245662
36273 -245662 -95329 103495 443511 656491 485110 188500 186250 326977 84882 -545020
36263 -545020 -958607 -830840 -507822 -363828 -335108 -310738 -441673 -758385 -948859 -847856
36253 -847856 -747009 -896937 -1078477 -1002460 -780498 -648309 -555024 -396289 -334559 -477889
36243 -477889 -528978 -211658 180303 151115 -221333 -364371 -11866 511543 793433 715062
36233 715062 323847 -256521 -694351 -600002 7905 622839 795918 602006 452185 585152
36223 585152 858144 954753 711454 273141 -39526 -29192 220866 473888 543240 373593
36213 373593 69123 -112045 34845 370633 501160 255427 -109585 -276897 -210168 -8218
36203 -8218 289659 563870 586404 378853 287431 424880 409708 31165 -258555 -71852
36193 -71852 91773 -482148 -1456159 -1740807 -1060047 -299556 -89488 44684 654993 1283658
36183 1283658 1105133 185915 -599562 -699424 -367858 -126488 -198950 -464504 -671092 -686998
36173 -686998 -646326 -729096 -807415 -638910 -435680 -720043 -1425072 -1730333 -1166781 -335149
36163 -335149 -43995 -244457 -388653 -356038 -331015 -170384 312287 715594 527259 47743
36153 47743 13189 424287 602660 341258 95541 24657 -193222 -466283 -210080 561237
36143 561237 1022450 779759 388139 213116 -189123 -930509 -1093069 -130859 887921
36134 887921 625671 -486247 -817480 89226 958142 675473 -329969 -911931 -604879
36125 -604879 187138 849571 1061441 961412 977752 1276448 1464118 1167522 687144 544185
36115 544185 580577 221054 -442401 -645225 -147018 372157 388849 261010 462944 750514
36105 750514 630508 181975 -159041 -312069 -515651 -782135 -876896 -769322 -733145 -983947
36095 -983947 -1405926 -1625603 -1334452 -680842 -276501 -496381 -836740 -468274 549742
36086 549742 1260238 1190927 979177 1194496 1326125 680431 -322857 -686812 -327368 -60466
36076 -60466 -240607 -381565 -188160 -33388 -160822 -228012 -7656 149518 -29805 -228780
36066 -228780 -143077 -51508 -265902 -500473 -393309 -241469 -500947 -841954 -538310 257518
36056 257518 489029 -342036 -1433700 -1799291 -1509873 -1269403 -1213412 -873697 -187466 226676
36046 226676 -18802 -485337 -576087 -378923 -382876 -600280 -526938 15933 520281 502858
36036 502858 192985 126368 261530 -8124 -905894 -1777541 -1832401 -1129003 -462947 -370664
36026 -370664 -635523 -821132 -866050 -899317 -808993 -423904 17677 48405 -340190 -599533
36016 -599533 -355075 106886 278655 68032 -233647 -377291 -307606 -105150 -20853 -340503
36006 -340503 -933618 -1177457 -689469 68925 334306 14219 -368053 -577946 -913152 -1488022
35996 -1488022 -1879468 -1729101 -1236870 -784956 -458449 -215988 -166180 -332713 -435392 -261425
35986 -261425 -28682 -24742 -77105 213225 794786 1119965 828608 191065 -233968 -204626
35976 -204626 48855 175050 76707 -104161 -290763 -560115 -833443 -727023 -31888 783078
35966 783078 967712 415692 -206996 -340115 -120035 58928 146668 331589 659087 1027881
35956 1027881 1313422 1297806 782570 -18541 -534585 -517041 -308020 -198158 22422 511876
35946 511876 863760 691391 358096 492981 999938 1191023 814127 345698 252383 484429
35936 484429 766123 956157 1032497 1030598 1017559 907813 460057 -240043 -557547 -59318
35926 -59318 710505 808871 165734 -366120 -257873 80382 128837 71772 384506 1008839
35916 1008839 1378775 1128106 482387 -34257 -156059 -107623 -238287 -475310 -416634 -46620
35906 -46620 86256 -287934 -619302 -353241 151321 207577 -57007 -576 317054 211958
35896 211958 -348780 -589327 -239385 -3368 -335504 -664438 -382902 157943 281761 29795
35886 29795 -78098 78881 158977 -84111 -580791 -1048917 -1100932 -600081 -47149 -113626
35876 -113626 -657241 -852963 -489693 -316814 -748456 -1136089 -906399 -525508 -554080 -569847
35866 -569847 -1265 641703 472756 -305013 -755303 -701269 -737421 -966163 -890823 -538601
35856 -538601 -562888 -1084036 -1419886 -1165028 -644317 -117865 546386 1163019 1134288 472022
35846 472022 74074 461087 932496 557885 -523576 -1369307 -1430930 -986563 -620128 -654517
35836 -654517 -949921 -1060363 -761599 -444158 -640920 -1179456 -1319670 -812767 -236408 -99608
35826 -99608 -219526 -247310 -207993 -175568 14137 322070 303434 -220603 -767343 -888014
35816 -888014 -762927 -664991 -391496 196609 597901 339997 -176328 -242980 66274 151637
35806 151637 -12936 113336 621696 985240 959925 888475 977681 983802 804695 720144 804094
35795 804094 721177 390168 247330 495857 653919 282940 -318950 -631224 -696287 -851644
35785 -851644 -1019087 -872663 -519820 -405639 -601160 -734627 -630086 -499852 -452985 -320413
35775 -320413 -93601 -52105 -248653 -308652 -19262 269690 167125 -176218 -400631 -556707
35765 -556707 -893015 -1214930 -1046772 -431146 12097 -24124 -112055 167215 523407 420129
35755 420129 -83618 -442220 -404117 -200002 -24347 162572 258101 -46134 -709893 -1120532
35745 -1120532 -779680 3551 450182 225320 -309581 -695691 -866996 -970549 -1021666 -952910
35735 -952910 -832404 -805867 -881760 -942194 -921296 -817829 -585209 -204107 162360 319462
35725 319462 357321 533448 774097 658416 108459 -292117 -60768 412567 387659 -134600
35715 -134600 -492614 -473707 -583616 -1052035 -1352571 -1106623 -761330 -800486 -889382 -537233
35705 -537233 -137054 -447984 -1271040 -1578383 -981220 -219772 -36501 -335090 -710669 -1082646
35695 -1082646 -1407246 -1377161 -893558 -385297 -198788 -59007 395617 892497 873055 334457
35685 334457 -205169 -460675 -600241 -748202 -741319 -472910 -131515 30071 -62320 -362702
35675 -362702 -792276 -1180606 -1294853 -1051003 -625858 -296965 -211120 -318514 -461758 -482235
35665 -482235 -278164 145461 602183 747764 363355 -311532 -720516 -609866 -306336 -188094
35655 -188094 -163536 -25356 -20883 -488496 -1083346 -1086499 -524249 -213560 -486065 -669252
35645 -669252 -253589 204471 1200 -530047 -580529 -183026 -64149 -408323 -689964 -696963
35635 -696963 -818064 -1169138 -1268354 -880395 -463640 -381601 -295543 162058 626128 520861
35625 520861 14191 -201437 35533 137084 -315326 -940580 -1090422 -689711 -243336 -150774
35615 -150774 -306133 -382182 -270182 -109830 -15727 43524 108658 128354 45646 -110288 -260708
35604 -260708 -330754 -259739 -71200 52027 -87661 -418459 -587606 -315310 320131 974061
35594 974061 1311910 1217806 881515 640604 553183 240030 -529772 -1222714 -1042477 -88281
35584 -88281 608300 432001 -48745 -37756 367991 559500 413841 247307 135585 -16797
35574 -16797 21462 526243 1180109 1372016 1026126 531654 21455 -597036 -1053721 -945295
35564 -945295 -496305 -303095 -341112 -62119 503283 675214 300315 28720 142813 96297
35554 96297 -356405 -552285 -53092 486063 323407 -214099 -364495 -113207 55038 58371
35544 58371 59066 -124806 -598117 -790859 -192930 624614 673547 38992 -261893 156318
35534 156318 596239 487598 145104 60959 177328 178486 -41883 -445392 -916085 -1123851
35524 -1123851 -800135 -249861 -79550 -325494 -405436 -55168 282530 200030 -117489 -329905
35514 -329905 -419238 -466686 -437629 -437376 -688487 -1008674 -859890 -228346 126606 -272372 -868161
35503 -868161 -900921 -500255 -308090 -393844 -276979 171599 573732 729163 785319 696134
35493 696134 176205 -632559 -1042522 -682678 -47433 152805 -150292 -538001 -829430 -1164143
35483 -1164143 -1460609 -1331014 -714632 -195942 -341512 -918255 -1167171 -805793 -333497
35474 -333497 -245276 -389880 -391448 -310473 -418541 -577754 -431520 -129421 -233552 -808228
35464 -808228 -1204057 -991717 -580315 -549318 -793500 -766439 -291586 279450 531325 285927
35454 285927 -351979 -939875 -920648 -243990 447525 586901 382520 363793 525503 462392
35444 462392 146941 -60633 -108583 -309533 -649803 -681188 -273089 106924 105547 -53374
35434 -53374 -107187 -235566 -610433 -920481 -831721 -573391 -535714 -559077 -232830 249480
35424 249480 220910 -407060 -868996 -585697 41930 276130 98270 106781 528728 879554
35414 879554 688199 136582 -234324 -177245 138951 456836 608246 493357 186446 16347
35404 16347 228140 550445 448561 -78082 -323272 226827 1109720 1395438 842183 125827
35394 125827 -75643 180273 391317 284219 -29471 -337970 -498990 -417210 -81934 354075
35384 354075 644473 625929 327511 -28714 -138960 130720 539538 647199 288434 -233063
35374 -233063 -512121 -472209 -301571 -110709 110428 258579 145676 -141600 -172993 293402
35364 293402 846219 812244 152992 -351610 -35425 771810 1154944 819507 436526 658678
35354 658678 1225293 1377962 873360 156475 -320565 -489476 -407244 -90906 254218 239884
35344 239884 -239480 -810812 -1095409 -1148476 -1228556 -1355969 -1348014 -1128372 -761100 -318070
35334 -318070 44361 22669 -500035 -1108988 -1181221 -626078 -46839 -42148 -531832 -922877
35324 -922877 -816358 -368909 10981 141759 159396 231338 333747 342019 229676 94861
35314 94861 51921 165205 413220 639416 644608 438251 258902 191533 -31071 -560000
35304 -560000 -969311 -727790 -50031 295456 103938 21921 439753 739622 194515 -845537
35294 -845537 -1355065 -999414 -428342 -272076 -476690 -692307 -740394 -535512 -45384 438599
35284 438599 401371 -253540 -964989 -1162009 -890525 -564743 -362592 -183532 -39234 -119988
35274 -119988 -442600 -680065 -484934 69358 484007 362549 -87963 -269925 15633 253403
35264 253403 -69868 -674589 -816755 -281074 419923 799599 825644 543139 -118880 -903811
35254 -903811 -1149524 -595606 110738 171046 -377142 -860512 -902452 -669856 -368680 -28209
35244 -28209 249014 299196 202297 196308 267092 185854 -41372 -154583 -96341 -67783 -70558
35233 -70558 134872 474785 483449 61373 -181746 217443 773671 674931 -33783 -522815
35223 -522815 -359027 41498 232199 348872 606069 749342 488892 94954 26102 211345
35213 211345 254021 176042 324220 575629 345347 -433281 -994310 -755680 -105197 256360
35203 256360 263866 242947 143195 -296723 -859620 -1040988 -837301 -664489 -537198 -74837
35193 -74837 601304 784111 277616 -160033 91357 614265 695084 432184 426639 718494
35183 718494 766601 365142 -81539 -226630 -179819 -134027 -26398 264872 663112 954218
35173 954218 942190 545999 -73494 -525634 -539977 -273257 -91291 -124202 -224343 -246697
35163 -246697 -144714 92998 357852 395312 116007 -194196 -218677 2556 275816 577669
35153 577669 823653 632728 -138395 -854555 -744261 15045 517633 392923 118320 29019
35143 29019 -151839 -555985 -765717 -585470 -479896 -714429 -745981 -138634 514986 412926
35133 412926 -148494 -204486 383919 829735 767854 721701 1035080 1252296 969204 535452
35123 535452 364895 168983 -463141 -1184376 -1350432 -1098490 -1157065 -1628738 -1783144 -1253837
35113 -1253837 -677919 -708374 -1002548 -821384 -229216 67287 -69986 24638 699017 1364217
35103 1364217 1386856 1021447 896418 962723 640375 -111698 -560073 -191294 554380 820739
35093 820739 319975 -471965 -933091 -884766 -622358 -508483 -574204 -530975 -170041 359114
35083 359114 728021 732387 320889 -433491 -1173117 -1336983 -769815 -60871 139529 -24751
35073 -24751 68735 500255 736506 568411 415078 524852 554752 248721 -89214 -192582
35063 -192582 -325781 -691180 -855868 -370421 411381 757215 557336 310925 291272 311360
35053 311360 232187 158612 139248 119038 168101 364752 520037 419510 245495 325266 550232
35042 550232 515779 169252 -181629 -453733 -818323 -1126516 -917735 -174620 459323 457701
35032 457701 -4669 -436608 -589650 -440520 -44519 331805 299964 -147724 -516381 -412756
35022 -412756 20715 447137 737766 816654 529630 -6083 -316655 -226371 -223139 -695090
35012 -695090 -1146866 -803234 185513 826125 594411 38309 -92180 242252 619761 853012
35002 853012 997335 932354 425805 -402844 -1042579 -1102540 -656348 -35472 498631 786507
34992 786507 708910 319608 -60369 -118690 85037 233114 222686 262862 426160 421392 56006
34981 56006 -326050 -236900 230884 461050 107398 -524665 -964756 -1099607 -1050933 -838658
34971 -838658 -423697 78989 455955 587290 463381 134570 -236474 -415623 -340403 -218765
34961 -218765 -271066 -489368 -744003 -961137 -1062986 -913230 -510953 -103380 75729 53573
34951 53573 -58168 -303833 -703558 -997709 -907199 -590349 -500784 -762563 -995734 -851461
34941 -851461 -447450 -127489 -12789 1766 -63221 -341073 -841223 -1241749 -1091975 -282140
34931 -282140 720620 1222483 954499 289531 -244061 -498560 -607346 -558369 -216774 275093
34921 275093 521162 413223 305710 450642 570641 296231 -210050 -449629 -280851 -6938
34911 -6938 187782 437261 739954 760060 334083 -177141 -362654 -309647 -316884 -312383 -32645
34900 -32645 362158 412845 114172 -26310 173999 253551 -70966 -306708 95419 820532
34890 820532 1090702 750123 303089 -34098 -603546 -1485362 -2053589 -1727436 -770333 40475
34880 40475 304353 235923 190398 277594 406434 483828 531810 660721 884605 998174 814174
34869 814174 512496 477059 713101 748557 299637 -263251 -392247 -82370 212914 258948
34859 258948 286809 561516 975266 1159274 874504 243146 -354589 -607593 -492549 -132488
34849 -132488 441848 1164142 1649924 1450329 700448 113297 108833 330322 303029 143122
34839 143122 175190 236201 -27618 -406404 -360387 57735 213409 -92727 -293946 28456
34829 28456 513022 658093 587288 718137 1022074 1108667 860026 545066 383594 341350
34819 341350 311316 224142 23287 -245784 -388571 -305426 -184748 -241038 -379866 -372301 -245983
34808 -245983 -208399 -270667 -283647 -297260 -493126 -732958 -613919 -141592 74332 -369141
34798 -369141 -961265 -828881 108434 982478 1046316 517271 143889 221886 393075 328778
34788 328778 204860 320550 515510 317887 -340802 -886739 -758240 -100040 441953 510464
34778 510464 318525 152186 -39951 -378794 -676655 -653900 -387780 -194495 -112693 109960
34768 109960 442705 389226 -352432 -1317425 -1721674 -1379531 -830365 -555098 -425339 -88742
34758 -88742 379389 526906 172436 -296142 -404821 -199576 -140261 -427656 -717301 -637676
34748 -637676 -342174 -248647 -369976 -303560 106696 533863 734211 904128 1178274 1186885
34738 1186885 592694 -188894 -369497 174989 753017 769873 332780 -133439 -436186 -618618
34728 -618618 -759429 -936317 -1136289 -1133725 -749956 -257243 -142367 -410703 -566161 -388213
34718 -388213 -223316 -304884 -325411 -23123 295390 251491 19768 15158 303305 754759
34708 754759 1401837 2118746 2316222 1618249 619468 285687 706380 1091589 944347 560833
34698 560833 340349 276449 275753 369810 399495 25602 -701411 -1238222 -1243773 -965972 -744358
34687 -744358 -570465 -372191 -290987 -380200 -408158 -260572 -191431 -375503 -552439 -448904
34677 -448904 -252465 -309585 -596466 -834561 -924956 -937035 -843407 -585648 -269064 -30853
34667 -30853 134789 200847 -15338 -516009 -890322 -764634 -323867 -46521 -64474 -133206
34657 -133206 -108728 -72928 -58793 -30629 -105767 -411946 -695758 -455442 394086 1262440
34647 1262440 1471671 972865 357820 211465 500182 612282 74541 -793034 -1159988
34638 -1159988 -705732 -54846 33176 -399340 -748959 -768423 -727850 -765882 -655092 -308019
34628 -308019 -24461 -31662 -146760 -102029 102063 361687 687795 1030045 1142886 893385
34618 893385 519670 338906 348135 343892 292621 316767 392255 322673 22156 -355850 -583195
34607 -583195 -530304 -206270 240956 579020 656655 504712 212301 -205019 -689275 -998717
34597 -998717 -903570 -512218 -183186 -63203 73451 413845 745093 731467 444037 324403
34587 324403 579583 866205 721538 129755 -526405 -939125 -1063844 -933841 -608516 -327132
34577 -327132 -383149 -716155 -914819 -790440 -642281 -706950 -677427 -191788 437206 548032
34567 548032 142869 -26973 454568 1047192 1042662 542086 208546 323951 569846 610489
34557 610489 419331 34073 -567139 -1212656 -1492203 -1169584 -474613 143975 423920 371237
34547 371237 105846 -234343 -518022 -661045 -636505 -460061 -242548 -203320 -454449 -764602
34537 -764602 -736131 -276302 286347 611445 668169 579214 408478 260838 327018 579541
34527 579541 640968 256472 -272700 -461987 -301081 -143244 -53996 220129 617546 664208
34517 664208 213882 -219008 -191576 18504 -111529 -564562 -912288 -953782 -759022 -329516
34507 -329516 228414 388327 -253723 -1152196 -1257661 -441229 228433 -72804 -877125 -1269232
34497 -1269232 -1154240 -1024882 -930377 -517651 74008 216878 -194577 -454563 -44926 621754
34487 621754 800203 360569 -196908 -378136 -37708 653927 1260617 1299274 738259 145466
34477 145466 54385 319569 403743 169116 1729 178164 491254 592580 404891 62985
34467 62985 -321721 -674017 -871247 -799225 -479195 -124740 -68400 -471306 -972074 -862889
34457 -862889 45545 912038 721094 -380420 -1188639 -996579 -380382 -120031 -39364 441602
34447 441602 1121421 1244088 714102 243282 253852 382202 235445 -17008 -64365 69880
34437 69880 238147 398761 412891 76365 -416770 -527373 -150266 156149 17728 -201493
34427 -201493 -63010 253700 369419 313617 216128 -100507 -632428 -795256 -219910 475835
34417 475835 487112 22234 -146614 8502 -87588 -384394 -256940 217642 212747 -397138
34407 -397138 -670821 -89688 630750 749919 557273 569851 565764 213672 -80041 155613
34397 155613 510489 331399 -138000 -184576 122256 51858 -560477 -1090415 -1106446 -794457
34387 -794457 -380776 132362 567556 589621 286729 165397 403799 616224 510082 284493
34377 284493 184277 103494 -122415 -371749 -432966 -331067 -281406 -444650 -784200 -1055772
34367 -1055772 -993571 -652482 -427089 -530705 -661599 -463014 -56567 261461 566838 1024382
34357 1024382 1304298 958764 283200 72613 475432 814589 696230 552099 764450
34348 764450 936019 528948 -250758 -744203 -732211 -566879 -561382 -627400 -483094 -4837
34338 -4837 609510 979851 948561 793702 819527 837165 423077 -361909 -978445 -1148161
34328 -1148161 -1076236 -886593 -449088 54363 53363 -559060 -1061611 -833931 -192767 142500
34318 142500 -1627 -303665 -551707 -681772 -542951 -168708 -28449 -463465 -1054794 -1076435
34308 -1076435 -453277 213318 470163 400647 270415 239600 409325 764920 1062565 1059136
34298 1059136 808352 505585 204654 -46714 -43538 221501 274689 -299557 -1194664 -1727644
34288 -1727644 -1719407 -1550971 -1459713 -1305114 -987723 -593602 -133720 391890 716491 599110
34278 599110 349606 499838 958063 1106675 798831 586567 783605 980851 810118 571006
34268 571006 652865 817794 571758 -48955 -514261 -448770 72033 696713 1029278 892362
34258 892362 556155 466286 601589 454702 -154160 -682289 -611310 -177884 64323 55258
34248 55258 102552 229223 220998 178865 449067 1000690 1353745 1195680 703440 210811
34238 210811 -113139 -218921 -127571 2410 -6017 -129198 -219900 -245304 -242036 -148528 45554
34227 45554 101531 -186378 -602534 -762734 -683942 -705531 -878849 -869438 -507253 -30818 280808
34216 280808 348970 139338 -319152 -712066 -690007 -422123 -417784 -697510 -703478 -223425 213184
34205 213184 183225 3744 70689 142494 -132916 -477719 -475803 -418545 -855393 -1522805 -1566401
34194 -1566401 -796411 53096 363135 197171 -236147 -891400 -1451276 -1375102 -747571 -373408
34184 -373408 -586459 -657453 22789 812290 685970 -176495 -595624 -62817 684100 870858
34174 870858 671657 649388 840420 902667 810718 863094 1097887 1140900 711321 8173
34164 8173 -527810 -685250 -591110 -436092 -254609 -12349 216110 288878 191927 76066
34154 76066 79265 193353 313709 338303 219226 2147 -199095 -343867 -508514 -672715
34144 -672715 -600005 -162049 343010 520702 440511 464865 580244 428358 48681 -43703
34134 -43703 260795 365955 -54526 -404709 -53115 654232 947025 783781 692334 760547
34124 760547 624755 318902 280307 503747 497794 177774 28468 217587 317212 165456
34114 165456 251200 839051 1358055 1163473 441270 -110953 -147441 162947 502056 597692
34104 597692 380698 220046 613232 1364008 1539737 639926 -638694 -1275106 -1167924
34095 -1167924 -973287 -1028489 -1058999 -810137 -404192 -79373 27856 -115546 -339312 -294240
34085 -294240 106258 447493 380792 216501 467406 938984 864682 19063 -834277 -852282
34075 -852282 -112255 603487 815632 769474 826672 805360 287481 -537556 -898880 -549954
34065 -549954 -271752 -709482 -1215772 -757468 322272 629977 -149726 -758062 -388361
34056 -388361 121975 -117668 -511217 -130616 598640 683107 285827 256127 481302 203541
34046 203541 -354830 -239496 476544 737210 376841 384660 1021084 1231480 493823 -167644
34036 -167644 223023 1161416 1615628 1391907 791850 -100195 -963877 -1010711 -114267 626833
34026 626833 340084 -369401 -493133 -124904 114787 349174 921771 1256079 606137 -466524
34016 -466524 -752161 -285711 -168871 -587448 -516928 362358 933015 427835 -276922 -9989
34006 -9989 931738 1324152 813280 256667 419416 1045447 1331529 925833 283299 112001
33996 112001 523377 843634 408962 -593517 -1351053 -1372897 -864679 -260670 169937 267747
33986 267747 24271 -215234 -3643 614800 1091967 1042046 601958 91032 -318920 -532301
33976 -532301 -508227 -411561 -465921 -605344 -588656 -440977 -392808 -412282 -269440 -70431 -193919
33965 -193919 -617768 -849694 -654724 -323552 -90317 145306 355736 272692 -23252 -44381
33955 -44381 255602 235835 -402709 -981190 -777278 -35934 553789 880604 1220424 1450484
33945 1450484 1242467 798505 637295 765360 745478 503356 374480 355341 14964 -689657
33935 -689657 -1116272 -751295 67787 531752 264379 -333644 -558366 -156511 392364 449197
33925 449197 43261 -188071 49993 307869 183080 -59154 -104739 -249135 -775814 -1177280
33915 -1177280 -829161 -80754 245315 175328 372026 733741 380898 -804997 -1750380
33906 -1750380 -1662841 -974975 -419929 -96708 67493 -153507 -668492 -788506 -244403 227363
33896 227363 2228 -438198 -397404 -156551 -350098 -719162 -543817 31251 162733 -359213
33886 -359213 -915600 -1120673 -1154450 -1036251 -481343 378108 930865 946174 828658 857883
33876 857883 810184 494517 62459 -361515 -784297 -980998 -648353 -31793 255926 171770
33866 171770 287586 726888 862090 399431 -47426 31586 189320 -188403 -839435 -1084982
33856 -1084982 -886732 -723775 -741811 -737037 -750597 -960037 -1103999 -718214 51033 492379
33846 492379 271903 -191191 -384050 -254250 10907 286551 393132 84642 -571968 -1091170
33836 -1091170 -1114146 -856364 -755574 -843867 -783172 -468596 -255159 -456702 -861254 -989029
33826 -989029 -729266 -430436 -338914 -268480 6140 312278 323738 52289 -222266 -368780
33816 -368780 -418462 -310294 -22623 162661 -10020 -267379 -163780 129129 40324 -366700
33806 -366700 -344548 336662 912584 744023 211602 -4390 110872 252490 502617 971292
33796 971292 1214606 805919 148117 -70797 34926 -189737 -795271 -1199587 -1222296 -1277804
33786 -1277804 -1477787 -1378170 -830337 -358796 -382284 -615548 -541782 -54440 578545 1003849
33776 1003849 914675 316554 -237923 -137788 446124 680819 167312 -564238 -821799 -528901
33766 -528901 -26527 425031 669137 583631 292356 151217 301617 512128 600443 669745
33756 669745 780907 768420 566881 366810 278498 202966 175532 401674 756669 723227
33746 723227 128347 -473286 -502865 -110400 120388 -55553 -392197 -551882 -379002 46754
33736 46754 432717 522228 407872 348932 284756 -44266 -464220 -447825 -1369 183105
33726 183105 -206036 -541321 -259534 175094 -35424 -805284 -1346458 -1291374 -968174 -733760
33716 -733760 -646386 -689638 -774655 -612966 -79912 411014 381625 3360 -170273 -54731
33706 -54731 -56463 -314978 -509364 -445954 -294471 -161802 64348 326246 317054 -29229 -347658
33695 -347658 -340520 -182840 -250085 -629441 -1025318 -1047205 -586481 -872 181053 -133088
33685 -133088 -482233 -514952 -456601 -599927 -704079 -432660 -97860 -266123 -740699 -714663
33675 -714663 -19294 549713 429324 127413 409976 1152834 1551114 1210207 532014 104941
33665 104941 93184 245284 250807 10633 -346104 -644589 -810490 -809608 -587132 -231598 -61967
33654 -61967 -285243 -647090 -721929 -495335 -318608 -318933 -274996 -144085 -254321 -737016 -1126405
33643 -1126405 -874899 -109830 437401 263804 -331815 -603391 -251328 178421 -34858
33634 -34858 -790260 -1220680 -874882 -375100 -507543 -1062329 -1168093 -545592 227958 616258
33624 616258 642150 513448 349289 323203 496532 492965 -36903 -643421 -540190 97778
33614 97778 208239 -537899 -1160132 -883403 -286022 -234569 -496698 -305648 304552 681369
33604 681369 647378 487357 181886 -391966 -740126 -247805 680523 967917 399616 -142035
33594 -142035 -107975 27998 -199887 -475823 -440364 -376869 -550434 -553214 -28460 491282
33584 491282 282870 -369162 -517175 38258 504667 329012 -98059 -238939 -250490 -551774
33574 -551774 -994437 -1067857 -767059 -659879 -1010273 -1339793 -1121572 -531649 -121691 7944
33564 7944 200446 473857 347644 -356441 -1037176 -1036431 -525122 -224006 -433212 -804044
33554 -804044 -980377 -980623 -916690 -783382 -645972 -667993 -811331 -813522 -567871 -212133 231358
33543 231358 883156 1512848 1510974 720928 -98013 -131773 413576 632211 184042 -342259
33533 -342259 -372196 -83189 34723 -96560 -229359 -316438 -506557 -696136 -519611 87320
33523 87320 632249 629967 259269 139035 459157 689653 344263 -269446 -450581 -121370
33513 -121370 54060 -340178 -848816 -811317 -278453 154287 190517 39268 -98922 -246211
33503 -246211 -339901 -202150 57904 42105 -347785 -693260 -651420 -419022 -351422 -453158
33493 -453158 -560727 -716458 -961349 -1011450 -621777 -124304 -81795 -433473 -512875 -16530
33483 -16530 540859 567671 182576 -70093 -14486 34342 -166758 -468565 -630031 -684875
33473 -684875 -832945 -1041910 -963921 -397743 248959 251175 -540990 -1369810 -1420475 -800506
33463 -800506 -267782 -120242 83668 636176 1116997 1030921 549215 202348 153620 215043
33453 215043 352614 691210 1104392 1244882 1019717 717441 623364 739407 874323 804168
33443 804168 409167 -113743 -274230 165866 728662 662466 -113387 -828227 -715184 206445
33433 206445 1271362 1839956 1750561 1337867 1104354 1207663 1256415 824614 130128 -152744
33423 -152744 177425 518323 284179 -300545 -568247 -319895 41223 177506 184605 226607
33413 226607 168305 -205938 -783293 -1166734 -1107882 -745065 -387323 -187694 -115359 -152369
33403 -152369 -329382 -537106 -501408 -108546 352429 466675 175795 -194206 -354030 -283178
33393 -283178 -36978 398272 918614 1200644 1028177 616203 365388 323235 150577 -301727
33383 -301727 -646213 -434736 148898 418544 75866 -363628 -277031 193091 364858 1964
33373 1964 -397541 -354191 6449 293080 345694 132719 -428319 -1160039 -1482218 -1056510
33363 -1056510 -336510 4881 -23416 50416 235818 75431 -443833 -716011 -450530 -121527
33353 -121527 -166260 -324793 -211984 -47578 -257578 -678400 -764741 -445719 -199802 -277772
33343 -277772 -379185 -251051 -162434 -457110 -874492 -738032 117400 931052 829591 -40297
33333 -40297 -585777 -118562 752712 949443 348263 -192878 -131469 138167 134608 68976
33323 68976 306913 552466 212949 -632563 -1246048 -1202345 -828650 -571853 -387064 -16561
33313 -16561 424789 514921 138135 -268734 -245450 62847 81077 -351385 -639265 -213683
33303 -213683 590644 913146 549438 179787 287180 468396 215407 -149260 45363 682943
33293 682943 925384 408282 -273207 -441112 -149470 166503 383717 576011 510492 -136318
33283 -136318 -1059593 -1394876 -782466 32630 86850 -543172 -895156 -488953 79991 132708
33273 132708 -106602 -7528 418067 629376 505826 465930 651944 694422 437816 271312
33263 271312 476735 769490 774943 518407 196216 -82952 -100384 387826 1062865 1130274
33253 1130274 424344 -156977 131301 787704 875122 437060 255700 511450 620200 319951
33243 319951 22674 -7765 -47451 -313705 -643850 -939980 -1307454 -1586658 -1391384 -829293
33233 -829293 -538318 -721874 -785049 -303477 252079 244352 -176587 -385985 -172404 211046
33223 211046 569093 812933 744780 328514 -10275 131978 497212 503091 81250 -344676
33213 -344676 -600849 -879332 -1124006 -946136 -312106 249243 367914 276959 272488 214241
33203 214241 -66681 -288514 -131213 155539 69969 -363288 -613251 -389205 49259 308742
33193 308742 219943 -183783 -662995 -781830 -338586 227967 316694 34876 30120 396446
33183 396446 449021 -147944 -760047 -782443 -605382 -890748 -1400061 -1395748 -909480 -691891
33173 -691891 -970235 -1140830 -813466 -376884 -292266 -479970 -670631 -799022 -789181 -460409
33163 -460409 95323 486846 558367 500114 333333 -129471 -674657 -727538 -255598 66719
33153 66719 -85351 -193531 143982 522104 506426 348972 342133 232543 -40847 130357
33143 130357 877914 1086033 -58025 -1442736 -1379756 -127086 505193 -80910 -567374
33134 -567374 2195 861860 1035893 816426 884446 1041229 744312 113138 -445008 -942229
33124 -942229 -1372592 -1235618 -330215 564058 678378 419868 622618 1086012 925238 127819
33114 127819 -365472 -137178 209682 227514 318160 842161 1340745 1217160 647960 235902
33104 235902 110272 -68631 -393416 -509381 -142550 490991 865868 623858 -62581 -522915
33094 -522915 -165026 830379 1597021 1568445 1133618 992354 1108325 840573 55956 -542722
33084 -542722 -424990 13295 132189 13066 142833 450347 405842 -872 -171038 79366
33074 79366 177649 -190910 -447205 -40827 572775 571233 -10369 -441938 -449932 -425648 -557801
33063 -557801 -544008 -282682 -155339 -376142 -622374 -588302 -434193 -395660 -359651 -148091
33053 -148091 102001 154570 38286 -49155 -3752 176963 414527 457824 77210 -495263
33043 -495263 -664679 -231633 279972 309640 -51087 -355286 -455632 -469434 -355802 -6939
33033 -6939 364151 400941 170287 150773 583107 1154863 1434241 1359280 1182301 1135768 1266120
33022 1266120 1422653 1302053 689925 -176310 -648946 -331234 366328 632446 259844
33013 259844 -104602 88398 466618 326544 -188836 -194368 584368 1294800 1160790 559241
33003 559241 305806 379538 157809 -359036 -472065 42785 523106 412565 -24816 -294198
32993 -294198 -378693 -469584 -472706 -234985 58268 118375 -30610 -178283 -257114 -278809 -170287
32982 -170287 44756 96711 -211278 -663990 -844260 -595614 -143339 126481 -50396 -557560
32972 -557560 -880736 -612774 -10001 294687 165891 80559 248641 218503 -298943 -793381
32962 -793381 -697121 -322555 -370009 -759120 -721024 -39305 542619 384856 -152774 -256708
32952 -256708 251411 782472 780852 289442 -271128 -572224 -514101 -138877 343073 531917
32942 531917 148376 -555840 -942616 -685457 -114002 291807 488218 695386 907713 962557
32932 962557 929635 1015923 1172903 1176033 988539 676061 151452 -519511 -790162 -266046
32922 -266046 484679 536758 -17164 -193091 278798 498431 -67152 -591050 -131168 892490
32912 892490 1299311 745825 -68140 -488491 -495067 -369320 -343912 -485698 -564416 -248173
32902 -248173 300784 427471 -63919 -458465 -130730 496443 618953 248333 18896 114918
32892 114918 161597 19718 -39480 93881 219822 209679 57919 -296133 -717798 -702651
32882 -702651 -45164 571106 353603 -412273 -731240 -367618 -109333 -476688 -978468 -944507
32872 -944507 -466745 -132293 -214765 -449281 -407753 52471 595254 711948 359929 56505
32862 56505 91106 41079 -467361 -954014 -756466 -190909 -156908 -699328 -911756 -373276
32852 -373276 228415 195301 -241756 -472553 -366266 -154170 63701 278662 368401 259561
32842 259561 84969 17253 143866 498416 914801 938394 312107 -518851 -859867 -626198
32832 -626198 -223755 244590 926890 1494597 1365439 717975 365139 457180 287691 -337762
32822 -337762 -612353 -103678 426378 284504 -23165 192524 487126 57911 -766151 -982674
32812 -982674 -529302 -288649 -606698 -902888 -817221 -728637 -895395 -965490 -709479 -514798
32802 -514798 -708924 -958698 -821787 -472952 -378898 -514531 -401095 149638 728406 826158
32792 826158 401369 -135287 -379826 -298393 -168698 -219587 -379979 -407065 -205526 68954
32782 68954 222602 251727 298877 404510 380353 14277 -588653 -976377 -765305 -48755
32772 -48755 692242 1037392 903291 468572 -4938 -300929 -353165 -240581 -26965 292043
32762 292043 597000 614227 313918 144186 510437 1126694 1295448 822914 242016 63510
32752 63510 213837 354873 381684 375276 338450 224740 69649 -82672 -267720 -505888
32742 -505888 -711911 -739041 -440447 227230 1000864 1357348 1046610 473842 233813 377723
32732 377723 516710 522491 626102 860361 951351 828494 728536 702122 528496 228848
32722 228848 138626 332947 506273 554179 700118 893548 735259 233006 -65725 -13871
32712 -13871 -193560 -850683 -1258192 -796129 -22938 112767 -356500 -657312 -521068 -326703
32702 -326703 -225576 -3968 242326 130378 -228851 -208684 385800 959268 949803 517455
32692 517455 168687 105647 212836 377907 547640 635935 586952 464469 385257 395364
32682 395364 399578 178746 -403410 -1106098 -1387144 -971038 -236667 159792 -12005 -374787
32672 -374787 -398482 56019 566178 516626 -193668 -881277 -845339 -341891 -269130 -835214
32662 -835214 -1233007 -901663 -351188 -225368 -269708 30492 381989 164058 -424912 -675759
32652 -675759 -585052 -754906 -1170976 -1134331 -522865 -108060 -324514 -634623 -523830 -308140
32642 -308140 -428645 -631605 -455232 -17595 263920 326673 290210 13577 -582114 -1043063
32632 -1043063 -862059 -267019 61143 -21954 -3143 390509 741828 585572 59639 -368497
32622 -368497 -532068 -608356 -690181 -631746 -325204 92628 390723 490103 494259 541824 678868
32611 678868 822080 812711 580826 291704 202426 288569 197295 -228546 -572783 -354399
32601 -354399 183929 286119 -240731 -688572 -457594 72224 112090 -437886 -975067 -1071579
32591 -1071579 -833532 -474510 -63419 258698 275871 51327 -57385 121856 341139 291659
32581 291659 -17372 -332724 -439289 -306753 -84590 41586 87346 266647 601112 707708
32571 707708 260976 -458786 -825502 -625035 -222220 -9902 -39560 -186283 -315050 -258932
32561 -258932 6635 132043 -276683 -1013689 -1354217 -928494 -154836 379305 619233 877586
32551 877586 1254489 1530813 1494894 1138528 617657 177412 22535 140025 334951 499677
32541 499677 706909 974864 1119103 952128 504309 -33259 -460021 -610009 -408586 24440
32531 24440 446005 723838 901698 1031890 1081722 997650 716023 165322 -542035 -1005386
32521 -1005386 -919711 -521820 -311645 -356006 -301860 -112004 -224097 -745415 -1052030 -642560
32511 -642560 25860 115567 -431405 -904411 -875763 -622393 -462304 -287584 4639 121892
32501 121892 -194300 -656301 -756046 -454102 -179680 -203714 -349050 -353766 -234563 -180174
32491 -180174 -278229 -472158 -677048 -845753 -982045 -1116320 -1204717 -1095225 -727522 -310379
32481 -310379 -101414 -68510 -46062 -161185 -667376 -1310482 -1425472 -907969 -502039 -699220
32471 -699220 -940277 -542208 116777 199465 -181839 -192015 256360 394665 27481 -106694
32461 -106694 295400 535592 239820 141185 798417 1521812 1483733 1050658 989233 1087732
32451 1087732 730788 254723 429673 967079 911946 365053 405821 1209090 1636554 1078452
32441 1078452 423265 572064 1067400 1008507 509022 322268 518190 439976 -201671 -920784
32431 -920784 -1160564 -911747 -540077 -292915 -93164 257300 720711 968676 791700 405535
32421 405535 112099 -158206 -584116 -888123 -565722 307136 1009005 1029216 564595 68610
32411 68610 -262095 -419168 -406488 -318240 -311354 -391843 -450628 -489673 -544218 -476271 -174768
32400 -174768 174659 384931 619810 1001736 1147834 693097 8741 -307425 -392509 -727133
32390 -727133 -1028811 -590677 348068 728311 289617 -94587 60579 183753 -114532 -334640
32380 -334640 -165195 -117839 -419778 -381762 341588 921871 698877 359196 732903 1307631
32370 1307631 1114280 359625 -57246 -70507 -234134 -455390 -242390 95338 -206144 -966421
32360 -966421 -1243817 -870401 -615443 -767153 -708299 -92621 605988 983600 1212401 1373685
32350 1373685 1150214 520729 6432 -113103 -167814 -382932 -434783 -49626 501677 819456
32340 819456 834641 635231 282759 -29333 -94016 -105146 -472010 -1097344 -1367476 -1027535
32330 -1027535 -535882 -335666 -289797 -115994 73916 12447 -246445 -375087 -132772 438883
32320 438883 1015802 1193321 893776 474911 201126 -134173 -673560 -948557 -528641 50531
32310 50531 -132181 -937986 -1230390 -526727 308191 333671 -294795 -838595 -993704 -940662
32300 -940662 -894159 -987686 -1177223 -1036739 -186450 893911 1175326 487580 -148630 4992
32290 4992 432454 447064 401096 950250 1759624 1961293 1518965 1128581 980704 647634
32280 647634 168326 212561 922561 1462035 1146193 388637 51754 305144 617916 600453
32270 600453 360259 107954 -169041 -542322 -895222 -1001178 -791393 -450424 -246200 -316221
32260 -316221 -610338 -945556 -1079594 -871591 -500122 -392453 -736446 -1165349 -1180566 -804352
32250 -804352 -495151 -462093 -460543 -317100 -230119 -370788 -538708 -442257 -71569 371416
32240 371416 669054 610531 135985 -419001 -583235 -398383 -389889 -703029 -781384 -252018
32230 -252018 377760 431801 92658 105791 676319 1273252 1446656 1272490 977918 636431
32220 636431 330241 211946 286954 409988 515819 578755 411471 -103028 -591280 -474055
32210 -474055 191702 594368 163178 -645017 -907570 -397916 210249 287818 5128 -79851
32200 -79851 74007 -56393 -648516 -1059951 -677542 47779 50243 -861324 -1649371 -1464207
32190 -1464207 -782730 -598762 -950578 -990558 -336868 402566 548535 177379 -207317 -382381
32180 -382381 -488716 -679925 -948967 -1169521 -1167484 -876866 -498293 -343556 -452042 -527721
32170 -527721 -337750 -14966 139959 41465 -104335 -63666 140068 220960 -34562 -425670
32160 -425670 -495108 -131420 183463 -64838 -776286 -1403988 -1619167 -1492325 -1141164 -627820
32150 -627820 -209958 -243271 -674457 -978743 -799957 -373654 -107531 -3789 218885 591688
32140 591688 795881 582741 73799 -405338 -665051 -763601 -825365 -814061 -559423 -45070
32130 -45070 426566 503767 207218 -68875 -19787 227479 311605 109366 -79871 138821
32120 138821 738192 1153637 837628 -52409 -721283 -603914 25836 477117 461538 226545
32110 226545 36223 -113660 -269997 -332469 -192392 100294 356658 371866 128446 -30322
32100 -30322 340068 1128317 1536788 982391 -79307 -682207 -540283 -187406 -55246 -65185
32090 -65185 -153642 -483556 -920112 -952366 -472783 -80049 -230673 -583432 -588750 -272411
32080 -272411 -1667 99475 38776 -325893 -937083 -1277106 -1019616 -616608 -641804 -864789
32070 -864789 -673214 -176077 -83558 -554330 -966516 -923696 -738285 -714936 -645752 -331366
32060 -331366 -18809 55773 90796 297605 442854 220959 -201419 -410062 -326407 -220160
32050 -220160 -259197 -342534 -328925 -218565 -118362 -121586 -185212 -134163 96148 284564 206867
32039 206867 22627 70993 329069 467681 440481 532742 740171 649515 160095 -208848
32029 -208848 -57950 325271 511980 572391 715238 734268 387707 -7507 20555 330440
32019 330440 406727 183880 12135 -51634 -245669 -465217 -343361 -20248 -96748 -619799
32009 -619799 -803795 -117994 901911 1345440 1014704 416020 12066 -84390 89853 418970
31999 418970 663311 647919 447505 222133 13458 -145785 -137598 20539 82676 -61189
31989 -61189 -160892 -37114 2968 -408095 -990387 -1014265 -250198 691667 1118855 1019128
31979 1019128 843424 781949 585260 49490 -615747 -1014620 -1006967 -776860 -517957 -220982
31969 -220982 168082 510568 552363 236926 -172719 -340786 -194928 12832 -11532 -249126
31959 -249126 -335632 23252 621380 902480 590367 -19636 -491810 -737286 -889397 -941788
31949 -941788 -816108 -622801 -510985 -370286 -42383 259385 157749 -275795 -541902 -401380
31939 -401380 -138524 -50073 -73849 -64398 -60609 -97670 -72742 28497 45531 -98929 -332412
31928 -332412 -664234 -1110777 -1362371 -1034027 -372096 -128092 -478913 -683079 -207147 390608
31918 390608 257636 -519384 -1093171 -976653 -433320 11230 -40296 -678764 -1408321 -1368936
31908 -1368936 -400586 459868 220708 -639755 -808626 -11802 667123 364836 -549282
31899 -549282 -1218890 -1267566 -764589 45596 638289 458456 -353429 -993276 -1032587 -874780
31889 -874780 -896542 -797553 -267842 300537 382655 172062 235852 615339 858662 728877
31879 728877 338029 -215550 -788064 -952878 -437862 277026 406243 -87448 -461784 -272146
31869 -272146 124823 311932 447261 806297 1166900 1119243 706262 307996 62158 -177490
31859 -177490 -413617 -469165 -368183 -353782 -475910 -533303 -497237 -570049 -660230 -284296 643277
31848 643277 1345241 1063820 157517 -326224 -73906 214732 39467 -197467 -40671 185482
31838 185482 -22156 -432343 -465261 -174187 -122822 -436055 -668978 -590136 -437861 -344429
31828 -344429 -141072 121744 70941 -319347 -490984 -81178 477267 519071 24714 -424525
31818 -424525 -388569 28341 389394 317656 -207971 -777705 -886509 -470576 25105 205119
31808 205119 157889 197413 358423 350703 -45038 -655021 -984013 -649459 161373 761420
31798 761420 671886 158763 -167965 -140109 -65849 -117221 -173051 -241940 -485321 -733172 -549648
31787 -549648 31473 399981 259387 59850 191841 316838 -3825 -509265 -683485 -631733
31777 -631733 -830558 -1224932 -1282217 -882710 -484362 -339085 -169908 186725 371927 62603
31767 62603 -455442 -654517 -476034 -297283 -292007 -216684 88952 331310 172933 -159432
31757 -159432 -75387 528146 1035428 960875 624603 563083 624412 292140 -286378 -396582
31747 -396582 81608 450136 368071 395625 908821 1283771 856108 41193 -330268 -299725
31737 -299725 -481843 -820640 -679546 -88607 124766 -377517 -908341 -810044 -306414 72569
31727 72569 289202 571071 855908 925606 799761 643097 520764 492142 659410 882103
31717 882103 762511 198297 -347722 -431268 -202465 -83341 -146886 -187081 -172038 -212061
31707 -212061 -241707 -149041 -87003 -220377 -285975 68355 543525 411806 -367492 -879997
31697 -879997 -471418 287304 379568 -265501 -781762 -591800 24494 571574 895597 950038
31687 950038 617409 82107 -107220 260114 658553 517008 -9895 -356400 -333400 -166182
31677 -166182 2473 185919 319560 368173 459305 538249 239875 -406095 -592919 203532
31667 203532 1163720 1063177 53183 -547702 -172648 424625 603079 588858 486080 -174581
31657 -174581 -1305743 -1879337 -1455981 -1014490 -1349428 -1682787 -990612 192908 610691
31648 610691 247301 60108 210017 24673 -484650 -522419 32012 376552 164472 -64653
31638 -64653 -51199 -246821 -741059 -855784 -292225 257898 174321 -215169 -328456 -187912
31628 -187912 -84511 -17922 38753 -130776 -547847 -832434 -802556 -765607 -896360 -913344
31618 -913344 -722621 -733737 -1081148 -1167123 -549174 255003 465660 116055 -175236 -151615
31608 -151615 -41425 -14447 -87300 -362502 -841233 -1162519 -995777 -555307 -320139 -389506
$$ [...]
##END NTUPLES=NMR SPECTRUM
##END=
