##TITLE=31Pdec_E3d1007-3
 CDCl3, 24 sc
 11.7.2023
##JCAMPDX= 6.0         $$ Bruker NMR JCAMP-DX V2.0
##DATA TYPE= NMR SPECTRUM
##DATA CLASS= NTUPLES
##ORIGIN= UXNMR, Bruker Analytische Messtechnik GmbH
##OWNER= root
$$ XWIN-NMR		Version 3.5
$$ Tue Jul 11 13:52:44 2023 Russian Standard Time (UT+4h)  she@DPX200
##.OBSERVE FREQUENCY= 81.013821
##.OBSERVE NUCLEUS= ^31P
##.ACQUISITION MODE= SIMULTANEOUS
##.ACQUISITION SCHEME= undefined
##.AVERAGES= 24
##.DIGITISER RES= 16
##SPECTROMETER/DATA SYSTEM= spect
##.PULSE SEQUENCE= zgpg30
##.SOLVENT NAME= CDCl3
##.SHIFT REFERENCE= (INTERNAL, CDCl3, 0, 248.564)
##AUDIT TRAIL= $$ (NUMBER, WHEN, WHO, WHERE, WHAT)
$$ ##TITLE= Audit trail, XWIN-NMR		Version 3.5
$$ ##JCAMPDX= 5.01
$$ ##ORIGIN= Bruker BioSpin GmbH
$$ ##OWNER= she
$$ F:/spectra/data/she/nmr/P31/1/pdata/1/auditp.txt
$$ ##AUDIT TRAIL=  $$ (NUMBER, WHEN, WHO, WHERE, WHAT)
(   1,<2023-07-11 13:51:47.06 +0400>,<she>,<DPX200>,
      <created by zg, POWCHK disabled, PULCHK disabled
       configuration hash MD5:
       00 E9 B6 7A A2 85 ED C7 34 08 36 98 17 FE 4E 26
       data hash MD5: 32K
       FF 34 E0 8A B8 16 36 B9 C9 3D 9D 23 82 C1 9E 5A>)
(   2,<2023-07-11 13:51:49.65 +0400>,<she>,<DPX200>,
      <Start of raw data processing
       efp BC_mod = 2 LB = 1 FT_mod = 6 PKNL = 1 PHC0 = -10639.75 PHC1 = -76.51532 SI = 64K 
       data hash MD5: 64K
       BB CC 70 DB 32 B6 B3 1B 64 A1 B2 98 D1 50 9A 9B>)
(   3,<2023-07-11 13:52:04.92 +0400>,<she>,<DPX200>,
      <pk PHC0 = 20.44801 PHC1 = 0 
       data hash MD5: 64K
       C6 80 D6 2F F9 26 E1 A3 5D 46 16 E3 5E C5 4E 3A>)
(   4,<2023-07-11 13:52:10.70 +0400>,<she>,<DPX200>,
      <abs ABSG = 5 
       data hash MD5: 64K
       7C 08 83 2E B9 AF 97 1E 4C 29 F1 F6 E1 83 95 49>)
$$ ##END=
$$ 
$$ hash MD5
$$ 14 C2 04 E5 93 05 E4 A5 8E 9C A6 1F 74 E1 8A FC
##$RELAX= 
##$RELAX= 
##$RELAX= 
##$RELAX= 
##$RELAX= 
##$RELAX= 
##$RELAX= 
##$RELAX= 
##$RELAX= 
$$ Bruker specific parameters
$$ --------------------------
##$DU= <F:/spectra>
##$EXPNO= 1
##$NAME= <P31>
##$PROCNO= 1
##$TYPE= <nmr>
##$USER= <she>
##$AMP= (0..31)
100 100 100 100 100 100 100 100 100 100 100 100 100 100 100 100 100 100 
100 100 100 100 100 100 100 100 100 100 100 100 100 100 
##$AQSEQ= 0
##$AQ_mod= 1
##$AUNM= <au_zg>
##$AUTOPOS= <>
##$BF1= 81.014009
##$BF2= 200.13
##$BF3= 200.13
##$BF4= 200.13
##$BF5= 200.13
##$BF6= 200.13
##$BF7= 200.13
##$BF8= 200.13
##$BYTORDA= 1
##$CFDGTYP= 0
##$CFRGTYP= 5
##$CHEMSTR= <none>
##$CNST= (0..31)
1 1 145 1 1 1 1 1 1 1 1 1 1 1 1 1 1 1 1 1 1 1 1 1 1 1 1 1 1 1 1 1 
##$CPDPRG= <waltz16>
##$CPDPRG1= <>
##$CPDPRG2= <waltz16>
##$CPDPRG3= <>
##$CPDPRG4= <mlev>
##$CPDPRG5= <mlev>
##$CPDPRG6= <mlev>
##$CPDPRG7= <mlev>
##$CPDPRG8= <mlev>
##$CPDPRGB= <>
##$CPDPRGT= <>
##$D= (0..31)
0 1 0 0 0 0 0 0 0 0 0 0.03 2e-05 3e-06 0 0 0 0 0 0 0 0 0 0 0 0 0 0 0 0 
0 0 
##$DATE= 1689069106
##$DBL= (0..7)
120 120 120 11 120 120 24 19 
##$DBP= (0..7)
150 150 150 150 150 150 150 150 
##$DBP07= 0
##$DBPNAM0= <>
##$DBPNAM1= <>
$$ [...]
##$SUBNAM3= <"">
##$SUBNAM4= <"">
##$SUBNAM5= <"">
##$SUBNAM6= <"">
##$SUBNAM7= <"">
##$SUBNAM8= <"">
##$SUBNAM9= <"">
##$SW= 501.771253377433
##$SWIBOX= (0..15)
0 1 3 0 0 0 0 0 0 0 0 0 0 0 0 0 
##$SW_h= 40650.406504065
##$TD= 32768
##$TD0= 1
##$TE= 0
##$TE2= 300
##$TE3= 300
##$TEG= 300
##$TL= (0..7)
0 120 53 12 22 120 120 120 
##$TP= (0..7)
150 150 150 150 150 150 150 150 
##$TP07= 0
##$TPNAME0= <>
##$TPNAME1= <>
##$TPNAME2= <>
##$TPNAME3= <>
##$TPNAME4= <>
##$TPNAME5= <>
##$TPNAME6= <>
##$TPNAME7= <>
##$TPOAL= (0..7)
0.5 0.5 0.5 0.5 0.5 0.5 0.5 0.5 
##$TPOFFS= (0..7)
0 0 0 0 0 0 0 0 
##$TUNHIN= 0
##$TUNHOUT= 0
##$TUNXOUT= 0
##$USERA1= <user>
##$USERA2= <user>
##$USERA3= <user>
##$USERA4= <user>
##$USERA5= <user>
##$V9= 5
##$VALIST= <valist>
##$VCLIST= <CCCCCCCCCCCCCCC>
##$VD= 0
##$VDLIST= <DDDDDDDDDDDDDDD>
##$VPLIST= <PPPPPPPPPPPPPPP>
##$VTLIST= <TTTTTTTTTTTTTTT>
##$WBST= 1024
##$WBSW= 4
##$XGAIN= (0..3)
0 0 0 0 
##$XL= 0
##$YL= 0
##$YMAX_a= 6004
##$YMIN_a= -5816
##$ZGOPTNS= <>
##$ZL1= 120
##$ZL2= 120
##$ZL3= 120
##$ZL4= 120
##$ABSF1= 248.5645
##$ABSF2= -253.2056
##$ABSG= 5
##$ABSL= 3
##$ALPHA= 0
##$AQORDER= 0
##$ASSFAC= 0
##$ASSFACI= 0
##$ASSFACX= 0
##$ASSWID= 0
##$AUNMP= <proc_1d>
##$AZFE= 0.1
##$AZFW= 0.5
##$BCFW= 0
##$BC_mod= 2
##$BYTORDP= 0
##$COROFFS= 0
##$CY= -3
##$DATMOD= 1
##$DC= 0
##$DFILT= <>
##$DTYPP= 0
##$F1P= 0
##$F2P= 0
##$FCOR= 1
##$FTSIZE= 65536
##$FT_mod= 6
##$GAMMA= 0
##$GB= 0
##$INTBC= 1
##$INTSCL= 6.047779e-11
##$ISEN= 30
##$LB= 1
##$LEV0= 0
##$LPBIN= 0
##$MAXI= 10000
##$MC2= 0
##$MEAN= 0
##$ME_mod= 0
##$MI= 50
##$NCOEF= 0
##$NC_proc= -6
##$NLEV= 6
##$NOISF1= 182.463
##$NOISF2= 159.3651
##$NSP= 0
##$NTH_PI= 0
##$NZP= 0
##$OFFSET= 248.5645
##$PC= 4
##$PHC0= -10619.3
##$PHC1= -76.51532
##$PH_mod= 1
##$PKNL= yes
##$PPARMOD= 0
##$PSCAL= 0
##$PSIGN= 0
##$REVERSE= no
##$SF= 81.0140089999694
##$SI= 65536
##$SIGF1= 159.3651
##$SIGF2= -187.1042
##$SINO= 113.3802
##$SIOLD= 16384
##$SREGLST= <1H.CDCl3>
##$SSB= 0
##$STSI= 65536
##$STSR= 0
##$SW_p= 40650.406504065
##$SYMM= 0
##$S_DEV= 0
##$TDeff= 32768
##$TDoff= 0
##$TI= <>
##$TILT= no
##$TM1= 0
##$TM2= 0
##$TOPLEV= 0
##$USERP1= <user>
##$USERP2= <user>
##$USERP3= <user>
##$USERP4= <user>
##$USERP5= <user>
##$WDW= 1
##$XDIM= 65536
##$YMAX_p= 518538635
##$YMIN_p= -5550653
$$ End of Bruker specific parameters
$$ ---------------------------------
##NTUPLES= NMR SPECTRUM
##VAR_NAME=  FREQUENCY,     SPECTRUM/REAL,   SPECTRUM/IMAG
##SYMBOL=    X,             R,               I
##VAR_TYPE=  INDEPENDENT,   DEPENDENT,       DEPENDENT
##VAR_FORM=  AFFN,          ASDF,            ASDF
##VAR_DIM=   65536,         65536,           65536
##UNITS=     HZ,            ARBITRARY UNITS, ARBITRARY UNITS
##FACTOR=    0.620285442955139, 1,           1
##FIRST=     20137.2065510682, 0,            0
##LAST=      -20513.1999529968, 0,           0
##MIN=       -20513.1999529968, -5550653,    0
##MAX=       20137.2065510682, 518538635,    0
$$ Real data points
##PAGE= N=1
##DATA TABLE= (X++(R..R)), XYDATA
$$ [...]
39731D2776K19549m92225m68342J11181M59062J66845m06161p00590n26008J2653
39721a581260P02509J123469Q28732k8751o65398o50488m70108o32971p55873
39712b130139k81958L50032K57279l76338m51453L29530J002728Q66223L93124
39703d0972J77542M596l72707m64719R5468O69560N19577j523j26422q269k93903
39692A58228p59035n81436J83078O08750L95570J64421J30004k59292r98680j112205
39682b070597k17052O11129L96098k53141k26036K90196K95737k27078l20663
39673a721407K55198N84565P9023o24927o81422j83552K10004K65595K62016L65736
39663a189171L70262K6722n61564q89781m61412O07636J514278J546250Q24971
$$ y = [42776, 262325, -229900, -698242, -587061, -127999, 38846, -367315, -1067905, -1593913, -1581260, -878751, 244718, 1073450, 1044699, 379301, -271187, -741295, -1374266, -2130139, -2412097, -2062065, -1804786, -2181124, -2632577, -2303047, -1300319, -434096, -40972, 136570, 141166, -231541, -696260, -600792, 68768, 588345, 586822, 460400, 452131, 158228, -600807, -1182243, -999165, -390415, 5155, 169576, 299580, 40288, -958392, -2070597, -2287649, -1676520, -1280422, -1533563, -1759599, -1469403, -1173666, -1400744, -1721407, -1466209, -881644, -802621, -1427548, -2108970, -2292522, -2082518, -1816923, -1554907, -1189171, -818909, -792187, -1353751, -2243532, -2704944, -2097308, -583030, 963220, 1788191]
39654A788191J9900m60240o10934m37827p612K65177N7253k09811J05787P15480
39644A225364O62884j35736o16229j99710L14457J05420l69856k95235Q3628K1160
39634G96147l09110j45091L93625L69845m15274j004496o63757J65195O00045
39625b12871L73295j28052m17980l15474r3540j97032n47242m51352L38504R74490
39615f77254O63724o0203k32070r6553m85909r49746k93043J017959J040728n06705
39605e79072j365697p7968J689352J698482M31822p0158M99577O99600j1992o80474
39595B233472p30262o37757o89992n90271l66776l53196k97083K49839Q15018
39586c67008O22478R1233K15051O84193L49575n66778o65784J35568L81725l15737
$$ y = [1788191, 1808091, 1347851, 736917, 299090, 291478, 556655, 613908, 404097, 509884, 1225364, 1888248, 1752512, 1136283, 936573, 1251030, 1356450, 986594, 691359, 774987, 796147, 487037, 341946, 735571, 1105416, 690142, -314354, -978111, -812916, -212871, 160424, 32372, -385608, -701082, -794622, -991654, -1538896, -1990248, -1651744, -677254, -13530, -73733, -305803, -402356, -888265, -1838011, -2131054, -1113095, -72367, -579072, -1944769, -2022737, -333385, 1365097, 1796919, 1726761, 2226338, 2925938, 2913946, 2233472, 1503210, 865453, 175461, -414810, -781586, -1134782, -1431865, -1182026, -367008, 255470, 346703, 561754, 1245947, 1595522, 1028744, 362960, 498528, 880253, 564516]
39576E64516o16382K991K60912m64942q83358j80269M74874K22833J74405J064627
39566F20207J382524p948j351639o82890O79511L03444j032629o22919J293371
39557E81032J680544j93304j507811n91830N62976N700r63576l86271Q95254Q08830
39547H91544m56329r36824m4529Q58442O84416j95918q41744o78484K28781J051121
39537E60476Q17749k09015n89949J55461O05901l04918j318194o87281R88932
39528A9162J626533P73266p8336p5379M0423k82603m63962j07356K22343Q7858
39518A761949j79473l76479p77681j174015q16200J72585O11833J27456j18930
39509g68955O02402J224412O35058l85553m19933K87353M11533j29652j76963
$$ y = [564516, -51866, -48875, 212037, -252905, -1136263, -1316532, -841658, -618825, -444420, 620207, 2002731, 1994783, 643144, -39746, 639765, 943209, -89420, -712339, 581032, 2261576, 2068272, 560461, -31369, 531607, 537307, -426269, -812540, 82714, 891544, 435215, -501609, -546138, 312304, 996720, 800802, -40942, -719426, -490645, 560476, 1378225, 1169210, 579261, 734722, 1340623, 1035705, -282489, -969770, 19162, 1645695, 2418961, 2340625, 2265246, 2305669, 2023066, 1559104, 1451748, 1674091, 1761949, 1582476, 1205997, 428316, -745699, -1561899, -1389314, -777481, -650025, -768955, -166553, 1057859, 1692917, 1307364, 887431, 1174784, 1586317, 1456665, 1279702]
39500A279702M92855O93792j91627j206272j288173o04505R6533M93717N56884
39491C22906K76651j2876J36524L95450k4355q07534n71851Q56106J618029M26491
39481B615541j297871j434601k61163L19196j04016k67100J50572Q0573n56760
39472g55629l69080R25787J617086P38253l22154k46219Q8536m53631r74237k41288
39462G424P59864L65367o87935l27182J240994J692186L62520p98991n56195j59499
39452A898553q10709j535448r74961L40718R86677P47211L89258K10408k926k22780
39442A026001l31864m62352n31637j56696M55510M88991o7050j71039M11392M12324
39432A073580p44076j545037o67926O74850N31598o65206q98436J33884P97479
$$ y = [1279702, 1772557, 2466349, 2274722, 1068450, -219723, -824228, -727695, -233978, 322906, 599557, 586681, 723205, 1118655, 1094300, 286766, -285085, 571021, 2189050, 2615541, 1317670, -116931, -378094, -58898, -162914, -430014, -279442, -198869, -755629, -1124709, -198922, 1418164, 2156417, 1834263, 1588044, 1676580, 1222949, 248712, 7424, 767288, 1132655, 444720, 117538, 1358532, 3050718, 3413238, 2614247, 2058052, 1898553, 1087844, -447604, -1422565, -1081847, -95170, 652041, 1041299, 1251707, 1248781, 1026001, 694137, 231785, -299852, -456548, -1038, 487953, 420903, 249864, 661256, 1073580, 329504, -1215533, -1883459, -1208609, -677011, -1342217, -2240653, -2106769, -1309290]
39423a309290M28318J67475O02564P34967J989n63524j72494L14263m2431o17609
39413d55772m27065J09057K0970l81763n8794Q11437R73590J46203n17530l17191
39403i6858l7109m45607q72366l09517P74497R78975J16696m72719L968O16152
39393B56112K62018o27307r41923o77407n84988n34605K28465J303943J320136
39384D444K31408k92946M77570J001813K0062j113839m36706J370590J843546
39375C105942L75473j122060j226570o63066m99300m84469m7176M35990L85045
39366B59809P3591K6947R1336r4219l10903j91406O1871N5601j21587j76054j46571
39355d71585j53278m3178K12091K17328k17098n91925m24779n735J50807J67731
$$ y = [-1309290, -880972, -713497, -110933, 624034, 626023, 62499, -109995, 204268, 161837, -455772, -882837, -773780, -752810, -1134573, -1193367, -381930, 591660, 737863, 220333, -96858, -133967, -579574, -1451940, -1761457, -986960, -7985, 108711, -364008, -360040, 256112, 518130, -109177, -1051100, -1728507, -2313495, -2848100, -2619635, -1315692, 4444, 235852, -57094, 420476, 1422289, 1442351, 328512, -108194, 1262396, 3105942, 3481415, 2359355, 1132785, 469719, -29581, -514050, -561226, -125236, 259809, 333400, 360347, 451683, 357464, 46561, -144845, -82974, -27373, -148960, -325014, -471585, -624863, -668041, -455950, -238622, -455720, -1047645, -1472424, -1478159, -1327352, -1159621]
39345a159621M09846O06189K10613n52357q59185m80218j52K08613M08848O96347
39335e11077O16468K2400m02197r9973M28516L84492m6439o6048K78862P4509
39325F79513q50637j360543o21831N92690J009545N81409J48845p1677m59714
39316c52400p54580k46862P26695Q92270Q063o37330k69468K03305r2026m72867
39306i95200j00742L19585k07534r49358m77176Q50908J356697P68031M88059
39297A053270R81875R08055m70703j778986j511096k30229L98718q8730p27609
39288a465435o53061P5888Q65330J120872O34836j28809m11963m0060M77078P46841
39278A221517P28462J98742r77917j878207j138291Q87208J930876P26667j093846
$$ y = [-1159621, -749775, -143586, 67027, -485330, -1344515, -1824733, -1824885, -1616272, -1207424, -511077, 105391, 127791, -274406, -374379, 54137, 438629, 392190, 326142, 605004, 679513, -171124, -1531667, -2153498, -1560808, -551263, 30146, 178991, 107314, -352400, -1106980, -1353842, -627147, 265123, 273186, -364144, -633612, -430307, -522333, -995200, -1095942, -776357, -983891, -1933249, -2410425, -1559517, -202820, 565211, 1053270, 2035145, 2943200, 2472497, 693511, -817585, -1047814, -649096, -737826, -1465435, -2118496, -2042608, -1177278, -56406, 578430, 449621, 37658, -2402, 474676, 1221517, 1949979, 2148721, 1170804, -707403, -1845694, -958486, 972390, 1699057, 605211]
39269F05211j257177L4701P76580K32308m20427k90480J00623J30354O9105K54000
39259B34798L58901O0531l56551n42665n85983n85390l35392J78574N42846N70684
39249d59647O51012R92688J037512K40483q82487j182611l52541N95136N49831
39240A189376l51585r60920n87520K03869M56429R5537j71720n2252q166k35120
39230d22072j27490O73392J383423J068653P9969m83378m67667o72865j191668
39221a59703j065733k8113O76979R1086q27711n44300P04577J251442M92332l41087
39211B49769j50346N34220O58427K78894J88582M77677M45821k15829r78931j267389
39201B20895j076773p09337l93375k71634l29133k32127L38662J084208J251259
$$ y = [605211, -651966, -617265, 159315, 391623, -28804, -319284, -218661, -88307, -19202, 234798, 593699, 654230, 297679, -244986, -830969, -1416359, -1751751, -1573177, -1030331, -459647, 191365, 1184053, 2221565, 2462048, 1579561, 396950, 44409, 639545, 1189376, 837791, -123129, -710649, -506780, -50351, 45186, -126534, -178786, -186952, -422072, -549562, 123830, 1507253, 2575906, 2655875, 2172497, 1704830, 1031965, -159703, -1225436, -1253549, -576570, -485484, -1313195, -1857495, -1152918, 98524, 590856, 249769, 99423, 633643, 1292070, 1570964, 1759546, 2237223, 2683044, 2467215, 1488284, 220895, -855878, -1565215, -1958590, -2230224, -2559357, -2791484, -2452822, -1368614, -117355]
39192a17355N76419l21750o99598m93978j52177L5367J67814M61324Q93150J049160
39182A398376M69814n74422r47318O3707J472306J510033n5609j491157j342142
39173E03588j30631P38171P71916L02099m64805j245808j263257k35251P28935
39164b95043M66671l99498l12654P52520J173509J69296j024102r62864J41619
39155b90546R86999Q15024n0830p26338m85630N19138J122465L73000j049698
39146A213584j489037n37708L79404O3402p78028o49837N65071J437508Q66523
39137A070882n05778j013364k7J201937Q34072q25345j584801m02308R55608M98983
39127B29859r44198j123030M1562O19236J24046J21465J030797J101284l58415
$$ y = [-117355, 459064, 137314, -562284, -1056262, -1208439, -1173072, -1005258, -543934, 349216, 1398376, 1868190, 1293768, 346450, 410157, 1882463, 3392496, 3336887, 1845730, 503588, 372957, 1111128, 1883044, 2185143, 1720338, 474530, -788727, -1023978, -295043, 171628, -227870, -540524, 211996, 1385505, 1554801, 530699, -432165, -290546, 696453, 1511477, 1460647, 734309, 248679, 767817, 1890282, 2263282, 1213584, -275453, -813161, -433757, -370355, -1148383, -1798220, -1233149, 204359, 1070882, 565104, -448260, -448287, 753650, 1587722, 762377, -822424, -1224732, -269124, 229859, -714339, -1837369, -1795807, -1176571, -1052525, -931060, 99737, 1201021, 842606]
39118H42606j321498k60219J194842Q55651n57061q64877r479L13753k28513l75987
39108d10782J57250K57217l31388m35866M14742J071950O24762k36549m27137
39099F84199L0319M01524L73594J77843M5119j9326j11949k22300j09218L57306
39089A607111O58650Q0958r93876j171022n6436Q52750L06995o93825m49968P21038
39079H62375J051623J27395p36030p82488o23183o00916j60992O78796Q72137
39070F88717N1786o82357m34457K07606L16565q020j92688j72872m5796M09478
39060A37962J058943J027448j16544j362255j361682k08889P04627M85259k94584
39051G0285m99390J41148P53050M48343m34270o26158L32994J244399Q02958m86967
$$ y = [842606, -478892, -739111, 455731, 1311382, 754321, -110556, -120035, 193718, -34795, -410782, -253532, 3685, -327703, -763569, -348827, 723123, 1347885, 1111336, 684199, 714518, 1116042, 1489636, 1667479, 1712598, 1693272, 1581323, 1359023, 1249805, 1607111, 2265761, 2346719, 1352843, 181821, 125385, 978135, 1285130, 591305, 141337, 862375, 1913998, 2041393, 1305363, 522875, -100308, -701224, -862216, -183420, 688717, 740503, 58146, -376311, -168705, 147860, 139840, -52848, -225720, -271516, 137962, 1196905, 2224353, 2107809, 745554, -616128, -825017, -120390, 364869, 70285, -429105, -287957, 465093, 913436, 479166, -146992, 186002, 1430401, 2233359, 1746392]
39041A746392r76063k39595M39731R5455o63142r02785p67518q41936r22760l71488
39031c403709O88107J353564J079407L13957o7962K42295O30100K89049o32987
39022D91821j011303k51792O76173M83586n41285r42353k64501M18351L12885
39013f28418j6967J30487M31280L16141K1283M5009J99458j7031n43942q87429
39003i50129p62206j54372P98937J570877J431604L77895o23996q12816n25666
38994C50128m17108m01054p1554L24987J88125m00798p14518l95283J80535N44019
38984h12521O17056N06617K49001j02777l89110m79717m20824l74395l78756k26567
38974a811993K00866M72090j6917r21199r09607N07467J776992J144179o84585
$$ y = [1746392, 770329, 530734, 970465, 1065920, 402778, -500007, -1267525, -2109461, -3032221, -3403709, -2715602, -1362038, -282631, 31326, -36636, 205659, 835759, 1124808, 491821, -519482, -771274, -95101, 388485, -152800, -1095153, -1359654, -941303, -628418, -645385, -514898, -83618, 232523, 253806, 298815, 498273, 481242, -62700, -950129, -1712335, -1866707, -1067770, 503107, 1934711, 2312606, 1688610, 875794, 350128, -66980, -468034, -539588, -214601, -26476, -427274, -1141792, -1537075, -1356540, -812521, -195465, 311152, 560153, 457376, 68266, -411451, -832275, -1206670, -1585426, -1811993, -1611127, -1139037, -1155954, -2077153, -2986760, -2479293, -702301, 441878, -242707]
38965b42707j269627J27483J548844J296360J63388l07612k49764o38078j146754
38956g18467o59289N86748J117877M31943m28362o55866o34908p44182m98310
38947b202816L97575J104071O89429m06542q65447k90019L16006N5007n42144
38938a744880k71931R23219J656989Q96678n72113j141636m87972K02049O7379
38929d72218l52831k10016L76739P37850O91669M76341J15915m32522q13643o52788
38919e35504k32153j63417m48014m12308L46644J308895J469264M08133j016257
38910G25283j260810J53192J668828J340325m82258j309219J10112J873935J546948
38901D366336l81060j342773m66351M59851l6078j050877j061209k73335M2281
$$ y = [-242707, -1512334, -1384851, 163993, 1460353, 1623741, 1316129, 1066365, 428287, -718467, -1377756, -791008, 326869, 758812, 330450, -325416, -960324, -1704506, -2202816, -1805241, -701170, -11741, -418283, -1283730, -1573749, -1257743, -1202736, -1744880, -2016811, -1093592, 563397, 1460075, 887962, -253674, -741646, -539597, -472218, -825049, -1035065, -658326, 79524, 771193, 1247534, 1363449, 930927, 117284, -535504, -767657, -931074, -1379088, -1791396, -1444752, -135857, 1333407, 1741540, 725283, -535527, -382335, 1286493, 2626818, 2144560, 835341, 945453, 2819388, 4366336, 3985276, 2642503, 2176152, 2636003, 2599925, 1549048, 487839, 214504, 256785]
38892B56785l25198m60300l6690K16181j13535l70681P2722P42812P47058J04826
38882H33980l19875p8016L56546M23263J95909O795j11016k24284k08434j10561
38872G64307l35615q85005r06309J39954J242007R15119n43368j176982r1053
38863h76945J222192J031217k29965q05184j90583M08853M4744p09589p79130
38854h84390j22163K96287j52475q83017p89988K62389J090841O94848l10937
38845g98605n24938J92100N47287j61387r93534q57088l6754N14925N88705N78450
38835i50839N84292N00002M71769N27581L05647j69584j88316L49958K73261j034803
38825F68968k030641q91718J510627K429789J024776o01916o05423J86574M7147
$$ y = [256785, -68413, -528713, -565403, -349222, -462757, -833438, -760716, -17904, 729154, 833980, 514105, 436089, 792635, 1215898, 1411807, 1418602, 1307586, 1083302, 874868, 764307, 428692, -456313, -1362622, -1222668, 19339, 934458, 391090, -785892, -876945, 345247, 1376464, 1146499, 341315, 150732, 559585, 604329, -105260, -884390, -1006553, -710266, -862741, -1745758, -2535746, -2273357, -1182516, -487668, -798605, -1323543, -1131443, -584156, -745543, -1739077, -2596165, -2632919, -2117994, -1529289, -950839, -366547, 133455, 605224, 1132805, 1438452, 1268868, 1080552, 1430510, 1703771, 668968, -1361673, -2253391, -742764, 1687025, 2711801, 2109885, 1504462, 1691036, 1738183]
38816A738183r11899j182286k75203O91979O77054m3043m75801j61806M28301
38807D85479N41504M5122m08196k28180K89387L53787k15574p77121p80113l73003
38797a066908P160J68423J40779N5862J73553N92490Q47649L24158p57128j324198
38787h38160p33080L93463R60619O69574J08975j56987j66850k66114n24291o03079
38777a155930k44554K17657J67017l64478n63955j8409N25911K80790k12488J24145
38767a244294J016862J072927K8351o55194j4862Q91176O36032m42700r70687
38758C17611o82541m78923o76256n82603J14336P47600P88378N94088O05035N94929
38748A341654K54268j12751q6500J03810o3744n20965o57188j85612M84107P57651
$$ y = [1738183, 826284, -356002, -631205, 60774, 737828, 694785, 218984, 57178, 485479, 1026983, 1072105, 663909, 435729, 725116, 1078903, 863329, 86208, -693905, -1066908, -1059748, -891325, -750546, -694684, -521131, 71359, 919008, 1243166, 486038, -838160, -1571240, -1177777, -217158, 452416, 561391, 404404, 237554, -28560, -552851, -1155930, -1400484, -1182827, -1015810, -1380288, -1944243, -1962652, -1436741, -1155951, -1368439, -1244294, -227432, 845495, 873846, 218652, 203790, 1094966, 1730998, 1288298, 317611, -364930, -843853, -1520109, -2102712, -1988376, -1240776, -452398, 141690, 746725, 1341654, 1595922, 1483171, 1396671, 1500481, 1436737, 915772, 258584, 72972, 557079, 1314730]
38738A314730M41599j68063n49556l75883J03629K27425k70759q11290p17778
38729h05946k17883r5689m08928l48891L86668R25742N12079k47583k87566K51582
38719c36415L20816k79399o15060k20577J86380K6428j97035J2153P8398n98824
38709a623135j240236n98545R99858J808155R86911l23138o41563K8832N85933
38700a6928M05871j29209l88879k14557Q6612J64521J8150k055K94604N33779
38690G51909K58292k35155j44408N75864Q95557J38602q79342r03934m2245M33476
38680H48616j8703n40625l31737K22701M32559M28236N62252L99439n42568j456814
38670C356j050189L08388P57031k62778r09413K97168J920396J467543r02271
$$ y = [1314730, 1756329, 1588266, 1038710, 662827, 766456, 993881, 723122, -88168, -805946, -1023829, -1119518, -1528446, -1877337, -1490669, -564927, -52848, -300431, -587997, -336415, -15599, -294998, -910058, -1130635, -944255, -917827, -1114862, -1102709, -1024311, -1623135, -2863371, -3461916, -2462058, -653903, 333008, 9870, -631693, -602861, -16928, 388943, 259734, -129145, -343702, -257090, -92569, -74419, -76474, 218130, 751909, 1010201, 775046, 630638, 1206502, 2102059, 2240661, 1361319, 457385, 415140, 848616, 829913, 289288, -42449, 180252, 612811, 1041047, 1603299, 2002738, 1460170, 3356, -1046833, -738445, 18586, -244192, -1153605, -856437, 1063959, 2531502, 1629231]
38661A629231k447423j601116J85934R00754O25005O44873J072590Q40762l01611
38652A548999j125142n39006Q79287J442667K80654j569733k204391j032065M78251
38643a840479O63070j63974l33446N79883J127697L48034o42817m25311M30795
38634b56548K72695r68579j552449m32359J300003J905580J037263k45939r08975
38625A50692p99419l40922J06008M73427P74916Q72495N87266j7839o63961j126722
38615A5941j232994p19581M04659J366866J169575j46577j373859j536635q26270
38606b878875P9622Q34348J164325P02015k47006n83243J22159P86102L68018
38597C47465m66196l97171M15004O35174p6471o30399l18492K35977K54485j23382
$$ y = [1629231, -818192, -2419308, -2233374, -1332620, -707615, -62742, 1009848, 1850610, 1548999, 423857, -115149, 764138, 2206805, 2487459, 917726, -1286665, -2318730, -1840479, -1177409, -1341383, -1674829, -1094946, 32751, 380785, -262032, -687343, -256548, 16147, -952432, -2504881, -2937240, -1637237, 268343, 1305606, 1059667, 150692, -648727, -989649, -883641, -410214, 364702, 1237197, 1824463, 1806624, 1142663, 15941, -1217053, -1936634, -1531975, -165109, 1004466, 857889, -515970, -2052605, -2878875, -2799253, -1964905, -800580, -98565, -345571, -928814, -806655, -20553, 347465, -118731, -515902, -100898, 534276, 457805, -172594, -491086, -255109, -624, -124006]
38587a24006l47321k41714N1494K94065J59639l67465o14031k252Q30806O63806
38577C03021m61523j109014m92946M33472N22476Q8618J61762P56989Q88030Q3192
38567A174077r35029j163341m27791N40978R09412N21755r3240m48145n99094
38558e20418p41765o65325j24643M76033M69263n0861l23867j07809K0999k40520
38548a808913l67109K5995M11632J79748l23415l18654J82258M27127Q8711l02392
38538a805012j89115K67155M98112K75624q8166j53346J99483O80964Q51114M92983
38528A029796j81298o80612o55783k16264J93963K30536j05317n91358r23319
38519a899656p30891J15075R92849Q63900l56131j253048n55079J025770J631046
$$ y = [-124006, -471327, -713041, -661547, -367482, -207843, -575308, -1189339, -1191591, -360785, 303021, -158502, -1267516, -1760462, -1326990, -804514, -715896, -554134, 202855, 1090885, 1174077, 239048, -924293, -1352084, -811106, 98306, 620061, 526821, 78676, -520418, -1262183, -1927508, -2052151, -1576118, -1106855, -1157716, -1481583, -1589392, -1568393, -1808913, -2176022, -2150027, -1738395, -1558647, -1882062, -2200716, -2018458, -1591331, -1502620, -1805012, -1994127, -1726972, -1228860, -953236, -1041402, -1194748, -995265, -314301, 536813, 1029796, 848498, 167886, -487897, -704161, -510198, -279662, -384979, -976337, -1899656, -2630547, -2515472, -1522623, -658723, -1014854, -2267902, -2822981, -1797211, -166165]
38510a66165P81642j65087j86230J58182J03987n9891R1306J46293k13145l43974
38500A46918K29447P52920M47996j12825r4022Q185o55960j429891r81847L78999
38490a310080R57090J93759o66162n84514L1926L97159M14967L14457J80492J25039
38480E4133J95771J04399k63432l55950J84882O60725L93192N1385N07587R99515
38470B532207K38868j091819j109382R8998M57084o10945j163606p6061J020364
38461B95708N31770m76837k89745M88519J29240j081304j147796M62168J883568
38452G95291J392805m46935j675847j218383J82803J021004O88012p9062m04713
38443B54975m06435n87223o69522r9453O20297M76058k31943j61786P55952R75453
$$ y = [-166165, 615477, 450390, 264160, 422342, 526329, 466438, 557744, 704037, 490892, 146918, 376365, 1129285, 1577281, 1464456, 1370434, 1378619, 722659, -707232, -1689079, -1310080, -352990, -159231, -825393, -1409907, -1377981, -980822, -565855, -251398, -70906, 54133, 249904, 354303, 90871, -265079, -80197, 580528, 973720, 1025105, 1532692, 2532207, 2771075, 1679256, 569874, 668872, 1125956, 515011, -648595, -724656, 295708, 827478, 350641, 60896, 549415, 678655, -402649, -1550445, -1088277, 795291, 2188096, 1741161, 65314, -1153069, -970266, 50738, 738750, 659688, 254975, -151460, -738683, -1408205, -1507658, -887361, -411303, -643246, -805032, -49080, 926373]
38433I26373j14352j014168m74461N05263L47592o41918r72135l17936L13388
38424a442354L67752L73617Q01612J226030Q36336n37153j937031j969707m09983
38415b690881J189996J322746N75148N66571J168974O82759j063312j994098r54981
38406a197078N04322P06750K75917M83050Q92745M46786m56178p66885n76339
38397C13090m39851k0247Q92365J138481j45993j623213j501974l12769J50471
38388a549640j41471J97844J133070J206284K58413k59346J01514J33209o25149
38379D54728r72125k47874M50481J68721m01032l12886Q7838N9585j76617k1073
38369i10254L57639M11961J82628O6865L6099k22684o37318p53939l12731M44227
$$ y = [926373, 812021, -202147, -676608, -171345, 176247, -465671, -1437806, -1755742, -1442354, -1074602, -700985, 100627, 1326657, 2162993, 1625840, -311191, -2280898, -2690881, -1500885, -178139, 397009, 963580, 2132554, 2815313, 1752001, -242097, -1197078, -692756, 13994, 289911, 772961, 1665706, 2112492, 1656314, 889429, 313090, -126761, -147008, 745357, 1883838, 1737845, 114632, -1387342, -1700111, -1549640, -1691111, -1493267, -360197, 846087, 1104500, 845154, 946668, 1079877, 454728, -517397, -765271, -314790, -146069, -547101, -859987, -772149, -712564, -889181, -910254, -552615, -140654, 41974, 108839, 144938, -77746, -715064, -1469003, -1781734, -1337507]
38359a337507R47256P38253p6770q57917j108331r33151n86947L4482R52770J537746
38349f90116J103621n7864q95934q38567l00815J5496j10004l56361k93130J12230
38339b311444M01720K78257J79691N93129R80309M15599o94016q79981Q3923P06582
38329b46231K48963n2618P01496J292638M62744p88856q80045k93725m06318p75120
38319g37072m9601J136366Q53638p48185j390792k41506R15324O71545q3480j51778
38309A74459J881n01272j143395p64267O28505J790539J651387L40161r50055
38300A227943j110690m04585j62776p51045p92999N87989J895498J268529n66885
38291A190979j387619q40721m00021l80766L41611J572234J538094j2570j052919
$$ y = [-1337507, -390251, 348002, 271232, -586685, -1695016, -2628167, -3215114, -3180632, -2227862, -690116, 413505, 355641, -540293, -1378860, -1679675, -1664179, -1774183, -2130544, -2423674, -2311444, -1909724, -1631467, -1451776, -858647, 121662, 537261, -156755, -1036736, -952813, -246231, 2732, -49886, 651610, 1944248, 2406992, 1618136, 738091, 444366, 38048, -737072, -786673, 349693, 1203331, 455146, -935646, -1177152, -261828, 409717, 326237, 174459, 176340, -324932, -1468327, -2232594, -1604089, 186450, 1837837, 2177998, 1227943, 117253, -287332, -450108, -1201153, -1994152, -1406163, 489335, 1757864, 1190979, -196640, -1037361, -1437382, -1818148, -1476537, 95697, 1633791, 1621221, 568302]
38282E68302n16368J64281j25462k51288P53622J523492N42985j148055j436311
38273G5198j93929R43804J014410L65712m40582r66954p38469P3551M14629j93393
38263C53977p06309j09730R00693R66204R0835n94278n55307j96860J05983K77642
38253E32850J64184k45099n21526l88040j75535j34897O3938N25789O03225m7380
38243C77509o66949n45996k12439m33362p18417m9419J295845J880658J011715
38234A939145m48712j221271q90442l9913M34748K09760p9984L25947J027396
38225A256674P79850n92121j578455r71268M14741R25022K66534m84334n49854
38216e33211q6631N00646Q89299O92897j16350p84204n95387R781l0270p87915
$$ y = [568302, 51934, 216215, 90753, -160535, 593087, 2116579, 2659564, 1511509, 75198, -118731, 825073, 1839483, 2205195, 1764613, 797659, 59190, 132741, 547370, 353977, -352332, -462062, 438631, 1404835, 1495670, 901392, 346085, 149225, 255208, 532850, 697034, 451935, -69591, -457631, -633166, -768063, -704125, -178336, 424889, 377509, -289440, -835436, -1047875, -1481237, -2199654, -2249073, -953228, 927430, 1939145, 1490433, 269162, -621280, -661193, -226445, -16685, -96669, 229278, 1256674, 2036524, 1444403, -134052, -1105320, -690579, 234443, 500977, 16643, -533211, -619842, -119196, 770103, 1463000, 1346650, 562446, -32941, -23160, -53430, -841345]
38206h41345j127701k93110R94256J423759O90288k39917l80190J33809L92860
38197G52709K9745l15757j6373O12693Q62816O16188J57635n00454j274369j448349
38187e23516n28972O22833O88609k11180p15181k48503L99786N27378K60576j89794
38177H2036o96425o37884M13425J444314J049052k91471q19930l87121m73575
38168c17579j102785m61303J557379K323159N47206j300773p63786P82048O33012
38159A896578q58800j317078m02505J71834q7919o9591L82391K06408n51755n63669
38149a194106L82603R08875L23437m47740n65462l15566j09804J52512M52913
38140d12338N66280O70584R60228Q85372Q929p86068m39428L47972O6369j012257
$$ y = [-841345, -1969046, -2262156, -1267900, 155859, 846147, 606230, 226040, 359849, 752709, 782454, 466697, 450324, 1063017, 1925833, 2542021, 2699656, 2199202, 924833, -523516, -1052488, -429655, 258954, 47774, -667407, -915910, -516124, 11254, 271830, 82036, -614389, -1252273, -838848, 605466, 1654518, 1363047, 543117, 155996, -317579, -1420364, -1881667, -324288, 1998871, 2546077, 1245304, 481518, 1263566, 1896578, 1037778, -279300, -681805, -509971, -597890, -667481, -285090, -78682, -630437, -1194106, -811503, 97372, 420809, -26931, -592393, -907959, -1017763, -865251, -412338, 153942, 824526, 1784754, 2670126, 2679055, 1892987, 1453559, 1801531, 1867900, 855643]
38130H55643j178674j62926M63256K5851k63145L26503P39821J62835m49178q0323
38120D39663N63995L05153n63716q80612m25104K9771J9117j70900q5828M36938
38110c31523J084929J089678o666j392559j591877l82897P50438N85819k83170
38101d77828n30107M0962N60119M90561R8936k02272k56537m2733K88019L75214
38091C44334J10979k2730M12787R43873N64721q34458j953593j497713J10591
38082a821209J086419N04474n20297m34267N65133R51346K29442m28233j49262
38073a6454L60750J88624k98159l15699r6461l00930o47147l39774N12022J021163
38063F7935Q44188M22720J17811m1892K462J60758j9231o10091q08947o6953Q04519
$$ y = [855643, -323031, -485957, -22701, 3150, -259995, 66508, 806329, 969164, 519986, 439663, 1003658, 1308811, 745095, -135517, -560621, -530850, -511733, -682633, -768461, -331523, 753406, 1843084, 1836418, 443859, -1148018, -1530915, -780477, -194658, -477828, -1007935, -966973, -406854, 83707, 182643, -19629, -276166, -318899, -30880, 344334, 455313, 432583, 845370, 1789243, 2353964, 1519506, -434087, -1931800, -1821209, -734790, -230316, -750613, -1184880, -619747, 331599, 561041, 132808, -16454, 344296, 532920, 234761, -80938, -177399, -478329, -1125476, -1465250, -953228, 67935, 912123, 1334843, 1452654, 1410762, 1413224, 1573982, 1554751, 944660, 135713, 68760, 873279]
38052H73279P06090l7599k11937L92378Q40000N73906j10455r04322j597210j557558
38042a033428m01795R17910J025284J18439k91010K78387O34725m1650q84735
38033C22127p38563J72019P25532M08794k97716o75867m84904o5583J28535R5822
38023d09804J32059J20378l32812q46916l94138R47029J574037O50567m49160
38014I91240l01566K43629l26654j369361j092099L06267R10068K71425p7348
38005d44399N46596R03952J02559r92750j258550o86422K01468R64930J067651
37996D05035M00032q4871L40924O64850l03861j424573o77236J186466J306579
37987A813345p61707k196304j280788L35990Q30352P53068R22501N26488p82751
$$ y = [873279, 1579369, 1541770, 1329833, 1722211, 2562211, 3136117, 3025662, 2121340, 524130, -1033428, -1435223, -517313, 507971, 626410, 335400, 613787, 1248512, 1206862, 322127, -416436, -244417, 481115, 889909, 592193, -83674, -568578, -634161, -505626, -409804, -277745, -157367, -490179, -1337095, -1731233, -784204, 789833, 1440400, 991240, 689674, 933303, 606649, -762712, -1854811, -1548544, -638476, -367051, -444399, 102197, 1006149, 1108708, 115958, -1142592, -1829014, -1627546, -662616, 405035, 805067, 720196, 1061120, 1725970, 1422109, -2464, -679700, 506766, 1813345, 1051638, -1144666, -2425454, -2089464, -1259112, -506044, 416457, 942945, 160194]
37978A60194j300988P8368J592477J161017m09204r05419o8853N87599L21341
37969A216532l14928p43366p20006j45368M73342L13043l29406k62806L83624
37960a29339J13674j020043r14648R25821J955236O32299q64128l59918N63163
37951I02117m23957j983273j310150R34571J695849M91156m05646j46463q0786
37942c26582n68056m20395L82663N09465m3927L8565O34806L15370o91671o46468
37932h16230L91993M60069p15358j112704k4217Q01879M44561J90825O18139L46248
37922E85205r81221j418352k8112J264824R01846J72551N18687Q61255r9561j133030
37912F44092n61294P03468P79238p960j38263J62885l37237j127883o46130P89537
$$ y = [160194, -1140794, -1062426, 530051, 1691068, 1281864, 376445, 307592, 895191, 1216532, 901604, 158238, -561768, -707136, -233794, 79249, -250157, -512963, -129339, -15665, -1035708, -1950356, -1024535, 930701, 1563000, 698872, 338954, 902117, 478160, -1505113, -2815263, -1880692, -184843, 306313, -99333, -245796, -326582, -894638, -1315033, -932370, -422905, -466832, -428267, 206539, 521909, -169762, -816230, -424237, 35832, -679526, -1792230, -1816447, -1014568, -570007, -379182, 238957, 585205, -396016, -1814368, -1842480, -577656, 324190, 496741, 1015428, 1876683, 1777122, 644092, 82798, 786266, 1565504, 1557544, 1419281, 1582166, 1244929, 117046, -529084, 260453]
37902B60453J290529M32932l70980m72871o69648j119165q10827L50682R15416
37893a93479J42675p51780n24501K70039M18366l0212j26744L18076N49146J47985
37883B19571l94846m96648k58223j41050k31150k39106j23750j88482l78233q7176
37873b319093P88930J188069K33820j099877r80395N91107J543196O60487o99121
37864i2877o93443M56432J190494R23163L11253j41419m31525m03874M8567L89796
37854A556567Q8848m15299l86707p7417k46352p05043n61609K17186O96913M42275
37844F09362k4470k84479m58298m98420j36330L15106J83108l45429l12674M42116
37834e10408R14996N01446j77727m69695n79053o65028k07082Q56043J368398
$$ y = [260453, 1550982, 1983914, 1612934, 1140063, 470415, -648750, -1459577, -1108895, -193479, -50804, -802584, -1327085, -1057046, -638680, -668892, -795636, -477560, 71586, 219571, -175275, -671923, -930146, -1071196, -1302346, -1541452, -1665202, -1853684, -2231917, -2319093, -1530163, -342094, -108274, -1208151, -2188546, -1597439, -54243, 606244, -92877, -786320, -329888, 860606, 1783769, 2095022, 1953603, 1522078, 1118204, 1166771, 1556567, 1645415, 1230116, 843409, 765992, 519640, -185403, -747012, -529826, 167087, 609362, 584892, 300413, -157885, -656305, -792635, -477529, -294421, -639850, -952524, -510408, 404588, 906034, 728307, 258612, -320441, -985469, -1192551, -336508, 1031890]
37825A031890M49477r62677j209059j03192J037586J220928N96090l15331j105203
37816F40509j242632m36870N81551N91237m90072j310025q10515M43110J145928
37807h87779Q98771L74864J83571J96110j0465m59804p16264m66889l8512o3402
37797i89799m93660m16083O00449J423999O65959j044447j473554Q1563J515243
37788a30330Q22121r62216j332106j7849Q73522K47829n62204k71905M09035L53219
37778e70884l7660J52830N61165L03496k81849k52151J17420k01582r69362q65529
37768b044106K21119Q20968K45108k97850K63143J101214Q48919l17475j135542
37759b94502j089572o25348l8445O67980J072699O30464l12604p52325l81794
$$ y = [1031890, 1481367, 518690, -690369, -793561, 244025, 1464953, 2061043, 1745712, 640509, -602123, -1038993, -457442, 133795, -356277, -1666302, -2476817, -2033707, -887779, 10992, 385856, 569427, 765537, 755072, 295268, -420996, -887885, -926397, -989799, -1483459, -1899542, -1299093, 124906, 790865, -253582, -1727136, -1645573, -130330, 691791, -270425, -1602531, -1620380, -746858, -499029, -1061233, -1333138, -924103, -570884, -608544, -455714, 105451, 408947, 127098, -125053, -7633, -209215, -1178577, -2044106, -1822987, -1002019, -756911, -1054761, -791618, 309596, 1158515, 841040, -294502, -1384074, -2009422, -2047867, -1379887, -307188, 323276, 10672, -741653, -1123447]
37750a123447R8709J40873P275L5624J1283k98375n58616l33061K01402M73814
37740a344519K86669n312j3750K63571N45045O14324N05950L67372J96566j21984
37730A293932m56299l96076J22634M48184j966p44068p27368J14993O47017K03752
37720E04735l79296j16548M79777J87589q46561j106859M6119J301001J145348
37711A215305j59190j095720q52407q912M67080K61866j64391j04647O12182J169923
37701A341089N23857j087019k020367j207811L74172J014840M79196j04003q5713
37692g71759J98948M68318O76530L26119q72797j690451n50784J682709K169433
37683A636266J61063j548780o80025J087409Q66904q79142j315771J04834J026621
$$ y = [-1123447, -1024738, -883865, -876590, -840966, -829683, -1128058, -1686674, -2019735, -1818333, -1344519, -1057850, -1063162, -1076912, -813341, -268296, 346028, 851978, 1219350, 1415916, 1293932, 837633, 441557, 564191, 1012375, 1010409, 266341, -461027, -346034, 300983, 504735, 125439, 8891, 488668, 676257, -170304, -1277163, -1231044, 69957, 1215305, 1056115, -39605, -892012, -900924, -433844, -171978, -336369, -441016, 171166, 1341089, 1864946, 777927, -1242440, -2450251, -2076079, -1061239, -582043, -686046, -771759, -572811, -104493, 572037, 898156, 25359, -1665092, -2215876, -533167, 1636266, 1797329, 248549, -431476, 655933, 1522837, 643695, -672076, -567242, 459379]
37674D59379K52774n35329O6441Q80976M09692n89213n17742M04438O84593l106
37664A512903n49192k51083M11346P42465N36747j29326r49311j263669o50742
37655e89862L33680O63683J45123l72296j86068L94317O05961K54422j81251l03918
37645G63791k60605l20267l12526Q6973O09225N37296k17469q28435p21566l44707
37635a008290k24807o0679M08622N00535k15586o25469L55990J497683O61073
37626A289072j617294k354667m35199J704417J734599N06000l7068O4765k04761
37617F49864m16421L65267J312567Q90664m45791q71692j40247K71701j80234
37608A435678m55065n6088K04783p7165k31549m585o5059n39556n94671J4231
$$ y = [459379, 712153, 176824, 243265, 1124241, 1533933, 944720, 426978, 831416, 1516009, 1512903, 963711, 712628, 1123974, 1866439, 2403186, 2273860, 1324549, 60880, -589862, -256182, 407501, 552624, 180328, -5740, 388577, 994538, 1248960, 1067709, 763791, 503186, 182919, -129607, -42634, 566591, 1103887, 886418, 57983, -663583, -1008290, -1233097, -1293776, -885154, -384619, -600205, -1225674, -869684, 627999, 1289072, -328222, -2682889, -3118088, -1413671, 320928, 826928, 789860, 854625, 649864, 233443, 598710, 1911277, 2801941, 2356150, 1484458, 1344211, 1615912, 1435678, 980613, 924525, 1129308, 1052143, 820594, 816009, 750950, 211394, -383277, -369046]
37598c69046M59335L96152N01463R29779Q10215m4270n30139j95675j66711j054583
37588G36520j539379m66004J025970J155978K23840j56470K09001J13821o09691
37579F93586o87276L29631J149017P20502k21551m17489R2556L37316M0917p1127
37569A966082M84861J115199Q53131l59197j443518j371269l75378L61151J84162
37560A415224l45791m09690l4673J84622O5928m4164L0268M3739j73422l77423
37550C54618k33773K04049M84081K69526j45497o4863O13220R36760N4785j322491
37540A150415j538424k55258R23190O69009k08848r7066R60673J436718O76995
37531C717404k97679n50664n29525r68244j445210j025782R1363O30266K9962
$$ y = [-369046, 90289, 486441, 987904, 1917683, 2727898, 2683628, 2153489, 1957814, 1791103, 736520, -802859, -1268863, -242893, 913085, 1136925, 980455, 1189456, 1303277, 693586, 6310, 335941, 1484958, 2205460, 1983909, 1566420, 1658976, 1996292, 2037209, 1966082, 2450943, 3566142, 4419273, 4060076, 2616558, 1245289, 869911, 1231062, 1415224, 1069433, 659743, 625070, 809692, 875620, 831456, 861724, 905463, 732041, 354618, 120845, 324894, 808975, 1078501, 933004, 868141, 1481361, 2418121, 2472906, 1150415, -388009, -643267, 279923, 948932, 740084, 643018, 1603691, 3040409, 3717404, 3419725, 2869061, 2339536, 1371292, -73918, -1099700, -1008337, -378071, -348109]
37522c48109p08374m53989L95768N07877l54415r00207k07450Q98170J101797
37513f8932N03364J87921L30323O9372p24920r60818p1411R38018R20924J42810
37503A266651m11196n26909o46814p98644n90621n2902K92220J66531j36890j26113
37493a564687L87360R85795Q96494K405o09488k808Q77875K43866j591413k106642
37483b481243k04698J904472J831010L35522l14901R8531J41882k75875P7040
37474A111740J039637R49475m84569j501167j045115j85676o3034k59138r9720
37465e37567M9828j91034k55039K78124P37702M66813q4199k12849k8593Q8510
37455C11696K14873L52084M7534p15828j075000m69609M67221Q52431O54728K68546
$$ y = [-348109, -1056483, -1510472, -1114704, -606827, -961242, -1861449, -2068899, -1170729, -68932, 434432, 622353, 952676, 1022048, 297128, -663690, -735101, 202917, 1123841, 1266651, 855455, 328546, -318268, -1116912, -1707533, -1760435, -1468215, -1301684, -1438574, -1564687, -1177327, -191532, 704962, 707367, 97879, 95071, 972946, 1216812, -374601, -2481243, -2685941, -781469, 1049541, 1385063, 1070162, 1168693, 1310575, 1034700, 1111740, 2151377, 3100852, 2616283, 1115116, 70001, -115675, -178709, -437847, -537567, -487739, -678773, -933812, -655688, 82014, 548827, 464628, 251779, 223186, 311696, 526569, 878653, 926187, 210359, -864641, -1334250, -867029, -14598, 640130, 908676]
37445I08676k14003o73535o78089j83405J63029j2770k15683N7123N48981P57698
37435D58022N34007o9841p32243o00170P40041J976318J305737p69010j707502
37426A135359n76382O17399K22523n99852k48395N39562L30195k84401J8653N69400
37416A724061j43956j450510j290175L31768J251843N52390l06942j22325L96219
37407I42373K48545k62001l18994J88395P74564Q71460J18597j088512j586262
37398a11835q76458n5445k01739n79190O6324J191816J314918N71633K77422L71431
37388A968877l03493j357894j128271K24296O20875l68215o27069Q45432K049386
37379A923924J202881m93385j004733m09884L9035J04531R6436k69587r11770
$$ y = [908676, 694673, 21138, -656951, -840356, -677327, -690097, -905780, -848657, -299676, 458022, 992029, 922188, 189945, -410225, 329816, 2306134, 3611871, 2842861, 1135359, 558977, 1176376, 1398899, 799047, 550652, 1090214, 1420409, 1136008, 1154661, 1724061, 1580105, 129595, -1160580, -828812, 423031, 975421, 668479, 546154, 942373, 1190918, 928917, 609923, 798318, 1572882, 2444342, 2562939, 1474427, -111835, -988293, -1043738, -1245477, -1824667, -1758343, -566527, 748391, 1320024, 1597446, 1968877, 1665384, 307490, -820781, -596485, 24390, -343825, -970894, -125462, 1923924, 3126805, 2633420, 1628687, 1218803, 1257838, 1362369, 1458805, 1189218, 277448]
37370B77448p43697M24385R14151j76905j035195R3317J760641J435127m52210
37361B497062j324223n58703Q7951j24595P979Q71939J024041k23671j394290
37352H63490j084429P1780O98321N46567R8827m88542j039012r09034J24978J188754
37342G1700J312028N94481k02806o69729q04330n90986r2752L89665O42733O92851
37332A342855M52739k47220j037987j081868j96673O57451N47467k02438n06237
37323b71911M4484P80021Q72860K22010n77568q80554n97807k63752m09160q34455
37313a915832p62932J25712J091012J098219J09425p43916m32986P19286J355499
37304F43487O97924m67113p42824J06387Q66969M85406n77517j030129m43221
$$ y = [277448, -466249, -41864, 872287, 695382, -339813, -246496, 1514145, 2949272, 2497062, 1172839, 614136, 702087, 577492, 585471, 1457410, 2481451, 2257780, 863490, -220939, -149159, 549162, 1095729, 1194556, 706014, -332998, -1242032, -1117054, 71700, 1383728, 1978209, 1775403, 1105674, 301344, -289642, -382394, 7271, 650004, 1342855, 1795594, 1548374, 510387, -571481, -768154, -110703, 436764, 234326, -271911, -227427, 552594, 1425454, 1647464, 1069896, 189342, -408465, -672217, -1081377, -1915832, -2678764, -2553052, -1462040, -363821, -254396, -998312, -1431298, -712012, 643487, 1341411, 874298, 131474, 237861, 1104830, 1590236, 1012719, -17410, -460631]
37295d60631L33722M21432K2178k1076M84968P14144l2169j115542j136006J27915
37285f61065J121318N37205o93774n95242R35287J864529R50268n66187r63671
37276A928668m14386j90282n08349n89901k83073j91595m20451m56984k04847
37267a331200k4593J40744N74802Q57266L35537n21313n55247J95544M44401k16148
37257a00207o05714L9548P81503N87353l5602j14598J42578L9513j41857K22096
37247H14613O48544K74357m03517j93450N48375J93813j362710k074769p23676
37238b278420J140891J456995M77962j66433j44681l00374m97544K85797J697008
37229A671201J905151L49198j172242j083200k17457k43009j089194j345122m62125
$$ y = [-460631, -126909, 294523, 316701, 295625, 780593, 1494737, 1462568, 347026, -788980, -661065, 460253, 997458, 303684, -291558, 643729, 2508258, 3458526, 2892339, 1928668, 1514282, 1324000, 815651, 225750, -57323, -248918, -669369, -1126353, -1331200, -1355793, -1215049, -640247, 217019, 552556, 31243, -524004, -328460, 115941, -100207, -705921, -666373, 115130, 702483, 666881, 552283, 694861, 734374, 592517, 814613, 1463157, 1737514, 1333997, 1140547, 1688922, 1882735, 520025, -1554744, -2278420, -1137529, 319466, 797428, 630995, 486314, 185940, -311604, -25807, 1671201, 3576352, 3925550, 2753308, 1670108, 1452651, 1209642, 120448, -1224674, -1686799]
37220a686799P89775J573464J516972M91004r38316j315282Q8173J784252J633523
37211C936766k66303j736828j523532n42433N6569L49311N79490K63598o77723
37202D38915j171743m78840N33293O60233R6269j71277j0096k2325k37133j02364
37192d65068L90101O14582L70279J62042K87930L74073P9979k97784l19575j53641
37182A042918l14428o88939m33862P29933J622436R30145p11393j244404j48262
37173G84144O38101k93085j462373q03509R44462J378141K21478n36562p4599
37164G96198L09066n6668r6294O78477J070830L66853n06239q86864j327394j737254
37154a389289q96128J023511J834957O70839m34278O3423O96905j33011j201504
$$ y = [-1686799, -897024, 676440, 2193412, 2684416, 1746100, 430818, 518991, 2303243, 3936766, 3670463, 1933635, 410103, -132330, -75761, 273550, 853040, 1116638, 438915, -732828, -1211668, -678375, -18142, 78127, -93150, -103246, -125571, -362704, -465068, -74967, 539615, 909894, 1071936, 1359866, 1733939, 1813918, 1516134, 1196559, 1042918, 728490, 39551, -394311, 335622, 1958058, 2888203, 2176810, 932406, 784144, 1422245, 1129160, -333213, -1136722, -192260, 1185881, 1407359, 870797, 796198, 1105264, 1048596, 952302, 1630779, 2701609, 3068462, 2562223, 1675359, 347965, -1389289, -2285417, -1261906, 573051, 1243890, 809612, 873035, 1569940, 1436929, 235425]
37145B35425q43600n5907l77655o51098Q67257K709638K049693n72446j898942
37136A462365r25726J30525j72200p06329l76989K55262N73311Q34923R62765
37127B037907L70268o27192r79171o13821l24364j13099N42816J076218M77932
37118A847494p14953j100661p17380n69487m02686O35192J644966J016926n22570
37109A116841p75448K54643N88773k246J48897R58327M35776j338277j816067
37100d28781m18324M08494k66289j86936J538086K179420P8632k013533j237719
37091c46950P87733R16972m84260q46136J51713P92442O60542O59498O33403k26529
37081B698428j292889j284816n32231k85251m31823J7350Q12209Q51770J81410
$$ y = [235425, -608175, -664082, -1041737, -1692835, -825578, 1884060, 3933753, 3361307, 1462365, 536639, 667164, 494964, -211365, -588354, -333092, 240219, 1075142, 2037907, 2408175, 1780983, 801812, 187991, -136373, -249472, 293344, 1369562, 1847494, 1132541, 31880, -685500, -1254987, -1657673, -1022481, 622485, 1639411, 1116841, 341393, 596036, 1184809, 1182563, 1331460, 2289787, 2725563, 1387286, -428781, -847105, -438611, -704900, -891836, 646250, 2825670, 2904302, 890769, -346950, 440783, 1357755, 873495, 27359, 179072, 971514, 1632056, 2291554, 2924957, 2698428, 1405539, 120723, -411508, -696759, -1128582, -1111232, -299023, 552747, 734157]
37072G34157j98425l5602K14944N15060Q84180O75114l71143j171300p61406K05974
37062F91553P00525Q97869J165005Q23708m46978j314019o93125L11170K19469
37053B355177l52562m5400O69442M78457k56246k40783L40648L76860L3072K39653
37043C598318O96466N18220J51959N02627Q77104M2014j317335j481398n03763
37034C084212R1562j08015l25668n06277j013954j031089K92105J634829J063821
37025C181526o13232q12139O92077J451714L20367j039028j083680l12854L28883
37016B113634P38080P85785J72421m43730n6917P86692O58220k27028l59048K55316
37006D423425J09337r00092j239998o54695n20935q83303j31635J620325J952505
$$ y = [734157, 535732, 500130, 715074, 1230134, 2114314, 2789428, 2418285, 1246985, 485579, 691553, 1392078, 2289947, 3454952, 4278660, 3831682, 2517663, 1824538, 2135708, 2355177, 2002615, 1957215, 2626657, 3105114, 2848868, 2608085, 2948733, 3325593, 3358665, 3598318, 4294784, 4813004, 4964963, 5467590, 6344694, 6386708, 5069373, 3587975, 3084212, 3175774, 3067759, 2742091, 2235814, 1221860, 190771, 482876, 2117705, 3181526, 2568294, 1756155, 2448232, 3899946, 4220313, 3181285, 2097605, 1784751, 2113634, 2851714, 3637499, 3809920, 3366190, 3309273, 4095965, 4754185, 4527157, 4168109, 4423425, 4532762, 3632670, 2392672, 1737977, 1217042, 333739, 202104, 1822429, 3774934]
36997C774934J52243j177716j47593J497179J381902L3856o85150o41258p32518
36988C455879p62551j44109N35289N36917M26062Q27269R22104r2253j190234
36979D514373r89068p7707p12o23302m23838Q79554J742705J004722n47521j187019
36969D292187k20050J280344J644017N80810l80309K153P83118L01836r99441
36960G284665j113529L05768J431236J241364P15673N01141j50056j170398r43432
36951H102432Q16810J847876P29233p22957m11010P80940R31301M16668P43520
36942A3234813J520620J296604M10044M13632J340890J915681J928702K208820
36934B4269806K754359K985905L324502M482994N765669O104593O140214P188027
$$ y = [3774934, 3927177, 2749461, 2601868, 4099047, 5480949, 5514805, 4829655, 4188397, 3455879, 2693328, 2549219, 3084508, 3621425, 4047487, 4874756, 5796860, 5704607, 4514373, 3525305, 3447598, 3446886, 2823584, 2399746, 3279300, 5022005, 6026727, 5479206, 4292187, 4072137, 5352481, 6996498, 7577308, 7196999, 7199152, 7982270, 8284106, 7284665, 6171136, 6476904, 7908140, 9149504, 9865177, 10366318, 10216262, 9045864, 8102432, 8919242, 10767118, 11496351, 10773394, 10362384, 11143324, 12074625, 12491293, 13234813, 14755433, 16052037, 16462081, 16875713, 18216603, 20132284, 22060986, 24269806, 27024165, 30010070, 33334572, 37817566, 43583235, 49687828, 55828042, 63016069]
36926F3016069Q890387J0140986J1495707J4136034J7319452J9798513K2972963
36919A67770111K9187845L7479429M4992996N2047985O0083748O3344624M9523826
36912E04430564J4108071k9532349o0281693o8588825o1597497n0907163m1343769
36905B06287339l2459126k4681726j9533725j6475228j3632368j0963653r872866
36898G8668647j0081324r504869p439887n595534n259292n328211m273982k609545
36890B8576003j927507k344304k477195j684625q81384r46082j469761j524986
36882A5320159q90297o1838M10970K44846m96092j350911j781646j644645j103071
36873H647475k87228M64960M08289o63016j528687q32613P52549J119366k04212
$$ y = [63016069, 71906456, 82047442, 93543149, 107679183, 124998635, 144797148, 167770111, 196957956, 234437385, 279430381, 331478366, 391562114, 454906738, 504430564, 518538635, 489006286, 428724593, 360135768, 298538271, 247631108, 206287339, 173828213, 149146487, 129612762, 113137534, 99505166, 88541513, 78668647, 68587323, 59082454, 51642567, 46047033, 40787741, 35459530, 31185548, 28576003, 26648496, 24304192, 21826997, 20142372, 19260988, 18314906, 16845145, 15320159, 14429862, 14368024, 14778994, 15023840, 14527748, 13176837, 11395191, 9750546, 8647475, 8360247, 8825207, 9233496, 8570480, 7041793, 6209180, 6961729, 8081095, 7876883]
36864G876883j236874n70194M95080K06412p20408l73964J061430J507610L04163
36855H550138q08874m36813N53543O95221R6295j44998K10538M52840K67024J22586
36845I557500L46257O10546N72034M74241P14359J086878J011078N89574Q22411
36836A5784878K208777L557888L180242J328952L47260J778287M216608M983590
36828C7386482L402951J332201O09798J028808J056791k11758k221438l684115
36820C8699720l853261l200619k848426l252888l702909l368530k473065j909635
36812A4090387j932464j877048j186583j56061M90789L71803l44504j178372j612905
36803F665042j346582n01901M02538P88830M83006o8833k14482Q8941J26277n40289
$$ y = [7876883, 6640009, 6069815, 6564895, 6771307, 6050899, 5676935, 6738365, 8245975, 8550138, 7741264, 7304451, 7857994, 8553215, 8649510, 8504512, 8715050, 9167890, 9434914, 9557500, 9903757, 10514303, 11086337, 11560578, 12274937, 13361815, 14372893, 14962467, 15784878, 17993655, 21551543, 24731785, 26060737, 26407997, 28186284, 32402892, 37386482, 40789433, 42121634, 42731432, 43760240, 44817031, 44605273, 42383835, 38699720, 34846459, 31645840, 28797414, 25544526, 21841617, 18473087, 16000022, 14090387, 12157923, 10280875, 9094292, 8938231, 9429020, 9800823, 9456319, 8277947, 6665042, 5318460, 4816559, 5219097, 6007927, 6490933, 6422100, 6207618, 6296559, 6422836, 5882547]
36793E882547j196856q19625L53199R73964M32249l63639l92655J53660M61823
36784E484667K68045j50563n47248p05724m05710J31472L13334P4570K3093L38928
36774D824864M42384K48459O30697J842942K631817K008359Q27554L03766J2347
36765A3773189r86206j944726j426731n0670L7423j459218k360147j349928R8511
36756D331497J92082n22070m25854M42122O16883l25789j060455l99720J126942
36747C975638J975610J416456L20818J37733J193453K269883K085171Q22910l62788
36738A3834884j019496j645115k331329k307073j251765j01720J15757m16401
36730D877742q01061o59985k45877J63633L18152j01282r08998j154003k69990
$$ y = [5882547, 4685691, 3866066, 4219265, 5193229, 5625478, 5261839, 4869184, 5022844, 5484667, 5752712, 5602149, 5054901, 4349177, 3943467, 4074939, 4388273, 4462843, 4485936, 4824864, 5267248, 5515707, 6146404, 7989346, 10621163, 12629522, 13457076, 13760842, 13773189, 12786983, 10842257, 9415526, 9364856, 9402279, 7943061, 5582914, 4232986, 4331497, 4523579, 4001509, 3575655, 4017777, 4634660, 4308871, 3248416, 2848696, 3975638, 5951248, 7367704, 7688522, 7826255, 9019708, 11289591, 13374762, 14197672, 13834884, 12815388, 11170273, 8838944, 6531871, 5280106, 5178386, 5294143, 4877742, 4076681, 3416696, 3170819, 3334452, 3652604, 3551322, 2642324, 1488321, 1218331]
36721A218331Q03923O24102p04679j531394r46176p639n9406p12734n54444N84363
36711a285753J325793Q28492R314Q9852Q03060R53333K53843m25080m81640k40992
36701A830222p8859J58709N07432M77464j63200p89385o77225L7092O38890P24145
36691B665285L81810j51158n76073n90492k62866m8395j19746j06407J65743K59271
36681A616972l4854p6254O28196J313531Q34141n68613j396262q56467J91438
36672A651828M92043j31007r06402j182514r35585m83117n5721L40581P20156
36663d89738Q41422L77042m69001q27140q6284J155069J547389N33175q88414
36654A693520j191779m8123J222255J119533k20676j149805o36506L69702L59038
$$ y = [1218331, 2022254, 2646356, 1941677, 410283, -535893, -543532, -602938, -1315672, -1870116, -1285753, 40040, 868532, 877846, 967698, 1770758, 2724091, 2977934, 2552854, 2071214, 1830222, 1751363, 1910072, 2417504, 2894968, 2731768, 1942383, 1265158, 1302250, 1941140, 2665285, 3047095, 2895937, 2319864, 1729372, 1466506, 1418111, 1298365, 1191958, 1357701, 1616972, 1582118, 1505864, 2134060, 3447591, 4281732, 3713119, 2316857, 1460390, 1651828, 2143871, 2012864, 1106462, -76052, -1011637, -1494754, -1550475, -1209894, -489738, 351684, 728726, 259725, -567415, -653699, 501370, 2048759, 2581934, 1693520, 501741, 453618, 1675873, 2795406, 2574730, 1424925, 788419, 1158121, 1517159]
36645A517159n39069r08759l43502N1002l28095n62863Q9599Q12719N78650j55739
36635B11102k83341J94666M65873L92558M55725N67375J52842o87963j130427
36626C38410p53549M8558P15533R35062N86588r6014n02086l32935l1419n5556
36616H52592j96685j58108j98160n05770n72193P291P04602Q61685O95074O42779
36606B133107M31142k14632o70168l50315J52885N6361k31120j9806J70799m02481
36596A055772r52402k20673J189457J492063N10154j73124J63909N59696L42188
36587C967040K0834j40670o30401j287977j112886o5516N29481N0166m01221K49839
36577A178689J561966K505457K737155K430976J952317K056331L158678M082023
$$ y = [1517159, 978090, 69331, -274171, -223169, -551264, -1114127, -1024528, -211809, 366841, 211102, -72239, 122427, 588300, 980858, 1436583, 2003958, 2156800, 1468837, 338410, -415139, -366581, 348952, 1284014, 1870602, 1774588, 1272502, 939567, 908148, 852592, 655907, 497799, 299639, -206131, -778324, -771033, -66431, 795254, 1490328, 2133107, 2564249, 2349617, 1679449, 1329134, 1482019, 1538380, 1307260, 1287454, 1458253, 1055772, 103370, -117303, 1072154, 2564217, 3074371, 2901247, 3065156, 3624852, 3967040, 3987874, 3847204, 3216803, 1928826, 815940, 750424, 1279905, 1330071, 928850, 1178689, 2740655, 5246112, 7983267, 10414243, 12366560, 14422891, 17581569, 21663592]
36569B1663592K951632j82433l023882l860100l320138k771963k469521k059196
36561F927991j579036j102214m55152J14211N8853l47644l11134j27323q22101
36552B356451j903526j531560M20731J672679R07563l52087m97951k07466m36424
36543D28410k89223R83346J835348P57122q48585q00163J62132k40579j623686
36534C64122j357058R34117K406376J174299j118812j921785r99679R0045L28603
36525i9772l6838k44104K28183J126589J449137O17112n22326p22961j02505K35130
36515A927645P7274J99546O37786M46694m85807q74469P8373J449257J969567
36506E425866J643803J257842J122120J121060J403617K201704L257111M025966
$$ y = [21663592, 24615224, 24432791, 21408909, 17548809, 14228671, 11456708, 8987187, 6927991, 5348955, 4246741, 3791589, 3905800, 3964653, 3617009, 3305875, 3178552, 2356451, 452925, -1078635, -657904, 1014775, 1922338, 1570251, 1072300, 864834, 428410, 139187, 1122533, 2957881, 3715003, 2866418, 2066255, 2228387, 1987808, 364122, -992936, -58819, 2347557, 3521856, 2403044, 481259, -518420, -428375, -99772, -136610, -380714, -152531, 974058, 2423195, 3040307, 2517981, 1795020, 1692515, 1927645, 2004919, 2204465, 2842251, 3288945, 2803138, 1928669, 2007042, 3456299, 5425866, 7069669, 8327511, 9449631, 10570691, 11974308, 14176012, 17433123, 21459089]
36498B1459089M245175L857945K614470K83498k661136m899949n171518l519552
36490A6208022j505180p81151j406371k029404j786889j255233j180846j195275
36482E067673o18548J57067J71071n55102j036322q03577m13380m08974n85052
36473I74856m89581q4587K97188L46380Q8850o3905K02138M93964J20048p03173
36463A182178q46267R4880J041970R62572K27068l72774r22997j592891j581538
36454a807799l51426Q97599O99467l02374k99214P23792J018144O5710n80970
36445F2929P3321R44456Q08352J34986l1509K63044L89829L15332K91359J41954
36435C394053k77336n36457k61360K46840N61550O88811O29675J26724o29172
$$ y = [21459089, 25704264, 29562209, 32176679, 32460177, 29799041, 24899092, 19727574, 16208022, 14702842, 13921691, 12515320, 10485916, 8699027, 7443794, 6262948, 5067673, 4449125, 4606192, 4777263, 4222161, 3185839, 2382262, 1968882, 1559908, 974856, 485275, 400688, 697876, 1044256, 1133106, 1069201, 1271339, 1765303, 1885351, 1182178, 335911, 430791, 1472761, 2435333, 2662401, 2289627, 1366630, -226261, -1807799, -2159225, -1261626, -562159, -864533, -1163747, -439955, 578189, 643899, 62929, 136250, 1080706, 1889058, 2024044, 1992535, 2255579, 2645408, 2960740, 3252099, 3394053, 3116717, 2580260, 2318900, 2565740, 3127290, 3816101, 4445776, 4572500, 3943328]
36426C943328q09344j09289N71657K97571o07802j087478p17598M2988N69717
36417B093750N22356m7964n97311m69207K45474O41742J51061o87593r86613o11626
36407B54069j34679n1159l84436p66854o94486j9998P15918Q38235L98635l3016
36397A22229k89924n56514n59661J02410Q13103M52382o48853p56077O09332J576508
36387H64935N83008j207672j575984l16691R53992J326363J209630Q37760k6412
36378B648929r00953p94199R1018L53320m45999j000979l03513P93482R88572
36369A429678N02215M74647J016926J139137N05783J19121R00132K327883L066574
36360A1482096K698321K297930L057438M508949M560886J706300k909384o185738
$$ y = [3943328, 3133984, 3024695, 3596352, 3893923, 3286121, 2198643, 1481045, 1524033, 2093750, 2616106, 2568142, 1970831, 1501624, 1747098, 2388840, 2539901, 1852308, 865695, 254069, 119390, 68231, -316205, -1083059, -1777545, -1797543, -1081625, -243390, 155245, 122229, -167695, -724209, -1283870, -1181460, -368357, 84025, -564828, -1320905, -711573, 864935, 1447943, 240271, -1335713, -1652404, -698412, 627951, 1837581, 2675341, 2648929, 1747976, 953777, 1044795, 1398115, 952116, -48863, -352376, 441106, 1429678, 1931893, 2406540, 3423466, 4562603, 5068386, 5187507, 6087639, 8415522, 11482096, 14180417, 16478347, 19535785, 24044734, 28605620, 30311920, 27402536, 21216798]
36352B1216798o102747l669549j505174r26276j126315j005348p41056j049614
36344E090719j678027j609060o14915K92316K08030n15622q60607m33095K79355
36335A59094O42846M39649j01992m62247k13817L78154M05218n37219j499908
36326g90222j181071K62211J201099N92287o66839r59801j3957R76938J093810
36317E14455P38963O94460Q07168L10867p42443j230835m96802N43101N50851
36308A689785l59971q50634l67238J67287o4997o01295o89040m58634l07438j3619
36298a855794N57945P04523K5380m55965K40077J098850M28905j196989j436117
36289a889185J68826J240119J38152j517738j335052L82000J424962R84889K85330
$$ y = [21216798, 15114051, 11444502, 9939328, 9013052, 7886737, 6881389, 6140333, 5090719, 3412692, 1803632, 1188717, 1481033, 1689063, 1173441, 312834, -120261, 159094, 801940, 1241589, 1139597, 677350, 463533, 841687, 1246905, 709686, -790222, -1971293, -1709082, -507983, 84304, -582535, -1542336, -1556293, -579355, 514455, 1253418, 1947878, 2755046, 3065913, 2323470, 1092635, 595833, 1138934, 1689785, 1329814, 479180, 111942, 279229, 214232, -387063, -1076103, -1534737, -1842175, -1855794, -1297849, -593326, -567946, -1023911, -783834, 315016, 743921, -453068, -1889185, -1720359, -480240, -342088, -1859826, -3194878, -2812878, -1387916, -403027, -117697]
36280a17697K81719M85613K60544r3927n9479J89942J53499j84307l59469j00973
36270D55465K77633K63252j11196j98582K78239N37827k32364j363071j293871
36261a386668J82639J463805J364281N52363L6988m63213j447466k038276j066041
36252b801588Q26941J759073J092984l4814n65030n58865l58854m239K82977J28200
36242b33215k16838p5128M84259O18872N4173m87053m41231j04622P4744P6255
36232b49784k9423j82238R585P86279J341844N74504j022292j527103k08899J269047
36222G61520J094743k95171j065649m61422N85857Q65147Q5395j003521j185343
36213f18444M8092J554859J532383j54096j610463j416640l07851M15086P67155
$$ y = [-117697, 164022, 649635, 910179, 816252, 756773, 946715, 1100214, 915907, 556438, 455465, 733098, 996350, 885154, 686572, 964811, 1502638, 1270274, -92797, -1386668, -1204029, 259776, 1624057, 2176420, 2213408, 1750195, 302729, -1735547, -2801588, -1974647, -215574, 877410, 842596, 277566, -281299, -640153, -644392, -361415, -233215, -450053, -525181, -40922, 577950, 632123, 145070, -296161, -400783, -326039, -249784, -279207, -461445, -451860, 334419, 1676263, 2250767, 1228475, -298628, -507527, 761520, 1856263, 1561092, 495443, 34021, 619878, 1485025, 1570420, 566899, -618444, -570352, 984507, 2516890, 2362794, 752331, -664309, -972160, -557074, 210081]
36204B10081J157268R70688j99043j001874r1682J300714Q65037j059791j753863
36195C97535k81719J139564O64357o27367q92439k55827J02006J3008q6317l70041
36185a97240q89067p18625N88345J667192J116608k27576n56045P8487J55180
36176A017259n14043n39301M30909R49403J56923q73861r59440m64236k37954
36167a034341j67597J88395N10446L14202o2168r272L40409M58183L18764K28097
36157A085118J68084j7902j66824j27377j51271l79138l98218L8705L33024j26450
36147B57751q27892p43206J18060O94189M20585j04150k17167j51578m37660q84925
36137a875993p53106K00242J262626J451105N41495o32849r47976j12550J023970
$$ y = [210081, 1367349, 2338037, 2138994, 1137120, 1045438, 2346152, 3211189, 2151398, 397535, 115816, 1255380, 1919737, 1292370, 399931, 144104, 246110, 259118, 172801, -197240, -1086307, -1804932, -1216587, 450605, 1567213, 1339637, 783592, 862079, 1017259, 503216, -36085, 394824, 1344227, 1501150, 627289, -332151, -796387, -1034341, -1201938, -1013543, -503097, -188895, -251063, -260335, 80074, 538257, 857021, 1085118, 1253202, 1235300, 1068476, 941099, 789828, 410690, 12472, 51177, 384201, 257751, -570141, -1313347, -1195287, -501098, -80513, -184663, -401830, -553408, -991068, -1875993, -2629099, -2428857, -1166231, 284874, 826369, 193520, -754456, -867006, 156964]
36128A56964J369261P17232j59692m83019k98375k23582n34453q08778o07748
36119h72190k19722k80329p14055o80015J70237J009553R39637K52832j14444
36110e08496M2592K23598K85636M54656M62766j68345r76462r12817k7258M54680
36100f69450O0354k49372J60234N40671K38138j21431M1715J4161q21188j424406
36090b230574n00201J250955J902008R49679k85564o94531m20579M6849M98103
36081E16145O37671K02689m41831o98100o36959o46790m68590L52612J289723
36072A06570J291979L33306o01507r51344q90241m41354M17822R36609L30971
36063E32811o93466o80661K57875N13410m02617j069358m97200M58293P69174
$$ y = [156964, 1526225, 2243457, 2083765, 1600746, 1302371, 1078789, 544336, -264442, -872190, -1091912, -1372241, -2086296, -2766311, -2596074, -1586521, -646884, -394052, -508496, -465904, -242306, 43330, 497986, 960752, 792407, -184055, -1096872, -1124130, -669450, -609096, -858468, -698234, -157563, 80575, -40856, 859, 15020, -806168, -2230574, -2730775, -1479820, 422188, 1371867, 1086303, 391772, -28807, 18042, 516145, 1153816, 1356505, 914674, 216574, -420385, -1067175, -1535765, -1183153, 106570, 1398549, 1731855, 1130348, 179004, -711237, -1152591, -734769, 201840, 532811, -160655, -841316, -583441, -70031, -472648, -1542006, -2039206, -1580913, -811739]
36054h11739P06601P15613L42055n73930r59812o8476J065598J020489M684p44225
36044F96858q42059p84734o53134o0065Q45325J332516R84451M5785q84165j135486
36034d54708m46320M96086O57126Q9385j38921K47745K50434n10503q83794j20846
36024h14316P30446O10381K35204N96127R82881L04839p26847p33667q2961n7546
36014A044541l99942o563N45870k11853j592963j317664O68768J789612Q86861
36005A406667j30243K55282P94943J17652p38049m31172J23707m29254j201821
35996b32288o50361M43820K01570r90799j027835L74401J295120Q13341J39261
35987C66230J64378J70731l27548n18802R472L12100j45029l93788K17650O57496
$$ y = [-811739, -105138, 610475, 952530, 378600, -581212, -649688, 415910, 1436399, 1441083, 696858, -145201, -929935, -1583069, -1643134, -797809, 534707, 1519158, 1564943, 680778, -454708, -901028, -404942, 252184, 341569, 202648, 450393, 700827, 190324, -693470, -814316, -83870, 526511, 761715, 1357842, 2340723, 2645562, 1918715, 1185048, 1102087, 1044541, 644599, 638036, 1183906, 972053, -620910, -1938574, -1269806, 519806, 1406667, 1276424, 1531706, 2326649, 2444301, 1706252, 1275080, 1398787, 969533, -232288, -882649, -438829, -237259, -1228058, -2255893, -1881492, -586372, 226969, 366230, 530608, 701339, 373791, -145011, -135539, 176561, 31532, -362256, -144606, 512890]
35977E12890J0216p48706l74143M04115R5263q93857q26104M69556J274676O85641
35967F09547j88895k10155K11563K58069R3166J84035K47671j30115n46231m05927
35957A22728K9814J19259n1574N8907L42853J56794m92919p60484j84060N75069
35947h3613O05479n5877n59050m41684k12423m90788q88439l95742R76085J726466
35937A80414P38259r80782j521132p12772j39178m72286m82812O39336J636010
35928a114943J119311j19766l51466L68176M54349n94917j524912j285876k59804
35919c309848O46614R86269O97163L4188l39633m5297L43647J84773o0005L45651
35909e16478Q90045N95635o8254J43281Q49748M19503j075843j570553l12357
$$ y = [512890, 523106, -225600, -599743, -195628, -100365, -994222, -1820326, -1350770, -76094, 609547, 420652, 210497, 422060, 680129, 773295, 957330, 1205001, 1074886, 528655, 122728, 152542, 271801, 220227, 279134, 621987, 778781, 285862, -474622, -658682, -83613, 521866, 465989, -93061, -534745, -747168, -1237956, -2126395, -2522137, -1546052, 180414, 918673, -62109, -1583241, -2296013, -2435191, -2907477, -3390289, -2750953, -1114943, 4368, -115398, -466864, -98688, 355661, -239256, -1764168, -3050044, -3309848, -2663234, -1676965, -979802, -945614, -1285247, -1330544, -986897, -802124, -862129, -516478, 373567, 969202, 900948, 1044229, 1893977, 2313480, 1237637, -332916, -645273]
35900f45273Q22053L88306m30484j66754L79439j74718j136467q83439M15310
35891a432027J271021J267452J039381N55022n68733j509945j040749L08328P97154
35882F86904J27109l22926L7879K39284k18467m23478J70509O11321m330j048058
35872a44253j324285o50566K64544Q14074P70463K11809l27205j92560N25337
35863e2642J001766P77067K20546k57385o69616q85720m76508M31879R18911M29326
35853A437624m25175p24330l77021O7279K60734K20197K1903k13027k77522j41520
35843a50858l0373n3893n2890L2915J136k16924l28227o6347M22488P30489N72655
35832H60171J8463m85085m33573J54865O47093N33603m69n03525q18740q37227
$$ y = [-645273, 176780, 565086, 134602, -32152, 347287, 172569, -963898, -1847337, -1432027, -161006, 1106446, 2145827, 2700849, 2132116, 622171, -418578, -110250, 686904, 814013, 491087, 528966, 768250, 549783, 126305, 296814, 908135, 903805, -144253, -1468538, -2119104, -1854560, -1040486, -270023, -58214, -385419, -577979, -52642, 949124, 1726191, 1946737, 1689352, 1019736, 134016, -342492, 89387, 1008298, 1437624, 1012449, 288119, -88902, -21623, 239111, 459308, 481211, 268184, -9338, -150858, -181231, -235124, -288014, -255099, -253963, -470887, -799114, -865461, -442973, 287516, 860171, 878634, 393549, -40024, 114841, 761934, 1295537, 1295068, 791543, -27197, -864424]
35822h64424k96556N51509P23814j73966j014821n99665N11934Q73672L68595
35813H0092O4687J95744J0188m42198k32531N25773N69123k47208m84114L77332
35803D16888Q90909R9169q13630n83402J29175K56867K43984P54972R33555q5053
35793B243434j142229o97864M36237L18459q18507r69770J73507P13445k12080
35784D4632j065146n17583O12024J004145P45804N20707K53567l27355q06320
35775D64475p57936n01410l90229j52924L40673M85596j17124q57956r89923o29283
35765c106041k22662K65853R05510J205072P55363m2318n45212o54706m93515
35756a932656L6472P44992R05642K51158m28295m06403n6026o893m8996K07433
$$ y = [-864424, -1160980, -609471, 114343, -59623, -1074444, -1674109, -1162175, -288503, 80092, 144779, 340523, 350711, -91487, -324018, 201755, 770878, 523670, 39556, 416888, 1307797, 1406966, 593336, 9934, 139109, 395976, 639960, 1394932, 2328487, 2243434, 1101205, 403341, 839578, 1158037, 339530, -630240, -456733, 256712, 44632, -1020514, -1538097, -926073, 78072, 823876, 1344583, 1598150, 1270795, 464475, -293461, -794871, -1185100, -1338024, -997351, -511755, -628879, -1486835, -2476758, -3106041, -3328703, -3062850, -2157340, -952268, -196905, -239223, -784435, -1439141, -1932656, -1896184, -1151192, -245550, 5608, -422687, -829090, -885116, -892009, -941005, -733572]
35746g33572L68706N0739j01131N43206J164802N52099q41062j412150p36938
35737a145301J36071N50475P94919Q23943J47933p81591p78798Q9050L86270l17969
35727i4998o92257L5711P69282N34797O5976J56159O6836q69642j513811o23767
35717b165714Q31598J021054Q3372l67467N7535L56097K67572M88048Q85218N29143
35707A986456m17398p66876m14472m45001r20001o43690M08001O32239l87473
35698i68215p96176N16422J787681R78999j040946j830393q35370L97311P94931
35689i95756O94829N00224P8158m29742m71666O1598O81143R61966P35709l1489
35679A784974q62571q03718K99702J136268N62149o60078r46103k10942K80732
$$ y = [-733572, -364866, -314127, -415258, 127948, 1292750, 1844849, 1003787, -408363, -1145301, -1009230, -458755, 336164, 1160107, 1308040, 526449, -252349, -163299, 222971, -94998, -787255, -751544, 17738, 552535, 618511, 774670, 841506, -28136, -1541947, -2165714, -1334116, -313062, -229690, -597157, -539622, -183525, 84047, 572095, 1457313, 1986456, 1569058, 802182, 387710, -57291, -977292, -1620982, -1212981, -580742, -968215, -1764391, -1247969, 539712, 1518711, 477765, -1352628, -2187998, -1790687, -995756, -300927, 199297, 277455, -152287, -623953, -562355, 118788, 1080754, 1816463, 1784974, 922403, 118685, 418387, 1554655, 2116804, 1456726, 510623, 299681, 580413]
35670E80413M8137j73719p6039k49366p57891p44054L6752O13510L67409M03J79542
35659a74903L34261k16539q62977o08066K39616N35624J57579R5843O50949Q34399
35649I85786L5585q33919p13833q1021r9740n70180j93647J074048J551666L81354
35639A536099r60866q95517j59697l04121q32024j09276J384555J394464l07445
35630G46172j246098k61650N75807l34574j151373K63329K340918K012390l70228
35621B574693j606984o37033L23205j86764q31119l41145L23247O4833l07089
35612f24156J93472O43967k52423j634236j428074N59581K178516J733942K9755
35603A400344r01435l93595K92474n7475q68567p28056K95009N61661n67414j481878
$$ y = [580413, 628550, 454831, 378792, 129426, -628465, -1372519, -1335767, -722257, -354848, -354445, -174903, 159358, -57181, -920158, -1528224, -1288608, -752984, -595405, -499562, 151387, 985786, 1021371, 187452, -526381, -607402, -707142, -1277322, -1470969, -396921, 1154745, 1536099, 575233, -320284, -479981, -784102, -1616126, -1725402, -340847, 1053617, 746172, -499926, -761576, -185769, -520343, -1671716, -1408387, 932531, 2944921, 2574693, 967709, 330676, 653881, 467117, -364002, -705147, -381900, -317067, -624156, -430684, 213283, -39140, -1673376, -3101450, -2541869, -363353, 1370589, 1400344, 498909, 105314, 397788, 340313, -528254, -1256310, -961301, -399640, -967054, -2448932]
35593b448932o50806J002513J495493O46445j25224j86102m9821J88639Q21251
35584F93456J163179K44136j177195j330563k24338M10621J02758J98604J035760
35575A116418J114186n7561p94423j22116N28170l9255p17767l85934r1212r00151
35565c49645j529225n00797R53673P46181n31259o33603N79950J148849L96256
35556B80380l03306j22280K55294M55459R55230J438423P56413q62219j546161
35547A307233n63427M09726j30219j198819r50018M60727J159240K52381j101447
35538c54623j408815o74533q4851l06765o84660k67581P82837J374140R94300
35529f30551L05752J0698o8015k72271k78785K12975N84183O8236r26748j224288
$$ y = [-2448932, -3099738, -2097225, -601732, 44713, -80511, -266613, -316434, -127795, 693456, 1856635, 2100771, 923576, -406987, -631325, -220704, -117946, 80658, 1116418, 2230604, 2173043, 1378620, 1256504, 1784674, 1745419, 1027652, 641718, 550506, -349645, -1878870, -2379667, -1425994, -679813, -1211072, -1844675, -1264725, -115876, 280380, -22926, -145206, 110088, 565547, 1520777, 2959200, 3715613, 2853394, 1307233, 743806, 1153532, 1023313, -175506, -1125524, -664797, 494443, 746824, -354623, -1763438, -2437971, -2522822, -2829587, -3514247, -3781828, -2998991, -1624851, -630551, -324799, -314101, -382116, -654387, -933172, -720197, -136014, -67778, -994526, -2218814]
35519b218814m73273M77038P39351K67986l51273m55038K09696J098511J231911
35510E26095L78177n17441n67272r4420O6873j18690q0367K55937M12064K00242
35500D61198r0405k12511j55334k8437p5197m05430n23823J43665J018209P68013
35490H99948n49250j092573Q7481J364368Q73166o91679j271852m76477L96063
35481d60805O57273O64604M40648k50099p22751r4301R81345J037079P4324o33169
35471A694148p90539j180757j610133r21809O78782J427598O59754k68321l07772
35462f19049p6692j85370q6818M72312N88180j42958o47741j60828M35640K00249
35452b23075k80320j25318K29712j1125m42786k21829L60557L58957k86378p70625
$$ y = [-2218814, -2692087, -2215049, -1475698, -1207712, -1558985, -2014023, -1804327, -705816, 526095, 904272, 386831, -180441, -274861, -207988, -326678, -407045, -151108, 260956, 461198, 370793, 158282, 2948, -25489, -100686, -506116, -1029939, -886274, 131935, 899948, 350698, -741875, -654394, 709974, 1583140, 891461, -380391, -856868, -460805, 196468, 861072, 1301720, 1051621, 328870, 234569, 1215914, 2252993, 2327317, 1694148, 903609, -277148, -1887281, -2809090, -2130308, -702710, -42956, -311277, -619049, -695741, -881111, -967929, -495617, 92563, -50395, -698136, -858964, -423324, -223075, -503395, -628713, -399001, -410126, -852912, -1074741, -714184, -355227, -641605, -1412230]
35442a412230n85283J51210J039968J427316P33597n91448j187638n32558K72774
35433f84292K02371j94911K1939M55038J06124p98026j079538m08729L79586O46438
35423a354000N65402L79533j8089n64139p40625j07285J092465J932743J489069
35414B675074j58883j668812j746469p10156o339j73189l43098L6989L04642k4861
35404a815102k74489J04402M51391J72346k5757N39882R74498J32507j227234
35395i67556j319607M379J158477J268902J044151J024170O11865n26073j414261
35386H84447j032927J75337Q99399N97966j32266n53235n68564n39052o71360
35377i40255p22365l17885M35396Q50758M23865m10618o35134J53516J153318
$$ y = [-1412230, -1997513, -1846303, -806335, 620981, 1354578, 763130, -424508, -957066, -684292, -481921, -676832, -654893, -199855, -93731, -891757, -1971295, -2380024, -2000438, -1354000, -788598, -409065, -427154, -991293, -1731918, -1839203, -746738, 1186005, 2675074, 2516191, 847379, -899090, -1609246, -1615585, -1788774, -2131872, -2094883, -1790241, -1815102, -2089591, -1985189, -1533798, -1361452, -1387209, -847327, 127171, 259678, -967556, -2287163, -2282784, -1124307, 144595, 1188746, 2212916, 2824781, 2298708, 884447, -148480, 26857, 926256, 1524222, 1391956, 838721, 270157, -268895, -940255, -1662620, -1980505, -1545109, -694351, -270486, -681104, -1316238, -1162722, -9404]
35368i404J173187R966j201619j242474l16836J94246l26664p56722J00623J489463
35358h86234J554817O5538j109489o11882N83116P22542k57607p92013J64241
35349e66971J794304K244616O22941j765480k523415r66428Q13754O90287m71482
35340a27874k97942J095690J156830p44087j890037m59650J466973J209435l89992
35331A019346p21285L11949O49400j94634o50917p9701L79765P8272k53207j47966
35321C91022k9388K3870L90708O63385K0343j070654j267627n27313m9573l6915
35311a492142M58948J309434J170448Q288n21853R2212L32958m57581p12292M50228
35301F38648J278303K45658j155715p81533N76484N79353o82993q96351N66857
$$ y = [-9404, 1163783, 1173749, -27870, -1270344, -1587180, -1392934, -1719598, -2476320, -2375697, -886234, 668583, 734121, -375368, -987250, -404134, 318408, 60801, -731212, -566971, 1227333, 3471949, 4094890, 2329410, -194005, -1160433, -346679, 343608, -127874, -425816, 669874, 1826704, 1082617, -807420, -1267070, 199903, 1409338, 1019346, 298061, 610010, 1259410, 1064776, 413859, 334158, 713923, 792195, 538988, 391022, 361634, 385504, 776212, 1439597, 1459940, 389286, -878341, -1405654, -1455227, -1492142, -1033194, 276240, 1446688, 1454976, 933123, 1025335, 1358293, 900712, 188420, 638648, 1916951, 2162609, 1006894, 225361, 801845, 1381198, 698205, -198146, 368711]
35292C68711J608712P15646r05009j375234o74617n1143m0308j79715p6850J72146
35282d37661L54125K82138k30662j006268j276852m26924R77426J496330N32024
35273B63676p09021o42609N17272R88515K4681r00450l19465R11194R14314k93567
35263G54540r44471l48411L22465K96185K91357O80607M78672o90040j314320
35254d73416k40518J148652Q17616p94308j488118o31224K54264J79622L314N78678
35244f45438J229328R45072j8553o79690p75951p82014q44928n32478L14820J053700
35234g36132R04411L64o24775l19372K58967N9868o99077o89207N09924J561885
35224B26856J181267p0894p04798l66098Q8516J69579K29375M36328L73314j29293
$$ y = [368711, 1977423, 2693069, 1788060, 412826, -261791, -312934, -353242, -532957, -609807, -437661, -83536, 198602, -32060, -1038328, -2315180, -2742104, -1764678, -268348, 263676, -445345, -1087954, -570682, 417833, 442514, -457936, -777401, 133793, 1048107, 754540, -189931, -538342, -215877, 80308, 371665, 1052272, 1530944, 840904, -473416, -713934, 434718, 1252334, 458026, -1030092, -1661316, -1407052, -1227430, -1224116, -645438, 583890, 1528962, 1510409, 830719, 54768, -727246, -1572174, -2104652, -1789832, -736132, 168279, 168643, -456132, -775504, -516537, -456669, -1155746, -1844953, -1335029, 226856, 1408123, 1337229, 632431, 266333, 354849, 524428, 753803, 1190131, 1563445, 1434152]
35214A434152n95153o24383m14333l08048k72725o2884L41304N89746K55590n42736
35204a99470q86711j7128J344875J519642J21839j227146j133538k46611J94501
35195e29747M02906J066872J393506K37423j389135j304576L82413J204678J23964
35186A588304j006588o06503L07450K75106j65895R8342N14425m2180j079032
35177a16571j280618o59197j57228J64105P55186J029246J16678j177430j122377
35168b448206K78518J223625Q39737J80063J71261L15191M5383j90523j1131N4080
35158D57998l25528m55346J80163Q46306O54658m3031l15638r3754k027j91276
35148G12525k48654m5399Q6947m9916k78570l46266j76642M9685j6765m09071
$$ y = [1434152, 838999, 214616, -199717, -507765, -780490, -843374, -502070, 87676, 343266, -199470, -1086181, -1103309, 241566, 1761208, 1883047, 655901, -477637, -724248, -529747, -126841, 940031, 2333537, 2570960, 1181825, -122751, 259662, 1464340, 1588304, 581716, -24787, 282663, 557769, 391874, 490216, 1004641, 962461, -116571, -1397189, -2056386, -2213614, -2049509, -1294323, -265077, -148399, -1325829, -2448206, -2169688, -946063, -106326, 73737, 244998, 560189, 605572, 415049, 403918, 457998, 132470, -322876, -142713, 703593, 1358251, 1315220, 999582, 905828, 903801, 712525, 463871, 418472, 505419, 455503, 176933, -169333, -345975, -296290, -313055, -722126]
35138g22126m97396K66281J273098J298142K64294n65374m72917j80520l25639
35129C37843l59093J65288N09988J31035j11023M46787O76655m96566j710059
35120d09145r14147J124071J660539J92983r12603m21099L241q86683j569639
35111b132482n30659Q84136O80298m17875l65557O05022N30052p05224j115246
35102b567535k1807Q85872N00000n636N42733J261137Q02488l93578r14559n20003
35092d30888r2168k4249P4505L42712L98769M8208m77328q94520r56490m32689
35082b444138M59677R47381O26292J24777J67394L95628R149p33411p64133O7479
35072a143905O73941M06733n1944p092P2658m40567r64100n06223N66038Q44083
$$ y = [-722126, -1219522, -953241, 319857, 1617999, 1882293, 1316919, 844002, 663482, 337843, -21250, 144038, 654026, 785061, 674038, 1120825, 1797480, 1300914, -409145, -1323292, -199221, 1461318, 1654301, 741698, 320599, 323840, -562843, -2132482, -2663141, -1779005, -1098707, -1516582, -1882139, -1277117, -747065, -1452289, -2567535, -2589342, -1703470, -1203470, -1209106, -666373, 594764, 1397252, 1003674, 89115, -430888, -523056, -547305, -472800, -130088, 268681, 316889, -160439, -1054959, -2011449, -2444138, -1984461, -1037080, -410788, -286011, -118617, 277011, 286160, -447251, -1211384, -1143905, -469964, -63231, -115175, -122267, -49609, -490176, -1454276, -1960499, -1394461, -550378]
35062e50378K99o46073j32988O64925M25410n03939n65479O18180J511907P15626
35052A537490j101972j997577j093932N35172J272850P40804l3747r583O24585
35043D74090P96962N6134p42545o13272J15267K80195l46421p58360l78000P9636
35033a036314j3041m2728O09526J109017L72644q41759p79892M72378Q69330m21834
35023B97327j562554q06082Q18335J109515o6013r22389o28247j54552k03765
35014b118425r2165O87044J260608P44644k00134l43648K12202L38509j94594
35005B94041l89609K23939P13254K19825o11157n82413K26398O18445P3690o60521
34995A25892q49908o19121k25358M55896J138406Q60923n38368j545206p96837
$$ y = [-550378, -550079, -1196152, -1329140, -664215, -238805, -742744, -1308223, -690043, 821864, 1537490, 435518, -1562059, -2655991, -2120819, -847969, -107165, -140912, -150495, 474090, 1271052, 1327186, 584641, -28631, 86636, 366831, 20410, -737950, -1115950, -1036314, -1049355, -1092083, -482557, 626460, 999104, 157345, -622547, -150169, 719161, 297327, -1265227, -2071309, -1252974, -143459, -209472, -1131861, -1760108, -1914660, -2118425, -2210590, -1523546, -262938, 481706, 281572, -62076, 150126, 488635, 294041, -95568, 128371, 841625, 1061450, 450293, -132120, 94278, 712723, 786413, 125892, -724016, -1343137, -1568495, -1112599, 25807, 886730, 348362, -1196844, -1993681]
34986a993681Q27718J358670N66031r764K67289L33605l20742n77963J88035P00829
34976A340027j24554j147070p57560M42125O33403k64445o66498n1419M08959
34967a87032O0625k81289l6907J36674k86504o93810m30563J85061N85869P22664
34957b25212N85368k4910p17886n74028M14741J024212N65987j21868j83441o4043
34947F78920l71120n70703l8230N49697K42594m93600n22827O9278K59636j07945
34937c04300k40531N3951J15798k45704m12082p3764L29503L88506R1885n19903
34927h16641j201931j200551q9709J276791J674148J122632N03588l4720q70457
34918C63150j449553q08391M63084O84320k22454m79211N65683J273443M85449
$$ y = [-1993681, -1165963, 192707, 758738, 748974, 1016263, 1349868, 1029126, 451163, 639198, 1340027, 1215473, 68403, -689157, -247032, 386371, 121926, -544572, -595991, -187032, -126407, -407696, -444603, -307929, -594433, -1288243, -1718806, -1533745, -947876, -225212, 360156, 335246, -382640, -956668, -541927, 482285, 1048272, 926404, 742963, 678920, 307800, -262903, -301133, 248564, 491158, -2442, -525269, -455991, -196355, -304300, -544831, -490880, -375082, -620786, -1032868, -1106632, -777129, -388623, -296738, -816641, -2018572, -3219123, -3308832, -2032041, -357893, 764739, 1268327, 1233607, 363150, -1086403, -1894794, -1431710, -747390, -969844, -1449055, -883372, 390071, 875520]
34909H75520n44580l64223K83077k9383q89296q85682J0761P04780Q88767R98468
34899A048209Q55521M0145q12701p09119K1371K40886j32795k97537k50438o24515
34889f20973j053243m96087P49980J134172K28552o27682m75452K9186Q2622J202
34879a047723L08436P27970P84404M91220k1675o56367q67591j22779R26115R69268
34869A491278L958o05388l40159j92325o16768o36244J42177M67516l52101r36182
34859a574238j03045R31450N44256m30165p5586J252346J398082p6546j222660
34850F43894p62213K75922N29570J66267m075N1318j02290n06844q93871j039444
34840a641766p46326n4040M76734L67352K5872J47435M96046K88212l80096o84001
$$ y = [875520, 330940, -33283, 249794, 220411, -668885, -1554567, -1543806, -839026, 49741, 1048209, 1903730, 1943875, 1131174, 422055, 443426, 684312, 551517, 253980, 3542, -620973, -1674216, -2170303, -1420323, -286151, -57599, -685281, -1160733, -1131547, -1048925, -1047723, -739287, -11317, 773087, 1264307, 1242632, 586265, -281326, -404105, 522010, 1491278, 1495236, 889848, 549689, 357364, -259404, -895648, -753471, -285955, -638056, -1574238, -1677283, -745833, -201577, -631742, -707328, 545018, 1943100, 1866554, 643894, -118319, 157603, 687173, 853440, 849365, 900683, 798393, 291549, -602322, -1641766, -2388092, -2442132, -1965398, -1598046, -1572174, -1424739, -928693, -640481, -1020577, -1704578]
34830a704578n59883o85811r26487l34930R82014J587253Q87080O1300O5492K25555
34820d02995j74414m02133K67399Q97571L49386n57401j82430J193723J666036
34811B654742N93212o39093r36384q54476j091940j146780m03618N25193O06197
34802f92947p8330n13730j39945O43510J122076Q78777J973q63764r47267k60400
34792h50047K63902K7416k84600K51344J174139J124170o1261r34454n55857J01140
34782B55892k56637j128205r78662K95163J111394N65152k88837j08391Q11396
34773B78265J130043L37771p91026j249687o43427O65616J650305J256243l69014
34764B265089j648290j308249O898O64681K38746k37202l5318L96259M73463L30073
$$ y = [-1704578, -2264461, -2950272, -3876759, -4211689, -3229675, -1642422, -755342, -694042, -628550, -402995, -577409, -979542, -712143, 185428, 534814, -22587, -205017, 988706, 2654742, 3247954, 2608861, 1672477, 818001, -273939, -1420719, -1824337, -1299144, -692947, -771277, -1285007, -1424952, -781442, 340634, 1219411, 1221384, 357620, -589647, -850047, -586145, -558729, -843329, -591985, 582154, 1706324, 1645063, 710609, 154752, 255892, -745, -1128950, -2107612, -1812449, -701055, -135903, -424740, -533131, 278265, 1408308, 1746079, 955053, -294634, -938061, -272445, 1377860, 2634103, 2265089, 616799, -691450, -684552, -19871, 218875, -18327, -53645, 342614, 816077, 1146150]
34754A146150K55854J14740k36567n56883n94419l77005J9971M60867M90982j90697
34744E32993r58965q25611Q6110N79211J37773l88564k51509J19029J04585m4614
34734i09562J02264K85822J72819N8813J69281N1554n09496p94420k86306L39541
34724a319690L85186L71704Q52833R26721l88365j949438j649874L76814J715196
34715f78913J079505j33181k89270K51473L20904r4301k96464k73858m22406n20479
34705a056990r5985N81844Q14260N09751J57055J7486j451O7267J68985m812n52735
34694F04675r12000n16786K58766M72841j12040p30051o52614l2111M39154L56627
34684h23539q3129l98006l10528L3494L11007M25587N06147N44312L52832k6173
$$ y = [1146150, 1402004, 1516744, 1280177, 723294, 128875, -248130, -228159, 232708, 723690, 532993, -425972, -1251583, -1165473, -586262, -448489, -837053, -1088562, -969533, -864948, -909562, -807298, -521476, -348657, -289844, -120563, -69009, -578505, -1372925, -1659231, -1319690, -934504, -562800, 290033, 1216754, 828389, -1121049, -2770923, -2394109, -678913, 400592, 267411, -21859, 229614, 550518, 456217, 159753, -114105, -536511, -1056990, -1152975, -571131, 243129, 752880, 909935, 927421, 925970, 993237, 1162222, 1157410, 604675, -307325, -824111, -565345, -92504, -204544, -934595, -1587209, -1619320, -1180166, -823539, -906668, -1304674, -1615202, -1581708, -1270701, -845114, -338967, 205345, 558177, 532004]
34674E32004k24558n6816J84760J72959n676r6990r5553j28475j64623j39596
34664b2564j70732l51679m87272l04720J64228N82840N90689N3301p25145j038790
34654a709844m50720M84928P00183J8212n21895j04025P31973R45591M21943j56826
34644C59520m23440n07464l96251M6058N44448O61718M99390M38150L33049j81316
34634A373862o89345l51885N97441Q35759j29294j076099q18327O8923K52422
34625F3457k81653l71499L20786P28280R5296p63997o04802M65420J153130P13579
34615A517997k52011q16724q36033o54178k76940M66042J181530J157307M40682
34606A927672q7557J794P0333m49409j027690q67855j70975L04599M85060P76328
$$ y = [532004, 307446, 250630, 435390, 608349, 602673, 505683, 410130, 281655, 117032, -22564, -193296, -544975, -1032247, -1336967, -1172739, -589899, 790, 54091, -671054, -1709844, -2160564, -1675636, -975453, -957241, -1479136, -1583161, -851188, 94403, 516346, 359520, -63920, -571384, -967635, -921577, -377129, 284589, 783979, 1222129, 1555178, 1373862, 684517, 332632, 930073, 1765832, 1636538, 560439, -257888, -188965, 63457, -218196, -589695, -268909, 459371, 554667, -209330, -814132, -348712, 804418, 1517997, 1265986, 449262, -386771, -1040949, -1317889, -851847, 329683, 1486990, 1927672, 1840115, 1841909, 1912242, 1462833, 435143, -432712, -603687, -299088, 185972, 962300]
34596I62300R60326M63485m04459p05779l98642l42546o59748n12478J58312K54971
34586b24258m59220o18678M07273J055968j3213j437747j058775O54738J309308
34577c84604K36162q43873p51574j94262J34999O25560J255961J059623K131m81905
34567F58218Q6172J35022j223222k189788r23310J284396J770165M71326l38992
34558b70013J88631N93597J02281o0244Q37136J425845M22288j201201j660012
34549C78308q25449J18409N87083P74314N70511k50734j050656q42569K25989
34540c14794R77780Q30222L57621J52450O7716j71103m20783n20403n78313n43949
34530a63556r5603P03222J190439R36957L14974j43731m65717q43508r93395n45939
$$ y = [962300, 1922626, 2386111, 1981652, 1275873, 877231, 534685, -125063, -637541, -479229, -224258, -683478, -1302156, -894883, 161085, 147872, -1289875, -2348650, -1693912, -384604, -148442, -992315, -1743889, -1938151, -1803152, -1177592, 78369, 1137992, 1140123, 658218, 744390, 879412, -343810, -2533598, -3456908, -2172512, -402347, 68979, -270013, -81382, 512215, 614496, 554252, 1391388, 2817233, 3239521, 2038320, 378308, -447141, -328732, 258351, 1032665, 1603176, 1352442, 301786, -540783, -314794, 662986, 1493208, 1850829, 2003279, 2070995, 1899892, 1479109, 958706, 380393, -163556, -259159, 444063, 1634502, 2571459, 2886433, 2742702, 2276985, 1433477, 440082, -105857]
34520a05857J88118M97476K23241j37359k29254j73000r4688O6395J43376k52670
34510A25778r95828j225163l32128J123341J933028J527607L88311o73940j241446
34501F29560j319525j024779m11171M66293J318053J518801N99783r34751j681784
34492h39520p72464R06756J522297M24370j045695j154579J82172J370814J058110
34483A652261l18482j129574n50837M77206N57863k86061p54249k17406M36107
34474a33172K84645k60276l52316j46373k50577l85849O0028N47901L8116r64559
34464a562432p62345Q23873J853328J078435k97009o76312l31134k76448k77010
34455d27054L31537Q74431K97654p44660p17043K01915L43125o17133j051585
$$ y = [-105857, 82261, 579737, 802978, 665619, 436365, 263365, 168677, 235072, 378448, 125778, -870050, -2095213, -2427341, -1304000, 629028, 2156635, 2544946, 1871006, 629560, -689965, -1714744, -2125915, -1659622, -341569, 1177232, 1777015, 842264, -839520, -1611984, -705228, 817069, 1241439, 195744, -958835, -776663, 594151, 1652261, 1333779, 204205, -346632, 130574, 688437, 402376, -351873, -569279, -133172, 151473, -108803, -461119, -607492, -858069, -1243918, -1183890, -635989, -597873, -1562432, -2324777, -1500904, 352424, 1430859, 1133850, 457538, 126404, -150044, -427054, -95517, 778914, 1076568, 331908, -385135, -183220, 159905, -457228, -1508813]
34446a508813o2427J069342R44516M5575l64589j69167o2172j12462J33547N37066
34436D50416M19108l66528j168415j344651q29768M5730Q44363J120173O30248
34427a99324l48886j048247p94612K47374J033349P14659k27109m86224K45829
34418h63191P63453J68876o92704n72219K03148M14600O3579J81488P32601N06252
34408I05883o50982j267379n56968K91447O2909o09371m56171M19459R90701R85872
34398A15400Q68627O46966q4431j098986j538552r98950K2342P52890P99694K93172
34388b21828k85391n14042l90782j19198L05672Q33840R48908L18206l60088k06522
34378C08775L11081L7599p47760n93343M83437O34797p65197j772857q58118O82710
$$ y = [-1508813, -1571240, -501898, 442618, 488193, 123604, -45563, -107735, -220197, -86650, 450416, 869524, 502996, -665419, -2010070, -2839838, -2794108, -1949745, -829572, -199324, -548210, -1596457, -2391069, -2143695, -1110346, -395687, -622796, -1109020, -863191, -99738, 69138, -623566, -1195785, -992637, -578037, -514458, -332970, 399631, 905883, 254901, -1012478, -1569446, -1277999, -1215090, -1824461, -2280632, -1861173, -870472, 115400, 984027, 1630993, 1546562, 447576, -1090976, -2089926, -2067584, -1314694, -515000, -221828, -507219, -1021261, -1412043, -1531241, -1225569, -391729, 557179, 875385, 515297, 308775, 619856, 657455, -90305, -683648, -200211, 434586, -330611, -2103468, -2961586, -2278876]
34368b278876R65803M51098O10412J102863O26714m06651n15210J22018K1191
34359F99362p84270p13147M67474J028189M0747j223260j306373l77589N49863
34350a619004Q64563M26053l62996m07531P98761J799924P93736j372777j920907
34341a000178k14004J208164N43752o61370l11182Q79220Q72680k48269o18543
34332D50270K72789R06026J84694j088606j514062p71755L40368Q72268N17161
34323A69153j98337n18136l67058l02344m64047l07273K79754N07888J8901k12617
34313a394116O58523J662505J110129q45827k070393j138270Q56651J728449P91365
34304A359016o37840j076448n24136l8376j31019k56276O5460L95264K03118o0391
$$ y = [-2278876, -1313073, -861975, -251563, 851300, 1478014, 1071363, 556153, 678171, 699362, -84908, -798055, -330581, 697608, 738355, -484905, -1791278, -2168867, -1619004, -754441, -328388, -691384, -1098915, -300154, 1499770, 2293506, 920729, -1000178, -1214182, -6018, 537734, -123636, -434818, 444402, 1317082, 1068813, 450270, 723059, 1629085, 1813779, 725173, -788889, -1560644, -1220276, -348008, 169153, -29184, -547320, -914378, -1216722, -1680769, -1988042, -1708288, -1200400, -1181499, -1394116, -735593, 926912, 2037041, 1191214, -879179, -2017449, -1160798, 567651, 1359016, 721176, -355272, -879408, -917784, -1048803, -1305079, -1239619, -844355, -641237, -701628]
34294g01628L74264J171868J198051K52761n65213m73607j8182o5311o02973j005308
34284d35278q41843p4606R12307J251827L55924r88241j207353m0712R44655N52935
34274D29615l33634j84159Q25708J089786o0557j354427j175106M45815J798427
34265A481468J403682k55939j295885q37994j13299m63137j105170l61944J353503
34256a94715J772126K11897j261404r23625K31940M38823j44596k69025R0342
34247d8237J8593m64800m82956J06008N86900O28819M91273K26477k84981p20965
34237E6131o44276k03042K23148O47378J014544P30104m20430j438163j227650
34228a262256j37824N68164M02584q3036l44218l03907r9777l6591l46898n39640
$$ y = [-701628, -327364, 844504, 2042555, 2295316, 1730103, 1256496, 1238314, 1173003, 570030, -435278, -1277121, -1351727, -439420, 812407, 1168331, 180090, -1027263, -1067975, -123320, 429615, 95981, -88178, 737530, 1827316, 1766759, 412332, -762774, -316959, 1481468, 2885150, 2629211, 1333326, 495332, 382033, -81104, -1186274, -1548218, -194715, 1577411, 1789308, 527904, -395721, -163781, 275042, 130446, -138579, -48237, -29644, -494444, -977400, -871392, -284492, 344327, 835600, 1062077, 777096, 56131, -588145, -791187, -568039, 79339, 1093883, 1823987, 1403557, -34606, -1262256, -1400080, -831916, -429332, -512368, -856586, -1160493, -1260270, -1296861, -1643759, -2183399]
34218b183399J96757J415594J432895k01019j581482j032859M78979J002730M21790
34209e0014j16270m12607q49051q16570K66839J168992M21020r70013q72456M40645
34199a789485Q33793M1084j63594M46918Q8921j297516j208924J193568L074472
34190A219237K024512l83693j281521o08327j72032l05217k6251N22098K83694
34181A272500n34840o41210J19327M90031j81230j059610j118635k90937P68728
34172a175876J315087R34206q3222q91471r63556n20624P6956P16050J064917
34163D72467O20172l26408p05059k05245J87648j82231n75980k44139K30823L8713
34153f89239l77010j53302M29349M60756n6314l32611q0911L09655N47378N63755
$$ y = [-2183399, -1986642, -571048, 861847, 660828, -920654, -1953513, -1474534, -471804, -50014, -166284, -578891, -1427942, -2244512, -1977673, -808681, -387661, -1357674, -2230130, -1789485, -955692, -914608, -1078202, -631284, -542363, -1839879, -3048803, -1855235, 1219237, 3243749, 2860056, 1578535, 970208, 798176, 492959, 466708, 988806, 1272500, 737660, 96450, 215777, 705808, 524578, -535032, -1653667, -1944604, -1175876, 139211, 1073417, 990195, 98724, -864832, -1385456, -1308500, -592450, 472467, 1092639, 766231, 61172, -144073, 43575, -138656, -714636, -958775, -727952, -689239, -1066249, -1219551, -790202, -329446, -385760, -718371, -799282, -489627, 57751, 621506]
34143F21506K53179k17308l16107N1772K91945J76209K34741N07979J23190j009492
34133G17614j451414m27279O04237J59453p73272m04469P53442P68514l79355
34124d32529q36181m9133N68277L33381K63290Q13686R03666N2986n38525j23024
34114I55894K06787m66160j096683m26563P64618Q42506j07306n71184j3501N66818
34104F55226L54860l31458q63047r69200m82647N75502J453125J151345j86541
$$ y = [621506, 874685, 657377, 341270, 393042, 684987, 861196, 1095937, 1603916, 1727106, 717614, -733800, -1161079, -556842, -397389, -1170661, -1575130, -821688, -53174, -432529, -1268710, -1317843, -749566, -416185, -152895, 660791, 1564457, 1617443, 1078918, 955894, 1162681, 696521, -400162, -826725, -62107, 780399, 673093, 101909, 88408, 655226, 1010086, 678628, -184419, -1153619, -1636266, -1060764, 392361, 1543706, 1357165]
$$ [...]
##END NTUPLES=NMR SPECTRUM
##END=
