##TITLE=31Pdec_E3d1007-2
 CDCl3, 24 sc
 11.7.2023
##JCAMPDX= 6.0         $$ Bruker NMR JCAMP-DX V2.0
##DATA TYPE= NMR SPECTRUM
##DATA CLASS= NTUPLES
##ORIGIN= UXNMR, Bruker Analytische Messtechnik GmbH
##OWNER= root
$$ XWIN-NMR		Version 3.5
$$ Tue Jul 11 14:09:33 2023 Russian Standard Time (UT+4h)  she@DPX200
##.OBSERVE FREQUENCY= 81.013821
##.OBSERVE NUCLEUS= ^31P
##.ACQUISITION MODE= SIMULTANEOUS
##.ACQUISITION SCHEME= undefined
##.AVERAGES= 24
##.DIGITISER RES= 16
##SPECTROMETER/DATA SYSTEM= spect
##.PULSE SEQUENCE= zgpg30
##.SOLVENT NAME= CDCl3
##.SHIFT REFERENCE= (INTERNAL, CDCl3, 0, 248.564)
##AUDIT TRAIL= $$ (NUMBER, WHEN, WHO, WHERE, WHAT)
$$ ##TITLE= Audit trail, XWIN-NMR		Version 3.5
$$ ##JCAMPDX= 5.01
$$ ##ORIGIN= Bruker BioSpin GmbH
$$ ##OWNER= she
$$ F:/spectra/data/she/nmr/P31/1/pdata/1/auditp.txt
$$ ##AUDIT TRAIL=  $$ (NUMBER, WHEN, WHO, WHERE, WHAT)
(   1,<2023-07-11 14:08:38.48 +0400>,<she>,<DPX200>,
      <created by zg, POWCHK disabled, PULCHK disabled
       configuration hash MD5:
       00 E9 B6 7A A2 85 ED C7 34 08 36 98 17 FE 4E 26
       data hash MD5: 32K
       93 EB E7 EB 0F 86 1C B9 53 91 D6 88 F1 80 30 AD>)
(   2,<2023-07-11 14:08:40.62 +0400>,<she>,<DPX200>,
      <Start of raw data processing
       efp BC_mod = 2 LB = 1 FT_mod = 6 PKNL = 1 PHC0 = -10550.17 PHC1 = -230.7153 SI = 64K 
       data hash MD5: 64K
       64 08 C0 14 AF 88 E9 20 22 A2 F1 7B 30 48 A7 66>)
(   3,<2023-07-11 14:08:54.01 +0400>,<she>,<DPX200>,
      <pk PHC0 = -3.630211 PHC1 = 0 
       data hash MD5: 64K
       95 EF 25 9C A2 49 F3 A8 85 58 5B AF 62 F4 E9 F6>)
(   4,<2023-07-11 14:08:57.51 +0400>,<she>,<DPX200>,
      <abs ABSG = 5 
       data hash MD5: 64K
       29 D4 74 4A 5B 4E D3 CE B5 69 08 13 1E 7F 40 02>)
$$ ##END=
$$ 
$$ hash MD5
$$ 0A FF 9D 52 B8 77 37 A3 23 EF 73 70 90 9F 61 D7
##$RELAX= 
##$RELAX= 
##$RELAX= 
##$RELAX= 
##$RELAX= 
##$RELAX= 
##$RELAX= 
##$RELAX= 
##$RELAX= 
$$ Bruker specific parameters
$$ --------------------------
##$DU= <F:/spectra>
##$EXPNO= 1
##$NAME= <P31>
##$PROCNO= 1
##$TYPE= <nmr>
##$USER= <she>
##$AMP= (0..31)
100 100 100 100 100 100 100 100 100 100 100 100 100 100 100 100 100 100 
100 100 100 100 100 100 100 100 100 100 100 100 100 100 
##$AQSEQ= 0
##$AQ_mod= 1
##$AUNM= <au_zg>
##$AUTOPOS= <>
##$BF1= 81.014009
##$BF2= 200.13
##$BF3= 200.13
##$BF4= 200.13
##$BF5= 200.13
##$BF6= 200.13
##$BF7= 200.13
##$BF8= 200.13
##$BYTORDA= 1
##$CFDGTYP= 0
##$CFRGTYP= 5
##$CHEMSTR= <none>
##$CNST= (0..31)
1 1 145 1 1 1 1 1 1 1 1 1 1 1 1 1 1 1 1 1 1 1 1 1 1 1 1 1 1 1 1 1 
##$CPDPRG= <waltz16>
##$CPDPRG1= <>
##$CPDPRG2= <waltz16>
##$CPDPRG3= <>
##$CPDPRG4= <mlev>
##$CPDPRG5= <mlev>
##$CPDPRG6= <mlev>
##$CPDPRG7= <mlev>
##$CPDPRG8= <mlev>
##$CPDPRGB= <>
##$CPDPRGT= <>
##$D= (0..31)
0 1 0 0 0 0 0 0 0 0 0 0.03 2e-05 3e-06 0 0 0 0 0 0 0 0 0 0 0 0 0 0 0 0 
0 0 
##$DATE= 1689070117
##$DBL= (0..7)
120 120 120 11 120 120 24 19 
##$DBP= (0..7)
150 150 150 150 150 150 150 150 
##$DBP07= 0
##$DBPNAM0= <>
##$DBPNAM1= <>
$$ [...]
##$SUBNAM3= <"">
##$SUBNAM4= <"">
##$SUBNAM5= <"">
##$SUBNAM6= <"">
##$SUBNAM7= <"">
##$SUBNAM8= <"">
##$SUBNAM9= <"">
##$SW= 501.771253377433
##$SWIBOX= (0..15)
0 1 3 0 0 0 0 0 0 0 0 0 0 0 0 0 
##$SW_h= 40650.406504065
##$TD= 32768
##$TD0= 1
##$TE= 0
##$TE2= 300
##$TE3= 300
##$TEG= 300
##$TL= (0..7)
0 120 53 12 22 120 120 120 
##$TP= (0..7)
150 150 150 150 150 150 150 150 
##$TP07= 0
##$TPNAME0= <>
##$TPNAME1= <>
##$TPNAME2= <>
##$TPNAME3= <>
##$TPNAME4= <>
##$TPNAME5= <>
##$TPNAME6= <>
##$TPNAME7= <>
##$TPOAL= (0..7)
0.5 0.5 0.5 0.5 0.5 0.5 0.5 0.5 
##$TPOFFS= (0..7)
0 0 0 0 0 0 0 0 
##$TUNHIN= 0
##$TUNHOUT= 0
##$TUNXOUT= 0
##$USERA1= <user>
##$USERA2= <user>
##$USERA3= <user>
##$USERA4= <user>
##$USERA5= <user>
##$V9= 5
##$VALIST= <valist>
##$VCLIST= <CCCCCCCCCCCCCCC>
##$VD= 0
##$VDLIST= <DDDDDDDDDDDDDDD>
##$VPLIST= <PPPPPPPPPPPPPPP>
##$VTLIST= <TTTTTTTTTTTTTTT>
##$WBST= 1024
##$WBSW= 4
##$XGAIN= (0..3)
0 0 0 0 
##$XL= 0
##$YL= 0
##$YMAX_a= 7699
##$YMIN_a= -6284
##$ZGOPTNS= <>
##$ZL1= 120
##$ZL2= 120
##$ZL3= 120
##$ZL4= 120
##$ABSF1= 248.5645
##$ABSF2= -253.2056
##$ABSG= 5
##$ABSL= 3
##$ALPHA= 0
##$AQORDER= 0
##$ASSFAC= 0
##$ASSFACI= 0
##$ASSFACX= 0
##$ASSWID= 0
##$AUNMP= <proc_1d>
##$AZFE= 0.1
##$AZFW= 0.5
##$BCFW= 0
##$BC_mod= 2
##$BYTORDP= 0
##$COROFFS= 0
##$CY= -3
##$DATMOD= 1
##$DC= 0
##$DFILT= <>
##$DTYPP= 0
##$F1P= 0
##$F2P= 0
##$FCOR= 1
##$FTSIZE= 65536
##$FT_mod= 6
##$GAMMA= 0
##$GB= 0
##$INTBC= 1
##$INTSCL= 6.047779e-11
##$ISEN= 30
##$LB= 1
##$LEV0= 0
##$LPBIN= 0
##$MAXI= 10000
##$MC2= 0
##$MEAN= 0
##$ME_mod= 0
##$MI= 50
##$NCOEF= 0
##$NC_proc= -5
##$NLEV= 6
##$NOISF1= 182.463
##$NOISF2= 159.3651
##$NSP= 0
##$NTH_PI= 0
##$NZP= 0
##$OFFSET= 248.5645
##$PC= 4
##$PHC0= -10553.8
##$PHC1= -230.7153
##$PH_mod= 1
##$PKNL= yes
##$PPARMOD= 0
##$PSCAL= 0
##$PSIGN= 0
##$REVERSE= no
##$SF= 81.0140089999694
##$SI= 65536
##$SIGF1= 159.3651
##$SIGF2= -187.1042
##$SINO= 113.3802
##$SIOLD= 16384
##$SREGLST= <1H.CDCl3>
##$SSB= 0
##$STSI= 65536
##$STSR= 0
##$SW_p= 40650.406504065
##$SYMM= 0
##$S_DEV= 0
##$TDeff= 32768
##$TDoff= 0
##$TI= <>
##$TILT= no
##$TM1= 0
##$TM2= 0
##$TOPLEV= 0
##$USERP1= <user>
##$USERP2= <user>
##$USERP3= <user>
##$USERP4= <user>
##$USERP5= <user>
##$WDW= 1
##$XDIM= 65536
##$YMAX_p= 346327440
##$YMIN_p= -2413973
$$ End of Bruker specific parameters
$$ ---------------------------------
##NTUPLES= NMR SPECTRUM
##VAR_NAME=  FREQUENCY,     SPECTRUM/REAL,   SPECTRUM/IMAG
##SYMBOL=    X,             R,               I
##VAR_TYPE=  INDEPENDENT,   DEPENDENT,       DEPENDENT
##VAR_FORM=  AFFN,          ASDF,            ASDF
##VAR_DIM=   65536,         65536,           65536
##UNITS=     HZ,            ARBITRARY UNITS, ARBITRARY UNITS
##FACTOR=    0.620285442955139, 1,           1
##FIRST=     20137.2065510682, 0,            0
##LAST=      -20513.1999529968, 0,           0
##MIN=       -20513.1999529968, -2413973,    0
##MAX=       20137.2065510682, 346327440,    0
$$ Real data points
##PAGE= N=1
##DATA TABLE= (X++(R..R)), XYDATA
$$ [...]
39885g98337L12610N29993m7584n43379k60022L05697L56196K7467l2482J60077
39875A0236P9537k32221k12443J44727K24239p6816j18233K95107M51025n5274
39865E09884n29019k81886K19412J49718l04825l31518J08507K69394r9137m08841
39855f98311k57000K9948P1882m0840j23604j80239q4407M01407J000298R43451
39845A062585N1533p49781n57379K54863N45295l1564o29924m24869L37215P52139
39835F10113L93603k87087o06231m09099p5459O3043L9385k8418j86434l80817
39825h67401k62494L17643Q31622O49970M894k72010n554R1093l36930o40368
39815d89535k66094K63386K13533j32784l6504L26514J36387n68628p86496j16063
$$ y = [-798337, -485727, 44266, -3318, -546697, -806719, -501022, -144826, -117359, -149841, 10236, 89773, -142448, -354891, -210164, 14075, -62741, -180974, 114133, 565158, 509884, -19135, -301021, -81609, 68109, -236716, -568234, -459727, -190333, -289470, -698311, -955311, -925363, -853481, -894321, -1017925, -1198164, -1282571, -881164, 119134, 1062585, 1114118, 364337, -193042, 61821, 607116, 575552, -54372, -479241, -142026, 610113, 1003716, 716629, 110398, -298701, -374160, -311117, -271732, -300150, -486584, -867401, -1129895, -812252, 19370, 669340, 674234, 402224, 396670, 487763, 150833, -489535, -755629, -492243, -278710, -411494, -447998, -121484, 14903, -553725, -1340221, -1456284]
39805a456284N96144N62030J31231K6888K14373J91167q3121k17751p8304J10637
39795b990J69313N3373k39483m82561k38226M95798R62090N08186m44309q73529
39785i2338m57594J87589M75952M18888K18099n3306k19011l6881L19695L40273
39775A101366l6213k41155K7043K65699m4479n77742o36223j70035K55016L23370
39765B66647K25120J27243l2084j80670p9513K08780K87906N3273r3773P9417
39755H62346J77978j94705o76912n62622J31094N74795K21145m74336o85903k39907
39745h67027L31716N53746M31858J75533r5282k55932j25688K48955M63437J91184
39735A052500l33290n40466k32189J92920K79590L6899k14115k94470k42156p6428
$$ y = [-1456284, -860140, -298110, -166879, -139991, 74382, 265549, 182428, -35323, -113627, -2990, 166323, 219696, -19787, -502348, -740574, -244776, 717314, 1225500, 781191, -92338, -549932, -362343, 113609, 532497, 750596, 697290, 478279, 441398, 761093, 1101366, 1065153, 823998, 851041, 1116740, 1072261, 494519, -141704, -311739, -56723, 266647, 491767, 619010, 586926, 406256, 326743, 535523, 823429, 876702, 782929, 862346, 1040324, 845619, 168707, -393915, -262821, 311974, 533119, 58783, -627120, -867027, -535311, 18435, 450293, 625826, 530544, 274612, 148924, 397879, 861316, 1052500, 719210, 178744, -53445, 139475, 419065, 455964, 241849, -52621, -294777, -371205]
39725c71205K12430M51184L60703m8493l90554l67339j21310N7450J65133L32086
39715B80085M05621J17863l47520m49665j03553R7163k08245m81395o3566P05306
39705d7906Q42380J09602o69364p84515m43823j40086J22492M94239O90750L62726
39695E36495k17029m28771j48792J84084K57919J55030l1427l41324o27559n35576
39685a196950J1670N95237P31566L58372j71153m33353k78231L3166J03005p3047
39675c19718n5738L46089O43880L34502k77803m78197j78591Q6061J04771J89337
39665C94593L76902K36710k84021n77376l15650O382p1646k20600K781K99767
39655a52158J56381j98290j42594K69779L74160l6678m22970l49813k0418K01180
$$ y = [-371205, -158775, 292409, 653112, 604619, 214065, -153274, -274584, -217134, -52001, 280085, 685706, 803569, 456049, 6384, -97169, -6, -208251, -689646, -753212, -47906, 794474, 904076, 234712, -549803, -993626, -1133712, -1011220, -516981, 173769, 536495, 319466, -109305, -258097, -74013, 183906, 338936, 307509, -33815, -661374, -1196950, -1185280, -590043, 141523, 499895, 328742, -104611, -382842, -349676, -246671, -319718, -375456, -29367, 614513, 949015, 671212, 193015, 14424, 100485, 205256, 394593, 771495, 1008205, 724184, 146808, -168842, -162460, -234106, -454706, -451925, -152158, 4223, -194067, -336661, -66882, 307278, 270600, -152370, -502183, -522601, -321421]
39645c21421K96477L84595L73507J09879k81924m42531j85020K13110K49482j61134
39635B35020m48875j13936M50863M25218j52466l40858K03496N68224K1096p33956
39625A13826o34721O8132L24477K3237l2287L01584K73495l21762o99602l85653
39615i69274J28560L80797N42076O30124K12732n56406o93235J00529O98946K08790
39605F83639n89846n25374Q6479J35754l21810k59279M31678P18650J77096l63480
39595A73507k25521J96071L23062K16340N5274l00734p06508n27818L29009R26638
39585D59320N52554j75185k65351J25155Q7589m55353o36572j03922M27023L48108
39575C63366J9360q254P2708j89871n63107m26545J69753M88376K06922j27195
$$ y = [-321421, -24944, 359651, 733158, 843037, 561113, 118582, -66438, 146672, 396154, 235020, -213855, -327791, 123072, 548290, 395824, 54966, 258462, 826686, 847782, 113826, -520895, -452763, -128286, -105049, -137336, 164248, 437743, 115981, -583621, -969274, -840714, -459917, 82159, 712283, 925015, 368609, -324626, -224097, 474849, 683639, 93793, -431581, -345102, -209348, -531158, -790437, -358759, 359891, 536987, 173507, -52014, 144057, 467119, 683459, 738733, 437999, -268509, -796327, -467318, 459320, 1011874, 836689, 571338, 696493, 784082, 328729, -307843, -411765, 15258, 363366, 382726, 374472, 447180, 257309, -305798, -732343, -562590, -74214, 132708, 5513]
39565E513N584L15468K55212o5435j03569J77850K38720j40953m97247m20981
39555b29838j35829j2785L8400K42654L76531Q2199m07514m56525N1670N10507
39545E9470M29026K3034k09698j23146Q6898K19145J65968q0196l16407k45690
39535H404J08289L19213P9008m06943p21623p03878m29505N51L99563M89120K64001
39524e93800J23195L03081M46980J65174k43808k08737J47879J59854k74029m98828
39514d73039k02526P9440n2389j29726L04695P22256L65943m19012n91367j5237
39504d10962L60636M6622k69345M1974M80884K61246m05928o71837l35173L1978
39494h69905R3102J13005K67083K67258q8536m77510m48501K3024N66921P97288
$$ y = [5513, 11097, 326565, 581777, 516342, 412773, 590623, 829343, 688390, 191143, -229838, -365667, -378452, -340052, -97398, 279133, 361332, -46182, -502707, -451037, 59470, 488496, 511530, 301832, 178686, 265584, 484729, 650697, 570501, 254094, 8404, 116693, 435906, 514914, 107971, -613652, -1317530, -1747035, -1746484, -1346921, -857801, -593800, -470605, -167524, 279456, 444630, 200822, -7915, 139964, 299818, 25789, -473039, -675565, -596125, -648514, -778240, -473545, 248711, 614654, 195642, -395725, -410962, -50326, -3704, -273049, -231075, 249809, 511055, 105127, -566710, -901883, -869905, -776803, -663798, -396715, -129457, -217993, -695503, -1144004, -1120980, -554059, 243229]
39484B43229N63597M7059l22954k67874p989K4429j98487k96938j10881P0887
39474b55922K3262p0823J2632J72162K13690J56075P6166p2608k57951k64416
39464b67733l5521J54079J15973M0491R8631R2211j34184k65205K5615M40533
39454B64890M22798J1674k21994m6700J61670O3159k18658m05898l94430j83412
39444e46901J59670L99489L38020J35119P3827O8583j31827l27698q3243M06934
39434D91973M08900j78576n19300j10870L95841K51116j94104j47858K62450K39414
39424H98986l19920o79557m72959j55770j00610n6646J98536L70701K01915l8917
39414a54241k4234J03900N1764j31504k09123j04897J46089M48526M65454j23253
$$ y = [243229, 806826, 853885, 530931, 263057, 255068, 279497, 81010, -215928, -326809, -255922, -232660, -303483, -290851, -118689, 95001, 251076, 327242, 254634, -3317, -267733, -303254, -149175, -33202, 7289, 105920, 198131, 63947, -201258, -175643, 264890, 687688, 699362, 477368, 430668, 592338, 655497, 436839, 30941, -363489, -546901, -387231, 12258, 350278, 485397, 559224, 627807, 495980, 168282, 85039, 491973, 900873, 722297, 202997, 92127, 487968, 739084, 544980, 397122, 659572, 898986, 579066, -100491, -573450, -729220, -829830, -886476, -687940, -317239, -115324, -154241, -178475, -74575, -22811, -154315, -363438, -468335, -322246, 126280, 591734, 468481]
39404D68481r12556r19818J02526J077500R37329L4865n09185m06263k37893k19867
39394e84881p162L33306K59084j75787k28973K46747M48936L103l20148P8865
39384E3090N39017K42382l69207l31830K30460L68134j08568m23274j52287K53390
39374C01307L36684J61378j25345m78264o25196l02782J36614J25204j24985P1435
39364e23950N57850M22902l94612p88615k28102L73625K05559j74215j7964K31124
39354c36398j14413n42735j90201N03780M44131k06514k82312L51950N75678k2297
39344A80669m62491j05527L14258Q2823k53314N2952N72938M16937k87082o52904
39334a40741m24342j60166j81334j83214N5267K62963J68985m6176j1963L32771
$$ y = [468481, -444075, -1363893, -1261367, -183867, 753462, 788327, 279142, -127121, -365014, -584881, -592043, -258737, 347, -175440, -404413, -157666, 291270, 294373, -25775, 53090, 592107, 834489, 465282, 133452, 363912, 732046, 623478, 200204, 47917, 301307, 637991, 799369, 674024, 195760, -429436, -732218, -595604, -470400, -595385, -523950, 33900, 456802, 62190, -726425, -954527, -580902, -375343, -549558, -567522, -336398, -450811, -993546, -1183747, -679967, -235836, -442350, -724662, -372712, 202966, 180669, -281822, -387349, -73091, 9732, -243582, -190630, 382308, 799245, 512163, -140741, -565083, -725249, -906583, -1089797, -1034530, -771567, -602582, -648758, -660721, -327950]
39324c27950O31166M57049j85808p24375n85364P1876N12668L93073J32166J30185
39314E04686J42850j55993m48770k01638M37169P65162M64155r4293m47886n01720
39304D63722l85976k47081k16754k96699k89747q6476R8570O6551L1127K84109
39294e78654O26626O16439K86988P9904P7365j06966n61343p89758m53900Q0791
39284g22508K73612J23179J7272J30984K85654K42834o6940m50253n01558k8766
39274f96490N02686L87132k88258n78935j5915N86712K88424n00632n91386J60694
39264g45968O46358K45948k54439O635N70300L96910m96686j041252o28859J72391
39254a128662N28451L31822K5970j12620j65346k42721k58004n5946K98898M42146
$$ y = [-327950, 303216, 760265, 574457, -149918, -735282, -663406, -150738, 242335, 374501, 504686, 647536, 491543, 42773, -158865, 278304, 1043466, 1507621, 1413328, 965442, 463722, 77746, -169335, -386089, -682788, -972535, -1059011, -960441, -893890, -862763, -578654, 47972, 664411, 951399, 1031303, 1108668, 1001702, 440359, -349399, -803299, -722508, -448896, -325717, -308445, -177461, 108193, 351027, 284087, -166166, -667724, -696490, -193804, 193328, -94930, -673865, -689780, -103068, 185356, -315276, -906662, -745968, -99610, 146338, -108101, -101466, 468834, 865744, 369058, -672194, -1301053, -1128662, -600211, -268389, -242419, -355039, -520385, -763106, -1021110, -1077056, -778158, -336012]
39244c36012J09694l40892j89355N86632R63385J77825r74170j029240N7809P82473
39234a91851K74718n03405l56731L55299M94176k2684l25866j40650l0119j94299
39224f41412j68190J59521K57903m8365k04724R3651L56941J51403k15144k96059
39214e54475j57198K692K57265N24337L67084k42301n64315j17520M82281M06598
39204D04448j30258k86631P3242L02705P9892k02840j74261M3366J87086J91601
39194D88350J10164M3314J00717J62968q9945n80113o50102k813O02761L37278
39184E22579l68260m14549K34622N09746p626m39349j04778M02350K93382j13724
39174E14393l4665L99953L51851l48510q93918o47425M2492M01908K05899q9126
$$ y = [-336012, -226318, -567210, -756565, -169933, 793452, 971277, -2893, -1032133, -974324, -191851, 82867, -420538, -777269, -421970, 72206, 49522, -276344, -416994, -447113, -641412, -809602, -650081, -392178, -440543, -645267, -551616, -194675, -43272, -258416, -554475, -711673, -708981, -451716, 72621, 439705, 197404, -366911, -484431, -2150, 404448, 274190, -12441, 60801, 363506, 443398, 240558, 66297, 109663, 296749, 488350, 598514, 641828, 742545, 905513, 815568, 235455, -414647, -417460, 185301, 522579, 154319, -260230, -25608, 484138, 476512, 37163, -67615, 334735, 628117, 514393, 479728, 879681, 1231532, 883022, -10896, -658321, -615829, -213921, -8022, -97148]
39164i7148k6437K88939L84734Q2928k47283k16075L2494R1581m3634j6948K21574
39153D54725K87167N972k75136k20215M4212K12987J83569k8298l77209n95992
39143c08218l26983K97907O14277K72136k55903l53999p1876J47765J95032K55894
39133D66032L08002J74495o0167j59501j63823k73544l84022j86054K79446N82966
39123E83830M72643J36222j51255l21393l78768k67285j2367J85489J36690j15268
39113B68538l01742j63736K45160M91528J89125m42625p10533k96987L06144M58113
39103D2985J80727l5323L409O4070N566l7926j109j4624j10130j20144K4459J44874
39091A46834O4485j64970l53695l66585k10272k5824L5595K88L5206J60555J94509
$$ y = [-97148, -123585, 165354, 550088, 633016, 385733, 169658, 202152, 293733, 250099, 233151, 454725, 741892, 747864, 472728, 252513, 296725, 509712, 693281, 664983, 287774, -308218, -635201, -337294, 276983, 549119, 293216, -60783, -132659, 15106, 210138, 466032, 774034, 948529, 888362, 728861, 565038, 291494, -92528, -278582, 864, 583830, 1056473, 1192695, 1041440, 720047, 341279, 73994, 61627, 247116, 383806, 268538, -33204, -196940, 48220, 539748, 728873, 286248, -424285, -721272, -415128, 42985, 223712, 188389, 191798, 255868, 261434, 223508, 222399, 207775, 97645, -22499, 1960, 146834, 211319, 46349, -307346, -673931, -884203, -910027, -874432, -874144, -838938, -678383, -483874]
39080d83874R5299Q8652K61332L32600J08522j49132j55424p8256j54134j69876
39070c04291J20651L75476J47244k45065j34662L13659K58241m12644p90980l57551
39060a029922K34143K56345k7686j2592K24526K62617J59073J87840J83994r0337
39050C48001k81436M9041N20376L98392j79158l44407J23062M62805J59587l42208
39040I14055m82679l92713l93514l14004J18116O24660O84435K55281k49587n02068
39030B61982m27983r4395K12432Q3215m33225o41283p6137P02793P80269J51771
39020E19439l40425k45533M7270J44139J70265K35873R2613l02663m89132k13881
39010c82035Q1789k7114k42239j04616J83041J60307k1347J12198M23498L25057
$$ y = [-483874, -388575, -299923, -38591, 294009, 402531, 253399, 97975, 19719, -134415, -304291, -183640, 191836, 339080, 94015, -40647, 273012, 531253, 118609, -672371, -1029922, -795779, -539434, -567120, -579712, -355186, -92569, 66504, 254344, 438338, 348001, 66565, 115606, 635982, 1034374, 855216, 510809, 633871, 1096676, 1256263, 914055, 431376, 38663, -354851, -668855, -550739, 73921, 758356, 1013637, 764050, 261982, -166001, -260396, -47964, 35251, -397974, -1039257, -1115394, -412601, 367668, 519439, 179014, -66519, -19249, 124890, 295155, 531028, 623641, 320978, -168154, -382035, -300246, -327360, -569599, -674215, -491174, -330867, -352214, -240016, 183482, 508539]
39000E08539j91224m72321k09609J96556L82846M30394L81637P3794l16062k75251
38990E09299J86489L76399j7245l96589k34133J26389K07061K23302M44089L74293
38980A799354m72301j410303j254571k7282R82637R21278K73479r2216j4071J15363
38970H21367J4485k86349n52325m92708q6986K47773J54798j12034p5316J93327
38960a73968K56440J15326J36750K58836O9196l00525k34864K44426L25843k88973
38950D08487q00529n13445J51221M17523K50148O0207r1143l11208l73866q1992
38940h84597K42207K50234J83901L85943N77598L09435j88441l34270j35829p3277
38930C32904k11909j76490O4109J13248j23856k73366j37176N2953J11455J36537
$$ y = [508539, 317315, -155006, -364615, -168059, 214787, 645181, 1026818, 1100612, 784550, 509299, 695788, 1072187, 1054942, 658353, 424220, 550609, 757670, 980972, 1425061, 1799354, 1327053, -83250, -1337821, -1365103, -382466, 538812, 812291, 720075, 706004, 821367, 835852, 549503, -2822, -495530, -582516, -334743, -179945, -291979, -367295, -173968, 82472, 197798, 334548, 593384, 662580, 362055, 127191, 371617, 697460, 408487, -392042, -905487, -754266, -336743, -86595, -26388, -117531, -428739, -802605, -884597, -642390, -392156, -208255, 177688, 755286, 1064721, 876280, 542010, 406181, 332904, 120995, -55495, 8614, 121862, -1994, -275360, -412536, -359583, -248128, -111591]
38920a11591J92069J83935J08580N3284l4848k19887l17730j72712l9067k00526
38910e58493l78932j03160M65367P23238N54890L74430K83916l2586n17448o50388
38900A60834l19972j0584Q3516L22324P25247O78472k4736o64885o62378m08750
38890a20912m16367l89795P1966N05768K64580k90390k80177K76212N35483K15255
38880C71623p4612M6257J87103o173k77123l07139k10522j59550m6870J61650
38870c15356K09297M553j26733K7255J62141n9521m41790n41214k83862M3085
38860a322145K33624K91409K63969K16315K44909L06777J95517j10188k85561
38851C4626j04652J65738J37142j09413j71165N1148K67946K90734K10324Q4381
$$ y = [-111591, 80478, 264413, 372993, 426277, 391429, 171542, -146188, -318900, -357967, -558493, -937425, -1040585, -575218, 148020, 702910, 1077340, 1361256, 1328670, 811222, 160834, -159138, -169722, -86206, 236118, 961365, 1639837, 1615101, 950216, 287838, -120912, -537279, -927074, -855108, -349340, -84760, -375150, -655327, -379115, 156368, 371623, 297011, 343268, 530371, 524198, 247075, -60064, -270586, -430136, -477006, -315356, -106059, -101506, -228239, -200984, -38843, -98364, -540154, -1081368, -1365230, -1322145, -1088521, -797112, -533143, -316828, -71919, 234858, 430375, 320187, 34626, -70026, 95712, 232854, 123441, -47724, 3424, 271370, 562104, 772428, 856809]
38841H56809j40255l24999j85135J96767L00900j27316o34573o33137j53096L18404
38831e25631N12145M82662K32004k52542o37732m88088K0467J77985k28401m93993
38821a201124k0257O99243P23904L5817m44824j95719K60504K57314q2776k26840
38811a94758j03633o9994k17230k33778M6035L65592M16991K19353K0266r142
38801B39702R6605J65985O3601j33800j89311k9061J09669K5329j02434M132K02207
38790D52624Q3309l42142n45325k25503K21845K49857j09368l69872k54724Q3567
38780g55732L86659N24382M45754J59894k06507m75293n26081k97505J53455N13975
38770g6999M25338J4778j39298J28173J85566l93121q97106l87854P15061J022674
$$ y = [856809, 716554, 391555, 206420, 403187, 704087, 576771, -57802, -690939, -844035, -525631, -13486, 469176, 701180, 448638, -189094, -677182, -656715, -478730, -707131, -1201124, -1221381, -522138, 201766, 237583, -207241, -402960, -142456, 114858, 32082, -194758, -298391, -368385, -585615, -819393, -773358, -407766, 9225, 228578, 248844, 239702, 336307, 502292, 565893, 432093, 242782, 213721, 323390, 348719, 246285, 250417, 452624, 535933, 193791, -351534, -577037, -355192, -105335, -214703, -584575, -839299, -755732, -369073, 155309, 601063, 760957, 554450, 79157, -446924, -744429, -590974, -76999, 348339, 363117, 223819, 351992, 537558, 144437, -752669, -1140523, -425462, 597212]
38760E97212K18128m36128l9676O09695L77250m42485p46505l70604p5851j46871
38750d55835j52818K1046P775j33230J10790O40912O36578j63771r30582q86715
38740a305850k55447L03336N11088L58931j21207n53755l49229M17693Q77225
38731a17215N32535p7071k89437j81358m8995J88303M79510L37981k63959n04125
38721E6169K577L81786r2664o59118l30759L23046J23177o16153n96767K10934
38711a197772N88334K30921P2016L22598P1406p31348p67176M00012J280735O97805
38701I67531m22469o64838k18628o4003j95831o9302P8383k12332m40430P4726
38691a167193P93902P15255N6875j90106J8508o6843m14438k77274K84677M17686
$$ y = [597212, 815340, 379212, 339536, 949231, 1326481, 883996, 137491, -233113, -308964, -455835, -608653, -587607, -579832, -713062, -602272, 38640, 675218, 511447, -419135, -1305850, -1561297, -1257961, -746873, -387942, -509149, -1062904, -1412133, -994440, -117215, 415320, 338249, 48812, -132546, -181541, 6762, 486272, 824253, 560294, 56169, 58746, 440532, 347868, -311250, -642009, -318963, -195786, -811939, -1408706, -1197772, -609438, -378517, -306501, 16097, 87503, -643845, -1411021, -1011009, 269726, 967531, 545062, -119776, -338404, -402407, -598238, -667540, -589157, -801489, -1241919, -1167193, -373291, 341964, 398839, 208733, 227241, 160398, -254040, -531314, -246637, 171049]
38681A71049L9405l4526L36167L33373k53874n61868j72787J98742O4699l6418
38671H3962K63455L61169j29587m78154n6837M73834K26961m34598n70999j99188
38661d59982j8912o8338J48899M59469J84906m95582n49449K67502Q32018K37136
38651E37667q59914j147310l88465M77054P01171M77174K90441J43687k27544
38642C961o98507p82851l19599K42087M26776L33932L65779N31714M35244l6877
38632E01659m28768l14409J06753K89964Q2401j07566Q6074M22634L14998l12848
38622F40892p06565j86579P40267Q01256k88102j194290o87077O03238J058332
38613G81372L44925l03835m9227M93578M73975J7190l30798m87946n27812k37348
$$ y = [171049, 210454, 175928, 512095, 845468, 591594, 29726, -143061, 55681, 120380, 83962, 347417, 708586, 578999, 100845, 44008, 517842, 744803, 310205, -260794, -459982, -478894, -547232, -398333, 61136, 246042, -249540, -798989, -531487, 300531, 537667, -322247, -1469557, -1858022, -1380968, -679797, -202623, 87818, 231505, 3961, -694546, -1477397, -1796996, -1554909, -1128133, -794201, -428422, 103292, 538536, 501659, 72891, -241518, -134765, 155199, 237600, 130034, 216108, 638742, 953740, 640892, -65673, -252252, 488015, 1289271, 1001169, -193121, -880198, -276960, 781372, 1126297, 822462, 773235, 1266813, 1740788, 1757978, 1427180, 939234, 411422, 174074]
38603A74074L29876N17700J1336m79737k58546J99168P941o57190q37996k72147
38593a265521L76756O34614O35146M75317O3409l36565k57510J62630L02104P2296
38583H62676J083J85103O7194m65989o83419j79078L75103K59418j91855k35670
38573e434O0250N0762l41084n21867j96083K60353M55949M31058L06685p98m35037
38562F4754n51763l3893O82347P38455o3387q56317p17706J25131N97279K59518
38552B44418j69949l5928K46475M3902k59611J23326Q53641P52841l08256j018419
38542D72440n39514K87881L29478j93635l38895j1330J46075L545K4529K58920
38532D39494K25380j84725n06529m76336k88845k1651M70353R67381R21569L09271
$$ y = [174074, 503950, 1021650, 1032986, 553249, 294703, 493871, 501812, -155378, -993374, -1265521, -888765, -254151, 380995, 856312, 919721, 583156, 325646, 488276, 790380, 862676, 863759, 1048862, 1116056, 650067, -33352, -212430, 162673, 422091, 230236, -5434, 54816, 105578, -235506, -757373, -953456, -693103, -237154, 193904, 500589, 499791, 64754, -487009, -520902, 161445, 899900, 836513, -19804, -737510, -612379, -15100, 244418, 74469, 38541, 285016, 328918, 69307, 192633, 1046274, 1799115, 1490859, 472440, -67074, 220807, 550285, 356650, 17755, 6425, 152500, 156045, 180574, 439494, 664874, 480149, -26380, -502716, -791561, -813212, -342859, 624522, 1546091, 1855362]
38522A855362k05752k24391j08647k27945l42166j58785O3545O23j04897J01538
38512F48485L37475O0526n69930p86900l04705K77296L33963O714j36607R2068
38502d1615L68708L86926K10526O9850K100j72257n29101q01542n95920R8612
38492a003713P32715P00495L0881n75230m88525J55503O26050M26720j90637n84386
38482a70127m41638L985L56427M15395J72152k46072n14685k91778L13440O89834
38472B86933M24841j43019l96717k69341j74004k45300j90692R0467K93518K54874
38462f8440K05855K77116K30196n8272l04440l09839k93381l92601l15802P7313
38452i52295L35016J04032j86711M314L65787K22788k90730m34612r7170J11864
$$ y = [1855362, 1649610, 1425219, 1316572, 1088627, 746461, 587676, 651221, 651844, 546947, 648485, 985960, 1046486, 476556, -310344, -615049, -337753, -3790, 2924, -133683, -41615, 327093, 714019, 924545, 994395, 996495, 824238, 295137, -506405, -1102325, -1003713, -270998, 429497, 460378, -114852, -603377, -447874, 178176, 604896, 414259, -170127, -611765, -607780, -251353, 164042, 336194, 90122, -424563, -716341, -402901, 286933, 711774, 568755, 172038, -97303, -271307, -516607, -707299, -616832, -323314, -68440, 137415, 414531, 644727, 586455, 282015, -27824, -321205, -713806, -1029608, -952295, -617279, -513247, -699958, -695644, -329857, -107069, -397799, -832411, -929581, -817717]
38442h17717o979n787J87859N5979l83623l05301N07076R76297K82951p28647
38432b37892o97908K85515R45359O94858J43849j42909l16928n57539o34845m22015
38422i40455j40471J21645N06160Q37428O47342k5842n10876m50962k55551k99313
38412e10895l20762m5717K00239N7844j78117n3270K40075K08394n0492M70L89149
38401f3082N28103J51772k31338p9640L99834N48211J38178l62900m24887j22935
38391D81316J4205k23328m04215j17256L17874K65426k10775l71000M1732L44406
38381A38385j6896n56662m84465J11153M94392L92155J50533l3056k69362m12305
38371d86128j12980M37734N40621J5662m27878j87323L93531N75522J98776l05882
$$ y = [-817717, -824696, -830483, -642624, -586645, -970268, -1275569, -768493, 207804, 490755, -237892, -935800, -650285, 295074, 989932, 1133781, 990872, 673944, 116405, -518440, -940455, -1080926, -959281, -453121, 384307, 1031649, 1005807, 494931, 43969, -211582, -510895, -831657, -877374, -677135, -619291, -797408, -850678, -610603, -402209, -452701, -452231, -63082, 465021, 616793, 385455, 305815, 705649, 1253860, 1392038, 1029138, 604251, 481316, 495521, 272193, -132022, -249278, 68596, 334022, 123247, -247753, -206021, 138385, 121489, -435173, -919638, -808485, -314093, 78062, 228595, 195539, -73823, -486128, -599108, -161374, 379247, 394909, -32969, -220292, 173239, 748761, 947537, 641655]
38361F41655n57732m70056r9316L44059M87820J61522l16382m89561l06839p2738
38351f77568K4177O1546J35756K24371K78969K69742J70494L5599J014O3142J315
38340E88557k70993m36408j65405L10440L99122l0222l98785j74039M15385O93732
38330I31384L92599j18288l90367l61311k04408j9497J36839J29917p9915k54494
38320A62459j40585J40993K54037J60440J26670J94209P9998k38944l20795K7619
38310D46101K74117r5256o84279o75335m8091L87641J94723j50103j09263J47818
38300c11927J69892o6833k67231k93649j79946N0950K68291J99026j77717m52797
38290a061941l06461N0950K68924L92597O05568P00920L33879l02219n79556k67822
$$ y = [641655, 83923, -386133, -485449, -141390, 346430, 507952, 191570, -297991, -604830, -677568, -653391, -591845, -456089, -231718, 47251, 316993, 487487, 523086, 524100, 587242, 588557, 317564, -118844, -284249, 26191, 425313, 395091, -3694, -177733, 237652, 931384, 1323983, 1205695, 815328, 454017, 249609, 230112, 366951, 496868, 416953, 162459, 21874, 162867, 416904, 577344, 704014, 898223, 978221, 739277, 418482, 446101, 720218, 624962, -59317, -734652, -782743, -395102, -200379, -350482, -459745, -311927, -142035, -208868, -476099, -769748, -949694, -898744, -630453, -431427, -609144, -1061941, -1368402, -1317452, -1048528, -655931, -50363, 650557, 984436, 682217, 102661, -165161]
38280a65161J65475K10556o3096k14321m2194K00098J48498k07351m50500k08780
38270f26776L18307N17524J37010l44933l17647K12824P09233P50966L43654k42627
38260A457535o62865o61632l17108j2305L3760J8928J50555K84757K55270K06878
38250G53773K10677n4643o88688j021662m27059N66420Q36660K50120k39043j14123
38240G2432Q8675n4238j13021K27994L81268j85184q77393p40265J32975P93375
38230b73382P64418L92580N4103k12044l35337j91254J5046m8350k22127l5474
38220i1821M48414N98511J79805k58399k24834J8905k8138l18589m23260k34977
38210c34383p0169j43135k80273k00426J17292M15529M35993J71695j57665l46532
$$ y = [-165161, 314, 210870, 147774, -66547, -108741, 91357, 239855, 32504, -417996, -626776, -308469, 209055, 346065, 1132, -316515, -103691, 605542, 1356508, 1700162, 1457535, 794670, 133038, -184070, -196375, -162615, -143687, 6868, 291625, 546895, 753773, 964450, 909807, 221119, -800543, -1227602, -661182, 175478, 425598, 186555, 72432, 161107, 106869, -6152, 221842, 603110, 417926, -459467, -1199732, -1066757, -273382, 491036, 883616, 937719, 725675, 390338, 199084, 214130, 165780, -56347, -91821, 356593, 955104, 1134909, 876510, 651676, 670581, 642443, 323854, -99406, -334383, -404552, -547687, -827960, -1028386, -911094, -495565, -59572, 112123, -45542, -392074]
38200c92074l31815r7833L25953O68919N13089j38601o33205m00873K51420N39260
38190C04240K81999L1903J21291K02680o7721m51870n62569m30389k69998m4579
38180h85013L23646N70063L47593k42435p04876o72271j74702M70690Q50072P06476
38170E89243K10339j70682k15475j55855k20351k85843j83263j3431R9661K32925
38160a12732L63725K29033j76794l84329j48507Q7073n3894j58542K32408O27920
38150E05361K76035m50140m70667K49137N59035l7865n95459k98308K44493P8645
38140F0267n42496o48786j00492L20905J69388j48851j18895K32686N02028L52179
38130G7933j80972n94197l32015M55092R01847N13395j46432l00582m6588J6445
$$ y = [-392074, -723889, -821722, -495769, 173150, 686239, 547638, -85567, -486440, -235020, 304240, 586239, 618142, 739433, 942113, 874392, 422522, -140047, -570436, -840434, -885013, -561367, 8696, 356289, 113854, -591022, -1263293, -1437995, -967305, -117233, 589243, 799582, 628900, 413425, 257570, 37219, -248624, -431887, -445318, -345657, -112732, 250993, 480026, 303232, -81097, -229604, -142531, -196425, -354967, -122559, 505361, 781396, 331256, -139411, 109726, 668761, 630896, 35437, -262871, -18378, 60267, -482229, -1131015, -1231507, -910602, -741214, -890065, -1008960, -776274, -274246, 77933, -103039, -697236, -1029251, -574159, 327688, 841083, 694651, 394069, 347481, 363926]
38120C63926j46695r4349J73286K17923J2439k5695J26945L2427l19840l60328
38110a9961Q2830M13783K33525k2214J15470L11849M276n92927p26434j91989
38100c91792L92541M34940P3598j09645J39861M55075L37732j63655m68974k31610
38090D68071J89487K75554Q5937L2482J39255P9711j61042k74690k52017l63826
38080B18922m91147k04497L53866M58601m2684l57854K1655M70406K13539m53406
38070A87401o32533q8388O14360R24685O89542L2878o16751o87208j56652K44714
38060E12048J474m45476m65207k33663k51749l43417j6682N03061N46561J31001
38050f2049j06983j3622l9793k89107l52948j37877J6833R8757M04352P04649
$$ y = [363926, 217231, 122882, 296168, 514091, 526530, 500835, 627780, 660207, 340367, -19961, 62869, 476652, 710177, 687963, 803433, 1115282, 1119558, 526631, -199803, -391792, 749, 435689, 509287, 399642, 539503, 994578, 1332310, 1168655, 699681, 468071, 657558, 933112, 1019049, 1051531, 1190786, 1270497, 1109455, 834765, 582748, 218922, -272225, -476722, -122856, 335745, 293061, -64793, -43138, 427268, 640807, 187401, -445132, -533520, 80840, 1005525, 1695067, 1727945, 1111194, 423986, 267334, 512048, 513522, 68046, -397161, -630824, -882573, -1225990, -1242672, -739611, -193050, -62049, -169032, -182654, -222447, -511554, -864502, -1002379, -985546, -886789, -482437, 222212]
38040B22212M16027k46838l50679K29730M60565k00910q78049o65355K9049L52603
38030f31645L56531N00227N11955j24175r64921j033857l00929K82065K14976
38021a189773j6387M2697J30329r2204l83430l13703R1367M42861M84321K66514
38011e37408M78j04660K7364K73528M22511L46612M6276l47057n55853l58092
38001g86301P2313K73289J07250k2991K06793N30829N13793J86971r6973j84459
37991H00514j31706L0451J56829o8485n90204p35443r7764O56142N92351j13052
37981D99633m56472j63467J6401k99680m66343J8182N61950L82760k55317m68598
37971f30951n6642L49744K89357j4285j40962J835K11877K44726J3627k63023
$$ y = [222212, 638239, 391401, 40722, 270452, 731017, 530107, -347942, -1013297, -984248, -631645, -275114, 225113, 737068, 612893, -352028, -1385885, -1686814, -1404749, -1189773, -1206160, -1163463, -1033134, -1125338, -1508768, -1822471, -1731104, -1288243, -803922, -537408, -536930, -641590, -614226, -340698, 81813, 428425, 474701, 127644, -428209, -786301, -713988, -440699, -333449, -356440, -149647, 381182, 894975, 1081946, 984973, 800514, 668808, 699259, 856088, 787603, 197399, -538044, -635808, 20334, 612685, 499633, 43161, -120306, -103905, -403585, -869928, -851746, -289796, 92964, -162353, -630951, -687593, -337849, -48492, -62777, -203739, -201904, 9973, 254699, 268326, 5303]
37961E303k09979J92905M26782Q2069m74359n10174N1241N00076L22169j45039
37951B40994k83334n6308Q0162n4573j24800J45071M95579M48990m9298n32845
37941C09638n55784j76164J64057J57854n6407j08982J25938L50366K16322j71086
37931B55752l28498o1096J90395n6226n51357n64517P0837O24838M07113l19113
37921c31872o83553k65497N01691Q76599N34149j71826n33826k13015L01793K33006
37911B47649m02189o94304q7634P78206R40448L90105j32785k72138k55192j85582
37901C26584M4757K03483q8295n49059m55748J69276M47962K3793l23848N2589
37891a48506N87567M11983k59913n07682j24552K09129P7689j43784n0027J48386
$$ y = [5303, -204676, -11771, 415011, 497080, 22721, -487453, -436212, 63864, 386033, 240994, -42340, -98648, -18486, -73059, -197859, -52788, 442791, 891781, 842483, 309638, -246146, -422310, -258253, -100399, -156806, -265788, -139850, 210516, 426838, 255752, -72746, -133842, 56553, 327, -551030, -1115547, -1044710, -419872, -12759, -331872, -1015425, -1280922, -779231, 97368, 631517, 459691, -74135, -287150, 14643, 247649, -154540, -848844, -936478, -158272, 782176, 1172281, 1039496, 767358, 512166, 326584, 371341, 574824, 486529, -62530, -518278, -349002, 98960, 122753, -201095, -148506, 439061, 851044, 591131, 83449, -41103, 168026, 245715, 101931, 51904, 200290]
37881B00290N4011k36014k63512Q5124L36937M8058m93914n19756J62199P51302
37871A24725M80923k72540n09942k9984M40828M75714L84889K94509j65482q43013
37861C80627q02089K02498R41306L53951q00594j046184l35104J64568L5132k0291
37851i26180L01830L87311l9814l27354j669M83839N82659M47329M08974L40242
37841A657167K8619l40756m92616m26088k04431J51979L75640J21468l74298m38315
37831E8369J0165K85869P9764m4548K53136L60339k23846q43600n98748K16715
37821d46385N40700J11185l16463k13351J06243J74967k059j61718j52155J1988
37811c47048J46856k689l74620m85087p4616L94055L52917j3042j00746J27363
$$ y = [200290, 254301, 18287, -245225, -160101, 176836, 224894, -269020, -788776, -626577, 124725, 605648, 333108, -176834, -206818, 234010, 709724, 1094613, 1389122, 1223640, 380627, -421462, -218964, 722342, 1076293, 275699, -770485, -1105589, -941021, -905889, -926180, -624350, -237039, -276853, -604207, -605876, -122037, 460622, 907951, 1316925, 1657167, 1685786, 1345030, 852414, 426326, 221895, 373874, 749514, 870982, 496684, 58369, 68534, 354403, 434167, 389619, 642755, 1003094, 779248, -64352, -663100, -446385, 94315, 205500, -110963, -324314, -218071, -43104, -45163, -206881, -359036, -347048, -200192, -202881, -577501, -1062588, -1137204, -743149, -390232, -403274, -504020, -376657]
37801c76657J73169p8299j90338L0799K54946K75597L08800M55038M51601K04034
37791A508690K0146L5578p0436m45751o47111k91637K68784M23712J76579J6685
37781I95239Q5218K8521l04378n34346l25000P1751J38836k07341n37333m98678
37771a087511k15399n914O9971J67233K92574K80102J23956M0105J17211J75893
37761d1779R1898o209p36L6425Q9143K86992N22299L62393k94713q33824o68894
37750d57005r6699J44345l7382o9675K86483N80045M06857m9447l72727l73163
37740c8368p4419L41116M83531Q5978n16272o78390l13447J9987K3210P6397M68469
37729a22208P56281L76213m30756q15777l67824L88994N95799K7919n95377l80078
$$ y = [-376657, -203488, -281787, -472125, -441326, -186380, 89217, 398017, 853055, 1304656, 1508690, 1528836, 1564414, 1493978, 1048227, 401116, 109479, 378263, 801975, 978554, 995239, 1080457, 1108978, 804600, 270254, -54746, 17005, 155841, -51500, -588833, -1087511, -1302910, -1308824, -1238853, -1071620, -779046, -498944, -374988, -334883, -217672, -41779, 50119, 43910, 43174, 79599, 168742, 455734, 978033, 1340426, 1045713, 211889, -457005, -553704, -409359, -446741, -516416, -229933, 350112, 756969, 707522, 334795, -38368, -112787, 228329, 711860, 797838, 281566, -396824, -710271, -690284, -667074, -590677, -122208, 634073, 1010286, 579530, -236247, -604071, -215077, 380722, 408641, -186736, -566814]
37719e66814N92660J184025N95305m93168q02354k36188J02181l06985o38242
37710e69580j38908O32873O84083L2154m98016m86712k00383N1001J82132J41996
37700a69360j6302m7910J04977J34657n4598k8486M16261O70689J76907n61528
37690F25307o45084j24520K12488J68466K51910N30197M25278j68618n47936l31247
37680C96241o2637k19948l84324q168N67307N62334q6471o57476o23171k02298
37670g18611P9350L1537r8987j8710K28769L32621J74863J6207M6817J8306l03446
37659b11284n60116k44458L86774N32639N0803k91032k2703K93563J5276m95558
37649e46096m15812K52258O57958L07982l04165m08967R6518O19945N90214K7309
$$ y = [-566814, 25846, 1209871, 1805176, 1312008, 509654, 273466, 375647, 68662, -569580, -708488, -75615, 608468, 640622, 142606, -344106, -544489, -493488, -311356, -169360, -185662, -233572, -128595, 6062, -48536, -77022, 339239, 1009928, 1186835, 625307, -19777, -144297, 68191, 236657, 488567, 1018764, 1444042, 1275424, 727488, 396241, 333604, 113656, -270668, -278836, 288471, 850805, 764334, 106858, -516313, -718611, -639261, -607724, -706711, -725421, -496652, -164031, 10832, 27039, 73856, 92162, -211284, -771400, -1015858, -629084, -96445, -45642, -336674, -359377, -65814, -50538, -546096, -961908, -709650, -51692, 256290, -47875, -456842, -360324, 259621, 849835, 877144]
37639H77144n49450o62270k71168L04796O86206O07295O4385m89984l89001M18264
37629E96217J012657N23616o28298j159205n94136K10875L74393N7176j28352
37620B64943p5342k4837N316O3303m4868l58077m36890k636M56445L31843j60918
37609A8282l51777j81012j51829l51088l12786R3713L87098K75268Q6537J33099
37599c54495K06036M5769j46155o4511J61312J86831m310j38354q8718N2946K39272
37588I5623M65099N36796J97656m13817p22103l52429L47099O65978L43680k31650
37578I31932n98559o53267m38767N6994O08332O69380O5774n30731m11862J09366
37568a91408J82800j77303j25097M79438O64621m5265o73468k71158N14347M46301
$$ y = [877144, 327694, -334576, -605744, -300948, 385258, 992553, 1056938, 566954, 177953, 596217, 1608874, 2132490, 1504192, 344987, -249149, -38274, 336119, 393295, 264943, 189601, 164764, 170080, 233383, 188515, -169562, -606452, -609088, -152643, 179200, 18282, -333495, -514507, -666336, -1017424, -1330210, -1236497, -849399, -574131, -487594, -354495, -148459, -102690, -248845, -313356, -152044, 34787, 30477, -107877, -196595, -143649, 95623, 560722, 1097518, 1295174, 881357, 159254, -193175, 153924, 819902, 1163582, 931932, 333373, -319894, -758661, -701667, -93335, 576045, 641819, 111088, -300774, -191408, -8608, -185911, -311008, 168430, 833051, 787786, 114318, -156840, 357507, 803808]
37558H03808l25008n63995L1950M43129O4453l95267j76227L60233M31813Q507
37548F83396l52132l83317k40159m2480K05791L80352L00075r556l09372l55076
37538a22478p5183L20599M43284J54836j79144j58882N9863O2475q7881k127K10230
37527F25592Q056n74530p70015k23418M34633N59081L32823J51487j17837n95173
37517a69301p40170r9828P23429P63058J13029k39006Q9686M45811K87900q8065
37507A086543k36809k56680l91947m68849j81352L63379P49689P25745L40740
37498A730459k04760o43257p31499m47382k8757K57305L05148J50788p9484k11264
37488I7297j74438p8754R651K24246N78232O79833J97803m81490n89171j5470
$$ y = [803808, 478800, -85195, -53245, 389884, 454337, 59070, -117157, 243076, 674889, 683396, 331264, -52053, -292212, -334692, -128901, 251451, 551526, 541970, 232598, -122478, -197661, 122938, 566222, 721058, 541914, 383032, 442895, 505370, 417489, 415362, 625592, 633648, 59118, -710897, -934315, -499682, 59399, 392222, 543709, 425872, -169301, -909471, -1009299, -285870, 477188, 590217, 351211, 440897, 886708, 1174608, 1086543, 849734, 593054, 201107, -267742, -449094, -85715, 663974, 1389719, 1730459, 1525699, 882442, 150943, -296439, -325196, -67891, 237257, 388045, 308561, 97297, -77141, -155895, -146244, 78002, 656234, 1336067, 1533870, 1052380, 463209, 447739]
37478D47739N10865M26186j3966l15419m38112n27867m30515J481M24971L88279
37468D73642M5371l4908K76110M88785K28248k57208m51564j65182L32079N85769
37458A521142L23354k85205p28742o69158l03686m8928O305O0689J35907M5285
37448E6963j76018k17853K1327K53006K50130J59631J81442K27485J24603p7189
37438H03527k24541k93026k91182j21839K41327N94277P10567N59700J93005l30757
37428A841058p32157n83472O5932M70632Q0804n83543n35290L04315R71401P62565
37418B062245N0604m13082m53842l84410l78462l43874j94966N7586L27600L93855
37408G23254P3881l86793m49939k7876L18060K23450Q5021L09146M82461N047
$$ y = [447739, 958604, 1384790, 1370824, 1055405, 617293, 89426, -341089, -339608, 85363, 473642, 519013, 484105, 760215, 1249000, 1477248, 1220040, 768476, 603294, 935373, 1521142, 1844496, 1559291, 830549, 161391, -142295, -191223, -184918, -124229, 11678, 56963, -119055, -336908, -315581, -62575, 187555, 347186, 528628, 756113, 880716, 803527, 578986, 285960, -5222, -127061, 114266, 708543, 1419110, 1978810, 2171815, 1841058, 1108901, 525429, 591361, 1061993, 1142797, 559254, 23964, 328279, 1299680, 2062245, 2112849, 1699767, 1245925, 861515, 483053, 139179, -55787, 1799, 329399, 723254, 797135, 410342, -39597, -67473, 250587, 474037, 559058, 868204, 1350665, 1355712]
37398A355712p76072r37794l86299K8413r4201j55599K46384N10019P8168m65496
37388e96765k47034M38668N43252n7750l77064P7823N42090K72113k84893k91691
37378A8749J36636K50548k1211k7617L67347M47275j55562p18900m53451K86176
37368A29990N18026O3619l00473q6324K54835J56976j96069k59791J0214J94421
37358D85424J28065Q6308K42624L62514J90581j38016k81879j45068M7759P1814
37348A050126o5857k19199k84692k20676L37L07373M41157J68976l26752m98887
37338C51906q6085M57828M92028M4456k62776j54984q3226m40066q46657o59609
37328a187185N8760N71929M30957j6708j65546J07971L90089K54963k61074o62497
$$ y = [1355712, 579640, -358154, -744453, -716040, -810241, -965840, -719456, -209437, -131269, -596765, -843799, -405131, 138121, 80371, -296693, -218870, 323220, 595333, 310440, 18749, 155385, 405933, 384722, 357105, 724452, 1171727, 1016165, 297265, -156186, 129990, 648016, 711635, 411162, 324838, 579673, 736649, 540580, 280789, 291003, 485424, 613489, 699797, 942421, 1304935, 1495516, 1357500, 1075621, 930553, 978312, 1050126, 984269, 765070, 480378, 259702, 260039, 567412, 1008569, 1177545, 850793, 351906, 265821, 723649, 1215677, 1260133, 997357, 842373, 759147, 319081, -527576, -1187185, -1128425, -556496, -125539, -142247, -307793, -199822, 190267, 445230, 184156, -478341]
37318d78341m91367J30480N78435M53773M7305j30856o4023j12567l27052l53295
37308g47508n2852K45919K76193K10036K71253L18407J33308j29786j52931L2122
37298D04161J10409M869m2921N3673M5806j97466l76904j86023J74114K70226
37288B59944J14801J13288K98037J62041m53542q36971l50969M59760M99841k47498
37278A8732o40778j08148N07814L34856j98386k38384O474k44892p87756o29066
37268a979534K91030Q27769L83244j92844P90N74885O43849K26510j0090P3503
37258H39112N4327j53722j86289L7020J53726j1311j98605j74287j3645J23818
37248D70144J56213L1326j63989j46693J46223K56728j81536o86115m48925L94199
$$ y = [-478341, -969708, -839228, -260793, 192980, 240285, 109429, 45406, -67161, -394213, -747508, -800360, -554441, -278248, -68212, 203041, 521448, 654756, 524970, 372039, 404161, 514570, 519439, 476518, 530191, 575997, 378531, 1627, -184396, -10282, 259944, 374745, 488033, 786070, 948111, 494569, -342402, -693371, -233611, 266230, 18732, -622046, -730194, -222380, 112476, -85910, -324294, -317820, -562712, -1350468, -1979534, -1688504, -860735, -477491, -670335, -669545, -94660, 549189, 775699, 765609, 839112, 893439, 739717, 553428, 590448, 744174, 732863, 534258, 359971, 346326, 470144, 626357, 657683, 493694, 347001, 493224, 749952, 568416, -117699, -566624, -172425]
37238a72425P89003K69485l36214j61135M12584M04828k67271p45240n19002O683
37228c18704K89688L15849K72957J23930j52995k99829j33044J01310P5951j20114
37218A54999j80063r7952q9450r9548J52732O04033P64102L75559j89909m22289
37208I72214k93253j35194j16142j26918o5498M8833J91119L25691L22319R0894
37198A214065k18454l37079j88315O9753K52942K41146k9924m20111n20760q0740
37188a7477N05740N27564j05715o42669m60679Q8259K16967j32915k41709K26918
37178c5716O24096K64884m52732n24111J84124O77392K82286l55174k83965K79874
37168F60958L47538k13302m55970R0377O23609L14154m45833p19366l62842P5185
$$ y = [-172425, 616578, 886063, 549849, 388714, 801298, 1206126, 938855, 193615, -325387, -318704, -29016, 286833, 559790, 683720, 530725, 230896, 97852, 199162, 275113, 154999, -25064, -123016, -212466, -312014, -159282, 444751, 1208853, 1584412, 1394503, 972214, 678961, 543767, 427625, 300707, 235209, 284042, 475161, 800852, 1123171, 1214065, 995611, 658532, 470217, 539970, 792912, 1034058, 1004134, 584023, 63263, -17477, 488263, 1015827, 910112, 267443, -193236, -104977, 111990, -20925, -262634, -35716, 588380, 853264, 400532, -123579, 60545, 737937, 1020223, 665049, 381084, 660958, 1008496, 795194, 339224, 429601, 1053210, 1367364, 921531, 202165, -160677, -85492]
37158h5492L53247N90471N99472P6459o05791o69594r7977K67768l350l25361
37148I9852j01479L36799L12139j32560l27725M0160N07711M33626k15433p82367
37138A70723o44125J9469M09574J71463j15094J37219N53391M15376q0839j02066
37128I35091L77877M54542j84293o54299k75843L41793L09452j80627l19985p74
37118H02934J84664k0151k76323l04076j59382O8890L06865L26717J6462k75651
37108F70949j39937K39061L05962l8360l18398k12277N6452J56461R8398P5488
37098H93799J08088M6598j55181l06395j85677J09116J62885k14791n90765m12858
37088e45181J55514M03914J27436q5413J70974M81156L36414o1438k31568j80195
$$ y = [-85492, 267755, 858226, 1457698, 1534157, 928366, 258772, 160795, 428563, 425213, 99852, -1627, 335172, 647311, 514751, 187026, 227186, 734897, 1168523, 953090, 170723, -473402, -453933, -44359, 127104, 12010, 149229, 702620, 1117996, 1037157, 935091, 1312968, 1767510, 1583217, 928918, 653075, 994868, 1304320, 1123693, 803708, 802934, 987598, 967447, 691124, 387048, 227666, 296556, 603421, 930138, 946600, 670949, 531012, 770073, 1076035, 1037675, 719277, 507000, 563452, 719913, 818311, 893799, 1001887, 1048485, 893304, 586909, 401232, 510348, 673233, 458442, -132323, -545181, -389667, 14247, 141683, 56270, 227244, 708400, 1044814, 983376, 751808, 571613]
37078E71613j69692j17408J58920M00476K39921j50072l30465k92439k71750j14007
37068g4903M40834R84810P80278p4782o09854l16394J94691J97068j25953j45141
37058A250654J89059L79122K31626R6327K21979L54188K08843J5964J84449N31560
37048C663771L70024m36926j006273n17753N67435J056864O56089K26967L27094
37039D907292M02773j35495q33729q78795l35270L1689j31289m80843o22117m87218
37029A436998j88893P0244P2260j07585q9790K21256L80106Q4987k80297k32473
37019A366813P5417K00991J15758K7284j22721l90773m17571O6703O13182N92409
37009B127492J20779j97184k16370k64015l95413l28464k3695K71647M54883N25171
$$ y = [571613, 401921, 284513, 443433, 843909, 1083830, 933758, 603293, 310854, 39104, -74903, 365931, 1350741, 2131019, 2056237, 1446383, 1129989, 1324680, 1521748, 1395795, 1250654, 1439713, 1818835, 2050461, 2146788, 2368767, 2722955, 2931798, 2947762, 3132211, 3663771, 4033795, 3596869, 2590596, 2072843, 2640278, 3697142, 4353231, 4580198, 4907292, 5310065, 5174570, 4340841, 3462046, 3126776, 3158465, 3027176, 2546333, 1924216, 1436998, 1248105, 1318349, 1390609, 1283024, 1193234, 1414490, 1794596, 1879583, 1599286, 1366813, 1442230, 1643221, 1758979, 1786263, 1663542, 1272769, 855198, 921901, 1535083, 2127492, 2248271, 2051087, 1834717, 1570702, 1175289, 846825, 823130, 1094777, 1549660, 2074831]
36999B074831L14270j87432m87409j86660L24309L99662J05339l6250k240j85174
36989B133246n24232n23024q3012L77920N79398N32145J92870l69519o37370j95960
36979A482462N00262O10557M9296n02056n68112k27412K96701P25226O51334O7752
36969C086010l17258R525N05387L89268j18651k70492n2530N4183J53884O14323
36959D053649R92609N45588l55026n71278Q0822O27834M56197m1633l24281k27004
36949E237477K62066Q34615P56443j03277o06618J50403J246076J211280L19183
36940I307648R733N22291Q53294P23340P89826J146641J344846J603109K299894
36931A8600622K780614K497017K569256M098302N871981O226589O078215P216640
$$ y = [2074831, 2389101, 2201669, 1714260, 1527600, 1851909, 2251571, 2356910, 2320660, 2318420, 2133246, 1609014, 1085990, 1002978, 1380898, 1960296, 2492441, 2685311, 2315792, 1678422, 1482462, 1982724, 2593281, 2642577, 2140521, 1572409, 1344997, 1641698, 2366924, 3018258, 3086010, 2768752, 2778277, 3283664, 3672932, 3554281, 3283789, 3231259, 3285442, 3439326, 4053649, 5046258, 5591846, 5236820, 4665542, 4746364, 5374198, 5830395, 5788762, 5464481, 5237477, 5499543, 6334158, 7090601, 6987324, 6380706, 6531109, 7777185, 8988465, 9307648, 9317381, 9839672, 10692966, 11416306, 12206132, 13352773, 14697619, 16300728, 18600622, 21381236, 23878253, 26447509, 30545811, 36417792, 42644381, 48722596, 55939236]
36923E5939236Q974017J0131641J2431590J7611148K2966473K6218355L2677349
36916A86949809M7523995N9919931M7497213M436492m4167738o6530016n7612351
36909A78017335l8467876k6971963k2059897j6317893j0159664p705209p866013
36902D8468820o908311n035557m615570n106580m461970l138814k758707k760756
36894A3682555j767513n48486o04906j314943j182873n38491n28223p47625k31015
36885F218480M13564R6993o18381n69084j24743k72541o03741k16305L32469j3518
36875D643193p44892o70055j02442j71951o11106k77455N82731O49332j21858
36866C175497m35017P3353L45890j16740m65364r0649M06756L51743O447p0375
$$ y = [55939236, 64913253, 75044894, 87476484, 105087632, 128054105, 154272460, 186949809, 234473804, 294393735, 341890948, 346327440, 302159702, 235629686, 178017335, 139549459, 112577496, 90517599, 74199706, 64040042, 56334833, 48468820, 41560509, 36524952, 31909382, 26802802, 22340832, 19202018, 16443311, 13682555, 11915042, 11366556, 10761650, 9446707, 8263834, 7725343, 7197120, 6449495, 6218480, 6632044, 6729037, 6110656, 5541572, 5416829, 5144288, 4540547, 4324242, 4656711, 4643193, 3898301, 3228246, 3125804, 2953853, 2342747, 2065292, 2648023, 3297355, 3175497, 2740480, 2813833, 3159723, 3042983, 2577619, 2486970, 2893726, 3245469, 3251916, 3181541]
36856C181541J24780K52750J43650j45676l82004k41537K66370N97429L31891
36847D129194j68009k32921K05852O57268P84358O31345L91234L36519O68916
36838G403756J103149J034417M70271K36643Q13526J589374J828085J732763J863960
36829A8075944K103708K004621J685773J517901J248251K91036j255893k582051
36821B3089290l087722k853656k329414j940131j823299j691017j204108n78895
36813G581048l53358n07639n36539m84098r22576j635557j504054k72782P53888
36804B118333N65193j39308l07241j65713l55801n02242k2863M82907J21745o57151
36794A137859p56737k24248R4315J99202O99683J282757J011627J6968o06499
$$ y = [3181541, 3306321, 3559071, 3702721, 3557045, 3175041, 2933504, 3199874, 3797303, 4129194, 3961185, 3728264, 3934116, 4591384, 5375742, 6007087, 6398321, 6734840, 7403756, 8506905, 9541322, 10011593, 10248236, 11061762, 12651136, 14479221, 16211984, 18075944, 20179652, 22184273, 23870046, 25387947, 26636198, 26927234, 25671341, 23089290, 20001568, 17147912, 14818498, 12878367, 11055068, 9364051, 8159943, 7581048, 7227690, 6720051, 6183512, 5699414, 4776838, 3141281, 1637227, 1364445, 2118333, 2683526, 2544218, 2236977, 2071264, 1715463, 1213221, 1190358, 1673265, 1795010, 1137859, 381122, 156874, 251189, 450391, 1150074, 2432831, 3444458, 3461426, 2854927]
36785B854927n38600m46898n19152k55753K32546K12276k23797j53559M84294
36776A646284O57137N7134k93695K31497R11767J078492J142407J431831J233644
36767H096498P390j385733j731626j098484m87381l62864m08676l73066l37208
36758A918850l16130k06129l1101J32374K96348L90102K46378l8385j03969J25882
36748B414220L21304L35278M16234O63893Q36405Q75199R68162Q84953N1559j334362
36738F432845k099922j582550n79201j69362l10327l57470k70206l33000k40736
36729D90071M01735R93521N56334o24648j158677n18101K55372J84347l18974
36720B60980l57713N6457K95885K30122K02172K13566l7179m07406l61011J72567
$$ y = [2854927, 2316327, 1869429, 1350277, 1094524, 1327070, 1539346, 1315549, 1161990, 1646284, 2303421, 2360555, 2066860, 2298357, 3210124, 4288616, 5431023, 6862854, 8096498, 8103888, 6718155, 4986529, 3888045, 3400664, 3037800, 2629124, 2256058, 1918850, 1602720, 1396591, 1365490, 1497864, 1794212, 2184314, 2430692, 2392307, 2288338, 2414220, 2735524, 3070802, 3487036, 4150929, 4987334, 5862533, 6830695, 7715648, 7767207, 6432845, 4332923, 2750373, 2171172, 2001810, 1691483, 1334013, 1063807, 730807, 490071, 891806, 1885327, 2441661, 1817013, 658336, 140235, 395607, 579954, 260980, -96733, -40276, 255609, 485731, 687903, 901469, 864290, 456884, 95873, 268440]
36710B68440O34158O60594M87802L46627O3066m04116n86536j79822L09050J91684
36700A790947l60634n41569r5145L59586K75928j15785k74284q7975J28111J04006
36690A183186j44028l80229l49823o4358J26960k3864k40068q6163L23480M58368
36680H03461K10100L9216J72874K38320o2068m39837n04493l18846j46877k9149
36670c7299Q1744J03196J8246j4225N2848P3805L5311P4605J12838l7093j68131
36659B95845Q2700M53153L06683k27754l23940J08688J87823l23417m35125L03034
36649D27690P63667N7925p98363m34021O09736P65787o0383n77774l27879j03562
36639C22823k46043j71714K54412L69812J7279j38991R6868J11157k42605k79691
$$ y = [268440, 902598, 1563192, 2050994, 2397621, 2460687, 2056571, 1470035, 1290213, 1599263, 1790947, 1430313, 888744, 793599, 1153185, 1429113, 1313328, 1039044, 951069, 1079180, 1183186, 1039158, 658929, 309106, 244748, 371708, 347844, 107776, 21613, 345093, 803461, 1013561, 1052777, 1225651, 1463971, 1401903, 962066, 457573, 138727, -8150, -37299, 44445, 147641, 165887, 151662, 204510, 278315, 313626, 388231, 501069, 463976, 295845, 378545, 831698, 1138381, 910627, 586687, 695375, 883198, 559781, 124656, 427690, 1191357, 1249282, 450919, 16898, 626634, 1392421, 1332038, 754264, 426385, 322823, 76780, -94934, 159478, 529290, 546569, 407578, 504446, 615603, 372998, 93307]
36629I3307J86065L66399j18263n15146k23755K17843J24808k42161k97874j08495
36619e17272n2258j07936q9416o6744o8141J03415L65558K88047r3316j12904
36609c50967M16362O98564J55485n91438o58011j97079M1812l0735R9830N04930
36599H8753O59194L04917j72132l05060n9270K71681M05704K83470Q2333j6234
36589A543356p9459k71825m93075m71815k07240M0626J85704L33750M07717K50824
36579A238563P8812K61060O42928P09727M68676M99525J037851J666426J969042
36570H572610J788658Q87278p16662k047632j956281q42022l74747j091274j596304
36561B623624q28985K55678L23386k39042k32946K36395J01072o97925j092183
$$ y = [93307, 279372, 645771, 527508, 12362, -211393, 6450, 131258, -110903, -408777, -517272, -569530, -677466, -766882, -833626, -901767, -798352, -432794, -144747, -238063, -350967, 65395, 763959, 919444, 328006, -330005, -527084, -485272, -516007, -416177, 88753, 747947, 1052864, 880732, 575672, 516402, 788083, 1193787, 1477257, 1559590, 1543356, 1463897, 1192072, 698997, 227182, 19942, 60568, 246272, 580022, 987739, 1238563, 1317375, 1578435, 2221363, 2931090, 3399766, 3899291, 4937142, 6603568, 8572610, 10361268, 11248546, 10531884, 8484252, 6527971, 5685949, 5311202, 4219928, 2623624, 1794639, 2050317, 2373703, 2134661, 1901715, 2138110, 2239182, 1541257, 449074]
36552D49074o07904R2727M17770M71854L77512j7653n40435o30260j46227L72174
36542B38632M41160J58436r2708p3019J71224K92076o0422o35086o67554J6340
36532b10921N37162K35247k13347J19511P64106N26839m63798q08170l5687O55631
36522A106573L18391l46840k70539L09971M20858l7482k60815J32814O12869N86569
36512B572369J24344k80655k90360N0147M30940N56159M24493L24746M79119P70042
36502E161344R27379R24088J065839J652001K534563L026863K401712O45794j348516
36493A6991067k527541k602917k122545j727936j570473j419837j071105n46111
36485C402602m7550J91191P7955k62009n77251o37313l50677J09875L27721M3604
$$ y = [449074, -158830, -66103, 351667, 823521, 1201033, 1183380, 642945, 12685, -133542, 238632, 679792, 838228, 745520, 672501, 843725, 1135801, 1075379, 440293, -227261, -210921, 326241, 561488, 348141, 467652, 1231758, 1758597, 1294799, 486629, 450942, 1106573, 1424964, 1078124, 807585, 1117556, 1538414, 1500932, 1240117, 1372931, 1985800, 2572369, 2696713, 2416058, 2125698, 2175845, 2606785, 3162944, 3587437, 3912183, 4391302, 5161344, 6088723, 7012811, 8078650, 9730651, 12265214, 15292077, 17693789, 18339583, 16991067, 14463526, 11860609, 9738064, 8010128, 6439655, 5019818, 3948713, 3402602, 3355052, 3546243, 3624198, 3362189, 2784938, 2147625, 1796948, 1906823, 2234544, 2278148]
36475B278148m21187m62721k8488K43482l8302l83712j72293L16853K68335m00093
36465A200022q22320l87509M05456O26962R8651m88675n05408q5599J67762k4637
36455A84705l18474k59186Q4623K20454o4121l79175k51316K49919O15914N11236
36445E94579P9622l02359l95136k19867N0970K57618L25205K40302O9951Q185
36435G09070J97348M12029K16355l44404n76841p2033N60859N03089k9198j54962
36425A421312K16453K81152k35431o08170l92809j41141k92917l31795J89369
36416A06023O33611K49727m78470n08798J36774M95274K13604o7393R4844L07898
36406A183094J27694k47033l78828k03651L9875J80491K08532J78125J25429K7740
$$ y = [2278148, 1856961, 1394240, 1365752, 1609234, 1570932, 1187220, 1014927, 1331780, 1600115, 1200022, 377702, -9807, 395649, 1022611, 1121262, 632587, 127179, 41580, 209342, 184705, -133769, -392955, -308332, -87878, -151999, -531174, -782490, -532571, 83343, 594579, 674201, 371842, -23294, -243161, -192191, 65427, 390632, 630934, 700885, 709070, 906418, 1318447, 1534802, 1190398, 613557, 541524, 1102383, 1605472, 1576274, 1421312, 1637765, 1918917, 1683486, 1075316, 682507, 541366, 248449, -83346, 106023, 739634, 989361, 510891, 2093, 138867, 634141, 847745, 780352, 875196, 1183094, 1310788, 1063755, 684927, 481276, 521151, 701642, 910174, 1088299, 1213728, 1241468]
36396A241468j15172j56265M1280L03059L10423R5868m0861j19101l93207o32123
36386E35369k80327M49274N83100r2154n29653p9323M13294O6365m96931k50159
36376C18855M40466N05540M2879K3122N17301P13230N05843O08065J110596J316288
36366F102185J075697J005307J298157J534955J713050K274534L220699M483286
36358B2707870O762953J0056478J1499626P346888j877300j0421552j3059276
36351C3015687j0262867o295272l879795k724528k003111j714026j697041j326764
36343C112283n77151j22316j79219k79490k37600l40005n29189l80509J5859O9766
36333E52429k85804m49847j86105L3886o3903j04956J69444L99406K64945O1804
$$ y = [1241468, 1126296, 970031, 1011311, 1314370, 1624793, 1720661, 1679800, 1560699, 1167492, 535369, 255042, 704316, 1287416, 1195262, 665609, 586286, 999580, 1065945, 569014, 318855, 759321, 1264861, 1307740, 1330862, 1848163, 2561393, 3067236, 3675301, 4785897, 6102185, 7177882, 8183189, 9481346, 11016301, 12729351, 15003885, 18224584, 22707870, 29470823, 39527301, 51026927, 58373815, 56496515, 46074963, 33015687, 22752820, 16457548, 12577753, 9853225, 7850114, 6136088, 4439047, 3112283, 2535132, 2412816, 2233597, 1954107, 1716507, 1376502, 847313, 466804, 482663, 552429, 266625, -183222, -369327, -335441, -399344, -504300, -334856, 64550, 329495, 391299]
36323C91299J66962L64813J86021l30773o50461m49924j2829J42241j02797l23951
36313f19399j20676K84455L03767j27506l68042l1698L51340J40578l43573k80490
36303h11244L08815N34470M5285l81755m2155N97465N98333q7762o25351m89270
36293c53169k6164J92553M5580k47668m70946m30125n71N53506O21716j755o33648
36282g50691m44423M14297R53135O38403k6076l63796l59251k81976o9778L42139
36272E1983N22042Q5243n11511m70020J39982M24215j7300n40848m58733L2621
36262g42326K74735N6054k58042k43911J61661N76201M61513k28772p57877m08677
36252a109441M69336Q20785L46187j28995K0253L22838J34002k67345k41105N0285
$$ y = [391299, 558261, 923074, 1109095, 778322, 127861, -322063, -334892, -192651, -295448, -619399, -740075, -455620, -151853, -279359, -647401, -679099, -327759, -187181, -530754, -811244, -502429, 32041, 77326, -304429, -346584, 250881, 849214, 761452, 136101, -353169, -379333, -186780, -141200, -388868, -859814, -1289939, -1290510, -737004, -115288, -117043, -750691, -1195114, -780817, 172318, 810721, 784645, 420849, 61598, -220378, -290156, 51983, 574025, 659268, 147757, -322263, -182281, 241934, 224634, -316214, -774947, -742326, -467591, -411537, -669579, -913490, -751829, -175628, 285885, 57113, -700764, -1109441, -640105, 180680, 526867, 397872, 418125, 740963, 874965, 607620, 366515, 416800]
36242D16800r6528p07122j002489n29486K64239P40759P95041O31418K88838k41898
36232E59572o95578p22959l50880L5699J93324K57197L88130M31389J78359j79180
36222I5073k22814N7304K00935r243j79566P6788N15721O26090L32825n6943l50487
36211A085683m89740l32089J07623M12409K54830q0305j68466j61356m11559o60990
36201d43960l80840K34479M44828R7161k33400k39463j86803j73697N1856M04330
36191d25509M34987J63458J08870L22689K55284k05964m59870k16693P8969J22404
36181A78625J57644K61507J68325M3804L55867P11181J07670j204266j550715
36172g70358k78843J042164Q82851j00894m19193n2287O1847j11358L9189K93821
$$ y = [416800, 320272, -386850, -1389339, -1918825, -1654586, -913827, -118786, 512632, 801470, 559572, -136006, -858965, -1209845, -1174146, -980822, -723625, -335495, 95894, 274253, 95073, -127741, -70437, 130498, 121255, -58311, 18477, 534198, 1160288, 1493113, 1436170, 1085683, 595943, 263854, 371477, 783886, 1038716, 958411, 789945, 628589, 217030, -443960, -824800, -590321, -145493, -48332, -281732, -521195, -707998, -881695, -829839, -425509, 9478, 172936, 281806, 604495, 859779, 653815, 193945, -22748, 56221, 178625, 336269, 597776, 766101, 809905, 1165772, 1876953, 1984623, 780357, -770358, -1049201, -7037, 875814, 774920, 355727, 303440, 365287, 253929, 293118, 586939]
36162E86939l9723o85792p54072k48220P8435Q7131K18799L91919J96882q3276
36152b50978R7969L90014J03081l93729k37210K65490J08685m60349k07913Q12664
36142B27724J081166O3354r13794q25742l30368k14651m7258N87313Q99679K00116
36132G27539o67297n14198L19400N58763m7572n73607m43096k5112K16284K62433
36122a86463J89408j0312j59358J2699L97598N20180J39271m09736n81089k31790
36112c19592K05710K24788r8309j97238J12653K78101j04234n26269l42270J20105
36102f46555R6416k76562k21020K34328K78826j49026j53936M96329Q46043L61732
36092H66575j79442r9796O4223k79104n87169j88191M27266M33367N2163j5924
$$ y = [586939, 547216, -138576, -892648, -1140868, -1062433, -975302, -756503, -364584, -167702, -250978, -153009, 237005, 340086, -53643, -290853, -25363, 83322, -377027, -584940, 227724, 1308890, 1372244, 458450, -367292, -697660, -912311, -959569, -372256, 527423, 727539, 60242, -453956, -134556, 424207, 376635, -196972, -640068, -665180, -448896, -186463, 2945, -7367, -166725, -154026, 243572, 763752, 903023, 493287, -87802, -319592, -113882, 110906, 12597, -184641, -71988, 206113, 101879, -424390, -766660, -646555, -550139, -826701, -1047721, -813393, -534567, -683593, -837529, -341200, 504843, 866575, 687133, 587337, 651560, 372456, -214713, -402904, 24362, 457729, 509892, 493968]
36082D93968R1683j73922n50077l82491J03278J53101j61185j36150K00348J55694
36072b05753k53218k50445K55946M10505j11426n13092k29448J63813J7137k85959
36062a001940m8685N34616O94702K60608j92067k20099J0606R4606j36782m96348
36052e00783n93465j99006M03543O18040K47477k21968k54891N6122K29687J16102
36042i9142J5787J40966L13142K71660L0457j98801k80599k27416j07224q076
36032a49246k0505j18622j17111Q8512K90504K15361j2300Q52K29131J25032m90511
36021D1097r11175m81554L18881N01865P8584j5711M53934N77211j11186o80484
36011b28538k46856N03379L31357n50836p50642J59513R94268P09877k09855o27535
$$ y = [493968, 585651, 411729, -138348, -520839, -417561, -264460, -425645, -561795, -361447, -205753, -458971, -709416, -453470, -42965, -154391, -667483, -896931, -733118, -715981, -1001940, -1050625, -516009, 178693, 439301, 247234, 27135, 37741, 132347, -4435, -500783, -1094248, -1293254, -889711, -271671, -24194, -246162, -501053, -444931, -215244, -99142, -83355, 57611, 370753, 642413, 672870, 474069, 193470, -33946, -141170, -149246, -169751, -288373, -405484, -316972, -26468, 188893, 176593, 177445, 406576, 531608, 41097, -870078, -1351632, -1032751, -530886, -452302, -468013, -14079, 563132, 451946, -228538, -475394, 27985, 359342, -191494, -942136, -782623, 211645, 921522, 711667, 84132]
36001H4132k78297J97425L04620J48563j0342j46057l26624m57568l41421K0331
35991h05238L06192K19604o3090o8923K57230L98845P5830k41686q1792J98902
35981A95874J0525l71066j92586L93838L67176n24806j169201o55516L87984P43829
35971h13949K80855j43886p4771J23692J16605O5655J47536K27339J97002J84231
35961C10309K47285K22364L4256j44136j87677k06010k89506l07736j32394J10974
35951c42271J82541L2238j44272j17870J23014L00033J09235l43916n34136j64187
35941h99591L35704L09659k08210n29191k89959J10196K30485K33386M49383P13896
35931D55758O25569K13091j49249l31699m58968m39661m8672M87582N48893l6197
$$ y = [84132, -194165, 3260, 307880, 456443, 446101, 300044, -26580, -484148, -825569, -805238, -499046, -279442, -342532, -411455, -154225, 244620, 320450, 78764, -3028, 195874, 206399, -164667, -357253, 36585, 403761, -121045, -1290246, -1945762, -1557778, -813949, -533094, -676980, -751751, -628059, -511454, -445799, -298263, -70924, 126078, 310309, 557594, 779958, 814214, 670078, 482401, 276391, -13115, -320851, -453245, -342271, -159730, -127492, -271764, -389634, -266620, 33413, 142648, -201268, -735404, -899591, -563887, -254228, -462438, -991629, -1281588, -1171392, -940907, -707521, -258138, 455758, 1081327, 1294418, 1145169, 813470, 354502, -85159, -133831, 353751, 902644, 866447]
35921H66447o44873o12209Q60O21647Q32139N63828o4054p43908j008073o32620
35911h20816L2848M02306K83880k5364j95950j83041j12625o2393J365J59052
35901e20738L96725N11955L01909r3079k57698o9262N2360k65038p09541o15216
35891a267623J39318R25105J085414N76652j47349o15671o32391l27771k7777
35882b92093O7169R3659K57139M10212K06326k80250m67167l7427M93593L73126
35872H24287l46108q13576n25675j1552k4674l80891k22311N83402J048985M54784
35862E86671m96858o11203J04735N59783K59364j27834n3668P0049j94591m21300
35852c24852r7606L61436K13709m26195q13711o71860k89387J94964P80637J077576
$$ y = [866447, 221574, -390635, -389775, 231872, 1064011, 1627839, 1563785, 819877, -188196, -820816, -787968, -385662, -101782, -127146, -323096, -506137, -618762, -681155, -679790, -520738, -124013, 387942, 689851, 596772, 339074, 269812, 322172, 57134, -652407, -1267623, -1128305, -203200, 882214, 1458866, 1311517, 695846, 63455, -264316, -292093, -224924, -131265, 125874, 536086, 742412, 462162, -5005, -42432, 451161, 824287, 478179, -335397, -861072, -872624, -897298, -1278189, -1500500, -917098, 131887, 586671, 89813, -521390, -416655, 143128, 402492, 274658, 220990, 291039, 96448, -324852, -422458, -61022, 152687, -273508, -1087219, -1759079, -2048466, -1853502, -1072865, 4711]
35842D711O62443r7320l92906j37412J1801k06224l42961j67096m4203j63062
35832h72229j71855J18029L66420L34258K20805J16287j82527n36133m14562J38491
35822h83016K96735k73394p04084j85140P22684Q63823J34080n06051m30035L9123
35812i25275L44608L37685J34363j47424l66400l80339j79850J26715L94574M40497
35802b20846J82256j20259q1057K17145K51843j08484k95170Q9196N78516N15114
35792A008254K0152k69005j47688M3017O2486k3353j69638l74297m29715j20327
35782d00114L37100M51702Q6199l81828n34843l04501R1535L81548M15517K45790
35772C88105J5616k23649m32517m08581m3634K90584J23833l04414k59082L06658
$$ y = [4711, 667154, 569834, 176928, 39516, 51317, -154907, -497868, -664964, -709167, -872229, -1044084, -926055, -559635, -225377, -4572, 111715, -70812, -606945, -1021507, -883016, -586281, -859675, -1563759, -1748899, -1026215, -162392, -28312, -534363, -964398, -925275, -580667, -242982, -108619, -256043, -622443, -1002782, -1182632, -1055917, -661343, -220846, -38590, -158849, -239906, -22761, 229082, 120598, -174572, -85376, 493140, 1008254, 1028406, 759401, 611713, 654730, 717216, 693863, 524225, 149928, -279787, -400114, -63014, 388688, 474887, 93059, -441784, -746285, -654750, -273202, 142315, 388105, 403721, 180072, -252445, -661026, -704660, -414076, -290243, -594657, -853739, -547081]
35762e47081N44957M8943m19461j35614M08903L48355j39947k27329J46964K68206
35752B96896j02792m31335l68553j69628o8012L4830J35230L2582j90040j55891
35742i86713J91384M44666L23881P459j88771j15186K08801N55707N46737J00243
35732A088208l29360l25891q9898l1058j03335o4022l6547j81968j76090K33084
35722a6877N03435L2786o77990o34455N3336L30962o4387k66172J33057M12154
35712a94151Q3420k24891J06069O13267N20037j32964p54715r92270p37647Q770
35702a705075P78848Q09141R3875m09771j43244K51111R8730j79352N6492M21924
35692G2679J81890l84005m00047J55742M98229L43251J39252P9580j16172m13139
$$ y = [-547081, -2124, 46819, -372642, -508256, -99353, 249002, 109055, -118274, 28690, 296896, 194104, -237231, -605784, -775412, -843424, -808594, -673364, -640782, -830822, -986713, -795329, -350663, -26782, -19323, -208094, -323280, -114479, 441228, 987965, 1088208, 758848, 432957, 343059, 312001, 208666, 144644, 108097, -73871, -249961, -16877, 486558, 519344, -158646, -793101, -739765, -408803, -473190, -739362, -606305, -194151, -110731, -335622, -229553, 383714, 903751, 770787, 16072, -976198, -1713845, -1705075, -926227, -117086, -23211, -432982, -576226, -325115, -226385, -405737, -349245, 72679, 254569, -129436, -529483, -373741, 124488, 467739, 606991, 686571, 570399, 157260]
35682A57260l97641r8444J0742o0895J93724O84198O03524k03768p12049j85023
35672h372O21686N39562k97688p31322k80423L40897L89480j8012l59062m25778
35662b29032l06120p9604J67281K91678K76302K45388J83206o9600m06410m18612
35652c45523j6853K90852J04336k30834j62244J84219K50090j5442j50103n0432
35642a41934r1205k95923j98319K27197L30631r9543l12967J94665P17787M14203
35632G44592k88019l63889J54036L16127j24776l82082j8186L91173K77472r5940
35622F10508k12811l8336J74778K66608J03254l39631o53940l54700K79769M03474
35612B38973j42725n19701j63217L99762M77055K26941J44622J60242m2268k76856
$$ y = [157260, -240381, -338825, -328083, -388978, -195254, 488944, 1092468, 888700, 176651, -8372, 613314, 1152876, 855188, 123866, -156557, 184340, 573820, 555808, 196746, -229032, -535152, -614756, -447475, -155797, 120505, 365893, 549099, 479499, 73089, -345523, -362376, -71524, 32812, -198022, -360266, -176047, 74043, 58601, -91502, -141934, -233139, -529062, -727381, -500184, -169553, -269096, -582063, -387398, 330389, 744592, 456573, 92684, 246720, 562847, 438071, 55989, 37803, 428976, 706448, 610508, 397697, 359361, 534139, 800747, 904001, 564370, -89570, -444270, -164501, 238973, 96248, -423453, -586670, -186908, 290147, 517088, 661710, 821952, 779684, 502828]
35602E02828j65840J07535M7265l41992n88394m64895j52187J78866M68265N61646
35592A53097L49416L7889p9811j9264M0351J19663L04801M25233K52334j00893
35582A482816l27934l67356l79652m02760l27378j16587J76218M66527N58411
35573G62305K72336j63505k30629J03183J96141k70118o32733k20808M71552M44326
35563G32050k26268m59488J32576O18060J78659o64709q55114k60338L50677M70876
35553A6981K98771J08772j55012m91897n75457k16553K15050K30149p1372j52060
35543g92628J34365L29423J15677j80598j31960J20983J52023p0429k32832k05032
35533g61008p0250J77971M86188N02074N1338l53551j47730L28678K96640j77057
$$ y = [502828, 336988, 444523, 491788, 149796, -438598, -903493, -1055680, -876814, -408549, 153097, 502513, 540402, 460591, 441327, 481678, 601341, 906142, 1331375, 1583709, 1482816, 1154882, 787526, 407874, 5114, -322264, -438851, -262633, 203894, 762305, 1034641, 871136, 640507, 743690, 939831, 669713, 36980, -183828, 287724, 732050, 505782, 46294, 178870, 796930, 975589, 310880, -544234, -804572, -453895, 16981, 315752, 424524, 269512, -222385, -797842, -1014395, -799345, -569196, -640568, -792628, -658263, -328840, -213163, -393761, -525721, -404738, -252715, -323144, -555976, -761008, -831258, -653287, -167099, 334975, 386313, 32762, -114968, 213710, 510350, 333293]
35523C33293l07346J6616N8765l65129m84066K0370L54427k1864m46386k36599
35513a077919J83355K16769K00701N55401P11244P3459o83374n79526J7925Q0439
35503c01526k50537l7023N68323M63794l81120o90706M2254P54958N78150N3938
35493H00505l2826J48338J60814J56373K80935J12402n25576r53979o23915m0124
35483e17053P0907j10621j6054K25725J24212j57145n9133L16583L06637j98232
35473a4174n33415k59131K61547M52535K09933j69179l75379k59219J05042M10555
35463a70885L72631N3986k20817k68120j82258q7583L3140K08343L29831K34217
35453C02485r1982m17344m21120k9938M18077M88757J55992j71687j77235Q487
$$ y = [333293, 25947, 42563, 101328, -263801, -747867, -727497, -373070, -394934, -841320, -1077919, -894564, -677795, -477094, 78307, 789551, 863010, 179636, -399890, -381965, -301526, -552063, -589086, -20763, 443031, 61911, -628795, -586541, 168417, 746567, 800505, 767679, 916017, 1076831, 1233204, 1514139, 1626541, 1100965, 146986, -476929, -517053, -446146, -556767, -572821, -347096, -222884, -380029, -439162, -122579, 184058, -14174, -547589, -806720, -545173, -92638, 117295, -51884, -427263, -686482, -581440, -170885, 201746, 255732, 34915, -233205, -415463, -503046, -469906, -261563, 68268, 302485, 210503, -206841, -627961, -657899, -239822, 248935, 404927, 233240, 56005, 64492]
35443F4492Q9558M5254O8308J62147P2917k99430o15822m33272J95044O75288
35433B4484N46655J3698l95736n04542m68393k57189K79739Q18484P07108m6337
35423G17971n80058l59965P6726P0400j16485P9740M19284K73876k29263m30498
35413g8272k67617k21217k97497q3771K54753J20243l21255k20083M70417P31686
35403H7387R5508n68487m32886J02623K69936J20671J21899K65843L03596K85329
35393F51419K42433p2158n42242m78048K78178P62553K26375o14088o17985P1917
35383i1646M31024K15780N7759J50868M5084k87225l19340k5733j7802l94723
35373b35954m48301J25440O18414M02662j24968k61702n8353k8482k30209k97326
$$ y = [64492, 154050, 199304, 267612, 429759, 502676, 203246, -412576, -845848, -650804, 24484, 571139, 584837, 189101, -315441, -783834, -1041023, -761284, 57200, 764308, 717971, 137913, -222052, -145326, -74926, -191411, -111671, 307613, 581489, 352226, -78272, -345889, -567106, -864603, -948374, -693621, -573378, -894633, -1114716, -644299, 87387, 182895, -385592, -818478, -715855, -445919, -325248, -203349, 62494, 366090, 651419, 893852, 821694, 279452, -198596, 79582, 842135, 1068510, 454422, -163563, -91646, 339378, 555158, 612917, 763785, 808869, 521644, 202304, 176571, 158769, -235954, -684255, -558815, 59599, 462261, 337293, 75591, 17238, -11244, -241453, -538779]
35363e38779j56501j00945k04091j78985R8403L33616K66982R5773J58216L32411
35353A06100J32763m95368q60987l70695N51766R15588M68459o6729j54716j22188
35343A03993l23666l69402J55446P44731N77789k10993o99506m97137r7125P1391
35333e44479J25522J32575j64128o94524q09584j49270O96662Q70560L02765l20180
35323e54081m42397j27166K30163L55919K53495Q6811l5704j60830l33770m22851
35313a150411k73405O524J39024N7966l1825O12N3058L9199O4022K33555M50412
35302d11269N11393L27688J0413j93655q2474K78469N50548M43488j479n04535
35292I28587p91851o83618j76007M03033N74654K68403n5934p7208n7927k83774
$$ y = [-538779, -695280, -796225, -1000316, -1179301, -1080898, -747282, -480300, -384527, -226311, 106100, 238863, -256505, -1117492, -1488187, -936421, -20833, 447626, 380897, 226181, 103993, -219673, -589075, -433629, 311102, 888891, 677898, -21608, -518745, -615870, -544479, -418957, -286382, -450510, -1145034, -1954618, -2103888, -1407226, -536666, -233901, -554081, -996478, -1123644, -893481, -537562, -284067, -197256, -232960, -393790, -727560, -1150411, -1423816, -1417292, -1278268, -1220302, -1252127, -1251515, -1198457, -1159258, -1095236, -861681, -411269, 100124, 427812, 438225, 244570, 162096, 440565, 991113, 1434601, 1433122, 928587, 136736, -546882, -722889, -319856, 254798, 523201, 467267, 390059, 332132, 48358]
35282D8358m63362k11256K05022K45508j3890q5500J6202j16401l35798m6885
35272g58002N99588O09415l52513j238045r93450K7174O99479O38019L33591J63832
35262b70912M7925n4932J7360K65550M65917M83611L24333l0514n04542p69425
35252b5629n71453j15909K03202L16199L69395K94747m0033l67811k57688J66160
35242b8820K84223j01261m16936j47515M13062O09936L27169K52j20841k36553
35232E82716m70424n20355j16634M29351N17718O3345l49394k23606K34429M62213
35222F09359K67659q0986l41373n21594o36148n57927k08131K84112O59369O76243
35212A50583K82945k10163l15234L1836K89237P3896j93905M2953M49261K38213
$$ y = [48358, -415004, -626260, -421238, -175730, -189620, -275120, -258918, -375319, -711117, -758002, -158414, 451001, 98488, -1139557, -2133007, -2105833, -1406354, -768335, -434744, -270912, -222987, -277919, -260559, 4991, 470908, 954519, 1278852, 1248338, 743796, -25629, -597082, -712991, -509789, -193590, 175805, 470552, 430519, 62708, -194980, -28820, 255403, 154142, -262794, -410309, 2753, 612689, 939858, 940110, 819269, 582716, 112292, -408063, -524697, -95346, 422372, 485717, 136323, -87283, 147146, 609359, 877018, 796032, 454659, -66935, -703083, -1261010, -1469141, -1185029, -525660, 150583, 433528, 223365, -91869, -60033, 229204, 303100, 109195, 152148, 601409, 839622]
35202H39622m55339o20029K9054N08542R3967n60006n33802o5117M5100j69034
35192h87042p2906L02302L01309j53045l83679o6486L15767K94228J8031j37080
35182d68601l4366K54596N03846L78423j28124m55104k10030J14396j29248n81285
35172g55497l93324K74797M37204j8818j17826M36667O50038r109n63892j50844
35162b10604M67596J75491o15674o83079J0007L95397P5327k59411r9929L02786
35152d42093O24153P63041M92822k39490p25959k12520P97908R94559R7007q00214
35142A349214q71778m70086j40295J55076M15469K74291j83431k70042Q4218k62
35132C42374p85502j120395j70713J042586J039524O3010m72285j93717J0129
$$ y = [839622, 384283, -235746, -206692, 301850, 395817, -164189, -697991, -763108, -718008, -887042, -959948, -657646, -356337, -509382, -893061, -959547, -643780, -349552, -331521, -468601, -502967, -248371, 255475, 633898, 505774, 50670, -159360, -44964, -174212, -755497, -1148821, -874024, -436820, -455638, -573464, -136797, 513241, 504132, -59760, -210604, 256992, 432483, -183191, -866270, -856263, -460866, -385539, -644950, -744879, -442093, 182060, 945101, 1437923, 1198433, 472474, 259954, 1057862, 2052421, 2149428, 1349214, 477436, 7350, -132945, 22131, 437600, 711891, 528460, 258418, 342636, 342374, -443128, -1563523, -1734236, -691650, 347874, 410884, -61401, -255118, -244989]
35123b44989k42078l07872J02592L52375M6911l09587k81308j99937l79469m23158
35113a886520Q2607P68905R66016N83534M3070l20775m03294k12212L2032j1253
35103c57890l02241l51067M7876L99025K07992k53435l47084K0336L62345L39366
35093b34777Q0175j48756k12384p4913J77719K87722O5782l10045m45875j87807
35083a003159K24759M33982K72714j34233m57811m25508r4459K12320K87696K17130
35073d66569J44086Q8467P8669J87774K97406J24965l08419n42014k84175J21828
35063e57982J69541j20653l56190l92510l54514k00028K17732O75088O79624J67658
35053g2234l10905k80189J00183L33890J96459j26060l12171j68281K26640N20069
$$ y = [-244989, -487067, -794939, -692347, -339972, -293061, -602648, -883956, -1083893, -1463362, -1886520, -1803913, -1035008, -68992, 514542, 557612, 236837, -166457, -378669, -346637, -357890, -660131, -1011198, -963322, -564297, -356305, -609740, -956824, -936488, -574143, -234777, -154602, -303358, -515742, -590655, -412936, -125214, -59432, -369477, -815352, -1003159, -778400, -344418, -71704, -205937, -663748, -1089256, -1183715, -971395, -683699, -466569, -322483, -234016, -155347, 32427, 329833, 454798, 146379, -395635, -679810, -557982, -388441, -509094, -865284, -1257794, -1612308, -1812336, -1594604, -919516, -239892, -72234, -383139, -663328, -563145, -229255, -32796, -158856, -471027, -639308, -412668, 107401]
35043A07401L78952j03318m32747k66995J78136M02743K14609r8016j67979j460
35033B11326N0711k28106n64592m70849J00001N78408M33201j40643m47680j58526
35023f36749L39572N17435L42092J46369O1208j06386m27624n93173l19580J35096
35013e41740J89555k70924o43695l77701K57305N35894K72965l265J17053M06760
35003e7793M73898L10650J09730r4588k88311k92996n9111J16143J164j86226
34993C2560j50771j5550n1662j59430p7226Q6922K7145j91345k37359r8632n7882
34982h93230j37957p7675J52802L01360K92507K59478J53306j55514m22692k75794
34972h03409Q8193J18421j37622p2221L49906L92300j60773m40941J37291P69428
$$ y = [107401, 486353, 383035, -49712, -316707, -138571, 264172, 478781, 380765, 212786, 211326, 262037, 33931, -530661, -1001510, -901509, -323101, 110100, -30543, -478223, -636749, -297177, 220258, 562350, 708719, 769927, 663541, 235917, -357256, -676836, -541740, -352185, -623109, -1266804, -1644505, -1387200, -851306, -578341, -581606, -464553, -57793, 416105, 726755, 836485, 741897, 453586, 160590, 101479, 217622, 218786, 32560, -118211, -133761, -185423, -344853, -422079, -335157, -308012, -499357, -736716, -835348, -893230, -1031187, -1108862, -956060, -654700, -362193, -102715, 50591, -104923, -527615, -803409, -715216, -596795, -734417, -806638, -456732, -64432, -225205, -666146, -528855, 240573]
34962B40573M16078n21117p32014O2098P63353N27870k03483n70159m23579j70164
34952f10544k1055J00358J80425J03620m6184o437K78708M90809K97238j77288
34942E89650m27387k14359N8998j02389m96805m40549J96560P11012N49542N0578
34932D74851j75050j26595j64411k69210j69244M3887O2658k4793J09988L71269
34922A33350L53935O6638q7489k9168n4947j65283l4278K77553L01715n960j45716
34911F10350K4550N1736j85492j74509J97938K27885l65435o84767l1493P31414
34901D02177L34041q82419j377152o56981J74581K36119J7364K76398P89473Q53764
34891A67365L79392j56834m35600m55807k68866K8067K40631K91041K70000J52230
$$ y = [240573, 656651, 135534, -596480, -534382, 228971, 756841, 553358, -16801, -440380, -610544, -631599, -531241, -350816, -247196, -293380, -299817, -21109, 469700, 766938, 589650, 162263, -52096, 6902, -95487, -592292, -1032841, -836281, -125269, 424273, 474851, 299801, 173206, 8795, -260415, -429659, -385772, -323114, -347907, -237919, 133350, 487285, 553923, 466434, 437266, 382319, 217036, 182758, 460311, 762026, 756066, 610350, 634900, 686636, 501144, 326635, 524573, 752458, 387023, -297744, -329237, 402177, 736218, -146201, -1523353, -2180334, -2005753, -1769634, -1752270, -1475872, -686399, 167365, 546757, 389923, -45677, -501484, -770350, -742283, -501652, -210611, 59389, 211619]
34881B11619j73889m64258k24067M67287P78078K13926n71615o02922J10160O75610
34871D19929N29190l8390m87444o24571n34309l24129o8262J94885M40356N42728
34861D9983L32091r2822l32764j80277R5609J82760J47273J43411N5734j87070
34851B13928k90190n3614J68924P485k38300p9777K65528K00921j94700k58186
34841b57981J34933L69287J27362j59039j12165N7367R9374J52562L03347K98019
34831A013066K2647k45539l48142m85744o86451n97934j16906L27094M34790M21690
34821b61429M23515J55844m11549o83068k85725K62499L16662N1990L9182K96627
34811i5452M00301K19971l2067k21965k85866j05773J83004J43200k85928n27320
$$ y = [211619, 37730, -426528, -650595, -183308, 594770, 808696, 237081, -365841, -255681, 419929, 949119, 910729, 423285, -201286, -735595, -1059724, -1127986, -933101, -492745, 49983, 382074, 289252, -43512, -223789, -128180, 54580, 201853, 345264, 400998, 213928, -76262, -129876, 39048, 46533, -191767, -271544, -6016, 194905, 205, -257981, -123048, 246239, 373601, 214562, 102397, 159764, 259138, 411700, 715047, 1013066, 1035713, 790174, 442032, -43712, -730163, -1328097, -1445003, -1117909, -683119, -261429, 162086, 317930, -93619, -776687, -1062412, -799913, -483251, -431261, -392079, -95452, 304849, 524820, 492753, 270788, -15078, -120851, 62153, 205353, -80575, -607895]
34801f07895k33603J41828J65742J60018M33759M78168j69016q59382o92878J4947
34791a168312K51069n1729q7801L09267M76709K23721J13978L28952L67111N8806
34781H21771j61608j79135l57330n85476k61625M84519O64200m4142o80051m33284
34771g32161K51066N56540M16083J64329j36486m24710l95844p7488J6107k32365
34761e94929k36349K50420N85335K79409k13027l42562k98491l58485k41923J62576
34751a008026K70260j67821l45806L17013R78020N96142l17621m69796J61348
34742A3713M23144o9583m67039k22011J58699J73395P6354J76004K36072K8681
34732E27429j59629k1320K24269J70941j63365l71822j95383J36947J39618k95214
$$ y = [-607895, -841498, -699670, -533928, -373910, 59849, 538017, 369001, -490381, -1183259, -1168312, -917243, -968972, -1056773, -747506, -270797, -47076, 66902, 395854, 762965, 821771, 660163, 481028, 123698, -461778, -723403, -238884, 425316, 381174, -298877, -732161, -481095, 75445, 491528, 655857, 519371, 94661, -301183, -378671, -362564, -594929, -831278, -580858, 4477, 283886, 70859, -271703, -570194, -928679, -1170602, -1008026, -737766, -905587, -1251393, -934380, 43640, 639782, 322161, -147635, 13713, 436857, 367274, -99765, -321776, -163077, 10318, 86672, 262676, 498748, 527429, 367800, 346480, 570749, 741690, 578325, 206503, 11120, 148067, 287685, -7529]
34722g529n97500j94532N57629P14547J30614k86786n0478J13800l96235q73588
34712h90058m45445L79573N26590J46253K29340P67842P49723n8151p06738o04898
34702I4031k22866k6633J26369K48228R173l89656k28796M39436O01254j18253
34692E32287p34328m20302K46274L31896j6402q0222J31899M2798m08746o79858
34682a054704m59424J5462L63551L74251R4665j15167J17741O03998O92569J75111
34672H08053l62746l69923l4107J54440O8687j51745l92793m47704r8923L86601
34662d40160M05989k5124j39612L42816O10305L0723o93652n19758L03374N96341
34652D71242J2085n41978k96570L67305N52044o651o87405o88952R4131Q66871
$$ y = [-7529, -605029, -799561, -241932, 472615, 603229, 316443, 265965, 379765, -16470, -890058, -1335503, -955930, -429340, -283087, -53747, 714095, 1463818, 1405667, 698929, 94031, -128835, -155468, -29099, 219129, 228302, -161354, -390150, 49286, 650540, 532287, -202041, -622343, -376069, -44173, -60575, -140797, -8898, 33900, -374846, -1054704, -1514128, -1498666, -1135115, -760864, -666199, -781366, -663625, -59627, 632942, 808053, 445307, 75384, 41277, 195717, 264404, 112659, -280134, -727838, -826761, -440160, -34171, -59295, -198907, 143909, 754214, 784937, 91285, -428473, -125099, 471242, 483327, -58651, -355221, 12084, 564128, 557477, -129928, -818880, -724749, 142122]
34642A42122P62904r4613p17132n34054l8810Q4645j19216k46437k40246j85590
34632a186427Q2948N58053P23915L03687j23313J7400K89561j8666n58277l87250
34622b98369M07309O99510L7704o92933o36366r5937J49241m9275k95778l42718
34612a117612k08963P5687M40913O61057N26189M6559n55144r11752o79250O5047
34602a657269O96929O86621K60162J2323K9079m3008j85514j795M28273M65195
34592F90996o9725m91762k40222L24818N34126L07019j3579k70028m29003k83136
34582E9504K27183O29545M03817k57456o44391m34768J5611K71905K93298K19811
34572G84059M8479k54296n03439m14687Q618L67735K82956j17494l02303k830
$$ y = [142122, 905026, 810413, 93281, -440773, -479583, -394938, -514154, -760591, -1000837, -1186427, -1103479, -545426, 178489, 482176, 358863, 376263, 665824, 647158, 88881, -298369, 108940, 808450, 846154, 153221, -483145, -579082, -429841, -479116, -774894, -1117612, -1326575, -1250888, -809975, -148918, 377271, 423830, -131314, -1043066, -1722316, -1657269, -960340, -273719, -13557, -1234, 27845, -15163, -200677, -202472, 225801, 690996, 621271, 129509, -110713, 214105, 748231, 1055250, 1041671, 771643, 342640, 59504, 286687, 916232, 1320049, 1062593, 418202, -16566, -955, 270950, 564248, 784059, 832538, 578242, 74803, -339884, -331266, 36469, 319425, 201931, -100372, -103202]
34562a03202M25757M85290J81893q8586j47213j46729j51012l2695J67299J87535
34552G78337m1186k86593m02797m52452l72992J4030N14422N97614J77147j56723
34542C68807k2994J63578l8436k71882q20M48875L20409k77496m34011J17840
34532C73870N34187J89355l45100k52495K17542J92686l85221o46314j44416M59959
34522A94053L67130k86829p47015o43946k05137K88751P17968Q58134M51836k98069
34512F96876p26735m57197J22334L78748K02879j9164k1301Q9893J27201N2449
34502D45983j02692k94124l97633k86276l1493J34068J00327j5327q2603j30662
34492f60432k35273l37690k68783N2448M66342O59633M85511J69928L7498M1688
$$ y = [-103202, 322555, 807845, 989738, 901152, 753939, 607210, 456198, 423503, 590802, 778337, 737151, 450558, 47761, -404691, -777683, -763653, -249231, 348383, 525530, 368807, 345813, 509391, 470955, 199073, 198253, 647128, 967537, 690041, 256030, 373870, 908057, 1097412, 752312, 499817, 717359, 910045, 524824, -121490, -265906, 194053, 561183, 274354, -472661, -1116607, -1321744, -1032993, -315025, 543109, 994945, 696876, -29859, -487056, -364722, 14026, 216905, 197741, 176440, 266333, 393534, 445983, 343291, 49167, -348466, -634742, -666235, -532167, -431840, -447167, -529770, -660432, -895705, -1233395, -1502178, -1449730, -983388, -323755, 161756, 331684, 369182, 410870]
34482D10870j54418n53609o66928k34786K82834L59594K07575L43716N92169K87359
34472H74376n29849r44082m65119K28539K96875r7206k06111J41400M47959M00752
34462A47534J95194N3017n8944j74083j88641o5731Q9098J84351J77962K7123
34452C86880j79395j74463J26082L77122K54587l5304j22012j38886m37499p69011
34442g11899n17833J85473M44013j4250l03964J99258P42911L67570m57698n02976
34432e69395K54907O02019M9892m45390r9225N24456N99520L18365K44122J87290
34422A666561k55108o27188k28069N25684N33379k72533p92867m60281M2050O6070
34412A97698n1211J54362L60209P6118m65484o82531m31089P8301O38738Q66412
$$ y = [410870, 256452, -297157, -964085, -1198871, -916037, -556443, -348868, -5152, 587017, 874376, 344527, -599555, -1064674, -836135, -539260, -636466, -842577, -701177, -253218, 147534, 342728, 395745, 336801, 162718, -25923, -91654, -2556, 181795, 359757, 386880, 207485, 33022, 159104, 536226, 790813, 755509, 633497, 494611, 57112, -711899, -1229732, -1044259, -600246, -614496, -918460, -719202, 23709, 391279, -66419, -569395, -314488, 287531, 337423, -107967, -207192, 317264, 916784, 1235149, 1479271, 1666561, 1411453, 784265, 556196, 1081880, 1615259, 1342726, 549859, 89578, 131628, 197698, 146487, 300849, 661058, 737176, 271692, -410839, -841928, -763627, -124889, 741523]
34402G41523K93168p79497j166336k76491Q61873Q92626m0530o92852n48264j86709
34392i01489l5352J14989L04468J72113k33176k96712J92887O44783N42331J02739
34382F07581k07656k69874j93299p9789o3876j63335q3376L44789O60880L63364
34372I15409j74051k16978N2459j62753p35122o55788J84426O48026K41585q0828
34362A6385K81048M30189l19426r56179l83704N98495N43736k48736l53369L08227
34352h3334M77096j48365m78478m5133K71688o0966l49440p2116K01387j5860
34342c03521k28606q48J61655j89383m86326j03716M79447M33846p0218k08951
34332e16621J90517N63972N71390L73685J21809j66025l41766k84775j75446j71425
$$ y = [741523, 1034691, 255194, -911142, -1187633, -325760, 566866, 526336, -166516, -714780, -901489, -936841, -821852, -517384, -345271, -578447, -875159, -682272, -37489, 504842, 607581, 399925, 130051, -63248, -143037, -206913, -370248, -453624, -108835, 552045, 915409, 741358, 524380, 576839, 414086, -321036, -976824, -792398, -144372, 97213, 16385, 297433, 727622, 408196, -547983, -931687, -333192, 210544, -38192, -391561, -83334, 393762, 245397, -233081, -278214, -6526, -67492, -416932, -489048, -287661, -303521, -532127, -532975, -371320, -560703, -1047029, -1150745, -671298, -237452, -307670, -516621, -326104, 237868, 809258, 1182943, 1304752, 1138727, 796961, 512186, 336740, 165315]
34322A65315o9756K40335L30253j61104p58630o76751M3612N93653N10274R1667
34312C08868k53199m16989l27262Q5936N22133M79982k7457m21946l88178k47179
34302f85291k85810k33301K20080P64442P84848J76383n13427p16932l95503K7680
34292h56831J47991j8624j10067P1771K61432J49704m7707J40219O05235O32399
34282I75522n5246p26938n81046R5597L18613j65030n26970j14969N55417N44345
34272C19295j43485n76321k41550K73712K20414k18075k94898J31894M64840L65676
34262C01502J88379K11754J22602k94143n47524j84260L00236J23330m59200m51314
34252f88638K61991O36772J20857m33804j37661N11709M58773k43258o15406l01969
$$ y = [165315, 95559, 335894, 666147, 505043, -253587, -930338, -886726, -293073, 217201, 308868, 55669, -361320, -688582, -602646, -80513, 399469, 372012, -49934, -438112, -685291, -971101, -1204402, -984322, -219880, 564968, 741351, 227924, -489008, -884511, -856831, -708840, -727464, -837531, -765760, -504328, -354624, -402331, -262112, 343123, 975522, 920276, 193338, -387708, -292111, 26502, -138528, -665498, -780467, -225050, 319295, 175810, -400511, -642061, -368349, -147935, -366010, -660908, -529014, -64174, 301502, 489881, 701635, 824237, 530094, -17430, -201690, 98546, 221876, -237324, -688638, -426647, 210125, 330982, -102822, -240483, 271226, 729999, 486741, -128665, -430634]
34242d30634J00472J97490K65926M15980K35172l59906p06444l19614L73717P05654
34232D77813O29350M15923L6356n27172q00385l84907K62541L49701j13623m16489
34222g0892k83222j30235j60979k5447L89137N83929K56241j46042j53163k9407
34212B29920k38518n62776m11858J96746O09178M60681Q4377q1305m2762n0065
34202A93618j67468k36130j08325J81883M02164L10423k1685j88863L8761L25153
34192G29531J99871k18540l50595k9329K21670k6844m64415n15469j67964Q7530
34182e34554J1125j21510k3683K12008L62821M13835M26453K87221j06901n04235
34172D22580m87060o3727K52495J33144r5196J9649L00078J96877k73704m47940
$$ y = [-430634, -330162, -132672, 133254, 549234, 784406, 424500, -281944, -601558, -227841, 477813, 1107163, 1523086, 1559442, 1032270, 231885, -153022, 109519, 459220, 345597, -70892, -354114, -484349, -645328, -670775, -281638, 302291, 558532, 412490, 259327, 229920, -8598, -571374, -983232, -786486, -177308, 283373, 367750, 286445, 243683, 193618, 26150, -209980, -318305, -136422, 265742, 576165, 554480, 365617, 404378, 729531, 929402, 710862, 360267, 330938, 552608, 525764, 61349, -454120, -622084, -534554, -523429, -644939, -668622, -456614, -93793, 320042, 746495, 1033716, 926815, 422580, -64480, -128207, 124288, 257432, 162236, 181885, 481963, 678840, 405136, -42804]
34162d2804m3107L14715Q840n77640n88051M5260N45362M56585J80988J87796
34152D87944L06712J53750k04244m30122m40906l37764o8210L88664O73717L89370
34142I18911k38470n15849j88434K13788J07754m00993p35250n63427n5806M11782
34132a045994N67760L55759l8635l04489l08178k31432k68156k84712j4042M47558
34122a124561O23228K44414l40139n10666n5297O14678Q98008N84173J3544l18999
34112F28383l03562k66127m27676n12214j52767M45449O62381L18298p2371p3177
34102B46617Q6423q858k90230m20879l64245k78236j03299K43785M87660L54070
34092d7192J19976K01792L75751J24396l68077m26469q7728j02960n40107m68955
$$ y = [-42804, -85911, 228804, 237644, -339996, -928047, -882787, -337425, 119160, 300148, 487944, 794656, 948406, 744162, 314040, -126866, -464630, -532840, -144176, 529541, 918911, 680441, 164592, -23842, 189946, 297700, -103293, -838543, -1401970, -1457776, -1045994, -478234, -122475, -161110, -465599, -773777, -1005209, -1273365, -1558077, -1572119, -1124561, -501333, -256919, -597058, -1107724, -1163021, -548343, 349665, 933838, 947382, 628383, 324821, 58694, -368982, -881196, -1033963, -588514, 73867, 392165, 319794, 246617, 333040, 324182, 33952, -386927, -751172, -1029408, -1132707, -888922, -401262, -47192, 72784, 274576, 650327, 774723, 406646, -19823, -107551, -210511, -750618, -1219573]
34082a219573M66133J201687P66605k21131n30955j36682K8244k89843m20598
34073c56113l6239L86844M47594L04497J64460R660p2931O1876J96633J328l17207
34062G90402k89974n1091j40797m60112l37810K33619M11013j30270n89359k97014
34052h61393K72301L70939J29742J05249K44768J07970k31842k80325M2845L05474
34042B05728K41352J8017j49261k37014k56301j65676J7999J83885K03259J5114
34032G7102k61596l49260j49698M1119l6279j25752J25613M52065L37657j5013
34022I5958O9190N06804M67474j72230m68750N1333N64941L05741k62033m11476
34012G46952l51770n32629o12250j76508K53718O0289k83160m0329L90140K09999
$$ y = [-1219573, -753440, 448247, 1214852, 993721, 462766, 326084, 354328, 64485, -356113, -392352, -5508, 442086, 746583, 911043, 920703, 847772, 909648, 1106281, 1107609, 790402, 500428, 449337, 308540, -151572, -489382, -255763, 155250, 24980, -564379, -861393, -589092, -218153, -88411, 16838, 261606, 369576, 137734, -142591, -99746, 205728, 447080, 465097, 315836, 78822, -177479, -343155, -325156, -141271, 61988, 77102, -184494, -533754, -683452, -642333, -678612, -804364, -678751, -226686, 110971, 95958, 165148, 671952, 1139426, 967196, 498446, 549779, 1114720, 1420461, 1158428, 746952, 395182, -137447, -749697, -926205, -672487, -612198, -895358, -935687, -545547, -335548]
34002c35548j96825J03212P57545N45665m80006r18603k38999M96146M65779J66956
33992C65322J49749O2271l53310n10710j0337N48381N17650J28908j54295l67648
33982C75981n29584k73699L45510N45114J3884m39526j93244J23116k24800p07385
33972i64633m04458M05204P06880L65336J10464J76289R6830k25824l10729l1880
$$ y = [-335548, -532373, -429161, 328384, 874049, 394043, -524560, -763559, -267413, 198366, 365322, 515071, 577342, 224032, -286678, -297015, 251366, 769016, 897924, 743629, 375981, -153603, -427302, -81792, 463322, 477206, 37680, -155564, -32448, -257248, -964633, -1369091, -963887, -257007, 108329, 218793, 395082, 491912, 266088, -44641, -76521]
$$ [...]
##END NTUPLES=NMR SPECTRUM
##END=
