##TITLE=31Pdec_E3d0607-4
 CDCl3, 24 sc
 7.7.2023
##JCAMPDX= 6.0         $$ Bruker NMR JCAMP-DX V2.0
##DATA TYPE= NMR SPECTRUM
##DATA CLASS= NTUPLES
##ORIGIN= UXNMR, Bruker Analytische Messtechnik GmbH
##OWNER= root
$$ XWIN-NMR		Version 3.5
$$ Fri Jul  7 14:51:09 2023 Russian Standard Time (UT+4h)  she@DPX200
##.OBSERVE FREQUENCY= 81.013821
##.OBSERVE NUCLEUS= ^31P
##.ACQUISITION MODE= SIMULTANEOUS
##.ACQUISITION SCHEME= undefined
##.AVERAGES= 24
##.DIGITISER RES= 16
##SPECTROMETER/DATA SYSTEM= spect
##.PULSE SEQUENCE= zgpg30
##.SOLVENT NAME= CDCl3
##.SHIFT REFERENCE= (INTERNAL, CDCl3, 0, 248.564)
##AUDIT TRAIL= $$ (NUMBER, WHEN, WHO, WHERE, WHAT)
$$ ##TITLE= Audit trail, XWIN-NMR		Version 3.5
$$ ##JCAMPDX= 5.01
$$ ##ORIGIN= Bruker BioSpin GmbH
$$ ##OWNER= she
$$ F:/spectra/data/she/nmr/P31/1/pdata/1/auditp.txt
$$ ##AUDIT TRAIL=  $$ (NUMBER, WHEN, WHO, WHERE, WHAT)
(   1,<2023-07-07 14:50:20.95 +0400>,<she>,<DPX200>,
      <created by zg, POWCHK disabled, PULCHK disabled
       configuration hash MD5:
       00 E9 B6 7A A2 85 ED C7 34 08 36 98 17 FE 4E 26
       data hash MD5: 32K
       85 CD CA A5 5B C6 EF CD 3C A8 BC A3 B8 B6 73 14>)
(   2,<2023-07-07 14:50:24.18 +0400>,<she>,<DPX200>,
      <Start of raw data processing
       efp BC_mod = 2 LB = 1 FT_mod = 6 PKNL = 1 PHC0 = -10478.63 PHC1 = -393.1151 SI = 64K 
       data hash MD5: 64K
       4B 94 2D D8 A6 83 47 49 60 7E 97 5E 54 74 96 1F>)
(   3,<2023-07-07 14:50:37.67 +0400>,<she>,<DPX200>,
      <pk PHC0 = 1.944581 PHC1 = 0 
       data hash MD5: 64K
       CC 7B 78 98 53 84 B5 F7 F5 E7 CB AE BB 92 D2 84>)
$$ ##END=
$$ 
$$ hash MD5
$$ 6E 38 A3 DC 2D B5 27 07 60 AD DF AE 77 B2 00 E1
##$RELAX= 
##$RELAX= 
##$RELAX= 
##$RELAX= 
##$RELAX= 
##$RELAX= 
##$RELAX= 
##$RELAX= 
##$RELAX= 
$$ Bruker specific parameters
$$ --------------------------
##$DU= <F:/spectra>
##$EXPNO= 1
##$NAME= <P31>
##$PROCNO= 1
##$TYPE= <nmr>
##$USER= <she>
##$AMP= (0..31)
100 100 100 100 100 100 100 100 100 100 100 100 100 100 100 100 100 100 
100 100 100 100 100 100 100 100 100 100 100 100 100 100 
##$AQSEQ= 0
##$AQ_mod= 1
##$AUNM= <au_zg>
##$AUTOPOS= <>
##$BF1= 81.014009
##$BF2= 200.13
##$BF3= 200.13
##$BF4= 200.13
##$BF5= 200.13
##$BF6= 200.13
##$BF7= 200.13
##$BF8= 200.13
##$BYTORDA= 1
##$CFDGTYP= 0
##$CFRGTYP= 5
##$CHEMSTR= <none>
##$CNST= (0..31)
1 1 145 1 1 1 1 1 1 1 1 1 1 1 1 1 1 1 1 1 1 1 1 1 1 1 1 1 1 1 1 1 
##$CPDPRG= <waltz16>
##$CPDPRG1= <>
##$CPDPRG2= <waltz16>
##$CPDPRG3= <>
##$CPDPRG4= <mlev>
##$CPDPRG5= <mlev>
##$CPDPRG6= <mlev>
##$CPDPRG7= <mlev>
##$CPDPRG8= <mlev>
##$CPDPRGB= <>
##$CPDPRGT= <>
##$D= (0..31)
0 1 0 0 0 0 0 0 0 0 0 0.03 2e-05 3e-06 0 0 0 0 0 0 0 0 0 0 0 0 0 0 0 0 
0 0 
##$DATE= 1688727020
##$DBL= (0..7)
120 120 120 11 120 120 24 19 
##$DBP= (0..7)
150 150 150 150 150 150 150 150 
##$DBP07= 0
##$DBPNAM0= <>
##$DBPNAM1= <>
##$DBPNAM2= <>
##$DBPNAM3= <>
##$DBPNAM4= <>
##$DBPNAM5= <>
##$DBPNAM6= <>
##$DBPNAM7= <>
##$DBPOAL= (0..7)
0.5 0.5 0.5 0.5 0.5 0.5 0.5 0.5 
##$DBPOFFS= (0..7)
$$ [...]
##$SUBNAM2= <"">
##$SUBNAM3= <"">
##$SUBNAM4= <"">
##$SUBNAM5= <"">
##$SUBNAM6= <"">
##$SUBNAM7= <"">
##$SUBNAM8= <"">
##$SUBNAM9= <"">
##$SW= 501.771253377433
##$SWIBOX= (0..15)
0 1 3 0 0 0 0 0 0 0 0 0 0 0 0 0 
##$SW_h= 40650.406504065
##$TD= 32768
##$TD0= 1
##$TE= 0
##$TE2= 300
##$TE3= 300
##$TEG= 300
##$TL= (0..7)
0 120 53 12 22 120 120 120 
##$TP= (0..7)
150 150 150 150 150 150 150 150 
##$TP07= 0
##$TPNAME0= <>
##$TPNAME1= <>
##$TPNAME2= <>
##$TPNAME3= <>
##$TPNAME4= <>
##$TPNAME5= <>
##$TPNAME6= <>
##$TPNAME7= <>
##$TPOAL= (0..7)
0.5 0.5 0.5 0.5 0.5 0.5 0.5 0.5 
##$TPOFFS= (0..7)
0 0 0 0 0 0 0 0 
##$TUNHIN= 0
##$TUNHOUT= 0
##$TUNXOUT= 0
##$USERA1= <user>
##$USERA2= <user>
##$USERA3= <user>
##$USERA4= <user>
##$USERA5= <user>
##$V9= 5
##$VALIST= <valist>
##$VCLIST= <CCCCCCCCCCCCCCC>
##$VD= 0
##$VDLIST= <DDDDDDDDDDDDDDD>
##$VPLIST= <PPPPPPPPPPPPPPP>
##$VTLIST= <TTTTTTTTTTTTTTT>
##$WBST= 1024
##$WBSW= 4
##$XGAIN= (0..3)
0 0 0 0 
##$XL= 0
##$YL= 0
##$YMAX_a= 6438
##$YMIN_a= -6174
##$ZGOPTNS= <>
##$ZL1= 120
##$ZL2= 120
##$ZL3= 120
##$ZL4= 120
##$ABSF1= 0
##$ABSF2= 0
##$ABSG= 0
##$ABSL= 0
##$ALPHA= 0
##$AQORDER= 0
##$ASSFAC= 0
##$ASSFACI= 0
##$ASSFACX= 0
##$ASSWID= 0
##$AUNMP= <proc_1d>
##$AZFE= 0.1
##$AZFW= 0.5
##$BCFW= 0
##$BC_mod= 2
##$BYTORDP= 0
##$COROFFS= 0
##$CY= -3
##$DATMOD= 1
##$DC= 0
##$DFILT= <>
##$DTYPP= 0
##$F1P= 0
##$F2P= 0
##$FCOR= 1
##$FTSIZE= 65536
##$FT_mod= 6
##$GAMMA= 0
##$GB= 0
##$INTBC= 1
##$INTSCL= 6.047779e-11
##$ISEN= 30
##$LB= 1
##$LEV0= 0
##$LPBIN= 0
##$MAXI= 10000
##$MC2= 0
##$MEAN= 0
##$ME_mod= 0
##$MI= 50
##$NCOEF= 0
##$NC_proc= -5
##$NLEV= 6
##$NOISF1= 182.463
##$NOISF2= 159.3651
##$NSP= 0
##$NTH_PI= 0
##$NZP= 0
##$OFFSET= 248.5645
##$PC= 4
##$PHC0= -10476.69
##$PHC1= -393.1151
##$PH_mod= 1
##$PKNL= yes
##$PPARMOD= 0
##$PSCAL= 0
##$PSIGN= 0
##$REVERSE= no
##$SF= 81.0140089999694
##$SI= 65536
##$SIGF1= 159.3651
##$SIGF2= -187.1042
##$SINO= 113.3802
##$SIOLD= 16384
##$SREGLST= <1H.CDCl3>
##$SSB= 0
##$STSI= 65536
##$STSR= 0
##$SW_p= 40650.406504065
##$SYMM= 0
##$S_DEV= 0
##$TDeff= 32768
##$TDoff= 0
##$TI= <>
##$TILT= no
##$TM1= 0
##$TM2= 0
##$TOPLEV= 0
##$USERP1= <user>
##$USERP2= <user>
##$USERP3= <user>
##$USERP4= <user>
##$USERP5= <user>
##$WDW= 1
##$XDIM= 65536
##$YMAX_p= 483825598
##$YMIN_p= -230647192
$$ End of Bruker specific parameters
$$ ---------------------------------
##NTUPLES= NMR SPECTRUM
##VAR_NAME=  FREQUENCY,     SPECTRUM/REAL,   SPECTRUM/IMAG
##SYMBOL=    X,             R,               I
##VAR_TYPE=  INDEPENDENT,   DEPENDENT,       DEPENDENT
##VAR_FORM=  AFFN,          ASDF,            ASDF
##VAR_DIM=   65536,         65536,           65536
##UNITS=     HZ,            ARBITRARY UNITS, ARBITRARY UNITS
##FACTOR=    0.620285442955139, 1,           1
##FIRST=     20137.2065510682, 0,            0
##LAST=      -20513.1999529968, 0,           0
##MIN=       -20513.1999529968, -230647192,  0
##MAX=       20137.2065510682, 483825598,    0
$$ Real data points
##PAGE= N=1
##DATA TABLE= (X++(R..R)), XYDATA
$$ [...]
39827e29421j86781l75688J75639M29583k9110k49204K72241O16838R4774n04709
$$ -529421 -716202 -1091890 -916251 -486668 -515778 -764982 -492741 124097 218871 -285838
39817b85838k88623K49219J91686k45664k51017J51242L14933J64473J37813K49150
$$ -285838 -574461 -325242 -133556 -379220 -630237 -478995 -164062 411 138224 387374
39807C87374J50325j00791j81437j92296l95486n12425j41966L47721K81006j36674
$$ 387374 537699 436908 255471 63175 -332311 -844736 -986702 -638981 -357975 -494649
39797d94649j09838L41453L90420r0471k38032K46567M46093k45950r94498p56026
$$ -494649 -604487 -263034 127386 36915 -201117 45450 491543 245593 -748905 -1504931
39787a504931J71887P45687O91968M86634L04998k1561l08085k29610n1570k55880
$$ -1504931 -1333044 -587357 104611 591245 896243 874682 566597 336987 285417 29537
39777B9537n81366l51520L14439N81373K34628n1111L6485o0359o28666r80676
$$ 29537 -551829 -903349 -588910 -7537 227091 175980 212465 152106 -476560 -1457236
39767a457236n11813K76138N23072K41720P3476K00870K44289L9657j54411j59393
$$ -1457236 -1969049 -1692911 -1169839 -928119 -854643 -653773 -409484 -369827 -524238 -683631
39757f83631l7581K10024O06607Q65120N85517j05075n22340k41694L24890M11995
$$ -683631 -721212 -511188 95419 960539 1546056 1440981 918641 676947 1001837 1413832
39747A413832j59114p66590p65655k93217n2695l18683n40864j89736L78935M23364
$$ 1413832 1254718 488128 -277527 -570744 -623439 -942122 -1482986 -1672722 -1293787 -870423
39737h70423m2340k88956l4506J94236N3292l5939K86113N83426L17446k19958
$$ -870423 -912763 -1201719 -1236225 -1041989 -988697 -1024636 -738523 -155097 162349 -57609
39727e7609l36938P905K46715J26781k6463N8327K25453K26618O3858r6894j49250
$$ -57609 -394547 -386642 -139927 -13146 -39609 18718 244171 470789 534647 437753 288503
39716B88503j40262k15658m08482m92742k50250J48796L57528M04962N70795P23623
$$ 288503 148241 -67417 -475899 -968641 -1218891 -1070095 -712567 -307605 263190 986813
39706I86813M20419k30870n46395l31543j73299l42614l01236K01890M95435J51593
$$ 986813 1407232 1176362 629967 298424 125125 -217489 -518725 -316835 178600 330193
39696C30193j42849K23409N94011J29423o57031o80109l8133K96667J22814L7029
$$ 330193 187344 410753 1004764 1134187 477156 -202953 -241086 55581 178395 215424
39686B15424J24201n2466l39070j70969K49549K17687j51016j52581R2003j31906
$$ 215424 339625 287159 -51911 -222880 26669 244356 93340 -59241 32762 -99144
39676i9144n81260l06932M90219N50308k37831m88745L00489P91708M4874r15112
$$ -99144 -680404 -987336 -497117 53191 -184640 -673385 -372896 418812 463686 -451426
39666d51426q22878o1310L26845L11578L63545L04571j18732l81253n5025K45877
$$ -451426 -1274304 -1335614 -1008769 -697191 -333646 -29075 -147807 -529060 -584085 -338208
39656c38208r6853m97324j47116N08628M98125m9331k25915J29888L83017K59077
$$ -338208 -435061 -932385 -1079501 -570873 -72748 -122079 -347994 -218106 164911 423988
39646D23988K0061k29202m93913m79487p5974J64623j25008l35400J28119O55936
$$ 423988 444049 214847 -279066 -758553 -834527 -669904 -794912 -1130312 -1002193 -346257
39636c46257L48826m05287n11366P2967M44719L24930K00762J19336k74563o04168
$$ -346257 2569 -402718 -914084 -841117 -396398 -71468 129294 248630 -25933 -630101
39626f30101j20465P50900P17169k81942p85285r6151O13214K51604m60727k94793
$$ -630101 -750566 334 717503 435561 -349724 -445875 167339 418943 -41784 -336577
39616c36577M53063N21072k60505p53002k67950N24253O80142K16982j47667m5483
$$ -336577 116486 637558 377053 -375949 -643899 -119646 560496 777478 629811 584328
39606E84328K20931K59365P0886j26615k38404k53718j22363L7689j37017o92320
$$ 584328 805259 1064624 1135510 1008895 770491 516773 394410 432099 295082 -397238
39596c97238r59781l54952N84979P83490K28751l93M96266P75194J41414p09269
$$ -397238 -1357019 -1711971 -1126992 -343502 -114751 -115144 381122 1156316 1297730 588461
39586E88461q75592n64549l50228q5230M24754N57939j25632p83538m43551M07478
$$ 588461 -287131 -851680 -1201908 -1287138 -862384 -304445 -430077 -1213615 -1657166 -1249688
39576a249688O73301M23067M04417M26453j38158p27102k81087O88666O33175
$$ -1249688 -576387 -153320 251097 677550 539392 -187710 -468797 219869 853044
39567H53044m38297q51335k3193O29981J32679n40435k94712L21047K88394j66132
$$ 853044 414747 -436588 -459781 170200 302879 -237556 -532268 -211221 77173 -88959
39557h8959j84451K50219M78320K31351k20373n27768m09858J39943N47184K22519
$$ -88959 -273410 -23191 455129 686480 466107 -61661 -471519 -331576 215608 438127
39547D38127m42017m96498O6605L03615m6153j75688K34587M31915N7884j55741
$$ 438127 -3890 -500388 -433783 -130168 -176321 -352009 -117422 314493 372377 216636
39537B16636J95059L88094n2744m54769k87536j11110l46048l46391K97149P43242
$$ 216636 411695 799789 747045 292276 4740 -106370 -452418 -798809 -501660 241582
39527B41582K98738l12148k42882L1306j81681l51815J87842P22336K88330m95844
$$ 241582 540320 228172 -14710 16596 -165085 -516900 -329058 393278 681608 185764
39517A85764l63841M67581P24376J57091l74114n21921o32994o07243p2673N16606
$$ 185764 -178077 289504 1013880 1170971 796857 274936 -358058 -965301 -1037974 -521368
39507e21368L84317j64295k20518R7346n5872n53599m68455J62261L54690j0441
$$ -521368 -137051 -301346 -521864 -424518 -480390 -1033989 -1502444 -1340183 -985493 -995934
39497i95934j9806M75020N28046j12369m68880n7666L36742J61918l2096J53309
$$ -995934 -1015740 -540720 -12674 -125043 -593923 -651589 -314847 -152929 -185025 -31716
39487c1716J90496j79903k61469K74650N70781O979o25402l84741K95799M05920
$$ -31716 158780 -21123 -282592 -7942 562839 569818 -55584 -440325 -144526 261394
39477B61394m8861l15065j98390q3826m2825J43551L30609J93479j17730j89471
$$ 261394 212533 -102532 -300922 -384748 -427573 -284022 46587 240066 122336 -67135
39467f7135n1325q3025l53541n42878m03611M4444N83681Q13846M27671k76505
$$ -67135 -118460 -201485 -555026 -1097904 -1501515 -1457071 -873390 -59544 368127 91622
39457I1622n75566k78006J6328q8125j83503Q7187K94515K1867k49693P8122N64881
$$ 91622 -483944 -761950 -745622 -833747 -1017250 -930063 -635548 -613681 -863374 -785252 -220371
39446b20371L58473l43132n40052l4240L22031R9682p8616K40025M88993R9058
$$ -220371 138102 -205030 -745082 -779322 -457291 -357609 -436225 -196200 292793 391851
39436C91851m28635l12957J66613R4613n23812o59347J27205R01696O81456j66968
$$ 391851 -36784 -349741 -183128 -88515 -612327 -1271674 -1144469 -242773 438683 271715
39426B71715n54149k22163J54552J92017K08513L69970L14578q5189l56924k17078
$$ 271715 -282434 -504597 -350045 -158028 50485 420455 735033 649844 292920 75842
39416G5842l9818j08050r4376J91252K61883j79045n46451l44864j14377m30320
$$ 75842 36024 -72026 -166402 24850 286733 107688 -438763 -783627 -898004 -1328324
39406a328324o57206N5470J078106J069841J50241k83115J32796K63620m15652
$$ -1328324 -1985530 -1930060 -851954 217887 368128 85013 217809 481429 65777
39397F5777r09622m72155K05348L26095J90797K50946J81731k07890k79306K64636
$$ 65777 -843845 -1316000 -1110652 -784557 -593760 -342814 -161083 -368973 -648279 -383643
39387c83643N81127O5380n05036k80360K16310J36279j76106k6015J84337j83075
$$ -383643 197484 262864 -242172 -522532 -306222 -169943 -346049 -372064 -187727 -370802
39377c70802n12588N6572Q01338M03089o75948p40631L56717R57554K95293m57974
$$ -370802 -883390 -826818 -25480 377609 -298339 -1038970 -682253 275301 570594 112620
39367A12620l15232J19266R0503p180L23530N91461K22898m08096o82419o32808
$$ 112620 -202612 -83346 7157 -23 323507 914968 1137866 729770 47351 -585457
39357e85457m63611n0586M23884K63880n75315j017459l65276N88872Q12165N39427
$$ -585457 -1049068 -1099654 -675770 -411890 -987205 -2004664 -2369940 -1781068 -968903 -429476
39347d29476N34914O20367J28008o86209q94069l36363K29050L14224J51920L1063
$$ -429476 105438 725805 853813 167604 -726465 -1062828 -833778 -519554 -367634 -336571
39337c36571m5050o8541n471K7896L0077K64778O68709N95713j98620q71391o31008
$$ -336571 -381621 -450162 -455633 -427737 -397660 -132882 535827 1131540 932920 61529 -569479
39326e69479j6669j0944l67800j01407O51220P16464j33084p35856l95969J67517
$$ -569479 -586148 -597092 -964892 -1066299 -415079 301385 168301 -567555 -963524 -796007
39316g96007K25287J33455L36839M05097o4126m92108k22189L27204L68387M2112
$$ -796007 -570720 -437265 -100426 304671 240545 -251563 -473752 -146548 221839 263951
39306B63951L2614L00931K10145k93850n77224l65101p3820k6865l8734P9154
$$ 263951 296565 597496 807641 513791 -63433 -428534 -502354 -529219 -567953 -488799
39296d88799J75077J05722J574K0575J30765K13483J61391p9145l33988k36048
$$ -488799 -313722 -208000 -206426 -185851 -55086 158397 319788 240643 -93345 -329393
39286c29393K33800M54255r3071r13160r40478L6218R74962Q62071m5332o11414
$$ -329393 -95593 358662 265591 -647569 -1588047 -1551829 -576867 285204 239872 -371542
39276c71542k16197N93275Q22536J83183n99095o53973j8542M50959K45028j60851
$$ -371542 -587739 5536 828072 1011255 412160 -241813 -260355 190604 435632 274781
39266B74781j25984J45167j0803n84865q71500n49133p4720J34993K44304M58463
$$ 274781 148797 293964 283161 -301704 -1173204 -1722337 -1797057 -1662064 -1417760 -959297
39256i59297N59187L58839J03117K210j64867n03272n34728R2508P96286P32219
$$ -959297 -400110 -41271 61846 64056 -100811 -604083 -1138811 -1046303 -250017 482202
39246D82202Q2091j73498K26595M37828q8678o94388n78548p7266o6071n10167
$$ 482202 564293 390795 617390 1055218 966540 272152 -306396 -383662 -449733 -959900
39236i59900n52665N9915N80677M60498R9299L3317J11340J5900j5338L15633
$$ -959900 -1512565 -1452650 -871973 -411475 -312176 -278859 -167519 -151619 -166957 148676
39226A48676N94358K05144o20242j039037p76516l25917j9884L11472O87178P71253
$$ 148676 743034 948178 327936 -711101 -1487617 -1813534 -1833418 -1521946 -834768 -63515
39216f3515N22663L43469L60805K45565n5157j63764q6282l17948p93865o99788
$$ -63515 459148 802617 1163422 1408987 1353830 1190066 1103784 785836 -8029 -707817
39206g07817J44777P21461L57270j68951L236L28199n2758o02835k77870M80382
$$ -707817 -563040 158421 515691 346740 349976 678175 625417 22582 -255288 225094
39196B25094L29374o58916j004799k07842N41663L63531j34833j80616N0859K34703
$$ 225094 554468 -104448 -1109247 -1317089 -775426 -411895 -546728 -727344 -676485 -441782
39186d41782N36397Q19208M33767n02808q17048o3466N74429R4481p34367o87791
$$ -441782 94615 913823 1347590 844782 27734 -35732 538697 633178 -101189 -788980
39176g88980K121K91517Q6029M8427K21085J28172j30747p2564J75747J46915
$$ -788980 -786859 -495342 -409313 -360886 -139801 -11629 -142376 -214940 -39193 107722
39166A07722J607J89716M52410K22669k65202l46735j23654j52691k23519K66450
$$ 107722 109329 299045 751455 974124 708922 362187 238533 85842 -137677 128773
39156A28773Q89382N70635n38938j026369l62809K99569L637o14456n52570p718
$$ 128773 1018155 1588790 1049852 23483 -339326 -39757 -36120 -650576 -1203146 -1210864
39146a210864J95940m972k0816L23821O01429M55185m0648n19662n49402L678
$$ -1210864 -1014924 -1019896 -1040712 -716891 -115462 339723 299075 -220587 -769989 -766311
39136g66311O60564P56360L06062l2244L2145O4197k39962n16614m05244j38431
$$ -766311 -105747 650613 956675 924431 956576 1020773 780811 264197 -141047 -279478
39126b79478m8583l0745Q4233J29502l941n5034J14795J96092O924j11261P7853
$$ -279478 -328061 -358806 -274573 -145071 -149012 -204046 -89251 106841 113765 2504 80357
39115H0357K01019p2599l59929j49823L36263M98734K63813J6257j11133k56569
$$ 80357 281376 208777 -151152 -300975 35288 534022 797835 814092 702959 446390
39105D46390l29836j17288K04352K14133j24798m36341m77978l13804l5402K79710
$$ 446390 116554 -734 203618 417751 292953 -143388 -621366 -935170 -970572 -690862
39095f90862M20913K63744N9046J15353K85488J77331k02196m44100l46928j12434
$$ -690862 -269949 -6205 52841 168194 453682 631013 428817 -15283 -362211 -474645
39085d74645O8386K13362K85559J29128k03692l77702j90290J50448L00500J83802
$$ -474645 -406259 -192897 92662 221790 18098 -359604 -549894 -399446 -98946 84856
39075H4856O267m1106R486r624j43401k22659j10686N6183P1334K4715J61581
$$ 84856 91123 50017 59503 49879 -93522 -316181 -426867 -370684 -299350 -274635 -113054
39064a13054L92027L39314l5934k92681j75344N938q0802k82205l19305k58073
$$ -113054 278973 618287 582353 289672 114328 120266 39464 -242741 -562046 -820119
39054h20119k43438j37442J48937L14208J39034k2623K27236N81891M26250j94055
$$ -820119 -1063557 -1200999 -1052062 -737854 -598820 -621443 -394207 187684 613934 419879
39044D19879o37565o14330m29761k94624n3560K76200L19282l4005l02689n1726
$$ 419879 -217686 -832016 -1261777 -1556401 -1609961 -1333761 -1014479 -1048484 -1351173 -1402899
39034a402899M74389O90182M43427J32086J02363K00527N3253l15403m13809O777
$$ -1402899 -928510 -238328 205099 337185 439548 640075 693328 377925 -35884 -29107
39024b9107M27540J89501m58632n78621O8148N87463K84974l09424l65321k4401
$$ -29107 398433 587934 129302 -449319 -381171 206292 491266 181842 -183479 -207880
39014b07880P5513j2728J53002L05324j71916r36629r44812r0298N68723M43512
$$ -207880 -132367 -145095 7907 313231 141315 -795314 -1740126 -1830424 -1261701 -818189
39004h18189J38866J85246J90650j65930l48893N2525M34584J51216l27141j72118
$$ -818189 -679323 -494077 -303427 -469357 -818250 -765725 -331141 -179925 -507066 -679184
38994f79184M10782N28460J9076m05153k94216O0836K39035J29582j94391n08055
$$ -679184 -268402 260058 279134 -126019 -420235 -359399 -120364 9218 -185173 -693228
38984f93228m48023K2658L52417J03992l38566l32326M7851K60446K39501L02730
$$ -693228 -1141251 -1118593 -766176 -662184 -1000750 -1333076 -1285225 -1024779 -785278 -482548
38974d82548L40512j0308m83351m22338P0599J91913k28996m47223j03931K12488
$$ -482548 -142036 -152344 -635695 -1058033 -987434 -795521 -1024517 -1471740 -1575671 -1363183
38964a363183J11947Q1512M20722M79577k14743q94927o10330K54994N75574J89291
$$ -1363183 -1251236 -1169724 -749002 -269425 -484168 -1379095 -1989425 -1734431 -1158857 -969566
38954i69566p1199J68947M19901L49264K10668J35764r7036l91395k73017K26995
$$ -969566 -1040765 -871818 -451917 -102653 108015 243779 146743 -244652 -517669 -290674
38944b90674M13221L163l57235r4221M06175M24261o9665n26960n77447k28783
$$ -290674 122547 125710 -231525 -325746 80429 504690 435025 -91935 -669382 -898165
38934h98165L33722P22679M86117k75577p60156m04462L24681N67904K09792j72507
$$ -898165 -564443 158236 644353 368776 -391380 -795842 -471161 96743 306535 134028
38924A34028k59252k61809l41698l55827k18516m3190J24826L30255M58167L26892
$$ 134028 -125224 -387033 -728731 -1084558 -1303074 -1346264 -1221438 -891183 -433016 -106124
38914a06124K0736j95506k34632j54603P0544L68878L79364o1644m61485l06951
$$ -106124 -85388 -280894 -515526 -670129 -599585 -230707 148657 87013 -374472 -681423
38904f81423M8638r8440n34354l51049M67213P76690L4499p03441l08898O97056
$$ -681423 -632785 -731225 -1265579 -1616628 -1149415 -372725 -338226 -1041667 -1350565 -653509
38894f53509R23948J22275o27838n60924p0577J83055J55453R2967l0529k97906
$$ -653509 270439 392714 -235124 -796048 -866625 -683570 -528117 -435150 -465679 -763585
38884g63585m53743k06388K23437K96280n8927k40316J83707P10126M89897l60258
$$ -763585 -1217328 -1423716 -1200279 -903999 -962926 -1203242 -1019535 -309409 180488 -179770
38874a79770p26411r1730N74794K35799n44856m60088L80411N80146k03924o48244
$$ -179770 -906181 -997911 -423117 -187318 -732174 -1192262 -811851 -231705 -435629 -1083873
38864a083873k6116N05777q8661q46918l97554O46085O48736l37887p40100j16366
$$ -1083873 -1109989 -604212 -692873 -1539791 -1937345 -1291260 -642524 -980411 -1720511 -1836877
38854a836877L01703o6469j67305O84189J445194R87420j32512o46842m17012
$$ -1836877 -1535174 -1601643 -1768948 -1084759 360435 1347855 1215343 568501 151489
38845A51489k00403k41057j89274k4315n8233k17726j41803J31427K50344J85437
$$ 151489 -48914 -289971 -479245 -503560 -561793 -779519 -921322 -789895 -539551 -354114
38835c54114J70687J57790o9186l46435k88689N3039K34686J16413K2960J65742
$$ -354114 -183427 -25637 -94823 -441258 -729947 -676908 -442222 -325809 -302849 -137107
38825a37107L36942K71660k357k48532k43363O4106M26227M32275j0384m63335
$$ -137107 199835 471495 469138 220606 -22757 41349 467576 899851 889467 426132
38815D26132m69709j31004R5764J4439k04271l83690m61354l47501j3998L10347
$$ 426132 -43577 -174581 -78817 -64378 -268649 -652339 -1113693 -1461194 -1475192 -1164845
38805a164845L30413O0031k08441k51614n8724K36773L81107J53051k73743l59670
$$ -1164845 -834432 -774401 -982842 -1234456 -1293180 -1056407 -675300 -522249 -795992 -1155662
38795a155662J07761N95271M73237j28458n31582m00789J5825L81607N29785L44202
$$ -1155662 -1047901 -452630 20607 -107851 -639433 -1040222 -1024397 -642790 -113005 231197
38785B31197j14079m23726k37038J59746K23055J1613P0030M64475O22539K76377
$$ 231197 117118 -306608 -543646 -383900 -160845 -149232 -79202 385273 1007812 1284189
38775A284189j15899j65208j33707l29974m79277k12143K21485K86740k1091k19703
$$ 1284189 1168290 1003082 869375 539401 60124 -152019 69466 356206 335115 115412
38765A15412r2330O5529l9246k92221l71689j63514R8698P3694k62075m61408
$$ 115412 23082 88611 49365 -242856 -614545 -778059 -679361 -605667 -867742 -1329150
38755a329150q3024O53708R87148N23315k56256n88975k74638K87420O37559N63859
$$ -1329150 -1412174 -758466 228682 751997 495741 -93234 -367872 -80452 557107 1120966
38745A120966J05676m34680o34634l79357k2005Q3974O526l0285m2583r1010Q037
$$ 1120966 1226642 791962 157328 -222029 -244034 -160060 -153534 -183819 -226402 -317412 -309375
38734c09375L28933M58840L8554m97929m01589K09618L99917j92931p78079o05076
$$ -309375 19558 478398 516952 19023 -382566 -172948 226969 34038 -744041 -1349117
38724a349117m3875J29559j3883J77993O91761P70486J57819m03583k77457J06128
$$ -1349117 -1392992 -1263433 -1277316 -1099323 -407562 362924 520743 117160 -160297 -54169
38714e4169l4929n61549n68868K39587J010653Q40773n6111p16707p08941m95532
$$ -54169 -89098 -650647 -1219515 -979928 30725 871498 815387 98680 -610261 -1105793
38704a105793n07544m45305J14825Q01821P80999N46n41700j15853O54484O15005
$$ -1105793 -1613337 -2058642 -1943817 -1141996 -360997 -360451 -902151 -1018004 -363520 251485
38694B51485k64069q07650k97057N32543N77850j16043n70641l01966J94130L39638
$$ 251485 -12584 -820234 -1117291 -584748 -6898 -122941 -693582 -995548 -801418 -461780
38684d61780J62379o5189k68273l73426j78877K32190L80442P2123k15473o7213
$$ -461780 -299401 -364590 -632863 -1006289 -1185166 -952976 -572534 -500411 -715884 -783097
38674g83097J69285k390k77868P828O62053P47545J5099o39931m88888K1056Q2293
$$ -783097 -613812 -616202 -894070 -886242 -224189 523356 538455 -101476 -590364 -569308 -487015
38663d87015k67244m10152j95361N443O2874K01276M06574L79493J37658P2256
$$ -487015 -754259 -1164411 -1359772 -1354329 -1291455 -1090179 -683605 -304112 -166454 -94198
38653i4198K68724L21361L6381k06730j15289k0131k84369n47554j89623N81083
$$ -94198 174526 495887 532268 325538 210249 190118 -94251 -641805 -831428 -250345
38643b50345P84710j2938r88387j041571j49129P17815Q60224N16366K23302N2034
$$ -250345 534365 521427 -466960 -1508531 -1657660 -939845 -79621 436745 660047 712081
38633G12081k02574m50193m21771k18940k22998m09239k70135L49116Q10926N11705
$$ 712081 509507 59314 -362457 -581397 -804395 -1213634 -1483769 -1134653 -323727 187978
38623A87978j72739l38468J58545M96638J10452m80004m69279L4807K24814j42167
$$ 187978 15239 -323229 -164684 331954 442406 -37598 -506877 -472070 -247256 -389423
38613c89423l84525J1702N41030M03941k72372n82328j47959L87285L76423Q2526
$$ -389423 -773948 -762246 -221216 182725 -89647 -671975 -819934 -432649 -56226 26300
38603B6300J22295M27596L93803j08871n28029m78318k16020r2804m8690P4466
$$ 26300 148595 576191 969994 861123 333094 -145224 -361244 -454048 -502738 -428272
38593d28272J38800j8926k23667k12855l5601Q7885J00366M0739j24721l25837
$$ -428272 -289472 -308398 -532065 -744920 -780521 -692636 -592270 -551531 -676252 -1002089
38583a002089k89998O4155L73594L09699O2445k6103l2135j85359k98449n1503
$$ -1002089 -1292087 -1227932 -854338 -544639 -482194 -508297 -540432 -725791 -1024240 -1075743
38573a075743L22375K97665n0881j08052K66327M79354J56451k96303l74563j58205
$$ -1075743 -753368 -455703 -506584 -614636 -348309 131045 287496 -8807 -383370 -541575
38563e41575K3042J08969J39882J8860j92282j56840J92009M01364J69400j59970
$$ -541575 -518533 -409564 -269682 -250822 -443104 -599944 -407935 -6571 162829 2859
38553B859j86200q6706j70458k45028k9533J95696M6438j76543P0552N68512O17294
$$ 2859 -183341 -270047 -440505 -685533 -715066 -519370 -472932 -649475 -578923 -10411 606883
38542F06883K13846L3036J91718O850p37985j209815p22403K12445O32711L79255
$$ 606883 820729 853765 1045483 1052333 314348 -895467 -1617870 -1405425 -772714 -393459
38532c93459k975j71703j64070K202K67634K86540j54660o17399m85931J20397
$$ -393459 -396434 -568137 -732207 -730005 -462371 -175831 -330491 -947890 -1433821 -1313424
38522a313424M74550K66827n2736l8777J51784J20353j84690m51474l63944J16354
$$ -1313424 -838874 -572047 -624783 -663560 -511776 -391423 -576113 -1027587 -1391531 -1275177
38512a275177O47070P12379J92766l41811k66993K17672L10647k42971p49839
$$ -1275177 -628107 84272 277038 -64773 -331766 -114094 196553 -46418 -796257
38503g96257n24385K15802P14972N84302L7161m76751n75117j60121L77593M40874
$$ -796257 -1320642 -1104840 -389868 194434 231595 -245156 -820273 -980394 -602801 -161927
38493a61927k3016l76907j90712J32994O5193j53937L1656M57902M49060m3595
$$ -161927 -184943 -561850 -752562 -619568 -554375 -708312 -676656 -218754 230306 186711
38483A86711l36662j33370N1807j59962l78428j71763J85387K11223N149k2505
$$ 186711 -149951 -283321 -231514 -391476 -769904 -941667 -756280 -545057 -539908 -562413
38473e62413J11116O2242j75390k33211M9462M15180N59405M11189P2007k67672
$$ -562413 -451297 -389055 -564445 -797656 -748194 -333014 226391 637580 709587 441915
38463D41915l88842k41224m1443k2442j78364l70229n00144m46982r1936L91224
$$ 441915 53073 -188151 -229594 -252036 -430400 -800629 -1300773 -1747755 -1839691 -1448467
38453a448467N64336L00317J9239M8310J10636j35890m26910l22426r955j433
$$ -1448467 -884131 -583814 -564575 -516265 -405629 -541519 -968429 -1290855 -1300810 -1302243
38443a302243k08662p1560M24431O39119L23087L7109K35727N59591M39894o4020
$$ -1302243 -1510905 -1582465 -1158034 -518915 -195828 -158719 77008 636599 1076493 1012473
38433A012473m49520m63104k38567J7006J69089J63122R9357J36719K12740R9563
$$ 1012473 562953 99849 -138718 -121712 47377 210499 309856 446575 659315 758878
38423G58878j72229k61866k8252K30156K11321k0612k61212m41464n05949l45707
$$ 758878 586649 324783 296531 526687 738008 717396 456184 14720 -491229 -836936
38413h36936n0640Q1852k1092q2663M7229J56704J17669J63173M35221O33203
$$ -836936 -887576 -805724 -826816 -909479 -862250 -705546 -587877 -424704 10517 643720
38403F43720M53577O1616k15712l68595n21466n54316l09143K1302R0817j28609
$$ 643720 1097297 1158913 943201 574606 53140 -501176 -810319 -789017 -698200 -826809
38393h26809l51460l31203j3428M63185P35019M52427k21666o31958l99450J04573
$$ -826809 -1178269 -1509472 -1522900 -1059715 -324696 127731 -93935 -725893 -1125343 -1020770
38383a020770K91580O0895k72085m19773k32742K75895P36505O37599L1483l92435
$$ -1020770 -729190 -668295 -940380 -1360153 -1592895 -1317000 -580495 57104 88587 -303848
38373c03848k46609L6481r352j62480q7795l5949k94644m63193o5590N16143N52979
$$ -303848 -550457 -513976 -523328 -685808 -773603 -809552 -1104196 -1567389 -1632979 -1116836 -563857
38362e63857J01377k09148k42022l21558l59762K1956N92160O84706K75016k6216
$$ -563857 -462480 -671628 -913650 -1235208 -1594970 -1573014 -980854 -296148 -21132 -47348
38352d7348o1854k52784n62509l72230L57320P80641M10807j95316m12068l85992
$$ -47348 -109202 -361986 -924495 -1296725 -939405 -158764 252043 56727 -355341 -741333
38342g41333m23010l11725J42290N26292L87683n3585k84498k10395m9909J05362
$$ -741333 -1164343 -1476068 -1333778 -807486 -419803 -473388 -757886 -968281 -1018190 -912828
38332i12828K22176J62517n7465j59878j2374J97856L42084M43469L06009k95595
$$ -912828 -690652 -528135 -585600 -745478 -757852 -559996 -217912 225557 531566 235971
38322B35971q93772o23649M02758R03363J74892q19508q58373j62947K47489K21652
$$ 235971 -657801 -1281450 -878692 24671 199563 -619945 -1478318 -1641265 -1393776 -1172124
38312a172124L49082N97905L44392l28463n56155q8076K74417k7077m40887k11063
$$ -1172124 -823042 -225137 119255 -209208 -765363 -853439 -579022 -606099 -1046986 -1258049
38302a258049M87918Q56451N29870j25213n71788o09717l91308j46567N3553K40969
$$ -1258049 -770131 86320 616190 490977 -80811 -690528 -1081836 -1228403 -1174850 -933881
38292i33881K99286L0528l89414l88402K19669P75923O07346K8289j35518J75086
$$ -933881 -634595 -604067 -993481 -1381883 -1162214 -386291 221055 249344 113826 288912
38282B88912K46667j52275l89894p5583K85326J81863o7605M0890K82098J32448
$$ 288912 535579 383304 -6590 -82173 203153 385016 317411 358301 640399 772847
38272G72847k63934l13910K6787K12773L7137j03860P422J4199l50093p21560
$$ 772847 508913 195003 221790 434563 471700 367840 375262 389461 39368 -682192
38262f82192o03618n2819M77260O92624N45606P5667m45912m97238P2327N98596
$$ -682192 -1285810 -1338629 -861369 -168745 376861 452528 6616 -490622 -418295 180301
38252A80301L50619l77997n75577M9110O43224M61963j46307m44168l89411l88844
$$ 180301 530920 152923 -422654 -373544 269680 731643 585336 141168 -248243 -637087
38242f37087l99428l0471O22669R54070O78863J33218k99811n65748o82189n89361
$$ -637087 -1036515 -1066986 -444317 509753 1188616 1321834 1022023 456275 -225914 -815275
38232h15275l74432k39915j46187J36272N37524O54600L35035p4800k10863r7830
$$ -815275 -1189707 -1429622 -1575809 -1439537 -902013 -247413 87622 12822 -198041 -295871
38222b95871N2495J36830J24551M994j20099j31430j13367k12888l06469j57576
$$ -295871 -243376 -106546 18005 22999 -97100 -228530 -341897 -554785 -861254 -1018830
38212a018830J25432K15987J49242K70951N38086M29914k35425q93581r25838
$$ -1018830 -893398 -677411 -528169 -257218 280868 710782 475357 -418224 -1344062
38203a344062l75582K65720O30749O18155L13238j2663j15551j21513l28698o12781
$$ -1344062 -1719644 -1453924 -823175 -205020 108218 95555 -19996 -141509 -470207 -1082988
38193a082988m87083J27685O88267P50609M25007k6298m82137o80934l03416L69641
$$ -1082988 -1570071 -1442386 -754119 -3510 421497 395199 -86938 -767872 -1071288 -701647
38183g01647N39514N166m50995k29357K06347J69523j71846k44189n0995N5167
$$ -701647 -162133 -156967 -607962 -837319 -630972 -461449 -633295 -877484 -928479 -873312
38173h73312J47048M60309O79503L22808l46882n99749l35924j36956k43283k52807
$$ -873312 -726264 -265955 413548 736356 389474 -210275 -546199 -683155 -926438 -1179245
38163a179245M1052K25908k8309l82561l11651J40059M29411K30598j61383j98191
$$ -1179245 -1138193 -912285 -940594 -1323155 -1634806 -1494747 -1065336 -834738 -996121 -1194312
38153a194312K24689N90804M17370p3067k70257p1177M3943j43272k88977k13993
$$ -1194312 -969623 -378819 38551 -34516 -304773 -375950 -332007 -475279 -764256 -978249
38143i78249k46506m87017m30218J49492N90192L13494j54898L4146O67469P97956
$$ -978249 -1224755 -1711772 -2141990 -1992498 -1402306 -1088812 -1243710 -1209564 -542095 255861
38133B55861K42014k14482j18622L6691k67011p44936p56977j58570N85743Q97903
$$ 255861 497875 283393 164771 201462 -65549 -810485 -1567462 -1726032 -1140289 -242386
38123b42386N54634j43451o08942n21203j25924J16171M3170j64715k47289k9764
$$ -242386 312248 168797 -440145 -961348 -1087272 -971101 -927931 -1092646 -1339935 -1369699
38113a369699M22648O94409M01521j96031m15674j39624J1938k47409l51344J00442
$$ -1369699 -947051 -252642 148879 -47152 -462826 -602450 -590512 -837921 -1189265 -1088823
38103a088823N45527L57265j02931j26507J84684K56424Q5075M3013K7496k43496
$$ -1088823 -543296 -186031 -288962 -415469 -230785 25639 110714 153727 181223 -62273
38093f2273l98150J03160Q32579P90743q8248q01633p10498k15750R8042J50248
$$ -62273 -460423 -357263 475316 1266059 1177811 376178 -334320 -550070 -452028 -301780
38083c01780L9947j97997l21427k6820M71602N94998K28950j66412l15502m01640
$$ -301780 -261833 -459830 -781257 -808077 -336475 258523 487473 321061 5559 -396081
38073c96081n29508m96026j88126K57968O85810Q92180N60455k48175p84306m42468
$$ -396081 -925589 -1421615 -1609741 -1351773 -665963 226217 786672 538497 -245809 -688277
38063f88277L20489N91958K75339k0277r1684k32144m01219k83444p4673k18711
$$ -688277 -367788 224170 499509 479232 387548 155404 -245815 -529259 -603932 -822643
38053h22643m31409l9582P16649Q41163J50904m34191l78807j99374l30112l94581
$$ -822643 -1254052 -1293634 -576985 264178 415082 -19109 -397916 -597290 -927402 -1321983
38043a321983m9063L76518N24847M88641K98392k32776q29783p97352j09542L93084
$$ -1321983 -1371046 -994528 -469681 18960 317352 84576 -745207 -1542559 -1652101 -1259017
38033a259017K60120K1851J45429L00439J32944p1517n086J30244J51091K26975
$$ -1259017 -998897 -977046 -831617 -531178 -398234 -469751 -474837 -344593 -193502 33473
38023C3473L24627J07281k78943k02531L08546L97735j98352o02041k38828K28364
$$ 33473 358100 465381 186438 -16093 292453 690188 491836 -110205 -349033 -120669
38013a20669J12995j73736m5070J70109j6630k57354r7832O9683k14886m72078
$$ -120669 -7674 -181410 -226480 -56371 -73001 -330355 -428187 -358504 -573390 -1045468
38003a045468j16122L66825K17356j89188K7882O32865N95260j51909n69330j81885
$$ -1045468 -1161590 -794765 -577409 -766597 -738715 -105850 489410 337501 -231829 -413714
37993d13714K83992J76696j79370k51379j59942k70121m53074k70293L33228Q83358
$$ -413714 -129722 46974 -132396 -383775 -543717 -813838 -1266912 -1537205 -1203977 -320619
37983c20619Q86645L29741l41203o97188p00178n31059k35569J69550M17926K98021
$$ -320619 566026 895767 554564 -142624 -842802 -1373861 -1609430 -1439880 -1021954 -723933
37973g23933J28401L31223N99257K55673n11741p02353l7238N34546L04940j92806
$$ -723933 -595532 -264309 334948 590621 78880 -623473 -660711 -126165 178775 -14031
37963a4031k67726j96944m41261n86826r1375N47292M63365j46235l24312J53565
$$ -14031 -281757 -478701 -919962 -1506788 -1598163 -1050871 -587506 -733741 -1058053 -904488
37953i04488N73238M53520N0060k58619l34197r9089L11585L37912l42936j057178
$$ -904488 -331250 122270 172330 -86289 -420486 -519575 -207990 129922 -213014 -1270192
37943a270192q23700K16262Q63667M72411k64908m03413L5218L36127J39057k51115
$$ -1270192 -2093892 -1877630 -1013963 -541552 -806460 -1209873 -1174655 -838528 -699471 -950586
37933i50586m17297l03452j06984O4858K63646M65770M78361K17060q4094j57531
$$ -950586 -1367883 -1671335 -1778319 -1713461 -1449815 -984045 -505684 -288624 -372718 -530249
37923e30249n5783K3882O7322P5288j46645n55501n57341J96270R89755Q85594
$$ -530249 -586032 -562150 -494828 -419540 -566185 -1121686 -1679027 -1482757 -493002 392592
37913C92592J72162o8591K69799K28304m31585p37704k14107K86809J06713j54658
$$ 392592 564754 496163 765962 994266 562681 -175023 -389130 -102321 4392 -150266
37903a50266P5340K12472l06694p90565l99935L87753O17442M09760M44927N40640
$$ -150266 -74926 137546 -169148 -959713 -1359648 -971895 -354453 55307 500234 1040874
37893A040874O4838o72531p58865j96921J08779j87599m66299k19147L18671O67419
$$ 1040874 1105712 433181 -325684 -522605 -413826 -601425 -1067724 -1286871 -968200 -300781
37883c00781O00282J71179k89094l69648j06399N0978M3742L02052P07872M38911
$$ -300781 299501 470680 181586 -188062 -294461 -243483 -199741 102311 810183 1249094
37873A249094n34235r11515J4826R80158N46012o51654r30714j29832M53035K28497
$$ 1249094 714859 -196656 -181830 798328 1344340 692686 -238028 -367860 85175 313672
37863C13672j88312l98915n89301n85071q848O37581M40294l59092o07742p9687
$$ 313672 125360 -273555 -862856 -1447927 -1456775 -819194 -378900 -737992 -1345734 -1425421
37853a425421K94038J05692k9581J53059J05504k82423l09135K08294M74236J10887
$$ -1425421 -1131383 -1025691 -1055272 -902213 -796709 -1079132 -1388267 -1179973 -705737 -594850
37843e94850j59119J57311M11872n018n10392k52435M68291O17739n8693p20393
$$ -594850 -753969 -596658 -184786 -189804 -700196 -952631 -484340 133399 74706 -645687
37833f45687n77799J66220O38874L57135k05723k54447K07718L47441k41256q59056
$$ -645687 -1223486 -1057266 -418392 -61257 -266980 -521427 -313709 33732 -207524 -1066580
37823a066580p33651j25037K46898L12492L94492L56200m9165l74326l9120N75118
$$ -1066580 -1800231 -1925268 -1678370 -1365878 -971386 -615186 -664351 -1038677 -1077797 -502679
37813e02679O09040J09329q8215K55076N07668K61561j91580m78634m86590j78228
$$ -502679 106361 215690 127475 382551 890219 1151780 960200 481566 -5024 -183252
37803a83252K56489K97763j86500n07317j50425L52794L74470K78413N21066N11453
$$ -183252 73237 371000 184500 -322817 -473242 -120448 254022 532435 1053501 1564954
37793A564954k94468r96962n67771J98355p1341p90449l31063R31841R98520l26392
$$ 1564954 1270486 273524 -294247 -95892 -167233 -957682 -1288745 -356904 641616 315224
37783C15224j004515k04633M38139j35624o21153R6961Q50820L12311o20979m06906
$$ 315224 -689291 -893924 -455785 -591409 -1212562 -1115601 -264781 47530 -573449 -980355
37773i80355N57852P90954J80201j66011J10357L39502J46264j82848l84739l62800
$$ -980355 -422503 368451 548652 382641 492998 832500 978764 795916 411177 48377
37763D8377J722M73656M05241l00908p90513m60557J37619K64957R7763J17383
$$ 48377 50099 523755 928996 628088 -162425 -622982 -485363 -220406 -122643 -5260
37753e260J62423p3842k78116r5879J20593n4454l03389j55479J48969J44909
$$ -5260 157163 83321 -194795 -290674 -170081 -224535 -527924 -683403 -534434 -389525
37743c89525j6166M5042J70676J2441k49815j96460J40879M01723M05465J70339
$$ -389525 -405691 -360649 -189973 -177532 -427347 -623807 -482928 -81205 324260 494599
37733D94599j96528l72011o7356M06401M21373J2014j69922J1085M814k92604
$$ 494599 298071 -73940 -141296 265105 686478 698492 528570 539655 544469 251865
37723B51865l07857K3815P870m63621n42218N2528L94157o7546n14011j77151
$$ 251865 -55992 -32177 -24307 -487928 -1030146 -977618 -583461 -651007 -1165018 -1342169
37713a342169M04788M55995K09937J54398O2059k70664l19653J61730M22323k6354
$$ -1342169 -937381 -481386 -271449 -117051 -54992 -325656 -645309 -483579 -61256 -87610
37703h7610m47365j91295J03075k41443n66254n3618O94008O49257R7008m1260
$$ -87610 -534975 -726270 -623195 -864638 -1430892 -1484510 -790502 -141245 -44237 -85497
37693h5497J34250l4663l17496r4525K67690K1495m71452l33325J77170J16192
$$ -85497 48753 14090 -303406 -397931 -130241 -108746 -580198 -913523 -736353 -620161
37683f20161l74479k90838M14190P35120L16938j27702j69710j72022l28377l24619
$$ -620161 -994640 -1285478 -871288 -136168 180770 53068 -116642 -288664 -617041 -941660
37673i41660j04064N952J8771K59019N98331N55094J24082k55408m28174m88085
$$ -941660 -1045724 -1039772 -1021001 -761982 -163651 391443 515525 260117 -168057 -656142
37663f56142k79651K63782O04801K95726j54717l4366L27696J09250n29835o48470
$$ -656142 -935793 -672011 -67210 228516 73799 39433 367129 476379 -53456 -701926
37653g01926l6044N43324N42092J37959l26389n70020k64865M69185P81436J57538
$$ -701926 -737970 -194646 347446 485405 159016 -411004 -675869 -206684 574752 732290
37643G32290o49081o62665j30195J17087J29068M05065N74435k1637q36509p51601
$$ 732290 83209 -579456 -709651 -592564 -463496 -58431 516004 494367 -342142 -1093743
37633a093743N0746L81177J2145k10506o7758j37987l37643N288N94507M41701
$$ -1093743 -1042997 -661820 -649675 -860181 -927939 -1065926 -1403569 -1398281 -803774 -362073
37623c62073j97365l9747Q18452P36686o64886j567144p43720N66303P56137J86096
$$ -362073 -559438 -599185 219267 955953 291067 -1276077 -2019797 -1453494 -697357 -511261
37613e11261M4314K45582J4468m24135k86508K49577L39760p2058k41791J38590
$$ -511261 -466947 -221365 -206897 -631032 -917540 -667963 -328203 -400261 -642052 -503462
37603e03462N91123O02438J13145n28997p20024j17806O87673O49927k47899p92744
$$ -503462 87661 690099 803244 274247 -445777 -563583 124090 774017 526118 -266626
37593b66626k98619L74847K54909k47412k32839J06935k2485m88895m30291K44846
$$ -266626 -565245 -190398 64511 -182901 -415740 -308805 -331290 -820185 -1250476 -1005630
37583a005630O84219M12695j15884l75667l90153l53627k73389j64660j23404
$$ -1005630 -321411 91284 -24600 -400267 -790420 -1144047 -1417436 -1582096 -1705500
37574a705500p4063J77233N55460P02424M25105n9598l55133k38095J49953L84327
$$ -1705500 -1779563 -1602330 -1046870 -344446 80659 21061 -334072 -572167 -422214 -37887
37564c7887J84197j99217k76441k7927P7155j39918k77536o3666J77829J08698
$$ -37887 146310 -52907 -329348 -357275 -280120 -420038 -697574 -761240 -583411 -474713
37554d74713q0323j14361j37632l01216l16695K8370L38034K10799j2305J94081
$$ -474713 -555036 -669397 -807029 -1108245 -1424940 -1396570 -1058536 -847737 -860042 -665961
37544f65961N60066M12613j49576l63035o1134Q0031k67331n13004j50190M05811
$$ -665961 -105895 306718 157142 -205893 -267027 -186996 -454327 -967331 -1117521 -711710
37534g11710M99898K01743J4451K8981k4030j41762p3205J48790K44742K00730
$$ -711710 -211812 -10069 4382 33363 9333 -132429 -205634 -56844 187898 388628
37524C88628K32727K64268j8938n25296p12115l65103O3598J34201j8957q9976
$$ 388628 621355 885623 866685 341389 -370726 -735829 -672231 -538030 -556987 -646963
37514f46963j12012j88461j29720J75634L71770J37582k03934j41637J83246K08526
$$ -646963 -758975 -947436 -1077156 -901522 -529752 -392170 -596104 -737741 -554495 -345969
37504c45969j17626k79939l6515K82984L39456J25658k25447m69613k15349N35896
$$ -345969 -463595 -743534 -780049 -497065 -157609 -31951 -257398 -727011 -942360 -406464
37494d06464R80042M02978o29808q72302j70321L80679J69644j69042p7411m753
$$ -406464 573578 976556 346748 -525554 -695875 -315196 -145552 -314594 -392005 -396758
37484c96758l89759p12815l63734L07684N92629M51779K33260m1731m09770n35350
$$ -396758 -786517 -1499332 -1863066 -1555382 -962753 -510974 -277714 -319445 -729215 -1264565
37474a264565k33732Q1220P4019N3603K88435M17476J89775P4296L88912N63833
$$ -1264565 -1498297 -1417077 -1343058 -1289455 -1001020 -583544 -393769 -319473 69439 633272
37464F33272J32951k80245L2202N49050L36634l82343o75713m70256m18166n19925
$$ 633272 766223 485978 518180 1067230 1403864 1021521 345808 -124448 -542614 -1062539
37454a062539j88915M54734O31380K45964K963J17043N7548k81325k93168J73214
$$ -1062539 -1251454 -796720 -165340 80624 83587 200630 258178 -23147 -316315 -143101
37444a43101L99683l6260n54234m88282j1234L07369L17223K49216K65572L74937
$$ -143101 256582 220322 -333912 -822194 -833428 -526059 -208836 40380 305952 680889
37434F80889N09395M89876J69515k78044m56645k19181J25864J17123l93442r90049
$$ 680889 1190284 1680160 1849675 1571631 1114986 895805 1021669 1138792 745350 -244699
37424b44699r77235j98256N54198M61084j18838j58876L76681M89261o5146k89559
$$ -244699 -1221934 -1420190 -865992 -404908 -523746 -682622 -305941 183320 118174 -171385
37414a71385K40140N13069j16390o90287l47965J00493k91692p70445k50170N80298
$$ -171385 68755 581824 465434 -224853 -572818 -472325 -764017 -1534462 -1784632 -1204334
37404a204334M09249l28469k69279L75022L00271l51679k15148O92137Q70790
$$ -1204334 -795085 -1123554 -1392833 -1017811 -717540 -1069219 -1284367 -592230 278560
37395B78560j7422o06020k59006N3126j94861j89182L88563N51046j25093n60145
$$ 278560 261138 -344882 -603888 -550762 -745623 -934805 -546242 4804 -120289 -680434
37385f80434m1185N38686K91647k44765l05941k04490l91995m01724J88572P44843
$$ -680434 -721619 -182933 108714 -136051 -441992 -646482 -1038477 -1440201 -1251629 -506786
37375e06786N73111P6503k7154J36634J01261o289J21448K47394L6493l05370
$$ -506786 66325 142828 115674 252308 353569 347280 468728 716122 752615 447245
37365D47245m45256m42926l83328r2510L54985M88785J93317n1772k382J778j91389
$$ 447245 1989 -440937 -824265 -916775 -561790 -73005 120312 68540 66158 67936 -123453
37354a23453k25855J441Q2159r2516j04580J27050J49794q8417p3775K23945J81351
$$ -123453 -349308 -347867 -265708 -358224 -462804 -335754 -185960 -274377 -348152 -124207 57144
37343E7144k68170l65929J12326L70152j4354l33079j2563M16246L01389j00765
$$ 57144 -211026 -576955 -464629 -94477 -108831 -441910 -454473 -38227 263162 162397
37333A62397k38872r6237J26901L62957L27945k73369r02484o23773L21890O41656
$$ 162397 -76475 -172712 -45811 317146 645091 371722 -530762 -1154535 -832645 -190989
37323a90989N7665k10339M01110P57002L3142p61890m63673L45525M26137j72414
$$ -190989 -133324 -343663 57447 814449 847591 85701 -377972 -32447 393690 221276
37313B21276n55616n08048l45168o255N45873P17069J51980m66682m76045l25736
$$ 221276 -334340 -842388 -1187556 -1193811 -647938 69131 221111 -245571 -721616 -1047352
37303a047352n97273p75932j87321N91265N54543o1312k18838K23989M85601K50404
$$ -1047352 -1644625 -2420557 -2607878 -2016613 -1462070 -1523382 -1742220 -1518231 -1032630 -782226
37293g82226m1355j20679j27149n1724K25360M75763L88502J02098q5606k22123
$$ -782226 -823581 -944260 -1071409 -1123133 -897773 -422010 -33508 68590 -17016 -239139
37283b39139l97954l66728o046L03371K71747J61402J92680J23599r3856P645
$$ -239139 -637093 -1003821 -1009867 -706496 -434749 -273347 -80667 42932 -50924 -43279
37273d3279N00940O45032M9320n59712m74200q4719l4400j42410n0109q9799n17312
$$ -43279 457661 1102693 1152013 592301 118101 33382 -1018 -143428 -193537 -283336 -800648
37262h00648o82558n8456O18643L98968k95970l42965K92321O33258K66364k58136
$$ -800648 -1483206 -1541662 -923019 -524051 -820021 -1162986 -870665 -237407 28957 -229179
37252b29179m29982k70826K4382K18512N2494k86230j50840N46170R27867M33124
$$ -229179 -659161 -929987 -905605 -687093 -634599 -920829 -1071669 -525499 402368 835492
37242H35492k37694k68478k4907k11478m95529j71044L99326L05906l16438m89132
$$ 835492 597798 329320 304413 92935 -402594 -573638 -174312 131594 -184844 -673976
37232f73976M838L88178K14989r4022q9252J49014L33281K60616j27920n32583
$$ -673976 -669138 -280960 -65971 -159993 -249245 -100231 233050 493666 365746 -166837
37222a66837m32147J41678M44520J05094k62821j13157J15195j18412m24326k45796
$$ -166837 -598984 -457306 -12786 92308 -170513 -283670 -168475 -286887 -711213 -957009
37212i57009N1294j29754m50577k36880K78942L95899J69730J28446J86615o4635
$$ -957009 -905715 -1035469 -1486046 -1722926 -1443984 -1048085 -878355 -749909 -563294 -627929
37202f27929l54341j26320L55946L77262q76j27370M2316o960k52756j27743M08052
$$ -627929 -982270 -1108590 -752644 -375382 -376258 -503628 -461312 -468272 -721028 -848771 -440719
37191d40719P10543M25292j08838m31265l58531N7155M54634L16277l00848n87014
$$ -440719 269824 695116 586278 155013 -203518 -146363 308271 624548 323700 -263314
37181b63314q8687N13414L99698j62251l76361j98124j74468l94036m76741l41476
$$ -263314 -352001 161413 561111 398860 22499 -175625 -350093 -744129 -1220870 -1562346
37171a562346k17039j31207j5177J2065K922L35319R39428R97094J15531q40905
$$ -1562346 -1779385 -1910592 -1925769 -1913704 -1910782 -1575463 -636035 361059 476590 -364315
37161c64315q94846l21670p031k0621K02290O87766Q92716O11061J56508j56163
$$ -364315 -1259161 -1580831 -1587862 -1608483 -1406193 -718427 174289 785350 941858 785695
37151G85695j93274J0980R1682l14519q11839n71727L08802P54393L77120K7803
$$ 785695 592421 603401 695083 380564 -431275 -1003002 -694200 60193 437313 465116
37141D65116K05098K60453j47219k70304J88493K83313l81268o55966R3907N81319
$$ 465116 670214 930667 783448 513144 701637 984950 603682 -52284 41623 622942
37131F22942k05702j015208l97648P03010N58621l53144k97247O57321R18187
$$ 622942 417240 -597968 -995616 -292606 266015 -87129 -384376 272945 1191132
37122A191132J87552l05369j42516j53796n67791o29166j19810L40029M78309
$$ 1191132 1378684 1073315 930799 777003 209212 -419954 -539764 -199735 278574
37113B78574M77357J61738n51773q46145j06807P21852M53608k98835j50070O15457
$$ 278574 755931 917669 365896 -480249 -587056 134796 588404 289569 139499 754956
37103G54956N87547k52038o15266k26996j0704j25663J43196O00233K69071o38731
$$ 754956 1342503 1090465 475199 248203 237499 111836 255032 855265 1124336 485605
37093D85605q35205j49497K67761M1889j4616K61230O7117n61794n30354L18248
$$ 485605 -349600 -499097 -231336 -189447 -204063 57167 124284 -437510 -967864 -649616
37083f49616P64008K58821k53675q8063J88775P8130l60K18717K35957j63535
$$ -649616 114392 373213 119538 31475 220250 298380 298020 516737 752694 589159
37073E89159m05061j79758L2786q6702j80842K0382K73402L61776L00520P347
$$ 589159 184098 4340 37126 -49576 -230418 -210036 63366 425142 725662 733009
37063G33009m53014n09435J32585O83871K97514m78687m77252K19503N21605J84681
$$ 733009 279995 -229440 -96855 587016 884530 405843 -71409 148094 669699 854380
37053H54380O967K62791L11543j39608n47894m47053K9541N22812O76469K68482
$$ 854380 861347 1124138 1435681 1296073 748179 301126 330667 853479 1529948 1798430
37043A798430l06239k45724L99473N52526j49206o32602k70237l2043n85348q46496
$$ 1798430 1492191 1246467 1645940 2198466 2049260 1416658 1146421 1114378 529030 -317466
37033c17466L2887Q32257K66281o70075m23211M25564L97141k13206k07524J26338
$$ -317466 -284579 547678 813959 143884 -279327 146237 543378 330172 122648 248986
37023B48986j51815n14531m9794M62033j8112m91516L35109J264007M47472j118440
$$ 248986 97171 -417360 -467154 -5121 -23233 -514749 -179640 1084367 1531839 413399
37013D13399j047515L96265R05847Q1382m21680j58023j56539l48355J98324Q65359
$$ 413399 -634116 -237851 667996 749378 327698 169675 13136 -335219 -136895 728464
37003G28464K99886p91035o17579M48894O04073m9167m634M86659K7209q24963
$$ 728464 1028350 237315 -380264 68630 672703 623536 618902 1105561 1132770 307807
36993C07807m47745N05022J36689r81071p41579N04485O36125j89181n4941P53313
$$ 307807 -139938 365084 501773 -479298 -1220877 -716392 -80267 -269448 -324389 428924
36983D28924L39433q03986n47369O31674M28805p59369n15211Q64053R04367k10290
$$ 428924 768357 -35629 -582998 48676 477481 -281888 -797099 66954 971321 761031
36973G61031j10377Q71827K90634j282104r57601Q50876R42525o41704p45495
$$ 761031 650654 1522481 1813115 531011 -426590 424286 1366811 725107 -20388
36964b0388P35173P01567r17024q66047J048529J448515j31641m91211Q23158
$$ -20388 714785 1416352 499328 -366719 681810 2130325 1998684 1507473 2330631
36955B330631P35195r68647j010498P73826Q90176q99237j000050Q54778J027161
$$ 2330631 3065826 2097179 1086681 1860507 2750683 1851446 851396 1706174 2733335
36946B733335o73724n63684J305203J064513q61280j48636K418392J730950j328271
$$ 2733335 2059611 1495927 2801130 3865643 3004363 2855727 5274119 7005069 5676798
36937E676798p38374K799416K418377j426979r21326L930897M354760l15497m61710
$$ 5676798 4938424 7737840 10156217 8729238 7807912 11738809 16093569 15778072 15316362
36928A5316362N392252P128095K912976L544583J0568241J1533483N651644R429266
$$ 15316362 20708614 27836709 30749685 34294268 44862509 56395992 62047636 71476902
36920G1476902K4695427L0421540K5341876M4118795R7109762J25167990O5493306
$$ 71476902 96172329 126593869 151935745 196054540 293164302 418332292 483825598
36913D83825598n1310092j24777577j07008076n0545878k3274139k6717416k4764566
$$ 483825598 432515506 307737929 200729853 150183975 126909836 100192420 75427854
36906G5427854j0244523l251913p782750r126854m237400l619860p821233p023141
$$ 75427854 65183331 61931418 54148668 45021814 40784414 37164554 29343321 22320180
36898B2320180j239880R58l803277m043252R4272R53516k363030k942559K40061
$$ 22320180 21080300 21081258 17277981 13234729 13329001 14282517 11919487 8976928 9216989
36889I216989J056005j476092j926962M39939O44900j731278j806785P50993J044643
$$ 9216989 10272994 8796902 6869940 7309879 7954779 6223501 4416716 5167709 6212352
36880F212352j441108j896605N39663J386477n27765j304482K30207P35342o62189
$$ 6212352 4771244 2874639 3414302 4800779 4273014 2968532 3198739 3934081 3271892
36871C271892q73211O65034Q48935p61727r56234Q22137J357804j82935q58102
$$ 3271892 2398681 3063715 3912650 3150923 2194689 3016826 4374630 4191695 3333593
36862C333593L12039P97374k72110o63829K90779N49681l09008l31533O10466
$$ 3333593 3645632 4443006 4170896 3507067 3797846 4347527 4038519 3706986 4317452
36853D317452M67824o68385m78018R70977J109275k52056n34479O90354J010206
$$ 4317452 4785276 4116891 3638873 4609850 5719125 5467069 4932590 5622944 6633150
36844F633150p6702l03086Q19236J094230P5606K5314J514083K270388J453390
$$ 6633150 6556448 6253362 7072598 8166828 8242434 8267748 9781831 12052219 13505609
36835A3505609J089637K186349L177999L244075L518735M015995K931699Q3733
$$ 13505609 14595246 16781595 19959594 23203669 26722404 30738399 33670098 33753831
36827C3753831k269229l004768l396250m067552l900317k736826k039420k115136
$$ 33753831 31484602 28479834 25083584 21016032 17115715 14378889 12339469 10224333
36819A0224333j667593o52661n29990j225397j006088J64824L83124o21138r69828
$$ 10224333 8556740 7904079 7374089 6148692 5142604 5307428 5690552 5069414 4099586
36810D099586k21612q7359r20417r20821L22390Q52381j05971q13277k61969K91527
$$ 4099586 3877974 3790615 2870198 1949377 2271767 3124148 3018177 2204900 1942931 2234458
36800B234458L9568q3049K46207k558p44814n13182N62054N66170o06727p08901
$$ 2234458 2274026 2190977 2437184 2434626 1689812 1176630 1738684 2304854 1698127 989226
36790I89226Q39372J702578O27312n69978m22393o2783m92035o33051J75637N81016
$$ 989226 1828598 3531176 4158488 3588510 3166117 3103334 2611299 1978248 2153885 2734901
36780B734901j43632n39237K46908P42035l3501o14352K19965J292780J418430
$$ 2734901 2591269 2052032 2298940 3040975 3007474 2393122 2613087 3905867 5324297
36771E324297J481340K172423K068034J56801j871412k114114j350038j270517
$$ 5324297 6805637 8978060 11046094 11202895 9331483 7217369 5867331 4596814
36763D596814j574776j042770Q362M93979N29865P02394N59650l75154j205165
$$ 4596814 3022038 1979268 1987630 2481609 3011474 3713868 4273518 3898364 2693199
36754B693199r42742j45801J83087K03423L81578K72996m22377p79021k514J241165
$$ 2693199 1750457 1604656 1787743 1991166 2372744 2645740 2223363 1444342 1441828 2682993
36744B682993K021753K391203K337387J076681j228976k636508j924349n27534
$$ 2682993 4704746 7095949 9433336 10510017 9281041 6644533 4720184 4192650
36736D192650l34234r25200p82086K4742L08352l9902k21787j77820l55056m67832
$$ 4192650 3858416 2933216 2151130 2175872 2484224 2444322 2222535 2044715 1689659 1221827
36726A221827m3398M18823K54585r8953k1741n9105q18415j349814m12993J203685
$$ 1221827 1178429 1597252 1851837 1752884 1731143 1672038 853623 -496191 -909184 294501
36716B94501J497940J76095r79985p27029K00090N47622J82259j86137p6670L95941
$$ 294501 1792441 1968536 988551 261522 461612 1009234 1191493 1005356 928686 1324627
36706A324627P78810O93465J93517l36973o99175r53331r46321l98932L60970
$$ 1324627 2103437 2796902 2990419 2653446 1954271 1000940 54619 -344313 16657
36697A6657N19059m9847n00620k79173J42095J98087O1198P1887J50637K27940
$$ 16657 535716 485869 -14751 -293924 -151829 46258 107456 179343 329980 557920
36687E57920M49310N73208Q4605p12452p70027P0166O49745K70288k83803j92909
$$ 557920 1007230 1580438 1665043 952591 182564 252730 902475 1172763 888960 696051
36677F96051J29893P4790j94L60565O58878K97769l26087n29472l89226k49807
$$ 696051 825944 900734 900540 1261105 1919983 2217752 1891665 1362193 972967 723160
36667G23160P154L88063L44502k48478n50282o4334M23106J55156k78657j4783
$$ 723160 730314 1118377 1462879 1214401 664119 599785 1022891 1178047 899390 884607
36657H84607N48736M81134q8907l00606Q298K77520K49982R6094j37332m34835
$$ 884607 1433343 1914477 1825570 1524964 1533262 1810782 2060764 2156858 2019526 1584691
36647A584691n49574m35276m33387n41144k25455N06278P72671K20527k60987
$$ 1584691 1035117 599841 166454 -374690 -600145 -93867 678804 899331 638344
36638F38344l8171J56433l66321q31611k77877O65389P13989l2349m26865j62840
$$ 638344 600173 756606 390285 -441326 -719203 -53814 660175 627826 200961 38121
36628C8121O9260k3350r4885j03093l04953m59515r9667N22899P05107L61924
$$ 38121 107381 84031 -10854 -113947 -418900 -878415 -978082 -455183 249924 611848
36618F11848p33j69068k96693l53909k29988r3254l0868K29212O56744O34891
$$ 611848 611115 442047 145354 -208555 -438543 -531797 -562665 -333453 323291 958182
36608I58182J5115l56822l741K33353l24225p64004l3490J053727R34977j90126
$$ 958182 973297 616475 612734 846087 521862 -242142 -275632 778095 1713072 1522946
36598A522946p52970l46815j6342j63443n2310M63744N43841M1457j11008L23761
$$ 1522946 769976 423161 406819 243376 191066 654810 1198651 1240108 1129100 1452861
36588A452861L63520l30707o74940o9456M43870Q57m89669R9587J098003J130238
$$ 1452861 1816381 1485674 810734 741278 1185148 1186005 696336 795923 1893926 3024164
36578C024164M28369L56395J071637J489741J564778K617177M664090N203014
$$ 3024164 3452533 3808928 4880565 6370306 7935084 10552261 15216351 20419365
36570B0419365K206568k629673n396487m509278k121231q55577q50367q52245
$$ 20419365 22625933 19996260 14599773 10090495 7969264 7113687 6263320 5411075
36562E411075o60963r08674j291601q48379J86105M72385k97606q47747l29892
$$ 5411075 4750112 3841438 2549837 1701458 1887563 2359948 2062342 1214595 884703
36553H84703M57228M85831l4284l45645l07610j19406K31250N14902J42360p47250
$$ 884703 1341931 1827762 1793478 1447833 1140223 1020817 1252067 1766969 1909329 1162079
36543A162079j009396j62615O24694K54739n20995l32202N57227P39124k2642
$$ 1162079 152683 -9932 614762 869501 348506 16304 573531 1312655 1290013
36534A290013n39845k01048K41623J18333j85266j40700K0609j40084m79537n34059
$$ 1290013 750168 549120 790743 909076 723810 583110 603719 463635 -15902 -549961
36524e49961j74670L34357O76160P02446M97847K77646J17268r2221l16118l01315
$$ -549961 -724631 -390274 285886 988332 1486179 1763825 1881093 1788872 1472754 1171439
36514A171439k0522J86465J72847K51263N86448Q07355O13187K87264K16159M00436
$$ 1171439 1150917 1337382 1510229 1761492 2347940 3155295 3768482 4055746 4271905 4672341
36504D672341P83978J431110K031158K079772K009641L000702M823832N112085
$$ 4672341 5456319 6887429 8918587 10998359 13008000 16008702 20832534 25944619
36496B5944619K184066k282967m996844m905815l688660k837229k158275j239476
$$ 25944619 28128685 25845718 20848874 15943059 12254399 9417170 7258895 6019419
36488F019419n41275m35167n18470m77694n52372p09673m46691J46853K21045
$$ 6019419 5478144 5042977 4524507 4046813 3494441 2784768 2338077 2484930 2705975
36479B705975m35870q93238n42915k4242r394r0545K58796N28061M7767o40067
$$ 2705975 2270105 1376867 833952 809710 800316 709771 968567 1496628 1544395 904328
36469I04328m78903L69895O64595n8907q13934o21569J81605N81831L06956j342
$$ 904328 425425 795320 1459915 1401008 587074 -34495 147110 728941 1035897 1034555
36459A034555J35588L72094J51062l95198n81380j45095L59062L27295q1678k30178
$$ 1034555 1170143 1542237 1693299 1298101 716721 571626 930688 1257983 1176305 946127
36449I46127J19910N82693P07826M31360o248l26883m00408l31536l11420l05457
$$ 946127 1066037 1648730 2356556 2787916 2781668 2454785 2054377 1722841 1411421 1105964
36439A105964r4113K60450L28271n2120m09222k86246O9076J24549r3359j15340
$$ 1105964 1011851 1272301 1600572 1548452 1139230 852984 922060 1046609 953250 837910
36429H37910J70481L84837K84948N1801o3697j1479J27415J84158l4108m37375
$$ 837910 1008391 1393228 1678176 1729977 1666280 1654801 1782216 1966374 1932266 1494891
36419A494891n79417k26675K08706K09052r0304j76321k7278j16335n49525p77836
$$ 1494891 915474 688799 897505 1106557 1016253 839932 812654 696319 146794 -631042
36409f31042l66355L45315O28770K53058k46671k40750J71107K78804j75499m85245
$$ -631042 -997397 -652082 -23312 229746 -16925 -257675 -86568 192236 16737 -468508
36399d68508k3864O05373L42263n98561r12152k22395L70293J60845j05541K29264
$$ -468508 -492372 113001 455264 -143297 -1055449 -1277844 -907551 -746706 -852247 -622983
36389f22983N00419O0040l90872q6541L03721p1984n06731N7335R24808O67350
$$ -622983 -122564 -62524 -453396 -539937 -236216 -308200 -814931 -757596 167212 834562
36379H34562l54903n56420J42788L28207k60615l77636K07872J71776p86195j101040
$$ 834562 479659 -76761 66027 394234 133619 -244017 -36145 135631 -650564 -1751604
36369a751604l6692Q97970M81787j96685K25671J012573P57192j61838m30814
$$ -1751604 -1788296 -890326 -408539 -605224 -379553 633020 1390212 1228374 797560
36360G97560n6883J59045N61046J916517L191047K300368o99879l117957k929254
$$ 797560 740677 899722 1460768 3377285 6568332 8868700 8168821 5050864 2121610
36351B121610j073220K56646L38955J4179k9621M9333n2863k66140l94058m18386
$$ 2121610 1048390 1305036 1643991 1658170 1628549 1677882 1625019 1358879 964821 546435
36341E46435m33559m65731m41323l10521j63417j33550j71241p7893J74477L79399
$$ 546435 112876 -352855 -794178 -1104699 -1268116 -1401666 -1572907 -1650800 -1476323 -1096924
36331a096924M45498N24322O35505N01328J1430m56586m95291j95797P9411J95955
$$ -1096924 -651426 -127104 508401 1009729 1021159 564573 69282 -126515 -47104 148851
36321A48851K09077R1052j44110k62191j12914P0324K353k07151k51251p6465
$$ 148851 357928 448980 304870 42679 -70235 89 2442 -204709 -455960 -532425
36311e32425J60535L61327M06914Q6362n18803q39006m46882L02735O86632N00074
$$ -532425 -371890 -10563 396351 482713 -36090 -875096 -1321978 -1019243 -332611 167463
36301A67463J16097j59557l22861l80248k92727j60777p5611J13703M90496O91072
$$ 167463 283560 124003 -198858 -579106 -871833 -1032610 -1108221 -994518 -504022 187050
36291A87050L37108k67896m53133j66170j9232k65271l96529m4554L31753J50807
$$ 187050 524158 256262 -196871 -363041 -382273 -647544 -1044073 -1088627 -756874 -606067
36281f06067l13008k71712L86580Q46497M52498l84228p01458k17005L58146K89516
$$ -606067 -919075 -1190787 -804207 42290 494788 110560 -590898 -807903 -449757 -160241
36271a60241k71062o12227m33391o1599J89742L57562M59521L27824L5017j5467
$$ -160241 -431303 -1043530 -1476921 -1538520 -1348778 -991216 -531695 -203871 -168854 -184321
36261a84321K56627L43294n8180m66702l60676m6902j10806l73276k19592K62295
$$ -184321 72306 415600 357420 -109282 -469958 -516860 -627666 -1000942 -1220534 -958239
36251i58239L95199R8612j2792J92496J15127l55066m27154K33392P16169K32491
$$ -958239 -563040 -464428 -477220 -284724 -169597 -524663 -951817 -718425 -2256 230235
36241B30235n44718m94102K06948M71550P9030j45906J43129L10283k1481l00630
$$ 230235 -314483 -808585 -601637 -130087 -51057 -196963 -53834 256449 234968 -65662
36231f5662o4112K60775J39348j89340k41100j41586k81367n17258m02990K0774
$$ -65662 -129774 131001 270349 81009 -160091 -301677 -583044 -1100302 -1503292 -1482518
36221a482518K92975K49218J20754K6661j00823j57117L3319K70525J62604j96470
$$ -1482518 -1189543 -940325 -819571 -792910 -893733 -1050850 -1017531 -747006 -584402 -780872
36211g80872k59806J28064M31392K18981j83549k08769R2802J66984j67995m15260
$$ -780872 -1040678 -912614 -481222 -262241 -445790 -654559 -561757 -394773 -562768 -978028
36201i78028j17157M27990M95237p2536n67326l25730L47972N93362K03685j56402
$$ -978028 -1095185 -667195 -171958 -244494 -811820 -1137550 -789578 -196216 7469 -148933
36191a48933m3007J13394j67372n18968k92199L48963O21912K75702j41449j66402
$$ -148933 -191940 -78546 -245918 -764886 -1057085 -708122 -86210 189492 48043 -118359
36181a18359M2855J46424P7612p0614k07943k10186n1372M4351q6203k09990p6944
$$ -118359 -75504 70920 148532 77918 -130025 -340211 -391583 -347232 -433435 -643425 -720369
36170g20369P7206n8552j97851J08717N61939M80617j7429j58170J44033J47075
$$ -720369 -643163 -701715 -899566 -790849 -228910 251707 234278 76108 220141 367216
36160C67216l26463m89044J3380M08690J07070l13921j78505J46507M6851j87458
$$ 367216 40753 -448291 -434911 -26221 80849 -233072 -411577 -265070 -218219 -405677
36150d05677L4565M64370M50900N6074j82602k10424k98654k95815P1918M49026
$$ -405677 -371112 93258 544158 600232 417630 207206 -91448 -387263 -315345 133681
36140A33681K83051k08602l30349J6658L15916K95533P7392k94277p27206p52647
$$ 133681 416732 208130 -122219 -105561 210355 505888 583280 289003 -438203 -1190850
36130a190850j19142N44856M92047J4431n1259K87860K98177j39877l89601k33671
$$ -1190850 -1309992 -765136 -273089 -258658 -309917 -22057 276120 136243 -253358 -487029
36120d87029j27495k00569l7486L87799N47181L29967K26867L24458R4641n12740
$$ -487029 -614524 -815093 -852579 -464780 82401 412368 639235 963693 1058334 545594
36110E45594p53594k94360J76415N4634k76081k17970P7093J35438j1412j6715
$$ 545594 -208000 -502360 -325945 -271311 -547392 -765362 -688269 -552831 -564243 -580958
36100e80958J88621M51383O39029M91042k55317j215330j409159m69277O89942
$$ -580958 -392337 59046 698075 1189117 933800 -281530 -1690689 -2159966 -1470024
36091a470024R50364L35932k59242l27918j23176J5746R2583J90590K27918J16117
$$ -1470024 -519660 -183728 -442970 -770888 -894064 -878318 -785735 -595145 -367227 -251110
36081b51110m8332p0595R2746K14426L3395l32444m15948k1892M34723M89685
$$ -251110 -299442 -370037 -277291 -62865 -29470 -361914 -777862 -799754 -365031 124654
36071A24654K32917k0045k90115o29226o34745j4470O38226N00359k02391m90640
$$ 124654 357571 337526 47411 -581815 -1216560 -1231030 -592804 -92445 -294836 -785476
36061g85476j19006K31512K43978L28034N27373K50800n06163p94393j48710N87057
$$ -785476 -904482 -672970 -428992 -100958 426415 677215 171052 -623341 -772051 -184994
36051a84994N30445l648k23951m9593J27830J88210J13253k83634q08979p31692
$$ -184994 345451 341803 117852 68259 196089 384299 497552 213918 -595061 -1326753
36041a326753J38309Q61572N98782j75312m61201j70217N8842p273j07844j69952
$$ -1326753 -1188444 -326872 271910 96598 -364603 -534820 -475978 -483251 -591095 -761047
36031g61047k73461k26114J07263L38356P8493l73964m75849k19153R8782M31448
$$ -761047 -1034508 -1260622 -1153359 -815003 -736510 -1110474 -1586323 -1805476 -1706694 -1275246
36021a275246O96009M70829k82972p33363k46131N49171O43293J12507k49602
$$ -1275246 -579237 -108408 -391380 -1124743 -1370874 -821703 -178410 -65903 -315505
36012c15505k72623l02410j98439L32724P16667J61784q07509q47129J43757Q36745
$$ -315505 -588128 -890538 -1088977 -756253 -39586 122198 -685311 -1532440 -1388683 -551938
36002e51938N34504K4952L297J1468m19953p73353m82522P5869L05193L02142
$$ -551938 -17434 7518 10815 22283 -397670 -1171023 -1653545 -1577676 -1272483 -970341
35992i70341L30950J69239k63858l78623J39791N29598L4593p68358p53725K8187
$$ -970341 -639391 -470152 -734010 -1112633 -972842 -443244 -408651 -1177009 -1930734 -1902547
35982a902547M96240K30525o2889J62433N28703N18810K29012j9401k02191l53122
$$ -1902547 -1406307 -1175782 -1238671 -1076238 -547535 -28725 200287 180886 -21305 -374427
35972c74427k97210o31K03654J00789k6948J32189L67564K69317j16522l90998
$$ -374427 -671637 -672268 -468614 -367825 -394773 -262584 104980 374297 257775 -133223
35962a33223m12098l35541j33590L66031Q82577P29957k10192j055498r53194
$$ -133223 -545321 -880862 -1014452 -648421 234156 964113 753921 -301577 -1254771
35953a254771j99314K53592J68912J70363N30979O47839N7578p08477q35867l47789
$$ -1254771 -1454085 -1200493 -1031581 -861218 -330239 317600 375178 -333299 -1169166 -1516955
35943a516955P8557J28089O8365R9523Q6718n0772j82881k49608k77735j11492
$$ -1516955 -1438398 -1310309 -1241944 -1142421 -1055703 -1106475 -1289356 -1538964 -1816699 -1928191
35933a928191M02052R11997P86840K8647n39661l14192K78251M02241o7452n05296
$$ -1928191 -1526139 -614142 172698 201345 -338316 -652508 -374257 27984 -39468 -544764
35923e44764m32368N766M00368N04678K83960r0703k49644K6563M03217L17489
$$ -544764 -977132 -971366 -570998 -66320 217640 126937 -122707 -96144 307073 624562
35913F24562j88606m26475q7911K18191p2485m79675k01948M62443M16272m82648
$$ 624562 435956 9481 -78430 139761 67276 -412399 -614347 -151904 264368 -218280
35903b18280j047242n29683K59651K97427r4629k4303L37906J42641m88789n47740
$$ -218280 -1265522 -1795205 -1535554 -1238127 -1332756 -1357059 -1019153 -876512 -1365301 -1913041
35893a913041J41092N79629K34467j69062N2971M86853M57046N7200k78235m96403
$$ -1913041 -1771949 -1192320 -957853 -1126915 -1073944 -587091 -130045 -72845 -351080 -847483
35883h47483o11817l56872K34726N40624K60393l3389J22665K66661p6791l98729
$$ -847483 -1459300 -1816172 -1581446 -1040822 -780429 -813818 -691153 -424492 -501283 -900012
35873i00012n3707N09328M22116j48019l20287K6144K08029l343j56211q3408
$$ -900012 -953719 -444391 -22275 -170294 -490581 -464437 -256408 -259751 -415962 -499370
35863d99370p0176p5333K16001N44116K91840l67413n55364p9915K72077O6673
$$ -499370 -569546 -644879 -428878 115238 407078 39665 -515699 -595614 -323537 -256864
35853b56864j64744J4651K45907J72912N5844J03658J8338k87899l21083R2576
$$ -256864 -421608 -406957 -161050 11862 67706 171364 189702 -98197 -419280 -326704
35843c26704L08789r7658n19407k56386L54898N19349J83832j12951j85627k35719
$$ -326704 -17915 -115573 -634980 -891366 -536468 -17119 166713 53762 -131865 -367584
35833c67584k43897m5351J98291K10476P8631J7432m9960j76116n7282L89830
$$ -367584 -611481 -656832 -458541 -248065 -169434 -152002 -201962 -378078 -435360 -45530
35823d5530N63412K0105o23680m89820J85094M31653R7014m6668K87469M75662
$$ -45530 517882 537987 -85693 -575513 -390419 41234 138248 91580 379049 854711
35813H54711J45581k58922l81520m72824o20128l85469K73675N95909J71781k80056
$$ 854711 1000292 741370 359850 -112974 -733102 -1118571 -844896 -248987 -77206 -357262
35803c57262m8409L67899J05740n65641o45259l278M80174L22432o578n5447j6989
$$ -357262 -405671 -37772 67968 -497673 -1142932 -1146210 -666036 -343604 -350182 -405629 -422618
35792d22618j10064j02834J65398L81043K69303N0694L1531J28810J20616J8904
$$ -422618 -532682 -635516 -470118 -89075 180228 230922 262453 391263 511879 530783
35782E30783r0788k41427l61474k23030J23852K48597l7153l49509l42835k19688
$$ 530783 439995 198568 -162906 -385936 -262084 -13487 -50640 -400149 -742984 -962672
35772i62672k40667j78024K17338N84779M14031j06427l25695p6306J97008J69071
$$ -962672 -1203339 -1381363 -1164025 -579246 -165215 -271642 -597337 -673643 -476635 -307564
35762c07564m0952k22214k77746j52838L1427m6642l66115l13655M27464J103339
$$ -307564 -348516 -570730 -848476 -1001314 -969887 -1016529 -1382644 -1696299 -1268835 -165496
35752a65496Q18770m6232l41747Q2542K57395k10157n63977l28275q4758k84547
$$ -165496 653274 607042 265295 347837 605232 395075 -168902 -497177 -581935 -866482
35742h66482m13019l5210L43755K45399R2092K59426K10070m06159p11170P8438
$$ -866482 -1279501 -1314711 -970956 -725557 -633465 -374039 -163969 -570128 -1281298 -1202860
35732a202860J048808P80286l65221p41557J8977N93747K19259k76699j34652
$$ -1202860 -154052 626234 261013 -480544 -461567 132180 351439 74740 -59912
35723e9912J24251j12979l66935m223N34651M36293j46773l92033q4379K30270
$$ -59912 64339 -48640 -415575 -419798 114853 551146 404373 12340 -72039 158231
35713A58231J79362n0320j92947k14753j51149m2321k5420j88998l66302l04828
$$ 158231 337593 287273 94326 -120427 -271576 -313897 -339317 -528315 -894617 -1199445
35703a199445Q574L49847M84751K89153j66844n22484l58356K66285P23819N18125
$$ -1199445 -1190871 -841024 -356273 -67120 -233964 -756448 -1114804 -848519 -124700 393425
35693C93425q1544l66426o1188L74696L32793k10435o34732l77067L52913P48644
$$ 393425 311881 -54545 -115733 258963 591756 381321 -253411 -630478 -277565 471079
35683D71079L95619j98996l48622j44009j45963l49020k09175K79195L98072r6850
$$ 471079 866698 667702 319080 175071 29108 -319912 -529087 -249892 148180 51330
35673E1330m27218q895N03439J99961n67952o52347J13111O52345K90675l20385
$$ 51330 -375888 -384783 118656 318617 -249335 -901682 -788571 -136226 154449 -165936
35663a65936l36136M4240J22947j01305r4669J52996R8223l27599m78027k9565
$$ -165936 -502072 -457832 -334885 -436190 -530859 -377863 -279640 -607239 -1085266 -1114831
35653a114831M44170L69382N9377J07149L34620J18187m52808o04496j16603L01689
$$ -1114831 -670661 -301279 -241902 -134753 199867 318054 -134754 -739250 -855853 -554164
35643e54164J43449j41889L0522M41363N16099K21717j00049l95883p22632p13364
$$ -554164 -410715 -552604 -522082 -80719 435380 657097 557048 161165 -561467 -1274831
35633a274831J2233J013880J331874O66832l16970q87073q90718n04640N2409
$$ -1274831 -1262598 -248718 1083156 1749988 1433018 545945 -344773 -849413 -797004
35624g97004M42984L90384Q4840m1404j750j91739n81453o20481j51587K38508
$$ -797004 -354020 36364 121204 79800 78050 -113689 -695142 -1315623 -1467210 -1228702
35614a228702J27299q7862R0161L99451K75030j84025l56008o5939K00037R1724
$$ -1228702 -1101403 -1189265 -1099104 -699653 -424623 -608648 -964656 -1030595 -830558 -738834
35604g38834j14415k6877K21429J74346k30083m80030j51080M70108P05286L69203
$$ -738834 -853249 -880126 -658697 -484351 -714434 -1194464 -1345544 -875436 -170150 199053
35594A99053k9699o5767M6820n1527k18162j03509K09550L91242M59350N99271
$$ 199053 169354 103587 150407 98880 -119282 -222791 -13241 378001 837351 1436622
35584A436622N80033M8752o65494p97444k58932K23062K04083J2792m1896j58540
$$ 1436622 2016655 2065407 1399913 602469 343537 566599 770682 783474 741578 583038
35574E83038m13027m10902j8973K43049L8374k08576j08598k1767l15156n27381
$$ 583038 170011 -240891 -259864 -16815 21559 -187017 -295615 -317382 -632538 -1159919
35564a159919r5583N57404N79594M4766j90693J19181K87977j25177o30978n83530
$$ -1159919 -1255502 -698098 -118504 -73738 -264431 -145250 142727 17550 -613428 -1196958
35554a196958l8635M70677N96194L54796l4484k84164k40147p8537j03185k97338
$$ -1196958 -1235593 -764916 -168722 186074 151590 -132574 -372721 -451258 -554443 -851781
35544h51781l11846L6057M67697N38582J19355m35435n57425k7531O59631P32588
$$ -851781 -1163627 -1127570 -659873 -121291 -1936 -437371 -994796 -1022327 -362696 369892
35534C69892R1979n00435m34251n4292k2282k69735k40061P0320J06868k27972
$$ 369892 461871 -38564 -472815 -527107 -549389 -819124 -1059185 -988865 -881997 -1109969
35524a109969l60703k5270K90617J99499L9189J90737L55327R8453l19599l28005
$$ -1109969 -1470672 -1495942 -1205325 -1005826 -966637 -775900 -420573 -322120 -641719 -969724
35514i69724O420J21373n5124K443M32391O01154O4791o17222n64252K00582P67853
$$ -969724 -963304 -841931 -897055 -894612 -462221 138933 203724 -413498 -977750 -777168 -9315
35503i315N40267q9400l88084k00445N8134P2904n5996j15590r6256j14218j82991
$$ -9315 530952 441552 53468 -146977 -88843 -15939 -71935 -187525 -283781 -397999 -580990
35492e80990j91969q2078M0166K1147j04715j03548J16542K59283l719m56503
$$ -580990 -772959 -855037 -814871 -793724 -898439 -1001987 -885445 -626162 -629881 -1086384
35482a086384m99187j3950L62938J52465j99999J445N54592N97019n0107n29829
$$ -1086384 -1585571 -1599521 -1236583 -1084118 -1284117 -1282672 -728080 -131061 -181168 -710997
35472g10997j69280N82575Q30978L85670k17907n27950n30430l66577j43699M899
$$ -710997 -880277 -297702 533276 918946 701039 173089 -357341 -723918 -867617 -862718
35462h62718P215N745J73641L88122L32958l4805l36705k10158K16107M29001
$$ -862718 -855503 -849758 -676117 -287995 44963 10158 -326547 -536705 -320598 108403
35452A08403J27174m03667o26387m01904r3503k503M95J19582K30009J39987o785
$$ 108403 235577 -168090 -794477 -1196381 -1289884 -1292387 -1291892 -1172310 -942301 -802314 -809099
35441h09099K0591R9252l317j27105M0273L61910M33078K58992J72595J71319
$$ -809099 -788508 -689256 -692573 -819678 -779405 -417495 15583 274575 447170 618489
35431F18489j6183k72185k30510m5129j92544m84029k40698L94491M22128l54470
$$ 618489 602306 330121 99611 54482 -138062 -622091 -862789 -468298 -46170 -400640
35421d00640p82225j29512O60949L96984n52090r12119l46715L91908P00839N52630
$$ -400640 -1182865 -1312377 -651428 -254444 -806534 -1718653 -2065368 -1673460 -972621 -419991
35411d19991N8059n01131n48996M5245M99161J99960k63085q4550L37855J53706
$$ -419991 -361932 -863063 -1412059 -1366814 -867653 -667693 -930778 -1015328 -677473 -523767
35401e23767k94689r540P74942Q04594j10527p75823n66842j87133j17689J72727
$$ -523767 -818456 -827996 -53054 751540 641013 -134810 -701652 -888785 -1006474 -833747
35391h33747Q74868J116819M03978m23395n30108k98424l16572k25877L65856
$$ -833747 41121 1157940 1561918 1138523 608415 309991 -6581 -232458 133398
35382A33398P56889J61547q17035r46461j60407N27100N70956K91103l9839m56679
$$ 133398 890287 1051834 234799 -711662 -872069 -344969 225987 517090 477251 20572
35372B0572p28736m46990K82289R02821J081343P66561r1110j177178j576901
$$ 20572 -708164 -1155154 -872865 29956 1111299 1877860 1786750 609572 -967329
35363i67329q00278K77622M74787m534n5214M09653M08801k27263m56239J01789
$$ -967329 -1767607 -1489985 -1015198 -1019732 -1074946 -665293 -256492 -483755 -939994 -838205
35353h38205L79833k91227q77068k53152Q99584J083300K14945m34945k14987
$$ -838205 -458372 -749599 -1626667 -1879819 -980235 103065 318010 -116935 -331922
35344c31922K34731K46825k7869k10648k49014j28461K53884O53538N28454j63910
$$ -331922 -97191 149634 121765 -88883 -337897 -466358 -212474 441064 969518 805608
35334H05608p17659n50656O0881M14537K30863j99707m58089l40796L4998K90920
$$ 805608 87949 -462707 -401826 12711 243574 43867 -414222 -755018 -720020 -429100
35324d29100J43862j87150j85157K46803O04359N00008J95253J13256J54371o1684
$$ -429100 -285238 -472388 -657545 -410742 193617 693625 888878 1002134 1156505 1094821
35314A094821m66871n66542j96676J78730Q1764l53917n65777k32586L83316P13802
$$ 1094821 627950 61408 -135268 43462 125226 -228691 -794468 -1027054 -643738 70064
35304G0064M43857j67693n18487k75053K48020M02051p7051p30459q30907j95505
$$ 70064 513921 346228 -172259 -447312 -199292 202759 125708 -604751 -1435658 -1631163
35294a631163N31569N60134o5796m37801N0245P97671P42864j34622p51186m78855
$$ -1631163 -1099594 -539460 -605256 -1043057 -992812 -195141 547723 413101 -338085 -816940
35284h16940J1610q6658m31283j87289M98356O53544N824n89802m17090J91337
$$ -816940 -805330 -891988 -1323271 -1510560 -1012204 -358660 -352836 -942638 -1359728 -1168391
35274a168391N11769L64278L5927k20048k46812L8747M02232L97890O271k30600
$$ -1168391 -656622 -292344 -256417 -476465 -723277 -684530 -282298 115592 121863 -108737
35264a08737j3264K13333l8468m95041n20490n0015L83941M10105J59331o4835
$$ -108737 -122001 91332 52864 -442177 -962667 -1012682 -628741 -218636 -59305 -124140
35254a24140q8434R2216K84249K10176j25806l56664k61823r6909j30453j73425
$$ -124140 -212574 -120358 163891 374067 248261 -108403 -370226 -467135 -597588 -771013
35244g71013K7572K39938J09764j54305n7307L42276M85659J91998j16074j31403
$$ -771013 -743441 -503503 -393739 -548044 -605351 -263075 222584 414582 298508 167105
35234A67105l1218R255J15572K97682K35343k01258o05169n51265j75756Q3807
$$ 167105 135887 145142 260714 558396 793739 592481 -12688 -563953 -739709 -655902
35224f55902Q7739q78j22942l47897n37380l52368K70288Q61383Q49652K27139
$$ -655902 -568163 -569041 -691983 -1039880 -1577260 -1929628 -1659340 -797957 51695 278834
35214B78834l81131m06937J2021K56505M7162k45358j87638J37811L52911L09678
$$ 278834 -102297 -509234 -497213 -240708 -193546 -438904 -626542 -488731 -135820 173858
35204A73858J09679j68668m17283l67132P7619M88003L33662k63837o16606l46789
$$ 173858 283537 114869 -302414 -669546 -591927 -103924 229738 -34099 -650705 -997494
35194i97494J97083M67169L19753m100k16667j96525n4409j5921j04085o7860
$$ -997494 -800411 -333242 -13489 -17589 -234256 -430781 -485190 -501111 -605196 -673056
35184f73056J62339K04539j90016n44366k55219L60885L84564k82057o33814k3315
$$ -673056 -510717 -306178 -496194 -1040560 -1295779 -934894 -550330 -832387 -1466201 -1489516
35174a489516Q47318R32443K76027k18118j16686J16691n2731n23136p75738n08836
$$ -1489516 -642198 290245 566272 348154 231468 348159 295428 -227708 -1003446 -1512282
35164a512282L7247L02423Q226m48981m12115J93723P50022P76696M75725K39966
$$ -1512282 -1475035 -1172612 -1164386 -1613367 -2025482 -1831759 -1081737 -305041 170684 410650
35154D10650O3053k01792l77834k31335N0093J19389L4461R3156K33059R5041
$$ 410650 473703 271911 -105923 -337258 -287165 -167776 -133315 -40159 192900 287941
35144B87941l32549n96625l90536O9276L72470L50551J13701j19001j68381m9783
$$ 287941 -44608 -641233 -1031769 -962493 -590023 -239472 -125771 -244772 -413153 -462936
35134d62936J1813j25703k76099j72077J21350K97120K59855J98932K04340J13090
$$ -462936 -451123 -576826 -852925 -1025002 -903652 -606532 -346677 -147745 56595 169685
35124A69685j65760m11577l31518O8165M50754M62257P7820l38746l94728j28556
$$ 169685 3925 -407652 -739170 -671005 -220251 242006 319826 -18920 -413648 -542204
35114e42204L1139j55005m06163l33301L4043L64949M67800L38396k1263m81358
$$ -542204 -511065 -666070 -1072233 -1405534 -1371491 -1006542 -538742 -200346 -221609 -702967
35104g02967o66511l78600o39j9859k67792j82382K40703M25536K12331J28184
$$ -702967 -1369478 -1748078 -1748717 -1768576 -2036368 -2218750 -1978047 -1552511 -1340180 -1211996
35094a211996L96239M38689j24469o56768m13326K24793L03967j81375l03227
$$ -1211996 -815757 -377068 -501537 -1158305 -1571631 -1346838 -1042871 -1224246 -1527473
35085a527473K50145O37777K21914m05922l66794J65837L42056l528k13528L2623
$$ -1527473 -1277328 -639551 -417637 -823559 -1190353 -1024516 -682460 -685988 -899516 -866893
35075h66893K45020L2380k12397O190M05153L32037j73038l86543j3339L36036
$$ -866893 -621873 -589493 -801890 -795700 -390547 -58510 -231548 -618091 -631430 -295394
35065b95394Q2438l96239l02584L57930P27156L23210k80670l18855R4616K60081
$$ -295394 -212956 -609195 -911779 -553849 173307 496517 215847 -103008 -8392 251689
35055B51689k2266k81740k35720j62914k45151j49949L33561P13646L97075l87670
$$ 251689 229423 -52317 -288037 -450951 -696102 -846051 -512490 201156 598231 210561
35045B10561q20249n33428O4053M45426M58141J79323k13283l76401r4980K88658
$$ 210561 -609688 -1143116 -1079063 -633637 -175496 3827 -209456 -585857 -680837 -392179
35035c92179K38320j20972j16268L59018N64124Q7350m33199l25929M2906k9576
$$ -392179 -153859 -274831 -391099 -32081 532043 619393 186194 -139735 -96829 -126405
35025a26405l46516k06515K94944L92112j0404j72646J60311K86778k15298o70988
$$ -126405 -472921 -679436 -384492 7620 -2784 -175430 -15119 271659 56361 -614627
35015f14627l30349M47774P26335K98164j97598k47263K8788K53633K15257p7515
$$ -614627 -944976 -497202 229133 527297 329699 82436 111224 364857 580114 502599
35005E02599m18571m85939j54619K81126L91023J02329k22597j92264J84453M61706
$$ 502599 84028 -401911 -556530 -275404 115619 217948 -4649 -196913 -12460 449246
34995D49246K22196l43373n46125j38765J86701k21424q07663n07878M69341P17656
$$ 449246 671442 328069 -218056 -356821 -170120 -391544 -1199207 -1707085 -1237744 -520088
34985e20088k00335r07145k83593P59636P38082q1216k86408K81528M05812l12073
$$ -520088 -720423 -1627568 -1911161 -1151525 -413443 -494659 -781067 -499539 -93727 -405800
34975d05800p95874l63229K41555K76337J42469L15319L12172k79583p16463j99052
$$ -405800 -1201674 -1564903 -1323348 -1047011 -904542 -589223 -277051 -556634 -1273097 -1472149
34965a472149O54197O60339p5762m13995k2127K98664J05425r4361M6785J20374
$$ -1472149 -817952 -157613 -233375 -647370 -669497 -370833 -265408 -359769 -312984 -192610
34955a92610j28084k38020J08937M49846L14089j5375q9458o3659k40478l23876
$$ -192610 -320694 -558714 -449777 69 314158 298783 209325 145666 -94812 -418688
34945d18688J27565P85156Q32303J01754o75811q06783l67489N9772N3238k94732
$$ -418688 -291123 494033 1326336 1428090 752279 -54504 -421993 -362221 -308983 -603715
34935f03715m96513j96035L20883M03642j3902k01110K57730O88919L40340l14718
$$ -603715 -1100228 -1296263 -975380 -571738 -585640 -786750 -529020 159899 500239 185521
34925A85521k55047L69570L91917m21519q61719k09329N28467J87770p01523p84735
$$ 185521 -69526 300044 691961 270442 -591277 -800606 -272139 -84369 -785892 -1570627
34915a570627J3316N40578L22973J08674L96590O32383L11251j08796m3493K02165
$$ -1570627 -1557311 -1016733 -693760 -585086 -188496 443887 755138 646342 602849 805014
34905H05014J0436m40978m50816N0256L84355J73660j61105j36167Q5723N4683
$$ 805014 815450 374472 -76344 -26088 358267 531927 370822 234655 320378 375061
34895C75061k21154k92211N0626M40380L74957j73708p22185q03066m28024m476
$$ 375061 153907 -138304 -87678 352702 727659 553951 -168234 -971300 -1399324 -1403800
34885a403800J35352M2535n919J18625K64207K24860j934k42632l54792l00494
$$ -1403800 -1268448 -1225913 -1231832 -1113207 -849000 -624140 -626074 -868706 -1223498 -1523992
34875a523992p6404K43875M03279J63466k72967l40258J36219N46266K64765l93359
$$ -1523992 -1600396 -1356521 -953242 -789776 -1062743 -1403001 -1266782 -720516 -455751 -849110
34865h49110n46016j0241M59472L29793L988L6651K51916J74004j29397k47913
$$ -849110 -1395126 -1405367 -945895 -616102 -612114 -575463 -323547 -149543 -278940 -526853
34855e26853j56359j25571j33693J3185J41804n8386l62208k37315K62879N09312
$$ -526853 -683212 -808783 -942476 -929291 -787487 -845873 -1208081 -1445396 -1182517 -673205
34845f73205K72611J4710M6783O7306j78043l85226k23619J14412K99319L83186
$$ -673205 -400594 -385884 -339101 -271795 -449838 -835064 -1058683 -944271 -644952 -261766
34835b61766N19645N31958K13017k17678l99537l66186l74153l71344r3016L77475
$$ -261766 257879 789837 1002854 785176 385639 19453 -354700 -726044 -819060 -441585
34825d41585N76800K53822l10420o56194o03487k87428Q2248L72466N06862M25920
$$ -441585 135215 389037 78617 -577577 -1181064 -1468492 -1386244 -1013778 -506916 -80996
34815h0996J54325j11846j39050K9201O1060j81380l45560p9451L52354L78174
$$ -80996 73329 -38517 -177567 -148366 -87306 -268686 -614246 -693697 -341343 36831
34805C6831l3144l41361k70761j19639j05700L572L21785M57115J23746k83544
$$ 36831 3687 -337674 -608435 -728074 -833774 -830202 -508417 -51302 72444 -211100
34795b11100k12202K34524M67316K07478k76665n74031m46019Q1957O32239O76598
$$ -211100 -423302 -188778 278538 486016 209351 -364680 -810699 -728742 -96503 580095
34785E80095J40739m01028m43734j99808j50988k40325l7497M50288P12826M97094
$$ 580095 720834 319806 -123928 -323736 -474724 -715049 -752546 -302258 410568 907662
34775I07662J33786l448L2903j3912k10624m24853n25800m68537k79095l1963
$$ 907662 1041448 1038000 1070903 1056991 846367 421514 -104286 -572823 -851918 -883881
34765h83881J78352K45388R4321j44258r7714L91687Q06980M48089m91873r38314
$$ -883881 -705529 -460141 -365820 -510078 -607792 -216105 590875 1038964 547091 -391223
34755c91223l58580M30041M18392j67874l44967J01359M45046K44539j31161k70583
$$ -391223 -749803 -319762 98630 -69244 -414211 -312852 132194 376733 245572 -25011
34745b5011k49810k21074j19985J5692k554p3888J23020M62219L89454j47411
$$ -25011 -274821 -495895 -615880 -600188 -602742 -676630 -553610 -91391 298063 150652
34735A50652m27316l746N44001M17655k62114o81415m42652P4179L38078K12509
$$ 150652 -276664 -280410 263591 681246 419132 -262283 -704935 -630756 -292678 -80169
34725h0169r6202l04575k56252o2043M308j19271j48995J29787M68886M30028
$$ -80169 -176371 -480946 -737198 -799241 -794933 -914204 -1063199 -933412 -464526 -34498
34715c4498q315l53305j65636L81242O09841Q8833p40188r25037j69621O55081
$$ -34498 -42813 -396118 -561754 -180512 429329 518162 -222026 -1147063 -1316684 -661603
34705f61603N74118j61312m49354L1000M00711L2323m52915k44587L03104K59413
$$ -661603 -87485 -248797 -698151 -667151 -266440 -234117 -687032 -931619 -628515 -369102
34695c69102l32803m98830J02382O03864K30449n56063p29035r4006N44383M88543
$$ -369102 -701905 -1200735 -1098353 -494489 -264040 -820103 -1549138 -1643144 -1098761 -610218
34685f10218l9058k91279N8884N86525P04956L83228P7164K4303l9036l18270
$$ -610218 -649276 -940555 -881671 -295146 409810 793038 870202 894505 855469 537199
34675E37199m99240k25393K15423K06770k44213m24149O5055O81698O55716R729
$$ 537199 37959 -187434 27989 234759 -9454 -433603 -368548 313150 968866 978595
34665I78595n07672l87201P1259J97725k12447o20528l60855M75088R90849N48249
$$ 978595 470923 83722 154981 352706 140259 -480269 -841124 -366036 624813 1173062
34655A173062l30953n78775k3355L97928K4687o01279o34668j67479R3420n759
$$ 1173062 842109 263334 239979 637907 662594 61315 -573353 -740832 -647412 -653171
34645f53171j6389J66693J42849j69601l24150j39763P190o4377N969L64505N28925
$$ -653171 -669560 -502867 -360018 -529619 -853769 -993532 -986342 -1050719 -1044750 -680245 -151320
34634a51320K07217j10530K2804J84201j76234o51484m34290L33239P14764L78469
$$ -151320 55897 -54633 -31829 152372 -23862 -675346 -1109636 -776397 -61633 316836
34624C16836q6918k61526l59141m70481k96289P6153N6992l65928l43091M54759
$$ 316836 229918 -31608 -390749 -861230 -1157519 -1081366 -1024374 -1390302 -1733393 -1278634
34614a278634J049254N59842l44783m14049K81308N64903M8990l84921j13700
$$ -1278634 -229380 330462 -14321 -428370 -147062 417841 466831 81910 -31790
34605c1790L14096K00533k28120l43861j22714j2549j34569j79250L3844L17714
$$ -31790 282306 482839 254719 -89142 -211856 -224405 -358974 -538224 -504380 -186666
34595a86666M13692K62374L901j38867m8494J13573M7929k70430m92596l46953
$$ -186666 227026 489400 493301 354434 305940 419513 467442 197012 -295584 -642537
34585f42537j6673J15955l2018j98435j42896J16318L67789L64095M344m67542
$$ -642537 -659210 -543255 -575273 -773708 -916604 -800286 -432497 -68402 -64058 -531600
34575e31600n47585r130O67270P01601l7451p56004o36338J57500O90961M31012
$$ -531600 -1079185 -1088315 -421045 280556 243105 -512899 -1149237 -991737 -300776 130236
34565A30236j60936l39920m5632J55970q0609m83255o18263m06092o9258J86610
$$ 130236 -30700 -370620 -416252 -260282 -340891 -824146 -1442409 -1848501 -1917759 -1731149
34555a731149K93120K81601K38767J89275Q353l58700n99349k81891M85776R93783
$$ -1731149 -1438029 -1156428 -917661 -728386 -720033 -1078733 -1678082 -1959973 -1474197 -480414
34545d80414P60431J24278k84937l73421m70773o07868m52339L3999L90259K92348
$$ -480414 280017 404295 119358 -254063 -724836 -1332704 -1785043 -1751044 -1360785 -1068437
34535a068437R933k4927J71893K59824J44162Q9274K66262M62776L60646m1923
$$ -1068437 -1058504 -1083431 -911538 -651714 -507552 -418278 -152016 310760 671406 629483
34525F29483m12769m36918j08290K78174L58671K091n10778o83930l37747J20652
$$ 629483 216714 -220204 -328494 -50320 308351 310442 -200336 -884266 -1222013 -1101361
34515a101361J66613j61593l46279j33786K04458M21790O10853P57329N32537
$$ -1101361 -934748 -1096341 -1442620 -1576406 -1371948 -950158 -339305 418024 950561
34506I50561p1118m26284j42751K25150K2380l91496k14660M33302O91368L26408
$$ 950561 879443 453159 310408 535558 557938 166442 -48218 385084 1076452 1402860
34496A402860j01549l59966p12439r38020m27200M99263O48508k11774q21880
$$ 1402860 1301311 941345 228906 -709114 -1136314 -637051 11457 -200317 -1022197
34487a022197l36720M60044O04332L94822M31626L70562j92043o02005k25524
$$ -1022197 -1358917 -898873 -294541 100281 531907 902469 710426 108421 -117103
34478a17103K18508j87176q21263m88286M59002O34847p7290m48798m2063K58282
$$ -117103 101405 -85771 -907034 -1395320 -936318 -301471 -378761 -827559 -869622 -611340
34468f11340q990j84303J36200M29936L45816K18419J35511k61529o93436k87155
$$ -611340 -620330 -804633 -668433 -238497 107319 325738 461249 199720 -493716 -780871
34458g80871P93103J091542l6505j256120j070471J57264R31975O39495p2953
$$ -780871 12232 1103774 1067269 -188851 -1259322 -1102058 -170083 469412 396459
34449C96459m18202j92809K99513N22380J86418l04396l17170L7025Q3121k15402
$$ 396459 -21743 -214552 84961 607341 793759 489363 172193 209218 292339 76937
34439G6937j74698L05563M53796J4852k29850J14269K79284k72059p91851n03604
$$ 76937 -97761 207802 661598 676450 446600 560869 840153 568094 -223757 -727361
34429g27361P8449J02590k20358k41845j20737l09072m61986m2423N23879M77256
$$ -727361 -648912 -546322 -766680 -1008525 -1129262 -1438334 -1900320 -1942743 -1418864 -941608
34419i41608O7765R7197M75012M17013j51331n38349m88308l56408j89775K89350
$$ -941608 -873843 -776646 -301634 115379 -35952 -574301 -1062609 -1419017 -1608792 -1319442
34409a319442Q09551P10930N9094l52970k23573o9830k07396k77181j6922K63119
$$ -1319442 -509891 201039 260133 -92837 -316410 -386240 -593636 -870817 -887739 -624620
34399f24620K53968P9985p7413k58512m30916l68444O934M84259Q02286P70553
$$ -624620 -370652 -290667 -368080 -626592 -1057508 -1425952 -1419018 -934759 -132473 638080
34389F38080L03053l34332n56135j59706K84432K06533j54620k70513k27198l90912
$$ 638080 941133 606801 50666 -109040 175392 381925 227305 -43208 -270406 -661318
34379f61318n47283k34503L04434L87012j8410k94752j64572J07996L61841N85055
$$ -661318 -1208601 -1443104 -1138670 -751658 -770068 -1064820 -1229392 -1121396 -759555 -174500
34369a74500N00568k7429l77132O7625P18874M55267n90953j129183o63995q8936
$$ -174500 326068 298639 -78493 -10868 708006 1163273 572320 -556863 -1220858 -1309794
34359a309794p3836j25510K57683O29265M42062l3319k53283j50193J37068N71479
$$ -1309794 -1383630 -1509140 -1251457 -622192 -180130 -213449 -466732 -616925 -479857 91622
34349I1622Q57359N23561k43179o16567l39054p4768k01303k18752J57321L44488
$$ 91622 948981 1472542 1229363 612796 273742 198974 -2329 -221081 -63760 280728
34339B80728j6577l12147n8569J90456j00444m01864j17042K34155l4164m00194
$$ 280728 264151 -47996 -106565 83891 -16553 -418417 -535459 -301304 -335468 -735662
34329g35662j1764O53076M48526m47573p10304R26N52969K26921k55855j10439
$$ -735662 -747426 -94350 354176 -93397 -803701 -802775 -249806 -22885 -278740 -389179
34319c89179K54929R7248l82201m53840o3122J70428m2197k99930j73512K08834
$$ -389179 -134250 -37002 -419203 -873043 -936165 -765737 -807934 -1107864 -1281376 -1072542
34309a072542L76538J23001k42396k52009J66871O11836P10745N23549L09656
$$ -1072542 -696004 -573003 -815399 -1067408 -900537 -288701 422044 945593 1255249
34300A255249J12150j67842m34231m58405k48268q5259j66614l86064m78208k78122
$$ 1255249 1367399 1199557 765326 306921 58653 -26606 -193220 -579284 -1057492 -1335614
34290a335614J10833L42726J52213k75951m46005j46457L18160N67429N13035
$$ -1335614 -1224781 -882055 -729842 -1005793 -1451798 -1598255 -1280095 -712666 -199631
34281a99631J97376l07511o47812l50034M08193P09771R6852o21726m40113L56139
$$ -199631 -2255 -309766 -957578 -1307612 -899419 -189648 -92796 -714522 -1154635 -798496
34271g98496O20414O1717m35027k74217L3997j04859l55053q4466N21070O97196
$$ -798496 -178082 -116365 -551392 -825609 -791612 -896471 -1251524 -1335990 -814920 -117724
34261a17724K32182k92323l79006j81846n4369J0752J79894L13275J39259j83070
$$ -117724 114458 -177865 -556871 -738717 -793086 -782334 -602440 -289165 -149906 -332976
34251c32976j50262L02319N58230J88783l33419l04598J21401K04134j57492k93781
$$ -332976 -483238 -180919 377311 566094 232675 -71923 49478 253612 96120 -197661
34241a97661O2517L50383K10011M8598J14306q2549p23350r38404r9001Q62493
$$ -197661 -135144 215239 425250 473848 588154 505605 -217745 -1156149 -1255150 -392657
34231c92657O41889l99708p51170r3109L51107p1549m71887o9402N13446M20043
$$ -392657 249232 -150476 -901646 -994755 -643648 -715197 -1187084 -1256486 -743040 -322997
34221c22997l3407r5556O0911k09884p11661o29878J11587O79145N46797J03224
$$ -322997 -356404 -451960 -391049 -600933 -1312594 -1942472 -1830885 -1151740 -604943 -501719
34211e01719j00420p8928j47894l62630m90227l39538L2667L66392M49328L72563
$$ -501719 -602139 -681067 -828961 -1191591 -1681818 -2021356 -1988689 -1622297 -1172969 -800406
34201h00406M01743N20045L64527j91837o94552o55067j98400J83718K99987K89193
$$ -800406 -398663 121382 485909 294072 -400480 -1055547 -1253947 -1070229 -770242 -481049
34191d81049K00007J0691q2085R5438K51302k8570n16657n22902O6389N42965
$$ -481049 -281042 -270351 -352436 -256998 -5696 -34266 -550923 -1073825 -1007436 -464471
34181d64471M10940Q5876J59491M44804L12084k84549p05974n21804j8769K81688
$$ -464471 -53531 32345 191836 636640 948724 664175 -41799 -563603 -582372 -300684
34171c00684K44861R1832L398k4259l7328k8967J0371N3700Q5600J38173K24042
$$ -300684 -55823 36009 39407 15148 -22180 -51147 -40776 12924 98524 236697 460739
34160D60739K47774P0914k78148n34034m49660r9791J84543J79615m0132k51643
$$ 460739 708513 779427 501279 -32755 -482415 -582206 -397663 -218048 -258180 -509823
34150e09823k86387j07947J39180J75227j01118l52870j58980L22827M39268k6553
$$ -509823 -796210 -904157 -764977 -589750 -690868 -1043738 -1202718 -879891 -440623 -467176
34140d67176m33334j65002M26490N09182n54l47808r0957L04268K50234j20867
$$ -467176 -900510 -1065512 -639022 -129840 -130394 -478202 -569159 -264891 -14657 -135524
34130a35524k72997o1024J94047K16323J1886k74933m53781l40341L6678L69684
$$ -135524 -408521 -469545 -275498 -59175 -47289 -322222 -776003 -1116344 -1079666 -709982
34120g09982M12795K72419J76157J21979p438j49124j65693j24619j84380k99470
$$ -709982 -297187 -24768 151389 273368 265930 116806 -48887 -173506 -357886 -657356
34110f57356l09974k12548o7952J98223N54616O09235Q0916n73531n84285L6836
$$ -657356 -967330 -1179878 -1247830 -1049607 -494991 114244 195160 -378371 -962656 -925820
34100i25820M33251J17827l51816k58096K47170M98336L21745J00934L5191o1593
$$ -925820 -492569 -374742 -726558 -984654 -737484 -239148 82597 183531 218722 157129
34090A57129k24997j49140K88364O88646N75574o387n45868o41035l79731j54950
$$ 157129 -67868 -217008 71356 760002 1335576 1329189 783321 142286 -237445 -392395
34080c92395j89267l05991k02320J12602L07095J94723K1978J21939M08526M60516
$$ -392395 -581662 -887653 -1089973 -977371 -670276 -475553 -453575 -331636 76890 537406
34070E37406J05737l09540l46725k9233K04789Q6860j33408o1968K35366K84479
$$ 537406 643143 333603 -13122 -42355 162434 249294 115886 53918 289284 573763
34060E73763q1461l83997j51032L32085L52705k16398p09623n73570m3775L02470
$$ 573763 492302 108305 -42727 289358 642063 425665 -283958 -857528 -901303 -598833
34050e98833L04739K17869K00421J58553J3017j50267k04861j38210q9838k21692
$$ -598833 -294094 -76225 124196 282749 295766 145499 -59362 -197572 -287410 -509102
34040e09102m46944l96094Q1580N09294L33616j66751j61379M32890P11844J96704
$$ -509102 -956046 -1352140 -1270560 -761266 -427650 -594401 -755780 -322890 388954 585658
$$ [...]
##END NTUPLES=NMR SPECTRUM
##END=
