##TITLE=31Pdec_E3d0607-3
 CDCl3, 24 sc
 7.7.2023
##JCAMPDX= 6.0         $$ Bruker NMR JCAMP-DX V2.0
##DATA TYPE= NMR SPECTRUM
##DATA CLASS= NTUPLES
##ORIGIN= UXNMR, Bruker Analytische Messtechnik GmbH
##OWNER= root
$$ XWIN-NMR		Version 3.5
$$ Fri Jul  7 14:41:56 2023 Russian Standard Time (UT+4h)  she@DPX200
##.OBSERVE FREQUENCY= 81.013821
##.OBSERVE NUCLEUS= ^31P
##.ACQUISITION MODE= SIMULTANEOUS
##.ACQUISITION SCHEME= undefined
##.AVERAGES= 24
##.DIGITISER RES= 16
##SPECTROMETER/DATA SYSTEM= spect
##.PULSE SEQUENCE= zgpg30
##.SOLVENT NAME= CDCl3
##.SHIFT REFERENCE= (INTERNAL, CDCl3, 0, 248.564)
##AUDIT TRAIL= $$ (NUMBER, WHEN, WHO, WHERE, WHAT)
$$ ##TITLE= Audit trail, XWIN-NMR		Version 3.5
$$ ##JCAMPDX= 5.01
$$ ##ORIGIN= Bruker BioSpin GmbH
$$ ##OWNER= she
$$ F:/spectra/data/she/nmr/P31/1/pdata/1/auditp.txt
$$ ##AUDIT TRAIL=  $$ (NUMBER, WHEN, WHO, WHERE, WHAT)
(   1,<2023-07-07 14:40:50.92 +0400>,<she>,<DPX200>,
      <created by zg, POWCHK disabled, PULCHK disabled
       configuration hash MD5:
       00 E9 B6 7A A2 85 ED C7 34 08 36 98 17 FE 4E 26
       data hash MD5: 32K
       E7 07 F0 08 7F CE 16 E1 C5 40 3F 52 79 A1 0F 6B>)
(   2,<2023-07-07 14:40:57.06 +0400>,<she>,<DPX200>,
      <Start of raw data processing
       efp BC_mod = 2 LB = 1 FT_mod = 6 PKNL = 1 PHC0 = -10671.06 PHC1 = 50.28481 SI = 64K 
       data hash MD5: 64K
       D5 F2 7B 2B E2 56 96 78 2B 4A C0 A4 11 69 04 E8>)
(   3,<2023-07-07 14:41:17.84 +0400>,<she>,<DPX200>,
      <pk PHC0 = 192.4265 PHC1 = -443.3999 
       data hash MD5: 64K
       37 18 AD 37 60 34 66 30 40 A0 F6 6F E1 D2 76 61>)
$$ ##END=
$$ 
$$ hash MD5
$$ 84 21 2D 95 C6 DE FE C9 8D 21 26 20 81 C7 63 3E
##$RELAX= 
##$RELAX= 
##$RELAX= 
##$RELAX= 
##$RELAX= 
##$RELAX= 
##$RELAX= 
##$RELAX= 
##$RELAX= 
$$ Bruker specific parameters
$$ --------------------------
##$DU= <F:/spectra>
##$EXPNO= 1
##$NAME= <P31>
##$PROCNO= 1
##$TYPE= <nmr>
##$USER= <she>
##$AMP= (0..31)
100 100 100 100 100 100 100 100 100 100 100 100 100 100 100 100 100 100 
100 100 100 100 100 100 100 100 100 100 100 100 100 100 
##$AQSEQ= 0
##$AQ_mod= 1
##$AUNM= <au_zg>
##$AUTOPOS= <>
##$BF1= 81.014009
##$BF2= 200.13
##$BF3= 200.13
##$BF4= 200.13
##$BF5= 200.13
##$BF6= 200.13
##$BF7= 200.13
##$BF8= 200.13
##$BYTORDA= 1
##$CFDGTYP= 0
##$CFRGTYP= 5
##$CHEMSTR= <none>
##$CNST= (0..31)
1 1 145 1 1 1 1 1 1 1 1 1 1 1 1 1 1 1 1 1 1 1 1 1 1 1 1 1 1 1 1 1 
##$CPDPRG= <waltz16>
##$CPDPRG1= <>
##$CPDPRG2= <waltz16>
##$CPDPRG3= <>
##$CPDPRG4= <mlev>
##$CPDPRG5= <mlev>
##$CPDPRG6= <mlev>
##$CPDPRG7= <mlev>
##$CPDPRG8= <mlev>
##$CPDPRGB= <>
##$CPDPRGT= <>
##$D= (0..31)
0 1 0 0 0 0 0 0 0 0 0 0.03 2e-05 3e-06 0 0 0 0 0 0 0 0 0 0 0 0 0 0 0 0 
0 0 
##$DATE= 1688726450
##$DBL= (0..7)
120 120 120 11 120 120 24 19 
##$DBP= (0..7)
150 150 150 150 150 150 150 150 
##$DBP07= 0
##$DBPNAM0= <>
##$DBPNAM1= <>
##$DBPNAM2= <>
##$DBPNAM3= <>
##$DBPNAM4= <>
##$DBPNAM5= <>
##$DBPNAM6= <>
##$DBPNAM7= <>
##$DBPOAL= (0..7)
0.5 0.5 0.5 0.5 0.5 0.5 0.5 0.5 
##$DBPOFFS= (0..7)
$$ [...]
##$SUBNAM2= <"">
##$SUBNAM3= <"">
##$SUBNAM4= <"">
##$SUBNAM5= <"">
##$SUBNAM6= <"">
##$SUBNAM7= <"">
##$SUBNAM8= <"">
##$SUBNAM9= <"">
##$SW= 501.771253377433
##$SWIBOX= (0..15)
0 1 3 0 0 0 0 0 0 0 0 0 0 0 0 0 
##$SW_h= 40650.406504065
##$TD= 32768
##$TD0= 1
##$TE= 0
##$TE2= 300
##$TE3= 300
##$TEG= 300
##$TL= (0..7)
0 120 53 12 22 120 120 120 
##$TP= (0..7)
150 150 150 150 150 150 150 150 
##$TP07= 0
##$TPNAME0= <>
##$TPNAME1= <>
##$TPNAME2= <>
##$TPNAME3= <>
##$TPNAME4= <>
##$TPNAME5= <>
##$TPNAME6= <>
##$TPNAME7= <>
##$TPOAL= (0..7)
0.5 0.5 0.5 0.5 0.5 0.5 0.5 0.5 
##$TPOFFS= (0..7)
0 0 0 0 0 0 0 0 
##$TUNHIN= 0
##$TUNHOUT= 0
##$TUNXOUT= 0
##$USERA1= <user>
##$USERA2= <user>
##$USERA3= <user>
##$USERA4= <user>
##$USERA5= <user>
##$V9= 5
##$VALIST= <valist>
##$VCLIST= <CCCCCCCCCCCCCCC>
##$VD= 0
##$VDLIST= <DDDDDDDDDDDDDDD>
##$VPLIST= <PPPPPPPPPPPPPPP>
##$VTLIST= <TTTTTTTTTTTTTTT>
##$WBST= 1024
##$WBSW= 4
##$XGAIN= (0..3)
0 0 0 0 
##$XL= 0
##$YL= 0
##$YMAX_a= 4834
##$YMIN_a= -5036
##$ZGOPTNS= <>
##$ZL1= 120
##$ZL2= 120
##$ZL3= 120
##$ZL4= 120
##$ABSF1= 0
##$ABSF2= 0
##$ABSG= 0
##$ABSL= 0
##$ALPHA= 0
##$AQORDER= 0
##$ASSFAC= 0
##$ASSFACI= 0
##$ASSFACX= 0
##$ASSWID= 0
##$AUNMP= <proc_1d>
##$AZFE= 0.1
##$AZFW= 0.5
##$BCFW= 0
##$BC_mod= 2
##$BYTORDP= 0
##$COROFFS= 0
##$CY= -3
##$DATMOD= 1
##$DC= 0
##$DFILT= <>
##$DTYPP= 0
##$F1P= 0
##$F2P= 0
##$FCOR= 1
##$FTSIZE= 65536
##$FT_mod= 6
##$GAMMA= 0
##$GB= 0
##$INTBC= 1
##$INTSCL= 6.047779e-11
##$ISEN= 30
##$LB= 1
##$LEV0= 0
##$LPBIN= 0
##$MAXI= 10000
##$MC2= 0
##$MEAN= 0
##$ME_mod= 0
##$MI= 50
##$NCOEF= 0
##$NC_proc= -5
##$NLEV= 6
##$NOISF1= 182.463
##$NOISF2= 159.3651
##$NSP= 0
##$NTH_PI= 0
##$NZP= 0
##$OFFSET= 248.5645
##$PC= 4
##$PHC0= -10478.63
##$PHC1= -393.1151
##$PH_mod= 1
##$PKNL= yes
##$PPARMOD= 0
##$PSCAL= 0
##$PSIGN= 0
##$REVERSE= no
##$SF= 81.0140089999694
##$SI= 65536
##$SIGF1= 159.3651
##$SIGF2= -187.1042
##$SINO= 113.3802
##$SIOLD= 16384
##$SREGLST= <1H.CDCl3>
##$SSB= 0
##$STSI= 65536
##$STSR= 0
##$SW_p= 40650.406504065
##$SYMM= 0
##$S_DEV= 0
##$TDeff= 32768
##$TDoff= 0
##$TI= <>
##$TILT= no
##$TM1= 0
##$TM2= 0
##$TOPLEV= 0
##$USERP1= <user>
##$USERP2= <user>
##$USERP3= <user>
##$USERP4= <user>
##$USERP5= <user>
##$WDW= 1
##$XDIM= 65536
##$YMAX_p= 382946389
##$YMIN_p= -171546411
$$ End of Bruker specific parameters
$$ ---------------------------------
##NTUPLES= NMR SPECTRUM
##VAR_NAME=  FREQUENCY,     SPECTRUM/REAL,   SPECTRUM/IMAG
##SYMBOL=    X,             R,               I
##VAR_TYPE=  INDEPENDENT,   DEPENDENT,       DEPENDENT
##VAR_FORM=  AFFN,          ASDF,            ASDF
##VAR_DIM=   65536,         65536,           65536
##UNITS=     HZ,            ARBITRARY UNITS, ARBITRARY UNITS
##FACTOR=    0.620285442955139, 1,           1
##FIRST=     20137.2065510682, 0,            0
##LAST=      -20513.1999529968, 0,           0
##MIN=       -20513.1999529968, -171546411,  0
##MAX=       20137.2065510682, 382946389,    0
$$ Real data points
##PAGE= N=1
##DATA TABLE= (X++(R..R)), XYDATA
$$ [...]
42150 -1214971 -1198997 -1255539 -1224534 -1022511 -961854 -1193443 -1262804 -783558 -162668 17574
42140 17574 -15791 316327 782628 647687 46906 -83373 399778 503658 -240236 -917623
42130 -917623 -686868 -77754 -4945 -338404 -402811 -213422 -203348 -246822 15099 261175
42120 261175 -79816 -751860 -992571 -729840 -524923 -495194 -254117 168847 314955 210229
42110 210229 373107 826649 960930 519925 -39256 -299404 -290611 -71411 374848 745147
42100 745147 633905 223259 58589 109086 -179166 -844216 -1246361 -1062479 -643909 -278759
42090 -278759 65018 165888 -330223 -1017725 -953787 -85202 524376 261401 -255096 -407676
42080 -407676 -503198 -798019 -674642 264100 1128391 853482 -177971 -664779 -174510 546627
42070 546627 798448 586044 216090 26718 411057 1371061 2093808 1657497 207947
42061 207947 -1110588 -1429453 -905538 -221395 181838 291098 302153 353676 374649 242194
42051 242194 96526 207274 446433 348457 -90529 -229084 210232 530175 66898 -684549
42041 -684549 -736098 -75355 410746 358341 353352 812306 1289415 1269154 995897 1002254 1213362
42030 1213362 1067038 385043 -337214 -569981 -372009 -205499 -282108 -341949 -121001 212211
42020 212211 310800 178685 109421 155286 66607 -183758 -265788 -77588 -45578 -519685 -1178041
42009 -1178041 -1387814 -955917 -220746 402454 655871 406261 -245331 -864627 -988036
42000 -988036 -567526 4492 268152 38033 -482874 -847368 -779897 -507387 -478813 -733496
41990 -733496 -853753 -624310 -358818 -370134 -474920 -333350 -26335 53445 -216709 -484724
41980 -484724 -313821 302151 809717 587957 -287788 -970142 -824843 -255744 -82238 -344528
41970 -344528 -427135 -232860 -327901 -810658 -996114 -576977 -208981 -437947 -842732 -836872
41960 -836872 -595940 -520851 -435498 -60141 269136 118602 -260028 -389471 -376747 -543067
41950 -543067 -675595 -408967 26509 178788 105556 533 -423254 -1302218 -1862257 -1346865
41940 -1346865 -343740 -38003 -400577 -376745 248510 579370 333894 382470 1100407 1539101
41930 1539101 992828 238354 257040 641000 383612 -386780 -677423 -320527 -178065 -629174
41920 -629174 -963277 -632921 -205022 -442138 -1031052 -996829 -146571 662434 747824 404988
41910 404988 210002 144414 -55200 -150470 235715 729981 550956 -215995 -568822 -81566
41900 -81566 416730 159916 -330235 -75156 842864 1419496 1103599 290571 -405020 -712686
41890 -712686 -615997 -258941 74475 266565 513607 850531 860526 322247 -213147 -92372
41880 -92372 473637 752184 567004 363560 366931 365934 268545 248854 361756 511739 711383
41869 711383 935250 945079 724325 729648 1152085 1398065 1028915 670256 1003263 1354972
41859 1354972 579857 -918987 -1510786 -733717 99238 15570 -334237 -131833 175331
41850 175331 -175085 -847079 -994791 -669489 -656944 -1199575 -1684222 -1539928 -924813 -500080
41840 -500080 -727118 -1323135 -1461713 -790112 -67771 -244690 -1058210 -1328863 -645744 145072
41830 145072 288790 16926 -202292 -365040 -442068 -67673 742039 1325678 1343618 1251271
41820 1251271 1316767 1029797 132262 -606833 -445797 203950 514836 453739 419222 309323
41810 309323 -95898 -348046 56155 650098 578325 -77243 -508127 -474730 -407722 -384039
41800 -384039 -44535 463647 472473 -103398 -528196 -372668 -122355 -339625 -852326 -1133682
41790 -1133682 -1002412 -624384 -217273 -38060 -316968 -913447 -1285903 -1052576 -423771
41781 -423771 77516 165803 -55823 -326901 -450209 -355069 -79413 268936 555521 688899
41771 688899 711242 762576 856644 788878 431219 -12735 -290141 -472045 -706041 -807739
41761 -807739 -604184 -484708 -893581 -1354037 -897014 389181 1198553 780051 -41443
41752 -41443 -166161 308573 619716 594166 538555 440536 124073 -215670 -381815 -666604
41742 -666604 -1264353 -1660753 -1368045 -790886 -543558 -413637 54625 441849 50548 -709729
41732 -709729 -752720 -8008 498831 262184 -148249 -243003 -207077 -139319 232196 769865
41722 769865 832584 300953 -190527 -343472 -582538 -997033 -899558 -15063 762359 504056
41712 504056 -510549 -1329146 -1538706 -1322899 -825672 -131205 460531 709791 745289 708014
41702 708014 430429 -153161 -679335 -863120 -939407 -1152967 -1212020 -772872 -130452 143514
41692 143514 20702 -64044 58982 168470 149422 115624 50050 -241791 -753110 -1165573
41682 -1165573 -1202196 -903152 -522151 -279414 -209560 -168413 -15859 203208 356023 450379
41672 450379 565250 593330 332110 -166098 -631192 -947314 -1142193 -1059309 -530987 101429
41662 101429 230112 -119202 -254976 90259 334014 80455 -155495 135234 471747 135150
41652 135150 -556237 -671029 -154343 73872 -450313 -1093973 -1156030 -782052 -466607 -234097
41642 -234097 183284 704269 924551 653604 98774 -395364 -562112 -299476 194639 458825
41632 458825 222665 -186248 -180706 261267 422715 -230124 -1157416 -1228349 -149583 1043215
41622 1043215 1207145 442379 -229820 -287387 -171033 -332699 -518459 -325491 37603 31517
41612 31517 -421125 -849992 -835639 -384507 191092 500549 297186 -248451 -578894 -317586
41602 -317586 251177 510486 250244 -193496 -500861 -737937 -1056368 -1298708 -1167121 -718596
41592 -718596 -421607 -579650 -866666 -723722 -194865 38932 -345882 -735405 -458865 107463
41582 107463 32608 -706444 -1105422 -612656 134233 422720 489898 821625 1137230 907604
41572 907604 410544 340458 604175 434400 -337172 -995917 -1041854 -775363 -580002 -367897
41562 -367897 -70487 -17913 -373302 -692508 -530259 -109975 73185 5469 27088 176252
41552 176252 160527 -114998 -434462 -658754 -845255 -981303 -954825 -830957 -830259 -957586
41542 -957586 -956928 -737156 -537962 -511704 -437539 -108074 240908 242003 14861 65724 532928
41531 532928 911110 698910 38384 -513179 -633462 -412185 -73173 156279 14442 -564745
41521 -564745 -1158542 -1146946 -437281 361476 639955 436374 197259 97013 -106054 -568022
41511 -568022 -992527 -933850 -398755 46980 -90928 -596811 -802880 -506481 -240392 -397122
41501 -397122 -525739 -37526 688181 685544 -108280 -590403 -44230 789322 773334 -23382
41491 -23382 -518805 -165742 429470 467987 -56737 -554737 -652496 -519830 -485245 -545683
41481 -545683 -409968 -50539 40956 -518311 -1265236 -1331235 -672168 -202422 -436375 -704860
41471 -704860 -259716 475258 540520 -89205 -563498 -500849 -380456 -578182 -843698 -902183
41461 -902183 -856225 -759261 -426758 59647 236302 -53375 -368345 -372546 -321797 -490906
41451 -490906 -605881 -324413 89602 110161 -244573 -468287 -344908 -187834 -247240 -292376
41441 -292376 -5922 437682 504470 40506 -385636 -140577 577738 909838 508070 61382
41431 61382 282082 793792 636671 -350266 -1354981 -1753534 -1724735 -1595411 -1291615 -755937
41421 -755937 -337077 -352066 -619736 -739935 -551597 -137013 282421 328688 -216854 -932400
41411 -932400 -1082791 -593220 -134296 -44447 130810 672611 1020828 648204 -51637 -428515
41401 -428515 -550995 -760045 -789113 -251434 379468 292347 -343537 -582889 -169006 204604
41391 204604 155056 104655 272145 165430 -456392 -954488 -729865 -115899 254726 421438
41381 421438 770381 1170540 1166331 792987 500916 371546 78409 -344987 -352220 274023
41371 274023 939005 955789 426777 8569 -23557 -23169 -272248 -492243 -318237 50350
41361 50350 87934 -279018 -568387 -441019 -72326 271183 545466 610457 146655 -690241
41351 -690241 -1035758 -358615 626824 818639 251635 -81162 169267 272411 -228129 -713583
41341 -713583 -541148 -80247 -6537 -159889 90556 689944 913545 435933 -287744 -713427
41331 -713427 -733411 -484539 -125265 123197 123725 75473 266308 576807 640706 492934 535116
41320 535116 746889 532330 -306394 -965067 -564785 607513 1401466 1258349 742762
41311 742762 518153 409037 -130331 -1032407 -1647927 -1628393 -1278254 -997333 -810694 -596741
41301 -596741 -408639 -323486 -230972 -31652 136984 107363 -50851 -199568 -394199 -715051
41291 -715051 -996495 -1013603 -803538 -515980 -117996 395465 674123 366068 -275970 -621482
41281 -621482 -463987 -105868 307647 902771 1440222 1287092 355787 -533582 -658291 -266355
41271 -266355 -5999 19265 60420 9288 -410784 -931583 -906691 -189655 694753 1269768
41261 1269768 1505185 1474455 1139217 643195 397900 610267 952496 912003 362701 -324406
41251 -324406 -683010 -630749 -557950 -860281 -1381813 -1544395 -1119962 -576609 -460982 -755138
41241 -755138 -1124867 -1457418 -1748173 -1770591 -1381773 -945345 -908510 -1111156 -1050296 -661115
41231 -661115 -234962 256894 1004170 1603748 1342070 349091 -399537 -476652 -512626 -922056
41221 -922056 -1053249 -299396 684696 749112 -208483 -1272891 -1769148 -1726281 -1340046 -778653
41211 -778653 -423423 -558098 -821169 -610131 -13421 297279 86830 -217046 -358235 -575565
41201 -575565 -926160 -1016719 -715639 -480801 -592431 -644315 -254890 231996 288447 28436
41191 28436 -81293 -22218 -133880 -417059 -515614 -320021 -88955 -20461 -142672 -529630
41181 -529630 -1123365 -1419681 -926094 14877 447001 -4684 -716417 -1053292 -1183574 -1523092
41171 -1523092 -1884980 -1758466 -1163373 -656365 -562564 -664951 -664779 -570684 -559891 -719382
41161 -719382 -989541 -1189940 -1102102 -694490 -246544 -101768 -335431 -770298 -1190005 -1380214
41151 -1380214 -1138552 -505342 126077 380923 292596 115305 -64675 -233832 -179773 250832
41141 250832 733359 772337 399777 109552 91215 16621 -329943 -682461 -705747 -385109
41131 -385109 117267 615087 821292 535691 205 -357109 -563427 -951015 -1341946 -1118559
41121 -1118559 -312624 188393 -62175 -356374 -913 541058 459272 -50635 -159778 263453
41111 263453 629853 688509 679435 559795 20391 -698954 -897095 -471727 -119538 -274568
41101 -274568 -549389 -487622 -240508 -177213 -321861 -480490 -551491 -499678 -343236 -257405
41091 -257405 -342117 -293644 234887 950752 1144383 659960 96645 -54767 64843 123255
41081 123255 16347 -253999 -589343 -638930 -217125 153917 -142368 -682064 -427600 580548
41071 580548 1057335 371581 -518120 -632208 -370612 -492531 -698968 -336353 248604 278013
41061 278013 -48595 50282 448861 244867 -723623 -1606765 -1798300 -1468799 -838000 71871
41051 71871 849444 849628 169068 -386294 -506666 -694456 -1172408 -1422657 -1179154 -956476
41041 -956476 -1069063 -964390 -187257 710526 976240 793464 796365 897453 523954 -193593
41031 -193593 -418578 131155 718229 627163 48416 -405177 -568704 -683255 -808203 -773989
41021 -773989 -632571 -704674 -1074519 -1360038 -1186653 -690432 -318502 -255163 -312508 -322127
41011 -322127 -307960 -240900 17412 372702 430287 15526 -495378 -626117 -347001 85845
41001 85845 535025 851306 641564 -282244 -1366128 -1814735 -1617706 -1507727 -1839803 -2123035
40991 -2123035 -1872080 -1340271 -1027836 -903542 -584506 -31126 393486 447347 216927 -153615
40981 -153615 -601437 -966867 -952953 -432710 291492 684729 494935 21084 -238080 -189744
40971 -189744 -205799 -499099 -725246 -476998 54819 320484 190742 28245 799 -152926
40961 -152926 -546397 -835963 -742546 -473569 -328636 -238620 -31661 149610 76192 -162225
40951 -162225 -370146 -652891 -1164984 -1602977 -1477923 -893624 -518996 -631839 -691564 -191120
40941 -191120 470335 483162 -173466 -619659 -283223 291920 201353 -584429 -1221392 -1107961
40931 -1107961 -495505 59847 351873 415153 197859 -289099 -760033 -944895 -911262 -808272
40921 -808272 -529561 -2651 401087 212183 -467789 -1059781 -1204368 -977726 -528269 18550
40911 18550 347141 179208 -237324 -364350 -167665 -168197 -593337 -998628 -908316 -351708
40901 -351708 398404 1099118 1362039 812275 -235567 -810321 -412250 367535 760401
40892 760401 807350 887429 807053 161590 -696034 -927225 -433723 -44006 -324512 -840043
40882 -840043 -861630 -336914 156980 137700 -359265 -900900 -1027529 -632012 -77981 142803
40872 142803 -105786 -538598 -794856 -710686 -353850 -2159 -11811 -459969 -944105 -960974
40862 -960974 -472288 97063 376580 355603 217372 91829 -29698 -280285 -748247 -1203088
40852 -1203088 -1189793 -619665 -29048 78538 -97652 -82415 21871 -266678 -857452 -1072140
40842 -1072140 -701131 -355846 -479152 -668374 -418282 36236 177112 57034 64024 140057
40832 140057 -79992 -483731 -504678 31098 628358 790481 522852 88283 -321249 -566270
40822 -566270 -596756 -614859 -855739 -1148122 -1087690 -703897 -472181 -532928 -442748 47732
40812 47732 531658 644608 678180 955302 1072401 486442 -433013 -740118 -230879 329690
40802 329690 360061 124852 59625 97753 -1569 -174595 -268932 -347149 -448666 -392545 -126383
40791 -126383 48605 -80681 -249138 -83070 353647 658231 570293 177365 -174642 -98667
40781 -98667 418643 790943 456017 -228445 -324884 284076 600515 9450 -733308 -667944
40771 -667944 -74686 108960 -220400 -392764 -176308 56343 190313 450992 707728 587855
40761 587855 248010 173768 251528 -62500 -651856 -771728 -260921 225936 345471 467685
40751 467685 746142 772501 469296 368480 618406 639165 189339 -144138 12554 213969
40741 213969 139693 181596 485709 402562 -349821 -923636 -624026 -75323 -119641 -369808
40731 -369808 -1730 677349 704267 68638 -370128 -310639 -236120 -392129 -560909 -711412
40721 -711412 -941458 -949162 -454798 91004 124020 -35796 207931 528463 266705 -162583
40711 -162583 132321 763757 523539 -414297 -522523 525699 1138467 333379 -707611
40702 -707611 -619750 97468 262896 -7136 52608 186570 -319428 -1004636 -761434 236909
40692 236909 613820 -161293 -1093458 -1254367 -929966 -790576 -834200 -680121 -291930 88993
40682 88993 341243 427639 264449 -73126 -244222 -8924 411175 516736 60047 -635055
40672 -635055 -888963 -346390 482250 614508 -247312 -1222325 -1271496 -489721 104258 -33105
40662 -33105 -347839 -73200 765984 1511981 1704825 1427857 999935 644983 447522 393103
40652 393103 367657 234755 2136 -150657 -107377 -30599 -171155 -431929 -361178 238730
40642 238730 913912 1078316 780324 546749 533436 348609 -175487 -572936 -411038 41959
40632 41959 199279 -73555 -448995 -682805 -771416 -701813 -460926 -286906 -548431 -1248674
40622 -1248674 -1853001 -1777561 -1049186 -398648 -542115 -1279310 -1535767 -612005 801393
40613 801393 1361715 752740 -30542 -164401 30621 -31986 -154891 110672 462345 251338
40603 251338 -398644 -725032 -476499 -160318 -148786 -262394 -326342 -471972 -713276 -796016
40593 -796016 -660310 -557983 -548204 -374494 -18193 148383 10100 3884 416788 816645
40583 816645 620078 -50093 -519849 -446939 -157702 -101471 -267184 -274117 61415 409642
40573 409642 301313 -223143 -601854 -510917 -311046 -448650 -758352 -843988 -858856 -1225709
40563 -1225709 -1717612 -1620807 -884267 -292439 -263463 -290109 37329 270324 -23517 -332944
40553 -332944 29826 707528 743607 21568 -615227 -648753 -481028 -603467 -868512 -881538
40543 -881538 -619167 -333569 -167657 -138993 -269962 -488559 -549902 -268370 224422 581001
40533 581001 590987 376058 206998 137769 -61762 -481646 -743630 -444991 129018 245298
40523 245298 -202043 -432603 85883 807970 912859 447234 32802 -180373 -517113 -953909
40513 -953909 -1059622 -697767 -134804 464838 1001451 1047025 282047 -722620 -996584 -475524
40503 -475524 27248 175340 429347 856451 776963 53594 -379996 26712 445054 -20301
40493 -20301 -875525 -1082860 -665955 -382745 -322154 1630 467959 446005 -24759 -250287
40483 -250287 -110040 -228119 -761067 -1001282 -513430 164178 360150 159398 53680 225708
40473 225708 550812 899565 1122780 1051646 730067 381656 73294 -256790 -441011 -209636
40463 -209636 274314 490912 266243 -62978 -253680 -414539 -568646 -510271 -265373 -182536
40453 -182536 -382869 -594542 -678087 -809563 -999646 -975170 -706924 -503933 -428379 -223421
40443 -223421 17270 -179098 -768268 -1029365 -679344 -377001 -618203 -888563 -566780 -1557
40433 -1557 77187 -301790 -580295 -611621 -583048 -353125 306802 1035123 1232858 958037
40423 958037 752258 705550 428856 -101067 -412639 -331768 -265232 -540716 -953165 -1108722
40413 -1108722 -860920 -346249 119522 211683 -69084 -353560 -443530 -621163 -1066619 -1335058
40403 -1335058 -968338 -337224 -207009 -622154 -899704 -669308 -260131 -32119 68967
40394 68967 198244 346480 459670 448340 144597 -363413 -556329 -157558 254410 -28141
40384 -28141 -682270 -701059 146518 1009646 1187544 896371 640910 528470 433972 257759
40374 257759 -148695 -771422 -1101990 -658063 139538 369493 -31534 -164421 411006 1080800
40364 1080800 1303037 1347257 1427543 1074977 91801 -700012 -535911 77931 115257 -476454
40354 -476454 -935169 -988506 -1037201 -1163702 -889214 -62356 720970 845795 379319 -157294
40344 -157294 -408989 -426207 -479289 -727500 -1002423 -974179 -594848 -213964 -143434 -307274
40334 -307274 -457054 -503988 -468462 -335563 -166158 -165122 -460491 -947546 -1407105 -1586975
40324 -1586975 -1224262 -354466 432938 539750 189116 134258 478358 524834 10901 -377544
40314 -377544 -180527 15168 -353138 -690406 -139148 897259 1187980 424147 -453605
40305 -453605 -659908 -411171 -243543 -243675 -206887 -27876 272637 543228 483244 16656
40295 16656 -366179 -126692 481351 634056 67252 -558154 -585092 -172971 61023 -156390
40285 -156390 -578367 -823763 -711620 -337464 44285 257897 319385 260127 -13503 -512879
40275 -512879 -974618 -1108567 -917894 -571003 -141117 282717 458769 295502 85232 89342
40265 89342 114513 -109971 -385841 -352230 -102986 54819 246037 766335 1305177 1201793
40255 1201793 525131 128541 427918 845360 789423 525308 601420 927270 978700 615609
40245 615609 189428 260 47779 203336 292595 100569 -401729 -884519 -962423 -649498
40235 -649498 -324650 -270000 -405245 -470818 -344141 -150997 -117535 -313121 -537451 -508698
40225 -508698 -168190 248306 428362 234468 -190918 -490735 -354551 153448 588467 566294
40215 566294 140086 -356786 -691119 -791392 -616748 -237853 67361 88337 -27131 -37026
40205 -37026 -48506 -328895 -735198 -787228 -391574 -55002 -171052 -463546 -449538 -201009
40195 -201009 -252751 -801997 -1342138 -1222200 -404685 481283 783555 393583 -300560 -827045
40185 -827045 -905518 -526441 2338 215982 -15529 -253046 -70369 259247 131322 -413527
40175 -413527 -719151 -588552 -579599 -956604 -1134654 -667504 -71083 -12397 -310891 -486735
40165 -486735 -689507 -1185020 -1467944 -968087 -246198 -284749 -826991 -734352 70379 460133
40155 460133 87730 -15425 640386 970428 113188 -1017422 -1164062 -700571 -787669 -1267771
40145 -1267771 -976308 122656 695090 103401 -668794 -623774 -113740 100820 209093
40136 209093 803202 1541811 1456027 506248 -136538 354378 1343029 1647546 1095693 538544
40126 538544 523112 661129 443230 59397 13283 306088 478666 286180 -92314 -422264
40116 -422264 -605535 -552413 -226028 176245 373797 321440 143201 -138182 -503128 -709018
40106 -709018 -551233 -253848 -199814 -375074 -513348 -653566 -1006807 -1361782 -1262740 -786360
40096 -786360 -480710 -469995 -328475 22653 66759 -388626 -797139 -755229 -590651 -639460
40086 -639460 -651966 -452890 -477233 -955381 -1205854 -596518 263983 250012 -619883 -1196492
40076 -1196492 -831116 -128393 51949 -375311 -905770 -1112800 -900262 -463136 -148384
40067 -148384 -105411 -95368 80590 137830 -263671 -803339 -799325 -205762 294565 284522 110407
40056 110407 199001 425319 448786 234821 -74228 -446536 -804488 -886298 -581623 -167309
40046 -167309 67774 192796 350547 369854 44651 -374487 -403448 -12845 287017 104294
40036 104294 -406321 -856828 -1062257 -1006825 -652003 -59046 431218 439578 -24850 -585589
40026 -585589 -946190 -1105413 -1122880 -961230 -688810 -568870 -713347 -833279 -593422 -85388
40016 -85388 308945 401579 261817 -78012 -615629 -1120910 -1252796 -955467 -442046 147572
40006 147572 691654 809436 236378 -478039 -341075 740477 1623702 1349962 338167
39997 338167 -354880 -448407 -450169 -647502 -867781 -1064865 -1365089 -1539620 -1153230 -344309
39987 -344309 194927 186349 97796 273761 365452 36915 -296509 -17342 712512 1123919
39977 1123919 890313 455742 281190 265535 101782 -188332 -374807 -424390 -453782 -416981
39967 -416981 -191806 63757 17972 -305452 -484521 -351404 -287157 -550202 -700386 -219012
39957 -219012 545461 724698 180947 -316307 -323359 -387868 -1073125 -1960973 -2253319 -1938671
39947 -1938671 -1650137 -1591008 -1339430 -702188 -75542 208644 340992 579986 768687 632213
39937 632213 280076 74431 120617 163980 -27372 -371867 -614857 -661008 -669331 -778723
39927 -778723 -815983 -464679 210914 637736 363925 -310157 -633292 -325545 108747 94279
39917 94279 -261052 -370026 -6151 364447 208219 -307724 -458134 78712 694097 576745
39907 576745 -179661 -636813 -255908 380371 406762 -113694 -331772 134022 649147 473684
39897 473684 -188799 -468050 -28784 452952 193047 -622648 -1038379 -545347 316642 714118
39887 714118 485889 47972 -327980 -652049 -810972 -601554 -189206 -18346 -166846 -255793
39877 -255793 -112080 -24367 -163360 -256213 -109030 11291 -152451 -395738 -412967 -257677
39867 -257677 -119636 9952 137342 98339 -84372 -69140 231517 372348 63297 -319570
39857 -319570 -361419 -253822 -272993 -145053 365200 720904 341325 -288871 -207439 530939
39847 530939 962532 736221 440517 320210 -172433 -1157424 -1727358 -1228298 -325338 -27562
39837 -27562 -242745 -113655 581803 1188934 1215066 899020 659254 496371 151892 -412169
39827 -412169 -878025 -854850 -272612 475230 843996 639497 145452 -238329 -351318 -274202
39817 -274202 -164481 -142564 -200907 -197334 -45683 134005 190890 162201 130253 18448 -200446
39806 -200446 -273088 -16334 255287 111390 -294172 -431772 -238818 -141028 -223937 -105641
39796 -105641 190260 5066 -902379 -1734809 -1655094 -920982 -416267 -414831 -471214 -330238
39786 -330238 -257912 -451838 -683395 -679323 -490166 -320644 -226988 -115799 69822 227049
39776 227049 139107 -278043 -740614 -788907 -333991 177657 311696 157750 71561 107299
39766 107299 38318 -153058 -189769 20776 130271 -212811 -801587 -992783 -456198 350707
39756 350707 641657 208413 -364130 -467144 -169227 73844 125909 185647 268749 178241
39746 178241 -30560 -61270 72987 494 -367886 -628693 -511886 -242465 -37152 252708
39736 252708 649424 713100 218901 -219645 150946 1077367 1485192 830462 -259919 -830015
39726 -830015 -667884 -312173 -225155 -234438 156886 992196 1582233 1227678 162727 -593506
39716 -593506 -449079 84379 176599 -246941 -628640 -690376 -682410 -796970 -841388 -607029
39706 -607029 -233008 -68005 -333900 -939604 -1477949 -1478945 -880177 -189289 40326 -162376
39696 -162376 -305412 -106698 230230 406174 428094 549292 947286 1476261 1681264 1197314
39686 1197314 269938 -334259 -190044 223622 177118 -291524 -525894 -347599 -348749 -873038
39676 -873038 -1307202 -896158 71368 506887 -73299 -931681 -1107019 -622194 -288947 -483946
39666 -483946 -654863 -221716 471952 580955 -25022 -520480 -227319 507861 837575 475723
39656 475723 -151651 -607934 -859003 -1029657 -1134608 -1126584 -960699 -566411 33461 568655
39646 568655 727600 560369 447162 598006 800633 760220 481620 168956 -82020 -283656
39636 -283656 -336292 -62150 466453 819885 641245 155077 4509 451573 946745 761982
39626 761982 -58866 -730993 -712649 -276169 16656 13914 -98300 -226906 -374404 -417082
39616 -417082 -232007 61879 249289 269907 113012 -287716 -747183 -720412 17616 797231
39606 797231 741403 -60500 -679495 -639363 -392442 -363869 -273737 179006 593673 441448
39596 441448 -42038 -190458 97586 349515 396240 561805 894721 897800 347170 -170995
39586 -170995 -44776 384165 223226 -681933 -1445813 -1270347 -408032 276974 365913 125142
39576 125142 -111390 -341207 -638006 -853401 -751379 -297227 277417 621642 516015 130157
39566 130157 -36394 302709 802815 917044 681863 634169 901911 937423 420716 -107919
39556 -107919 16828 615053 983286 917103 802988 835897 796086 619646 574175 719324
39546 719324 723391 434236 180543 241249 387710 241311 -201116 -663810 -962046 -1017688
39536 -1017688 -732757 -134010 497473 874882 974661 897358 633808 180914 -255771 -415546
39526 -415546 -277128 -40310 102565 47810 -230774 -592144 -727121 -437897 124341 626433
39516 626433 889445 955030 926504 884839 880295 878756 784625 604732 479833 457956 374346
39505 374346 80975 -338170 -708559 -975988 -1136741 -1123142 -942522 -787446 -804866 -861885
39495 -861885 -719495 -336227 138024 509289 542611 75894 -627269 -914240 -492530 74704
39485 74704 37138 -558382 -1029748 -1066426 -995106 -1052691 -1015047 -705801 -334605 -103765 64148
39474 64148 197436 140786 -25688 57311 357323 283235 -383771 -922516 -621677 120137
39464 120137 334119 -145407 -571814 -427624 35140 391579 513360 358768 -93739 -557834
39454 -557834 -629449 -416889 -466597 -916862 -1270152 -1193253 -969895 -891775 -772307 -425824
39444 -425824 -102239 -21993 38733 236706 217270 -250914 -618401 -220745 661551 1111278
39434 1111278 806132 270989 -29302 -160175 -240803 -171720 -16157 -81221 -381327 -497972
39424 -497972 -222205 94899 115966 61622 338993 885133 1217322 1014679 425968 -106448
39414 -106448 -205747 113050 377606 91958 -673990 -1319930 -1414258 -1113559 -776251 -456755
39404 -456755 -26746 401758 471812 -21559 -876629 -1606054 -1778437 -1358443 -767063 -486639
39394 -486639 -572900 -694590 -637032 -523428 -496844 -476287 -370488 -286585 -349281 -508830 -686353
39383 -686353 -901949 -1076587 -924030 -302420 453622 817372 655624 341582 298579 577055
39373 577055 885154 932602 713838 470215 380310 358560 240612 65598 -4778 29183
39363 29183 42766 57081 163619 180097 -237484 -1018459 -1580288 -1533853 -1194270 -1114130 -1326873
39352 -1326873 -1367813 -942521 -285522 155052 199661 34446 -109797 -273449 -620321 -962959
39342 -962959 -751361 173958 1080761 1085867 290804 -360504 -324204 62899 393888 730485
39332 730485 1057706 952969 309356 -220917 -119639 154880 -93159 -612931 -567862 112560
39322 112560 565569 215025 -546205 -1048330 -1131903 -1009169 -806536 -551226 -328742 -184884
39312 -184884 -20794 241276 495464 582776 517218 470510 512349 435525 -14402 -676737
39302 -676737 -989450 -735193 -510084 -922113 -1492291 -1149152 88067 853645 295207
39293 295207 -700481 -847378 -246180 115090 44038 165648 556996 581359 107897 -224371
39283 -224371 -181102 -362798 -1086228 -1712507 -1604242 -1073219 -817887 -913076 -906983 -605103
39273 -605103 -277479 -228247 -454553 -654373 -505153 -106594 -58806 -731786 -1557456 -1606660
39263 -1606660 -875188 -330430 -542309 -998776 -1084451 -984711 -1084343 -1116804 -654560 -50125
39253 -50125 -85835 -796650 -1334000 -1074196 -341278 114854 -21246 -460883 -737905 -616493
39243 -616493 -199715 205894 326939 99331 -303458 -573571 -483300 -106693 225944 290294
39233 290294 180077 43737 -185214 -556043 -822959 -773116 -665205 -885057 -1267492 -1276603
39223 -1276603 -824555 -350477 -53882 340960 920309 1287266 1168569 779761 353926
39214 353926 -134282 -507963 -284484 528559 1084186 690126 -249054 -812428 -740985 -495268
39204 -495268 -428056 -487304 -580191 -681009 -632253 -294429 126778 275904 144593 44085
39194 44085 94326 31251 -429595 -1186150 -1713145 -1440311 -353976 765002 1007184 308889
39184 308889 -580151 -1125321 -1462702 -1691457 -1445642 -640713 -9517 -215890 -865333 -1094579
39174 -1094579 -810639 -611985 -721679 -775563 -571766 -299626 -39034 290763 463481 92874
39164 92874 -659847 -1133753 -1051446 -803561 -728941 -668763 -417479 -94968 168704 479541
39154 479541 869057 1102236 1005625 681562 267471 -183799 -493463 -431850 -148304 -127905
39144 -127905 -542824 -1010845 -1152306 -999161 -697611 -250822 215684 378880 201675 81017
39134 81017 204748 201009 -174398 -445617 -64349 671858 978775 682336 306844 142231
39124 142231 -67223 -390183 -373406 195803 729917 544296 -206104 -798979 -942358 -951315
39114 -951315 -1004063 -825332 -267056 302326 483513 350391 153214 -139784 -605449 -963214
39104 -963214 -909417 -660515 -616666 -630529 -266319 269798 264414 -284176 -456744 158873
39094 158873 672633 205946 -716128 -991036 -632886 -557475 -942558 -1009746 -519879 -302117
39084 -302117 -866897 -1481155 -1271043 -509416 -74735 -147129 -198346 49327 395061 728705
39074 728705 1142796 1492867 1435218 983244 565465 453794 538203 712443 1021543 1294465
39064 1294465 1103740 371833 -346878 -529515 -358878 -366349 -621696 -736641 -575451 -432182
39054 -432182 -410563 -145217 561262 1210632 1140655 384804 -401654 -756493 -758879 -651232
39044 -651232 -561248 -607824 -830531 -934363 -559374 62832 214610 -302606 -756207 -452780
39034 -452780 287775 595861 198176 -384134 -582603 -264750 368800 910119 887177 237496
39024 237496 -433137 -470271 51372 566878 853243 1085803 1199472 877307 250008 -41404
39014 -41404 284647 724191 688697 220753 -234369 -413097 -348980 -200508 -172794 -371090
39004 -371090 -600774 -555171 -257494 -16619 70095 177560 286438 136165 -242733 -449173
38994 -449173 -339426 -231076 -261793 -82530 480851 949738 786950 101537 -594266 -979277
38984 -979277 -967492 -576612 -110919 -50284 -366141 -397763 145963 554973 65659 -997283
38974 -997283 -1691060 -1694310 -1346189 -787331 44477 714842 551734 -293347 -881571 -778260
38964 -778260 -541342 -667552 -825230 -564461 -125449 34639 48487 347979 837836 964072
38954 964072 538572 7834 -153866 23789 181316 117368 -15826 74666 481507 978732
38944 978732 1252527 1203903 956682 644675 334502 89056 -98704 -399938 -938225 -1481005
38934 -1481005 -1596585 -1160982 -474453 147807 620577 887290 832119 551511 392845 494664
38924 494664 551353 290560 -51889 -55639 234047 330054 -36217 -549775 -658122 -131348
38914 -131348 717863 1245488 969120 43984 -759533 -742618 10982 739605 832154 388789
38904 388789 -90655 -363135 -585645 -899082 -1144894 -1099477 -814113 -539520 -390470 -287499
38894 -287499 -212574 -281003 -482695 -589740 -492031 -429637 -642967 -908262 -717413 66707
38884 66707 963193 1345858 1033997 396813 -19517 16982 209647 67148 -466726 -879637
38874 -879637 -754781 -345359 -168898 -223580 -82086 298173 417670 6345 -570936 -916442
38864 -916442 -1128027 -1393828 -1502178 -1228762 -894998 -980479 -1328756 -1311265 -791924 -390482
38854 -390482 -615497 -1163973 -1356700 -980496 -386592 76778 383418 594887 625126 406558
38844 406558 133765 117603 388461 614378 498540 146083 -77322 23838 312956 540868
38834 540868 594252 543948 548027 672971 743381 489876 -37936 -400193 -330763 -152718 -277568
38823 -277568 -499081 -313733 151942 201160 -345637 -819968 -738628 -475351 -450703 -334553
38813 -334553 237833 685827 149077 -1081946 -1741296 -1237886 -287430 278795 508004
38804 508004 747551 821068 431423 -73005 -70056 350902 437339 -131300 -746988 -703169
38794 -703169 -131040 229673 -15974 -559639 -916061 -922341 -628386 -73535 554892 820300
38784 820300 482631 -93610 -360768 -296670 -248844 -202669 167196 713097 846409 558965
38774 558965 590208 1154571 1350167 523718 -545903 -761952 -395494 -521470 -1158388 -1260544
38764 -1260544 -496650 243887 313630 102614 33862 -131639 -500672 -566946 -126025 214387
38754 214387 75991 17532 486574 880022 515458 -154751 -267887 57519 83170 -190219
38744 -190219 -105097 394997 613026 199719 -449011 -896485 -988794 -531261 498731 1384508
38734 1384508 1207970 133289 -657602 -538426 -157492 -283056 -718478 -841275 -575420
38725 -575420 -258000 4693 285061 435639 245375 -159836 -432168 -398991 -123092 246344
38715 246344 483111 358032 -96234 -579480 -901922 -1114729 -1175789 -870280 -272663 102839
38705 102839 -66768 -437689 -489519 -227026 -39627 -90162 -232672 -378506 -550293 -662886
38695 -662886 -626738 -630555 -953077 -1450956 -1557077 -926857 98138 791472 723072 98822
38685 98822 -497002 -653351 -454871 -277568 -325104 -477991 -579680 -674679 -874556 -1147934
38675 -1147934 -1366476 -1446277 -1346768 -1052379 -653932 -320288 -89024 176838 519437 735907
38665 735907 640983 331628 29319 -197144 -363215 -364624 -100295 254035 352850 99545
38655 99545 -229329 -337630 -245152 -193500 -314368 -488239 -510389 -327711 -86051 22484
38645 22484 -91818 -395847 -744514 -874147 -557002 74422 490271 298300 -239898 -496299
38635 -496299 -257688 100027 253554 352702 607589 824536 710176 417175 372786 628194
38625 628194 771869 547489 211620 112231 185244 135893 -39223 -58041 112510 98651
38615 98651 -289342 -607018 -324374 303773 444625 -135962 -652062 -385154 276018 405027
38605 405027 -169611 -772986 -932555 -827062 -663915 -315975 185251 398821 87281 -360734
38595 -360734 -491993 -405594 -428789 -505611 -354582 -21766 172303 144464 127737 266543
38585 266543 425853 385944 11049 -700024 -1490676 -1849171 -1430663 -516847 165939 179167
38575 179167 -190072 -294660 121423 615749 551216 -114940 -714430 -649265 -89251 343425
38565 343425 374728 183260 -122820 -577926 -917399 -684827 46995 627382 733136 753203
38555 753203 968620 977379 434074 -180951 -179951 304366 561365 331807 -31143 -257679
38545 -257679 -399147 -459187 -360388 -241584 -282215 -288212 40899 497455 563672 205969 -80510
38534 -80510 -48885 27679 -69282 -212638 -353756 -704978 -1269939 -1626132 -1422778 -776809
38524 -776809 -26410 566802 763495 417318 -207735 -566131 -482688 -344082 -475413 -697670
38514 -697670 -699318 -465959 -116760 296777 572441 350339 -338331 -888030 -860092 -556524
38504 -556524 -444203 -390115 -32639 385376 265971 -347637 -732367 -524278 -140431 24272
38494 24272 167345 479941 558456 -11129 -835979 -1119562 -741177 -333046 -293890 -329925
38484 -329925 -138599 6163 -284635 -825397 -1048176 -733335 -216785 57092 -57619 -376516
38474 -376516 -557056 -382543 -30925 72298 -194110 -479711 -540710 -629006 -922814 -941662
38464 -941662 -165651 950609 1337620 728630 -2092 -97658 179713 219775 -8870 -169669
38454 -169669 -193779 -181940 -34699 301734 476240 103001 -669509 -1341660 -1645408 -1617253
38444 -1617253 -1318510 -865862 -557802 -588002 -755966 -767380 -657291 -618821 -612703 -484179
38434 -484179 -301639 -256222 -362597 -518838 -686947 -788046 -656486 -326480 -81049 -2784
38424 -2784 152959 409844 399144 74732 12122 489185 860740 516444 -82810 -138115
38414 -138115 174593 68955 -481716 -760601 -577751 -522807 -902899 -1336226 -1528523 -1632060
38404 -1632060 -1670589 -1359914 -692193 -54965 355347 634789 677060 274824 -262303 -332502
38394 -332502 68038 411993 574695 857796 1111552 848336 319187 354378 885255 808726
38384 808726 -239287 -1155793 -1038869 -469983 -350840 -496372 -345292 -191532 -601950
38375 -601950 -1230217 -1304133 -876361 -602906 -614293 -533223 -337549 -325677 -444005 -457748
38365 -457748 -560485 -1012303 -1403260 -1119327 -372858 71566 74988 178753 552534 761357
38355 761357 620536 440637 290397 -188055 -998671 -1524644 -1334780 -704622 -94917 368386
38345 368386 661145 624906 274604 -48204 -113087 -94635 -226751 -451085 -581050 -542303
38335 -542303 -306846 135371 592454 712953 364308 -214745 -703430 -930428 -812353 -374614
38325 -374614 82105 150951 -179390 -423945 -166905 447886 933467 1012749 799308 520482
38315 520482 230416 -151899 -569329 -721057 -389608 163848 396959 156157 -157663 -255305
38305 -255305 -414538 -935061 -1487674 -1525780 -1149663 -962604 -1097471 -1010437 -403094 219850
38295 219850 263439 -91486 -192735 105021 252607 -150930 -731717 -840135 -482067 -332800
38285 -332800 -727993 -1057142 -559627 512892 1107596 753245 115878 -46278 124742
38276 124742 82566 -135664 -58106 337531 544697 301547 -82911 -219224 -45518 283128
38266 283128 553035 524273 143397 -257650 -278930 35194 289322 304869 286020 455890
38256 455890 832468 1302119 1589590 1270030 252344 -798851 -1027012 -426194 161556
38247 161556 183708 -17142 53401 230510 45282 -459004 -758862 -574714 -156506 141005
38237 141005 240569 233547 144096 -32749 -164155 -34931 374789 763943 789877 474825
38227 474825 211994 316431 666257 842095 541267 -155848 -810047 -938417 -511766 -117672
38217 -117672 -323256 -857799 -859231 -77190 676652 610972 14994 -252083 36606 366677
38207 366677 339144 38909 -314965 -521427 -313078 308459 759972 525420 38625 194934
38197 194934 957284 1254170 478009 -696888 -1356790 -1475761 -1475482 -1300902 -670075 118309
38187 118309 386229 2228 -478523 -596307 -436410 -270228 -165533 -56097 92588 274109
38177 274109 403753 297563 -92070 -455806 -419751 -68779 119091 -70566 -303633 -226338
38167 -226338 -2058 -50140 -406216 -646827 -424704 169176 785902 1123352 1017369 502594
38157 502594 -86195 -311074 -115936 80340 -37084 -250150 -237945 -170556 -419538 -827728
38147 -827728 -830854 -328847 125122 150433 23837 108302 297818 341572 265317 110121 -312836
38136 -312836 -981916 -1387709 -1199193 -859651 -956832 -1287226 -1181408 -576279 -89301 -77503
38126 -77503 -270982 -392307 -537070 -797791 -1031393 -1189347 -1443936 -1790992 -1898816 -1550490
38116 -1550490 -942239 -398286 -70469 -23409 -290799 -686019 -840597 -613957 -254092 -22057
38106 -22057 115712 273541 340004 90701 -483528 -1101122 -1417418 -1292944 -886430 -497813
38096 -497813 -302138 -273278 -335385 -425620 -403609 -156911 136342 168431 40170 232289
38086 232289 826397 1223402 987659 499031 304171 296763 134079 4229 220728 432295
38076 432295 137833 -260855 59446 883929 1078592 321994 -370305 -232319 151695 -70985
38066 -70985 -683908 -909951 -671861 -541911 -750885 -955102 -864378 -566215 -275608 -128204
38056 -128204 -156443 -225694 -116627 155451 305615 221448 168060 359768 629078 761825
38046 761825 859642 1064606 1167226 839457 157603 -369148 -283449 379272 1049093 1050209
38036 1050209 276706 -595309 -835592 -529820 -361322 -602311 -826386 -653887 -232661
38027 -232661 147683 376550 292593 -293144 -1096657 -1437935 -1126121 -753605 -789423 -915756
38017 -915756 -659142 -167803 117838 151431 157760 170391 135484 162646 273721 224451 -60095
38006 -60095 -248704 -176843 -208576 -563129 -750982 -289685 391184 441890 -242744 -1001630
37996 -1001630 -1393051 -1567511 -1726540 -1800661 -1697668 -1418717 -915852 -200844 444573 695442
37986 695442 545275 175393 -351256 -957766 -1350929 -1317706 -1012438 -635326 -146287 340500
37976 340500 325530 -366949 -1067027 -1100157 -753745 -644681 -543151 150348 1004127 878049
37966 878049 -237773 -941161 -408922 434036 422082 -94339 72390 1090532 1930767
37957 1930767 1835961 1099046 347231 -231488 -723696 -1048948 -1034122 -760084 -574914 -711913
37947 -711913 -963991 -857724 -248601 370509 390447 -132145 -539006 -460973 -262130 -418434
37937 -418434 -822420 -1016444 -848677 -530859 -214435 97977 283448 131163 -290271 -593835
37927 -593835 -517021 -198724 82636 247720 348826 333670 111231 -181969 -217186 114237
37917 114237 453332 302773 -404662 -1184655 -1471561 -1124106 -458060 87864 247082 20689
37907 20689 -360635 -591084 -518313 -236819 63088 257545 240627 -135431 -851188 -1479378
37897 -1479378 -1420626 -540988 544100 1004247 607181 -132228 -622006 -821655 -1046475
37888 -1046475 -1289282 -1089187 -214462 798345 1111710 537782 -264995 -589899 -441530
37879 -441530 -388669 -814966 -1458291 -1684992 -1206653 -501848 -359204 -891959 -1267265 -743524
37869 -743524 233025 500278 -271426 -1124378 -1121450 -517265 -192437 -386877 -599450 -500392
37859 -500392 -285420 -136989 62737 306029 228440 -377146 -1098347 -1305918 -924031 -510746
37849 -510746 -555767 -927611 -1126691 -927686 -570514 -353716 -280062 -209294 -156271 -219985
37839 -219985 -324130 -271548 -28612 252461 468477 612118 613579 374729 -27895 -380464
37829 -380464 -562896 -565787 -389609 -195764 -391355 -1127423 -1809953 -1668056 -840768 -293020
37819 -293020 -506616 -909084 -900587 -772019 -1063687 -1536155 -1479814 -804197 -181141 -168137
37809 -168137 -668342 -1214610 -1392247 -1034386 -361069 107974 69423 -199432 -231517 23652
37799 23652 266664 346476 343874 286929 149082 61162 196742 491052 738912 882472 945296
37788 945296 820474 430773 -19103 -254869 -280258 -230956 -64833 247736 413928 151596
37778 151596 -274658 -331291 -3681 172547 -79768 -400954 -382484 -161545 -194889 -643071
37768 -643071 -1171013 -1298998 -897103 -352898 -174042 -395385 -578897 -470635 -308882 -270574
37758 -270574 -57446 525547 967798 654523 -155862 -636348 -567902 -503303 -762851 -1020616
37748 -1020616 -1031952 -1029291 -1111549 -936010 -429719 -185326 -606828 -1152639 -1053806 -443130
37738 -443130 -101186 -269942 -418087 -191065 68479 -32058 -276839 -189439 244973 570989
37728 570989 478681 137086 -97862 -102481 -36019 -77533 -201274 -216574 -22834 196824 125430
37717 125430 -278028 -619555 -489270 -7990 254452 -54701 -696750 -1187063 -1246177 -806588
37707 -806588 47401 869070 979192 300441 -226818 305160 1457322 1906230 1215347
37698 1215347 336649 156794 390616 366830 153719 223916 527376 638624 506632 375692
37688 375692 196700 -213088 -581896 -422560 186959 652457 680561 510794 354969 169826
37678 169826 30012 170323 531036 746851 724642 766733 957004 904100 373699 -214069
37668 -214069 -276076 176090 595952 594553 298734 71532 104829 310373 455379 341715
37658 341715 -52408 -511732 -710426 -540999 -331904 -538633 -1112502 -1430020 -1091336 -516148
37648 -516148 -335983 -431326 -174980 465420 801258 503302 68070 -51654 -68930 -244072
37638 -244072 -318869 -43442 319141 501178 683008 960044 965790 561649 258911 347184
37628 347184 301196 -215287 -503552 71417 821815 712113 51513 -61986 385238 399133
37618 399133 -210718 -528402 -174806 84357 -278769 -717707 -606756 -126336 261964 404415
37608 404415 190657 -495926 -1267833 -1458104 -1099996 -881669 -959407 -768927 -249483 -168614
37598 -168614 -799588 -1340278 -1218198 -968439 -1144156 -1317076 -967766 -518407 -569681 -798612
37588 -798612 -555049 -22772 128250 -152166 -376068 -381010 -350142 -259883 -13002 150847
37578 150847 32733 -33411 276266 547843 162718 -670508 -1142484 -969457 -613720 -437018
37568 -437018 -263895 155105 714725 1072784 950103 381399 -185986 -298784 -147866 -378706
37558 -378706 -1043779 -1364778 -943548 -509646 -813663 -1422294 -1460325 -1027367 -878014 -1038383
37548 -1038383 -837491 -211241 99232 -230413 -620889 -556732 -261326 -140665 -211132 -346570
37538 -346570 -543318 -713540 -688328 -566936 -593436 -627325 -296138 238506 289579 -392098
37528 -392098 -1227833 -1582870 -1389736 -837043 -68345 530705 388850 -456096 -1106206 -824440
37518 -824440 41463 565120 354517 -229206 -668587 -696615 -329262 127441 250114 -33461
37508 -33461 -296767 -141496 339143 800654 1054292 1019001 618961 26550 -320769 -256964
37498 -256964 -103438 -60477 143453 570362 606862 -125000 -858522 -594931 345834 718837
37488 718837 227594 -131404 216634 557142 261016 -73068 288532 829083 559148 -346895
37478 -346895 -809361 -483010 -54150 41476 134104 400160 417494 7985 -287381 -47435
37468 -47435 345914 345679 51309 -93438 5268 156536 288811 355458 160826 -282655 -509180
37457 -509180 -159686 432328 634114 310997 -149674 -425500 -474050 -300863 98682 608803
37447 608803 1050638 1281960 1120189 452945 -369278 -633812 -112325 534574 604763 277724
37437 277724 224018 599553 977249 1059408 890462 506450 -68845 -548665 -594469 -254246
37427 -254246 185442 606816 912071 765876 66175 -582565 -556531 -203597 -396908 -1184063
37417 -1184063 -1696676 -1460952 -985212 -844123 -921497 -874636 -734364 -683705 -691882 -652661
37407 -652661 -528822 -220799 302953 687019 517102 49678 22371 582707 1026524 834020
37397 834020 343545 82991 29270 -70745 -168687 -141723 -105532 -73170 276289 1019659
37387 1019659 1547604 1230574 310197 -341147 -220477 412938 1003496 1200050 981054
37378 981054 601238 399120 455334 480978 179197 -365298 -773465 -761330 -367448 97955
37368 97955 278971 80441 -204301 -192045 152201 499736 552540 307509 -26666 -227243
37358 -227243 -238811 -275924 -595967 -1043216 -1086481 -536779 88734 240184 39041 -83842
37348 -83842 -82729 -118937 -53263 248877 409548 55494 -392360 -230817 383630 637080
37338 637080 327914 70065 197722 324648 142074 -114369 -185289 -123604 14311 213487
37328 213487 223686 -118497 -363719 4885 600384 574163 -53714 -490271 -546502 -777974
37318 -777974 -1171617 -960276 -61944 529274 267934 -164372 -139998 -28915 -221914 -269896
37308 -269896 238519 840293 989641 887554 846686 649930 229057 146001 649959 1047467
37298 1047467 775859 326594 305541 357650 -74220 -613810 -539200 25929 409723 445062
37288 445062 429936 458148 509572 773790 1228436 1377657 1031406 786249 1083955 1405610
37278 1405610 1116726 503976 209560 215269 161936 110798 206503 140367 -278934 -586126
37268 -586126 -436605 -288898 -537852 -686020 -260453 195350 57249 -183422 203183 790877
37258 790877 747285 398792 656736 1297846 1279969 563511 172282 462233 696829 459040
37248 459040 206426 184288 -51562 -683306 -1178749 -1140905 -805431 -432316 35120 476926
37238 476926 508417 149649 -66716 99169 255316 60102 -266621 -321581 -14930 431235
37228 431235 669281 417121 -232380 -779471 -867522 -660502 -411143 -48355 401694 463057
37218 463057 -126853 -798215 -833254 -328355 135588 373995 467693 198689 -555224 -1211281
37208 -1211281 -1138443 -660960 -550102 -768144 -644661 -135036 81749 -226942 -480667 -229382
37198 -229382 274556 620441 770179 878758 995940 1046180 889695 505344 231403 461675
37188 461675 945723 967632 463652 190396 405967 357062 -303786 -685063 -170399 313660
37178 313660 -222968 -1035718 -799746 183172 560513 190916 107781 497406 468653 -155760
37168 -155760 -478471 -163828 58402 -183196 -339117 -136281 -69868 -320593 -348109 41635
37158 41635 301097 191353 205694 575733 837748 755408 715346 830854 610126 -47498
37148 -47498 -435473 -125439 325289 262744 -153468 -410341 -400806 -257896 46312 490565
37138 490565 795019 784352 652921 629952 663539 591608 373366 75396 -164663 -198589
37128 -198589 -79201 -51984 -157543 -152198 -33774 -165028 -553100 -618240 -166387 76331
37118 76331 -436768 -1077231 -938704 -178114 374449 452327 360663 216816 13160 -5909
37108 -5909 212058 226046 -54546 64901 857239 1390198 931389 229629 249437 571825
37098 571825 394063 166881 642265 1145216 621447 -244413 65451 1279514 1652245
37089 1652245 773368 79510 440647 1069792 1134022 835942 532784 166910 -114698 30852
37079 30852 341762 232695 -156438 -263466 -228262 -536464 -868736 -599127 -65575 33565
37069 33565 54834 703257 1412126 1138445 329693 241912 674729 392188 -459528 -500771
37059 -500771 376958 832555 529661 610592 1394658 1675798 846302 -102366 -256559 112425
37049 112425 536647 1005255 1352093 1314903 1263266 1601986 1745511 1138095 729779 1628012
37039 1628012 2899211 2846789 1905252 1834228 2496011 2174237 905216 570400 1518779
37030 1518779 1994948 1325829 872670 1282170 1521752 1272399 1607020 2580055 2733276
37021 2733276 1750062 1111080 1407483 1464179 775819 331047 437302 263438 18666 863347
37011 863347 2185449 1921349 183359 -540667 463642 1048588 183649 -373257 377881
37002 377881 827235 -14426 -607578 121209 849143 591583 498830 1274899 1626392 932201
36992 932201 672439 1563808 2038047 1177955 402547 679652 882068 428009 633341 1901140
36982 1901140 2546199 1937078 1749174 2632646 2890719 1963675 1750399 2847508 3119109
36973 3119109 1767799 1033102 1920416 2188551 724147 -125970 1048884 2060047 1371944
36964 1371944 926029 2045783 2651006 1400592 505018 1486766 2278330 1487144 1244048
36955 1244048 2748145 3465528 1999847 1110688 2471450 3248172 1548018 299500 1794840
36946 1794840 3418701 2886803 2536616 4176134 5093858 3613674 2935491 4891222 5978799
36937 5978799 4360785 4101001 7278590 9250411 7484832 7040819 10818879 13246881
36929 13246881 11094107 10868168 16825907 22172095 22159977 24240995 33433248 40996130
36921 40996130 42309490 50677662 74189872 96620412 109354478 145031137 236556504
36914 236556504 345963360 382946389 310362053 192056304 113412443 88820604 76673866
36907 76673866 54605816 37563144 35469417 35603464 29208494 24166423 24919121 23292019
36899 23292019 15696127 10404459 11576461 12078157 7779623 4733336 6637511 7948160
36891 7948160 5019782 2713946 4415873 5654379 3090737 766019 2091883 3716127
36883 3716127 2447749 1038725 2227715 3524253 2471884 1269224 1991020 2577545
36875 2577545 1378243 629211 1879511 2760958 1617100 732593 1806486 2682519 1672254
36866 1672254 836023 1885658 2881102 2047772 1089758 1743875 2579715 2074601 1537462
36857 1537462 2235742 2753514 1839501 953119 1507334 2342498 2204908 2030700 2651477
36848 2651477 2927035 2212760 2044577 3379788 4711619 4784591 4635765 5186009 5446087
36839 5446087 4918188 5134104 6925722 8712257 9349880 10149437 12199544 14254848 15298859
36830 15298859 16717823 19715692 22747226 23691954 22666601 20755649 17941180 14284414
36822 14284414 11266371 9876522 8944632 7176804 5270132 4345517 3957666 3358574 3071199
36813 3071199 3466561 3391075 2017417 598635 603636 1438896 1710097 1446780 1376897 1206429
36803 1206429 367672 -499631 -441816 214078 528530 457459 505647 643483 631931 673865
36793 673865 846992 703165 209961 187922 1069505 2134968 2633251 2712803 2681438 2373820
36783 2373820 1799389 1411973 1303787 1127613 1011311 1372715 1791431 1505627 1013267
36774 1013267 1466567 2504457 2762055 2636140 4035418 6806623 8067081 6249121 3415155
36765 3415155 2138080 2249717 2263809 2022075 2096757 2169537 1819182 1668173 2163770 2382896
36755 2382896 1508874 389970 239768 807473 1132388 1164327 1432793 1947499 2430464
36746 2430464 2852837 3074305 2944863 3199505 4830114 7018135 7404911 5261606 2666859
36737 2666859 1560518 1417155 990914 503094 595167 728010 247274 -270604 -193595 -87828
36727 -87828 -459543 -590825 12119 406903 -124169 -619818 -159850 379818 -70677 -782239
36717 -782239 -588886 21942 10946 -193963 298765 867145 416105 -445405 -289522 695336
36707 695336 1088806 571204 38025 -211700 -618933 -984939 -650160 96668 314925 -1859
36697 -1859 -23728 367676 450389 -2962 -452804 -583705 -540866 -329925 78714 274766
36687 274766 -78670 -544837 -539272 -262797 -212774 -262521 -81693 52160 -243699 -640252
36677 -640252 -631508 -373789 -216967 -11369 350428 425018 72119 19704 690465 1312132
36667 1312132 1147169 698162 640721 529550 -206192 -913254 -749698 -256916 -415421 -812397
36657 -812397 -317431 885138 1473459 930244 -36573 -763130 -1084975 -806651 71049
36648 71049 830673 852310 659937 1092712 1807014 1751512 828724 -47978 -314321 -144265
36638 -144265 233963 619548 560107 -39059 -385153 175514 1028585 1169157 733958 599191
36628 599191 894819 1029935 837926 628099 419414 106785 21286 384185 651414 349810
36618 349810 37727 426621 1117390 1288673 1059023 1020634 1006052 546082 6612 -6534
36608 -6534 137661 -216777 -622513 -234058 514401 403942 -649296 -1552297 -1716586 -1480187
36598 -1480187 -1059122 -373595 237814 351774 343722 815012 1421392 1422785 1027703 944052
36588 944052 990981 525332 -96300 64122 882047 1379556 1388799 1587494 2052346 2223264
36578 2223264 2183718 2558766 3289622 3960601 5120982 7576517 10346848 11104390 9053498
36569 9053498 5942389 3820335 3031050 2731468 2195027 1231750 251648 61368 794350
36560 794350 1286154 536986 -633966 -716988 145688 542924 189723 111140 539801 573771
36550 573771 91078 86404 741562 989314 463533 124909 414163 510171 40832 -159299
36540 -159299 297668 569312 210020 8328 398073 581575 102271 -238459 16868 -18004
36530 -18004 -883343 -1526740 -988147 -51470 119306 -108243 317435 1247881 1679186 1359075
36520 1359075 828364 352115 -122879 -369781 -165232 207757 465348 854239 1535123
36511 1535123 2027732 1955157 1756577 1997771 2564103 3155749 3938446 5088112 6387418
36502 6387418 7893864 10194877 13205586 15452043 15458123 13340281 10334629 7387541 4961123
36493 4961123 3503281 3096976 3041679 2614992 1931674 1451964 1160803 901744 953109 1503632
36483 1503632 2044885 2027981 1662279 1381364 1065252 540829 271077 664134 1179903 1044049
36473 1044049 463454 224327 424148 534891 453107 516327 612661 217039 -668410 -1414122
36463 -1414122 -1665102 -1657957 -1582449 -1269288 -643521 16897 415391 504140 408400 356597
36453 356597 590337 1079221 1496760 1730443 2112623 2791388 3232949 2874238 2017327 1488372
36443 1488372 1528558 1595630 1254972 725490 403073 263175 5699 -390570 -533464 -114796
36433 -114796 586993 939574 739588 439569 399126 352099 51750 -58971 413165 801405
36423 801405 171186 -1024836 -1321726 -427639 262094 -200170 -926552 -719470 105418
36414 105418 448545 174092 -363 135235 132373 -119166 -185051 135615 510434 581792
36404 581792 333293 -3025 -129009 61553 247485 32498 -371394 -352086 72152 157666
36394 157666 -355185 -770484 -598458 -299901 -291587 -128980 538114 1045113 691365 -53757
36384 -53757 -298622 -87822 -34412 -148018 -56655 71172 -143270 -434322 -347520 -141281
36374 -141281 -269140 -430690 -160709 160193 17099 -81701 547230 1340306 1442117 1527088
36364 1527088 2789185 4509419 4999445 5089231 7875408 13790394 18376687 17094854 10910476
36355 10910476 4952503 2490567 2424191 2358265 1772429 1465171 1598015 1566942 1134334
36346 1134334 695344 564706 572906 389214 -25236 -336884 -188646 313409 550260 43376
36336 43376 -860437 -1221208 -524848 701391 1413187 1098168 206699 -401246 -312734 170487
36326 170487 515536 536382 432534 420816 531321 719771 954538 1132476 1081515 758540
36316 758540 356899 124211 104290 102041 -113201 -568353 -1019035 -1136743 -799128 -181726
36306 -181726 430264 840686 948612 714725 237832 -230139 -471707 -466280 -305136 -43059
36296 -43059 264849 470739 424022 148493 -149301 -262340 -171399 -68106 -151041 -370227
36286 -370227 -484493 -436188 -454854 -615613 -588357 -180522 161451 -62121 -533056 -548916
36276 -548916 -235972 -427856 -1184444 -1427055 -519164 698074 1136277 931643 819186
36267 819186 706272 -24673 -1148594 -1687923 -1321633 -681253 -167704 524455 1430530
36258 1430530 1785737 1004523 -401176 -1386513 -1480266 -971454 -376911 -118270 -432070
36249 -432070 -1164335 -1754069 -1726727 -1183504 -647848 -496150 -666354 -860644 -898047 -832130
36239 -832130 -757291 -600132 -250061 137147 237818 48459 -36459 188958 421689 386411
36229 386411 323334 537124 784925 629507 179362 -70506 11359 150828 260140 484661
36219 484661 704067 587809 190707 -59334 -35358 -49893 -252521 -417457 -419441 -390052
36209 -390052 -296170 84669 621521 819081 548330 261810 266960 309176 112011 -203936
36199 -203936 -508543 -909801 -1282291 -1115996 -278676 564881 785076 607104 590693 714375
36189 714375 591643 279335 188336 344855 384481 229916 180963 313224 353301 251336
36179 251336 335342 664885 688000 -67967 -1188137 -1670271 -1080344 -129798 120787 -458262
36169 -458262 -916417 -506611 255192 297621 -453470 -978469 -723804 -411719 -810718 -1443758
36159 -1443758 -1324681 -504181 61591 -25317 -244455 -269642 -463434 -990084 -1298488 -956343
36149 -956343 -342359 -15060 50709 88651 -58441 -536064 -907076 -700258 -248703 -241469
36139 -241469 -615015 -683619 -329811 -202103 -548664 -702470 -165214 499065 477013 -83473
36129 -83473 -404889 -347878 -554561 -1314356 -2005809 -1934124 -1225178 -550883 -307279 -420368
36119 -420368 -721974 -1089062 -1271415 -996709 -388016 -6687 -247949 -801251 -940378 -356300
36109 -356300 499722 986421 992310 886666 886202 808556 510483 225477 217120 311715 96445
36098 96445 -494586 -1090860 -1374767 -1388561 -1318256 -1230996 -1113462 -954223 -693837 -293499
36088 -293499 59824 55248 -287263 -505111 -275877 64438 -110902 -894962 -1674335 -1800533
36078 -1800533 -1211932 -363698 228604 299066 -88712 -602027 -886244 -875189 -779940 -721603
36068 -721603 -562095 -235258 -10662 -122287 -286988 -28654 516488 627844 39743 -540002
36058 -540002 -362879 299817 599324 358254 171388 319263 376720 105951 -28675 311822
36048 311822 628005 313807 -340181 -572474 -326436 -288191 -819775 -1502493 -1799632 -1628587
36038 -1628587 -1172756 -602786 -124834 87316 138484 272161 439748 369036 91004 -25184
36028 -25184 147590 300339 203378 7663 -128990 -318924 -641057 -904975 -928911 -766292
36018 -766292 -507601 -170381 95774 75321 -90868 32379 494073 788191 621984 374424
36008 374424 431053 537009 309450 11670 213596 888992 1433979 1495840 1255775 915854
35998 915854 419059 -235043 -811211 -1110684 -1138513 -934892 -528179 -125316 -47636 -333143
35988 -333143 -630652 -649494 -538082 -626888 -905526 -994407 -675930 -251417 -179047 -441435
35978 -441435 -564669 -336961 -159343 -409705 -779288 -712691 -298718 -98973 -143047 149226
35968 149226 846852 1088362 281886 -872773 -1216794 -623451 -5337 -46883 -551489 -949726
35958 -949726 -888108 -340450 356046 570597 -35541 -942552 -1214424 -566838 382699 941243
35948 941243 974068 650156 59258 -673425 -1264045 -1557269 -1708458 -1854234 -1819792 -1400305
35938 -1400305 -769889 -347509 -318906 -485354 -545340 -370326 -37171 265424 373044 312590
35928 312590 323618 578430 875538 793169 242309 -313003 -392204 -128653 -55015 -295301
35918 -295301 -396391 -113810 102688 -194238 -622693 -417909 437636 1136583 1123352 680956
35908 680956 322840 154473 86237 195523 515446 778754 705617 363400 46499 -7661
35898 -7661 301164 841880 1167889 917581 401497 327455 790809 1081269 740214 216698
35888 216698 95064 258831 325676 363000 538553 522111 -21632 -657229 -669188 -155296
35878 -155296 123453 -85505 -249076 -5200 287617 165909 -286558 -644172 -667178 -465897
35868 -465897 -364764 -638397 -1178366 -1501150 -1333907 -1035919 -1115360 -1517912 -1804822 -1847110
35858 -1847110 -1835735 -1741846 -1357990 -842042 -608899 -616645 -365225 233981 570533 199285
35848 199285 -490100 -821178 -686742 -482667 -444751 -458523 -435170 -511519 -793693 -1102778
35838 -1102778 -1117962 -736700 -186952 249498 501104 575103 332873 -285402 -881133 -889786
35828 -889786 -347051 90188 54852 -102856 -56085 -74506 -385408 -527898 -57581 475485
35818 475485 91760 -1164760 -2107082 -1854473 -814950 -43477 -51862 -459416 -581010 -212706
35808 -212706 143259 -75452 -676128 -946518 -771956 -858714 -1501851 -1889449 -1302723 -340927
35798 -340927 -56846 -386197 -468804 -174767 -167664 -591713 -839481 -664464 -468669 -383724
35788 -383724 -92050 291690 197864 -319192 -512200 -242489 -296673 -982845 -1440937 -936729
35778 -936729 51362 676342 865711 959648 912962 562309 124476 -207872 -643701 -1192683
35768 -1192683 -1267785 -550039 269419 334154 -185273 -433649 -84702 448033 765380 830659
35758 830659 728854 586808 589337 694773 560400 81606 -325586 -339704 -224400 -269914
35748 -269914 -195790 312430 847958 738733 43019 -543914 -652321 -532901 -469324 -437939
35738 -437939 -358160 -243745 -77100 141281 238414 43897 -319165 -539621 -450169 -107790
35728 -107790 320006 632770 745481 816956 967096 902568 308754 -363383 -206032 799859
35718 799859 1493018 1038799 40055 -426207 -233058 22153 77773 27959 -257308 -863025
35708 -863025 -1303853 -1110920 -673873 -662348 -885523 -670358 -179595 -277411 -1047985 -1510462
35698 -1510462 -1070567 -328996 -58088 -165362 -157839 -2847 29970 -25839 97101 421871
35688 421871 669214 580666 151321 -324574 -418694 -6365 470427 454287 -45599 -529803
35678 -529803 -680539 -560246 -237072 258108 600140 386478 -177423 -364422 89854 605978
35668 605978 631026 381831 335718 407040 144698 -461893 -874648 -710856 -221029 25469
35658 25469 -239555 -767143 -1134087 -1199677 -1134592 -1058341 -905708 -746651 -897509 -1410438
35648 -1410438 -1731212 -1293251 -281140 631178 1131365 1359619 1332963 940809 468908
35639 468908 400339 598237 418671 -176708 -407992 77044 539141 285763 -231512 -195680
35629 -195680 253181 363755 110681 210195 837027 1239588 853989 80609 -369676 -346552
35619 -346552 -136686 65396 174021 52452 -257075 -385705 -100488 275314 286934 40001
35609 40001 31807 352388 538052 314332 19152 30430 154858 -12146 -350786 -335998
35599 -335998 138627 544291 473651 192440 144492 239013 65232 -352107 -530176 -308899
35589 -308899 -161915 -483627 -954777 -1003687 -648724 -402764 -438757 -404373 -165980 -157915
35579 -157915 -633859 -1041033 -711450 82218 429023 85903 -224710 18204 367819 201020
35569 201020 -306946 -557621 -463080 -371665 -337727 -156852 -5483 -323402 -991494 -1279856
35559 -1279856 -827816 -163541 3728 -384494 -834511 -896331 -464109 224722 713728 688888
35549 688888 323956 52110 6545 -12373 -84725 -114407 -183358 -453849 -720302 -630829 -377470
35538 -377470 -499604 -921682 -962599 -494789 -231730 -510964 -695276 -323928 27319 -233595
35528 -233595 -638271 -494543 -132064 -298582 -805561 -835955 -275151 298595 705110 1195713
35518 1195713 1559901 1285569 593287 267342 392670 282417 -209068 -354144 190398
35509 190398 781193 837705 620633 533841 459023 261236 217855 439148 535509 368352
35499 368352 469769 1144676 1766203 1607288 876235 285895 25136 -183131 -349008 -216038
35489 -216038 204685 650238 977642 1082440 723151 -82402 -758748 -804063 -499143 -474675
35479 -474675 -804780 -1076474 -1132042 -1127263 -1018588 -650935 -271172 -284547 -511479 -361485
35469 -361485 197302 534093 360110 125879 153972 93781 -319571 -619470 -355207 14906
35459 14906 -234909 -839157 -803207 69652 778920 539772 -163511 -458979 -414910 -720367
35449 -720367 -1361762 -1527015 -889493 -155055 -167 -163533 -114220 -47220 -465824 -1089509
35439 -1089509 -1048027 -196730 533957 368698 -325641 -652779 -351069 87693 199389 13408
35429 13408 -183415 -220864 -145368 -95488 -105647 -41079 186834 409847 420284 337163 434947
35418 434947 636207 613479 452134 652230 1232102 1425091 736777 -192369 -412591 -12723
35408 -12723 90164 -446075 -976034 -927168 -554314 -375543 -419311 -379855 -130073 232859
35398 232859 547482 556473 62646 -615516 -724273 10042 862731 952090 346026 -176261
35388 -176261 -268460 -293748 -487662 -536948 -224819 78923 -37100 -388208 -521200 -394716
35378 -394716 -297216 -285042 -161006 80926 227251 241367 294746 402658 420771 421458 641796
35367 641796 977062 985990 577886 251724 388502 712849 792935 699366 732483 788466 517330
35356 517330 -35107 -456467 -602654 -731268 -964145 -1060307 -851573 -535922 -361226 -306448
35346 -306448 -271389 -350129 -674361 -1096760 -1253516 -963039 -452331 -122635 -105259 -139883
35336 -139883 19926 190168 -7966 -520138 -831363 -690926 -465173 -500100 -527455 -130499
35326 -130499 502364 805859 638715 342333 126785 -70882 -194903 -92196 88416 55227
35316 55227 -68613 95879 451150 466196 39172 -321423 -330409 -283222 -360587 -269402 82232
35305 82232 226840 -87255 -370178 -171870 161390 117178 -86039 72900 476990 617216
35295 617216 526794 682251 1076743 1166931 795159 463095 509680 610159 371340 -14631
35285 -14631 -41034 420599 951695 1033051 563585 -30055 -235517 -39683 87581 -139976
35275 -139976 -469691 -594417 -609758 -659081 -516918 -17424 423005 304072 -156972 -337642
35265 -337642 -142928 39079 151642 446142 683005 241774 -790307 -1462835 -1213209
35256 -1213209 -566491 -246696 -266819 -293472 -264792 -189104 75113 370882 179780 -477266
35246 -477266 -719384 -37192 769863 695997 48492 -97163 390168 607801 141807 -399393
35236 -399393 -518638 -516327 -712285 -819582 -567687 -310675 -493739 -953456 -1210343 -1127566
35226 -1127566 -887180 -602736 -333998 -261400 -489966 -814812 -945782 -851792 -701648 -607511
35216 -607511 -581459 -598383 -580335 -465426 -351843 -382777 -471990 -406112 -226880 -172107 -211376
35205 -211376 -63100 242363 305318 40388 -93495 171673 440054 289081 -58047 -137801
35195 -137801 33997 108607 -15494 -199897 -405239 -612651 -653414 -508170 -503838 -813304
35185 -813304 -1069449 -923052 -650575 -683354 -851824 -702331 -300642 -62373 19001 289883
35175 289883 714074 920479 895813 947164 1009067 674473 -52126 -663031 -844524 -698954
35165 -698954 -325895 191084 469906 221368 -118174 68138 484830 310582 -339127 -447813
35155 -447813 211279 601490 81097 -595209 -577114 -197288 -148125 -264050 -51331 262331
35145 262331 178467 -83473 10574 292189 169176 -340396 -666927 -591308 -362527 -85437
35135 -85437 329974 736718 863157 732699 486799 20560 -701015 -1244850 -1187071 -744893
35125 -744893 -417100 -285102 -184594 -200147 -387478 -378668 65769 465766 297049 -89453
35115 -89453 -5396 427998 518303 149637 -182710 -314792 -506108 -694574 -533306 -126178
35105 -126178 87771 108442 218045 196224 -363905 -1048920 -993374 -300479 -12768 -502679
35095 -502679 -982926 -896264 -686167 -739417 -620621 2326 558828 434552 -52139 -243543
35085 -243543 -163801 -261047 -556859 -702606 -590583 -363643 -42856 405928 820459 1007614
35075 1007614 997436 897938 689644 319501 -214905 -919733 -1646582 -1928040 -1433239 -572592
35065 -572592 -90317 -41178 158379 583955 523664 -356380 -1336854 -1597034 -1214836 -731363
35055 -731363 -287071 235226 623544 493680 -130728 -781181 -1003147 -729606 -385925 -581648
35045 -581648 -1351310 -1842844 -1306705 -223665 315098 209123 318371 845495 1012134
35036 1012134 630583 615273 1295163 1569811 703862 -257423 -92059 596423 428651 -444342
35026 -444342 -702816 -148990 17190 -755633 -1538080 -1461263 -858922 -399464 -89028 276842
35016 276842 433540 63336 -562840 -878024 -688491 -220457 249962 537221 521190 232676
35006 232676 -128414 -393492 -573044 -752744 -926681 -984202 -844669 -596892 -438835 -401469
34996 -401469 -270248 30283 184642 -22172 -197037 110942 543362 398741 -108417 -50623
34986 -50623 610207 775574 11472 -587357 -104743 704145 659355 6021 -182818 224882
34976 224882 542044 671600 1033786 1348108 866694 -190621 -718545 -397814 -122200
34967 -122200 -491217 -937652 -751574 -87773 490002 773375 826769 710583 601711 715485
34957 715485 914090 853627 591807 496847 503987 124849 -657608 -1171695 -983077 -462537
34947 -462537 -163409 -138209 -145736 -109337 -106880 -212698 -494909 -899882 -1131890 -972342 -652754
34936 -652754 -533603 -549976 -440875 -348564 -598015 -1015550 -1122895 -921245 -805316 -788661
34926 -788661 -554608 -198888 -96183 -64946 413179 1095268 1108264 358973 -235580 -250466
34916 -250466 -406651 -1198458 -1899426 -1701167 -1021715 -809423 -1126370 -1274322 -930824 -386154
34906 -386154 77463 373672 388030 132753 -59688 34948 137442 -66184 -338690 -264395
34896 -264395 29148 41021 -355879 -807293 -1024140 -1024353 -894236 -679218 -500042 -496149 -646204
34885 -646204 -806596 -874739 -813962 -639360 -469892 -454369 -595586 -799818 -1050217 -1283670
34875 -1283670 -1227530 -789553 -502784 -962732 -1789805 -1880366 -908623 160880 428650 196924
34865 196924 208671 416979 267881 -223736 -494618 -352824 -179412 -258778 -468031 -619875
34855 -619875 -647348 -456697 -9974 434363 509827 192328 -194325 -392786 -400343 -299727
34845 -299727 -136065 40613 136039 -6448 -548464 -1372333 -1908294 -1652850 -920078 -573444
34835 -573444 -842806 -1004364 -566392 -123366 -451675 -1285157 -1720070 -1478367 -993989 -499632
34825 -499632 107179 574002 388515 -277943 -555093 -134370 179548 -339436 -1188936 -1326035
34815 -1326035 -641601 -20253 -16900 -184290 80190 588618 696897 269982 -200380 -358248
34805 -358248 -353149 -357885 -222420 103462 229451 -140607 -618262 -605957 -200503 -38986
34795 -38986 -291248 -440305 -173718 135065 105801 -32467 104458 387905 399099 74753
34785 74753 -266876 -418288 -488392 -659953 -928455 -1079107 -923416 -644615 -747082 -1367035
34775 -1367035 -1819967 -1352597 -264382 377717 191892 -113910 -4295 60028 -458812
34766 -458812 -1187708 -1449087 -1283804 -1137101 -972408 -480551 140343 406785 366120 431542
34756 431542 508229 55188 -936344 -1718353 -1704670 -1089584 -412408 21545 130333 -103345
34746 -103345 -540448 -878729 -903447 -638530 -266461 -40455 -160524 -517421 -684892 -412878
34736 -412878 6082 115699 -123355 -410913 -581852 -684503 -751600 -808944 -943849 -1086631
34726 -1086631 -983792 -710867 -850439 -1681141 -2533481 -2563088 -1902298 -1368843 -1247346 -1140475
34716 -1140475 -914011 -899785 -1065315 -848190 -100625 530170 509856 90090 -253909 -458796
34706 -458796 -579192 -449232 -97784 9185 -352054 -678533 -470414 -54701 -73441 -451939
34696 -451939 -566960 -301646 -208270 -544851 -806423 -501705 75812 252781 -93310 -417577
34686 -417577 -289722 51393 85836 -234621 -410000 -113560 285620 189729 -361175 -669785
34676 -669785 -311433 279080 411734 80603 -83641 260640 676516 531439 -166076 -736668
34666 -736668 -591352 121029 660782 452498 -327946 -943799 -888586 -409147 -128889 -228704
34656 -228704 -272350 71280 462095 368705 -96958 -313348 -102996 9290 -297328 -526120
34646 -526120 -107290 656271 991322 770645 564360 655391 710448 533273 454482 683247
34636 683247 849603 587782 134714 -72571 -56820 -140011 -386309 -616874 -791548 -980981
34626 -980981 -1065423 -809713 -225807 352276 549889 255685 -232834 -378940 29086 501486
34616 501486 389279 -224438 -676216 -770103 -972401 -1389229 -1396133 -734370 -146631 -241172
34606 -241172 -462004 -48820 602447 562105 -96233 -492223 -404146 -381661 -506023 -254930
34596 -254930 285203 276619 -455177 -947025 -537898 159906 319994 93579 38763 57328
34586 57328 -280211 -814945 -1021819 -895375 -881762 -1044930 -955239 -432608 122718 263800
34576 263800 18883 -243744 -272015 -157796 -187114 -494689 -890821 -1097642 -1073062 -920280
34566 -920280 -587594 10696 609375 743866 378280 3920 -19270 129930 114926 -119194
34556 -119194 -421796 -614932 -497997 -56192 257419 -81624 -867766 -1291311 -1038427 -662757
34546 -662757 -607873 -557975 -194319 107039 -35243 -233975 -25310 159771 -377211 -1320196
34536 -1320196 -1662602 -1207207 -781902 -891221 -1067689 -801146 -298317 46864 271529
34527 271529 525719 677074 629485 580474 607028 442027 13523 -264336 -144490 -18523
34517 -18523 -250253 -492235 -260542 202798 342975 261778 458138 772665 530573 -202501
34507 -202501 -483903 60488 553508 178039 -600409 -853393 -616696 -599447 -865496 -826014
34497 -826014 -435894 -370899 -848804 -1199078 -960204 -600032 -650676 -820648 -603862 -236343
34487 -236343 -303930 -726095 -889935 -653962 -500826 -689039 -905969 -880857 -772356 -748463
34477 -748463 -665245 -423699 -261812 -400514 -676804 -794547 -712939 -535132 -229811 220935
34467 220935 525845 294892 -413386 -1020548 -1033550 -570438 -141760 -16257 -20771 28543
34457 28543 -20209 -358641 -766818 -808427 -455416 -164822 -259044 -575757 -863126 -1134286
34447 -1134286 -1371968 -1245418 -530353 387251 825786 556949 -27904 -386653 -231512
34438 -231512 352348 924084 1012673 687739 551399 861759 1026757 449282 -459135 -761467
34428 -761467 -304552 166923 160963 -18891 19335 171094 176970 33296 -136876 -208155 27733
34417 27733 597429 981001 600779 -251609 -637506 -261986 185077 216769 268609 780701
34407 780701 1312826 1217760 633648 134419 -158723 -433974 -535172 -191208 323279 455441
34397 455441 194703 21691 124946 240751 221933 219913 298693 346097 373021 472014 503408
34386 503408 248829 -157795 -381458 -420195 -536909 -713472 -685144 -504832 -503119 -617006
34376 -617006 -363574 324536 817399 649868 163464 -84573 -99879 -176109 -222501 44393
34366 44393 432415 413333 -68294 -462746 -395469 -100085 109268 324762 664476 795256
34356 795256 350038 -354146 -570311 -113076 415159 518631 411278 441209 408978 -35181
34346 -35181 -639821 -817635 -548658 -409459 -672134 -959478 -948973 -869513 -1012989 -1204251
34336 -1204251 -1124077 -832578 -592229 -404188 -99205 252892 382336 228440 40515 62649
34326 62649 285484 512358 576506 496233 417153 364869 179276 -143163 -243028 113443 515036
34315 515036 401784 -13054 -5688 426974 436582 -288537 -890518 -662379 -188984 -357873
34305 -357873 -876683 -775523 4198 573352 487822 173876 -36843 -343307 -800201 -1062078
34295 -1062078 -1042175 -1096386 -1308521 -1276459 -870530 -549301 -626638 -838581 -938265 -1100909
34285 -1100909 -1383285 -1385452 -889972 -332086 -202185 -428161 -731183 -1100459 -1487262 -1529809
34275 -1529809 -1083093 -573752 -329343 -36284 559612 917584 414249 -580047 -1148195
34266 -1148195 -1099580 -964404 -899451 -542860 20100 101263 -516766 -1143532 -1166717 -810623
34256 -810623 -544545 -365549 -133720 -80946 -427486 -867167 -984946 -923725 -1095569 -1390467
34246 -1390467 -1215199 -333901 739132 1279409 1052602 439249 20331 41797 210023
34237 210023 85348 -307404 -473380 -117019 491159 975868 1324887 1616587 1643432 1228163
34227 1228163 645208 257260 -54107 -580660 -1093855 -1077314 -590694 -239061 -214379 -50889
34217 -50889 447702 706090 215724 -634444 -1055382 -844931 -423087 -158777 -125019 -322478
34207 -322478 -671984 -877271 -708786 -385580 -336696 -632250 -963018 -1117656 -1153841 -1147184
34197 -1147184 -1102298 -1083996 -1115095 -982827 -504526 31025 95711 -346447 -753601 -773771
34187 -773771 -665632 -721349 -694017 -212847 497079 807074 537133 156191 46819 -10526
34177 -10526 -370595 -855970 -961390 -620254 -321455 -361558 -399272 -48404 414575 402508
34167 402508 -78046 -422284 -348536 -249010 -430004 -583275 -415745 -312385 -774887 -1486704
34157 -1486704 -1603563 -911339 -92202 219519 112173 4618 81153 338005 764633 1176048
34147 1176048 1180885 653374 41854 -110493 151605 275089 -69185 -588202 -774828 -545533
34137 -545533 -307972 -408313 -690880 -771494 -650950 -742144 -1196590 -1539310 -1251762 -495469
34127 -495469 77060 95835 -265034 -669863 -897468 -824750 -543684 -467353 -894945 -1442474
34117 -1442474 -1352156 -491428 365620 450198 -140021 -704392 -779180 -461571 -85923 161026
34107 161026 330340 524588 627910 311870 -538728 -1506776 -2000031 -1880148 -1485685 -1108727
34097 -1108727 -773444 -482691 -301475 -172431 2170 90132 -87280 -318756 -198742 213332
34087 213332 433417 341304 373163 729286 954647 649167 115045 -131974 -136114 -328690
34077 -328690 -812826 -1253666 -1379188 -1251208 -1065743 -902607 -679627 -298950 109498 186887
34067 186887 -180908 -503922 -206532 522118 884665 546578 19073 -177911 -168137 -261032
34057 -261032 -372661 -289011 -102290 -8045 15859 28126 -56549 -213877 -226256 -74186 -8146
34046 -8146 -24438 226214 728713 860069 250185 -616099 -1065936 -1014175 -679080 -103380
34036 -103380 538339 735344 345795 -20810 63700 119346 -309877 -636551 -130665 650780
34026 650780 530028 -390271 -728288 156345 1266118 1448381 851811 389174 414393 506669
34016 506669 206602 -487194 -1191332 -1454532 -1111673 -429632 166037 442552 350552 -76704
34006 -76704 -565481 -646437 -232022 128045 -23826 -386625 -439710 -275027 -278682 -349675 -204985
33995 -204985 -168905 -738844 -1496474 -1445025 -504377 279534 225056 -174492 -245415 -110588
33985 -110588 -210941 -506179 -663346 -597664 -416763 -176507 11882 -37886 -283833 -455171
33975 -455171 -479484 -546516 -683887 -705746 -632377 -668093 -723375 -520849 -219146 -275893 -596364
33964 -596364 -566199 -133450 -51684 -678879 -1308416 -1212630 -682061 -419806 -461786 -383510
33954 -383510 -175724 -195489 -442497 -522142 -304799 -148009 -384042 -840106 -954966 -374626
33944 -374626 502907 739779 -82104 -1180286 -1428735 -756483 -57660 179324 279027 351803
33934 351803 -75431 -978390 -1379232 -666767 389180 684002 206665 -322835 -650160
33925 -650160 -976576 -1209857 -1105411 -872897 -857799 -853434 -455180 131670 352530 159009
33915 159009 -89933 -350851 -783636 -1124468 -963404 -522344 -366239 -417377 -67218 735867
33905 735867 1322236 1298827 939668 477756 -188716 -873356 -980812 -384901 210545 193676
33895 193676 -187961 -354441 -209371 -22638 105213 232480 298001 215555 56246 -119228
33885 -119228 -403066 -803116 -1096637 -1133685 -1058734 -1030213 -963428 -774664 -637578 -722302
33875 -722302 -861096 -762952 -458967 -270135 -358830 -517438 -436879 -78653 267667 299815
33865 299815 70969 -42917 180265 490628 493412 176968 -126995 -220222 -171401 -16784
33855 -16784 308776 678703 753852 408712 -53820 -243469 -77787 202278 234264 -212018
33845 -212018 -931930 -1309033 -994624 -502793 -647340 -1362568 -1671449 -1016984 -33118 349551
33835 349551 32603 -444494 -735362 -786729 -512268 19044 349473 185679 -63540 87413
33825 87413 318775 -2747 -665975 -852520 -475971 -277020 -438962 -201346 708795 1322412
33815 1322412 863363 81047 187264 1057480 1535708 1172309 599432 335611 256257 271896
33805 271896 543183 843021 599017 -145302 -588266 -289410 283581 610300 762924 841338
33795 841338 556211 -112809 -557112 -430820 -260703 -524352 -746231 -289723 465538 616565
33785 616565 78733 -411663 -419211 -139040 228275 649669 897870 736782 407091 294945
33775 294945 268024 11596 -202718 95007 591046 525536 -54695 -360717 -190451 -138287
33765 -138287 -354511 -244301 270154 358428 -276793 -649911 22165 980541 1005846 177077
33755 177077 -431143 -371758 -183742 -340482 -685355 -870651 -715069 -158405 619435 1086376
33745 1086376 810621 -16855 -824323 -1275615 -1365276 -1163830 -839095 -693673 -803893 -842202
33735 -842202 -599757 -403761 -619561 -1019128 -1100445 -818868 -549218 -480893 -463102 -333016
33725 -333016 -71096 229902 312960 -76887 -729431 -1001700 -599176 43346 452595 717636
33715 717636 1018882 1099007 753167 370010 360475 466886 290967 82158 248651 459441
33705 459441 93531 -650542 -960140 -609819 -159901 -27607 -102489 -215060 -278879 -66453
33695 -66453 461679 784286 528606 275115 708962 1235261 656654 -812915 -1573229 -938734
33685 -938734 -79190 -148297 -728623 -891852 -702106 -705135 -777586 -529276 -247795 -416205
33675 -416205 -697062 -367888 475686 1025344 923131 545695 228748 -58027 -276206 -219517
33665 -219517 68314 266731 212137 -23185 -419940 -973473 -1450184 -1594377 -1496842 -1379847
33655 -1379847 -1175211 -763330 -441534 -577246 -899429 -783140 -255356 -52656 -533942
33646 -533942 -1164325 -1320340 -1029268 -606251 -134056 265936 176001 -504130 -1051346 -708723
33636 -708723 207324 687159 451211 224615 447912 530230 -124459 -985559 -1032478 -214281
33626 -214281 492431 415101 -145559 -652612 -1013952 -1257149 -1196007 -892759 -920929 -1563549
33616 -1563549 -2121389 -1715723 -599068 55805 -311409 -994684 -1058515 -434498 301959
33607 301959 753084 887994 734190 339719 -50717 -130497 131109 471571 659198 700297
33597 700297 704957 638690 295594 -411310 -1158728 -1411738 -1055366 -638103 -728125 -1169961
33587 -1169961 -1323908 -966025 -531987 -429649 -539181 -552149 -434223 -322290 -243892 -163976
33577 -163976 -84055 81810 465854 883643 824967 120425 -641120 -761955 -351728 -159197
33567 -159197 -525754 -959486 -871948 -346287 93111 219496 264352 421718 548262 466569
33557 466569 314409 374966 666282 904602 837161 442547 -135337 -627562 -674119 -150404
33547 -150404 498878 622652 190067 -144777 -17722 76513 -397964 -1064591 -1134480 -620862
33537 -620862 -311411 -528698 -651804 -107754 755095 1152301 820508 122076 -528201 -973990
33527 -973990 -1185064 -1109153 -686897 18425 637298 566284 -446117 -1777482 -2384607 -1918292
33517 -1918292 -1067501 -669619 -839156 -1153838 -1298741 -1205131 -858823 -356005 13452 61888
33507 61888 -20182 72355 343413 570831 656856 652768 548354 301789 23685 -95390 -19807
33496 -19807 125253 232397 269628 245656 240463 353366 490892 368147 -91976 -523630
33486 -523630 -531219 -216469 -5931 -30756 -20756 163632 259702 37378 -272470 -264156 62695
33475 62695 305936 220798 -24353 -238252 -542790 -1061772 -1491322 -1375340 -769764 -225043
33465 -225043 -27177 132830 542770 932937 889687 483835 82918 -218764 -534990 -738774
33455 -738774 -588017 -229388 -87524 -254903 -444760 -554341 -788919 -1157024 -1332786 -1181429
33445 -1181429 -1001732 -1054641 -1196482 -1152081 -857356 -415496 -2450 139571 -38501 -136644
33435 -136644 244287 784933 753274 129141 -254867 37222 364510 43758 -584655 -772847
33425 -772847 -538669 -445837 -531896 -308125 249615 530413 256549 -58495 94135 483818
33415 483818 557135 224910 -151204 -335833 -394647 -375788 -186794 141958 354278 285207
33405 285207 82223 -84430 -340952 -822168 -1200357 -996900 -420636 -304745 -900978 -1316683
33395 -1316683 -714929 382310 745550 132718 -508950 -463905 3256 424930 783252
33386 783252 1083136 1040354 622659 298222 340706 429513 303446 227034 390037 443683
33376 443683 152326 -43320 286647 769129 761412 326684 48750 131068 266808 222459
33366 222459 45482 -150483 -202423 87836 603390 865251 674947 422520 385847 222261
33356 222261 -342296 -853256 -810315 -530703 -582966 -785242 -610438 -238056 -260374 -560813
33346 -560813 -473183 13271 181600 -228662 -685516 -848902 -1018529 -1381321 -1620732 -1564540
33336 -1564540 -1509919 -1604739 -1554856 -1242921 -1014654 -1024694 -882964 -325722 257956 357615
33326 357615 30107 -252061 -150585 318327 809112 821857 221526 -424566 -500299 -271462
33316 -271462 -515329 -1226298 -1519769 -1015178 -428415 -382895 -474444 -115621 414698 512441
33306 512441 310522 403233 821318 1015371 701771 117101 -454813 -881862 -1009000 -771899
33296 -771899 -441159 -359821 -479844 -465165 -168287 251832 544067 471204 -74221 -804464
33286 -804464 -1153903 -949822 -663668 -675070 -668748 -222613 368917 468756 66507 -272489
33276 -272489 -317481 -380918 -610876 -697681 -423505 -5759 270203 369317 344648 220328
33266 220328 119525 157710 163404 -112402 -482143 -470259 -45874 298093 336519 423587 747682
33255 747682 845133 310346 -458109 -780340 -671213 -709857 -1098836 -1442198 -1426984 -1182043
33245 -1182043 -910362 -658409 -531298 -640142 -709198 -275996 485448 718579 70767 -615824
33235 -615824 -412884 320507 490889 -12079 -137878 634161 1401227 1156334 235997 -301507
33225 -301507 -233233 -216643 -500767 -545143 -73816 285134 -176705 -1264541 -2126102 -2202088
33215 -2202088 -1623338 -887897 -436117 -406819 -585020 -669897 -683253 -916395 -1363476 -1503665
33205 -1503665 -917129 81661 738106 686767 206712 -280355 -648339 -954736 -1159227 -1128265
33195 -1128265 -843738 -497139 -353548 -509576 -783180 -898476 -794015 -642838 -513439
33186 -513439 -171490 589689 1480851 1820562 1222010 71626 -807482 -962618 -689036
33177 -689036 -571963 -762382 -863406 -525892 63596 435612 410601 176234 -113098 -483367
33167 -483367 -840984 -864702 -409192 195144 491139 429447 334268 424462 611221 730625
33157 730625 705454 436855 -182445 -984273 -1464591 -1257153 -591341 -54763 61815 -54426
33147 -54426 -189556 -388835 -647321 -661443 -227779 319862 485777 334432 384834 768747
33137 768747 989405 685385 168217 -96419 -150617 -305633 -544003 -595592 -420883 -206848
33127 -206848 -26838 104366 5911 -366954 -516208 130088 1288652 1900764 1342408 152644
33117 152644 -658727 -694295 -333331 -102385 -168372 -328653 -298029 -29834 219747 229685
33107 229685 138409 222145 429010 446468 211803 -10845 -107149 -267773 -538199 -611514
33097 -611514 -309961 38010 -10166 -429101 -772067 -684195 -224940 208305 214888 -199404
33087 -199404 -551646 -449683 -176369 -331747 -896938 -1164357 -747447 -123111 116093 38738
33077 38738 11209 30126 -71561 -123497 100536 353079 231032 -177172 -523334 -859952
33067 -859952 -1393862 -1732338 -1213997 -79945 534833 104120 -549394 -500247 -31731 -7900
33057 -7900 -429388 -499781 36887 521478 475947 295111 488264 834842 792540 348883
33047 348883 -62953 -254872 -376150 -469229 -451427 -457522 -659846 -763129 -280501 579346
33037 579346 934439 406269 -318569 -486920 -274066 -254920 -385738 -216167 202047 376672
33027 376672 202097 13183 -108133 -356799 -550461 -224233 501794 896918 669462 319380
33017 319380 178264 -128016 -819030 -1294869 -968336 -216293 195483 243419 485317 1026271
33007 1026271 1370963 1224470 808533 379537 -19590 -283164 -219114 77456 209730 -37876
32997 -37876 -474323 -801821 -870100 -623903 -111426 385512 502005 176388 -290057 -594190
32987 -594190 -668608 -557804 -303996 -45745 -27862 -348576 -767328 -900448 -640808 -317195
32977 -317195 -339226 -684799 -919115 -828442 -766750 -1056179 -1299607 -862604 36754 445203
32967 445203 51269 -317073 8997 457286 104678 -882314 -1516785 -1398946 -1009508 -719247
32957 -719247 -362424 101497 260456 -125751 -696874 -970293 -884196 -663870 -454989 -258072
32947 -258072 -13368 305864 511795 248091 -470286 -971823 -684127 -22150 112646 -346802
32937 -346802 -583460 -266225 -101222 -632240 -1277954 -1189331 -504605 -48785 -145467 -426317
32927 -426317 -609275 -778007 -938458 -906780 -703399 -575241 -549070 -394773 -128578 -127193
32917 -127193 -552597 -1003466 -982425 -489557 68670 394141 490656 436432 206729 -224349
32907 -224349 -729935 -1071911 -1101499 -893145 -657191 -535450 -537734 -667380 -971824 -1376953
32897 -1376953 -1595557 -1387708 -889526 -510644 -480529 -640428 -708828 -587117 -345157 -91088
32887 -91088 23322 -153059 -532221 -739959 -556165 -291183 -393546 -721964 -636656 51589
32877 51589 651116 420883 -474031 -1213233 -1306133 -920426 -407456 14123 178025 81150
32867 81150 80724 481123 898313 615849 -302521 -904576 -644263 -144007 -195982 -574371
32857 -574371 -497999 112570 585983 545872 307924 236805 310673 418189 592874 805562
32847 805562 881559 736303 445955 93990 -204103 -248010 -68329 -134574 -786974 -1581658
32837 -1581658 -1750468 -1260848 -804713 -706866 -545612 -60268 260475 -90614 -836784 -1301411
32827 -1301411 -1231357 -842094 -379674 -45892 -65374 -393790 -574871 -295269 99804 46077
32817 46077 -438735 -815936 -797194 -617166 -521481 -394619 -60036 307049 285035 -313350
32807 -313350 -1154978 -1630172 -1441934 -925468 -648728 -717644 -709949 -336349 145274 336732
32797 336732 222811 36460 -153119 -405891 -631841 -670808 -565675 -485405 -456489 -417732
32787 -417732 -437809 -599250 -750445 -674492 -457563 -385303 -489537 -505860 -303989 -58337
32777 -58337 71862 143799 206811 138946 -132563 -434641 -528181 -355244 155 441404
32767 441404 812707 880169 571827 174172 79071 313529 486201 263841 -230708 -588873
32757 -588873 -567921 -224775 302216 882363 1244337 1073923 475504 55940 191097 409838
32747 409838 8078 -787273 -903792 117170 1337075 1538808 707990 -143743 -357698
32738 -357698 -213462 -228615 -487364 -774979 -912628 -797712 -451956 -142244 -147173 -342544
32728 -342544 -358446 -190037 -228971 -582854 -842802 -741003 -556419 -547948 -457711 -35056
32718 -35056 347204 187106 -292783 -427381 -131329 19840 -247404 -523087 -473178 -358039
32708 -358039 -447268 -432492 80918 807573 1032350 518955 -260064 -765553 -878582 -714604
32698 -714604 -328320 204137 622272 641691 275262 -115187 -138953 254535 754445 1048676
32688 1048676 1124890 1121204 997546 612343 111416 -98767 95555 294169 132351 -222885
32678 -222885 -399672 -379368 -366900 -326839 -105204 119976 35107 -182889 -12987 500777
32668 500777 571071 -242143 -1208970 -1216449 -177671 863093 1027631 534567 151346 96367
32658 96367 -88874 -655936 -1132390 -976955 -444134 -295360 -703601 -1017957 -786992 -426195
32648 -426195 -470271 -693614 -572856 -213089 -74449 -59464 266410 674711 457894 -317444
32638 -317444 -742242 -520520 -492926 -1219050 -1979464 -1902963 -1300566 -1014491 -1042145 -767841
32628 -767841 -181960 97658 -147366 -541921 -860780 -1174223 -1286808 -817848 52968 585168
32618 585168 386061 -185151 -607268 -716309 -581265 -328717 -168752 -219130 -303114 -253470
32608 -253470 -265918 -518741 -667397 -312588 207483 195666 -327339 -683615 -652699 -696117
32598 -696117 -972353 -996011 -543812 -99196 -29748 -36893 173931 351953 288183 312433 670974
32587 670974 951057 706767 225274 86398 296742 428216 366426 378847 576951 754671
32577 754671 690012 314728 -297780 -908215 -1257669 -1382834 -1520184 -1603264 -1284142 -635032
32567 -635032 -303325 -625838 -1062658 -926788 -272896 346620 605547 459823 -94883 -825305
32557 -825305 -1189637 -966371 -618565 -575886 -582668 -305052 -102679 -454177 -980087 -887988
32547 -887988 -204154 270783 159027 -136824 -263671 -324920 -384353 -301355 -196115 -393583
32537 -393583 -746491 -685621 -135117 301217 323359 419596 990265 1607261 1645749 1185837
32527 1185837 765020 574285 402478 140167 -124398 -355051 -530844 -514765 -318272 -330574
32517 -330574 -871634 -1605446 -1823420 -1328798 -662091 -361634 -341080 -186576 176575 385165
32507 385165 134878 -444747 -948267 -1090731 -879463 -489036 -87371 226134 421877 534478
32497 534478 615875 672918 681264 638645 536690 315228 -42000 -390002 -546354 -520211 -443843
32486 -443843 -293643 65423 505753 607557 177128 -431387 -713880 -576311 -326403 -252663
32476 -252663 -369549 -466586 -322007 -11189 -4782 -670864 -1631416 -2004199 -1437078 -504547
32466 -504547 100353 289622 240091 -88909 -622742 -862842 -523215 -105827 -219434 -649030
32456 -649030 -750047 -449461 -130032 185111 684257 1005523 571783 -345446 -832204 -662049
32446 -662049 -486794 -586809 -447654 141397 591138 561595 546611 847101 879588 219213
32436 219213 -493432 -512200 -136109 -5594 89303 639799 1168222 762396 -361311 -1026139
32426 -1026139 -821941 -530909 -683301 -814405 -538771 -329586 -600795 -824537 -341402
32417 -341402 482530 716224 208749 -273581 -188847 155717 236154 51678 -49267 3832
32407 3832 -102766 -548816 -992668 -893688 -196872 521068 711534 464888 246106 221940
32397 221940 222928 260128 575504 1104181 1379489 1180522 848345 708674 607389 350782
32387 350782 181974 355519 578283 422681 60906 -2515 220717 252900 -11841 -194007
32377 -194007 -209297 -465691 -1075563 -1526014 -1457710 -1190393 -1089028 -958465 -541761 -119103
32367 -119103 -43074 -90284 110828 363074 283170 87499 216998 394862 -36796 -863378
32357 -863378 -1038954 -204980 711383 822983 437846 329801 484688 310261 -236220 -475858
32347 -475858 34226 875659 1233628 757407 -121155 -661151 -594199 -348775 -380065 -501221
32337 -501221 -252572 251090 416975 71005 -383193 -719799 -1062587 -1211328 -704300 148027
32327 148027 267501 -610902 -1289546 -765686 307821 679506 233556 -335369 -863148
32318 -863148 -1530302 -1869998 -1289032 -299216 48192 -221404 -219365 132904 43262 -522034
32308 -522034 -620794 1755 453907 304482 257231 667878 765140 115203 -409720 -59826
32298 -59826 518869 471775 190093 435072 877418 763901 358422 411687 694882 387852
32288 387852 -392913 -758665 -568510 -520972 -778767 -755761 -379956 -353094 -864739 -1148388
32278 -1148388 -739833 -223818 -227788 -485143 -452870 -200458 -118308 -238292 -335690 -306121
32268 -306121 -74124 426489 839687 491009 -632025 -1506331 -1261813 -350479 111460
32259 111460 -133490 -359790 -130991 118756 -47145 -319640 -198738 150319 143723 -283609
32249 -283609 -522406 -154043 448123 625876 272154 -159139 -320293 -259108 -74508 269708
32239 269708 634641 619226 100736 -415536 -365278 114575 378601 155847 -142418 -32474
32229 -32474 446512 852638 839631 433873 -49957 -299198 -267842 -146902 -75887 -47700
32219 -47700 -148139 -574518 -1183496 -1350782 -701182 244393 652401 472004 373704 629983
32209 629983 730797 300755 -234841 -294027 13790 154624 -8951 -138734 -14516 219834
32199 219834 361099 354602 198209 -77527 -303626 -276387 -22086 192119 131654 -236539
32189 -236539 -803820 -1371250 -1656613 -1471991 -978584 -596801 -538010 -549166 -287772 125492
32179 125492 167181 -408132 -1159753 -1434454 -1140743 -790149 -770852 -881056 -723667 -302211
32169 -302211 43177 156781 229629 456340 769595 961953 913647 667869 394138 269668
32159 269668 287502 221976 -90013 -493014 -686972 -591402 -372347 -195825 -165034 -405454
32149 -405454 -918406 -1376312 -1374751 -927649 -437970 -153257 33303 186262 108463 -308055
32139 -308055 -824377 -1159520 -1297706 -1299767 -1088421 -666409 -283647 -93181 121033 534325
32129 534325 823566 563165 -27472 -218220 290852 965815 1111243 635539 -3635 -359571
32119 -359571 -334641 -149653 -122840 -342535 -492013 -190373 431796 761721 445205 -174145
32109 -174145 -554233 -607546 -555575 -396180 23920 502889 556292 95768 -373858 -410205
32099 -410205 -147153 52055 121108 157175 26569 -463827 -1087673 -1325540 -1046600 -708918
32089 -708918 -707436 -806323 -497971 225834 796995 791316 438457 256894 389428 559941
32079 559941 582533 570184 601462 551534 434919 552944 979932 1233521 921492 443848
32069 443848 418667 568496 10795 -1225189 -1862522 -1011628 570614 1455563 1229675
32060 1229675 565919 80718 -135734 -149916 -78702 -184136 -472023 -432890 206057 797495
32050 797495 591113 -75494 -282571 24807 104024 -217136 -363341 -204746 -232326 -381190
32040 -381190 73216 1092968 1589935 1078713 427116 325186 213213 -433933 -917428
32031 -917428 -479749 303314 454497 122230 2826 -29070 -438830 -801614 -429109 210834
32021 210834 89849 -652795 -942807 -542473 -229302 -308532 -324129 -243646 -522498 -879322
32011 -879322 -453297 539671 742799 -278906 -1246725 -1046258 -182918 325343 374377 301606
32001 301606 16839 -489650 -615378 -45182 501869 296461 -247311 -311762 -10426 -58941
31991 -58941 -529345 -860042 -865799 -895587 -1090887 -1186702 -1015159 -684755 -332757 -102415
31981 -102415 -202477 -615822 -959361 -976727 -903407 -1008582 -1110011 -930161 -599886 -402812
31971 -402812 -337281 -311077 -416423 -625374 -608874 -283404 -116392 -406676 -681471 -363398
31961 -363398 317545 641774 338068 -299258 -916769 -1241096 -1071360 -643139 -617127 -1172363
31951 -1172363 -1546433 -1088693 -303875 -105368 -449531 -574821 -290844 -91672 -141179 -84665
31941 -84665 133625 134222 -122014 -189103 90641 327114 235382 -18715 -217208 -321002 -281390
31930 -281390 -126488 -180397 -636140 -1006483 -665662 104823 341519 -266707 -972769 -1028637
31920 -1028637 -497067 144789 588992 686336 399978 -18828 -216769 -171414 -55603 204245
31910 204245 685547 969608 628291 83846 87508 377749 -62755 -1223986 -1722243 -773352
31900 -773352 529887 696978 -201120 -943499 -967616 -807372 -979045 -1316387 -1471494 -1456541
31890 -1456541 -1489105 -1595856 -1522470 -1001851 -137136 558700 698346 492553 387495 384085
31880 384085 179787 -142945 -182461 58076 173145 101734 166692 332956 225107 -36006
31870 -36006 72382 383041 82775 -833091 -1273645 -732984 -111525 -157485 -261321 226991
31860 226991 585716 -96332 -1178000 -1345059 -672014 -344275 -660586 -788527 -404568
31851 -404568 -140756 -276734 -300190 -37119 -35414 -461043 -682901 -387958 -135433 -305335
31841 -305335 -384726 112166 761513 894636 553397 188754 -85387 -339941 -353156 88672
31831 88672 668742 871798 691544 545881 583836 507453 112385 -318334 -321069 131475
31821 131475 464056 104334 -735065 -1174275 -782114 -231348 -387699 -1026536 -1142184 -468423
31811 -468423 103003 -158758 -804544 -950209 -517128 -164218 -248442 -400795 -132949 495648
31801 495648 941824 799394 267436 -73561 35428 251579 208200 108020 389511 993750
31791 993750 1416291 1403138 1145774 846424 561842 433952 567715 692309 459407 53491
31781 53491 -60428 43904 -128579 -533554 -542966 -43722 235994 -166463 -774266 -1018183
31771 -1018183 -1029070 -1082488 -942692 -373774 273861 623181 901573 1367678 1614730 1187882
31761 1187882 488667 274919 549069 717752 625088 619818 724224 558429 112263 -150804
31751 -150804 -69091 -11740 -175740 -225246 150355 752491 1143888 1099221 708630 320672
31741 320672 364267 883642 1295155 1004138 230412 -210447 68675 679861 1131606 1318119
31731 1318119 1254986 885461 384613 197910 484425 865454 980538 952589 1011308 991626
31721 991626 622437 115911 -7800 307776 476588 40624 -683770 -1040442 -952081 -964829
31711 -964829 -1319847 -1499467 -1064621 -498280 -560168 -1045462 -1038542 -421024 -157403 -742530
31701 -742530 -1330513 -1067643 -463547 -524831 -1126348 -1301210 -808522 -322115 -168240 73907
31691 73907 617340 1039323 1027050 800486 579935 281397 -86996 -320937 -425466 -555713
31681 -555713 -549719 -178351 189910 -8340 -461035 -270868 554767 961460 503920 53224
$$ [...]
##END NTUPLES=NMR SPECTRUM
##END=
