##TITLE=31Pdec_E3d0607-2
 CDCl3, 24 sc
 7.7.2023
##JCAMPDX= 6.0         $$ Bruker NMR JCAMP-DX V2.0
##DATA TYPE= NMR SPECTRUM
##DATA CLASS= NTUPLES
##ORIGIN= UXNMR, Bruker Analytische Messtechnik GmbH
##OWNER= root
$$ XWIN-NMR		Version 3.5
$$ Fri Jul  7 14:33:51 2023 Russian Standard Time (UT+4h)  she@DPX200
##.OBSERVE FREQUENCY= 81.013821
##.OBSERVE NUCLEUS= ^31P
##.ACQUISITION MODE= SIMULTANEOUS
##.ACQUISITION SCHEME= undefined
##.AVERAGES= 24
##.DIGITISER RES= 16
##SPECTROMETER/DATA SYSTEM= spect
##.PULSE SEQUENCE= zgpg30
##.SOLVENT NAME= CDCl3
##.SHIFT REFERENCE= (INTERNAL, CDCl3, 0, 248.564)
##AUDIT TRAIL= $$ (NUMBER, WHEN, WHO, WHERE, WHAT)
$$ ##TITLE= Audit trail, XWIN-NMR		Version 3.5
$$ ##JCAMPDX= 5.01
$$ ##ORIGIN= Bruker BioSpin GmbH
$$ ##OWNER= she
$$ F:/spectra/data/she/nmr/P31/1/pdata/1/auditp.txt
$$ ##AUDIT TRAIL=  $$ (NUMBER, WHEN, WHO, WHERE, WHAT)
(   1,<2023-07-07 14:32:55.84 +0400>,<she>,<DPX200>,
      <created by zg, POWCHK disabled, PULCHK disabled
       configuration hash MD5:
       00 E9 B6 7A A2 85 ED C7 34 08 36 98 17 FE 4E 26
       data hash MD5: 32K
       12 E1 20 D9 37 52 F1 44 81 08 03 18 39 98 A9 67>)
(   2,<2023-07-07 14:32:58.76 +0400>,<she>,<DPX200>,
      <Start of raw data processing
       efp BC_mod = 2 LB = 1 FT_mod = 6 PKNL = 1 PHC0 = -10675.47 PHC1 = 58.28481 SI = 64K 
       data hash MD5: 64K
       A6 12 85 CE BB 57 79 C4 9B 49 A6 61 73 D2 B6 FE>)
(   3,<2023-07-07 14:33:13.54 +0400>,<she>,<DPX200>,
      <pk PHC0 = 4.405566 PHC1 = -8 
       data hash MD5: 64K
       CD 9F 3B 70 9C 35 A3 2F 37 28 87 93 BA EF F0 CA>)
$$ ##END=
$$ 
$$ hash MD5
$$ 7D 9E 48 D6 07 38 D1 76 AC 21 91 99 05 3D 05 7C
##$RELAX= 
##$RELAX= 
##$RELAX= 
##$RELAX= 
##$RELAX= 
##$RELAX= 
##$RELAX= 
##$RELAX= 
##$RELAX= 
$$ Bruker specific parameters
$$ --------------------------
##$DU= <F:/spectra>
##$EXPNO= 1
##$NAME= <P31>
##$PROCNO= 1
##$TYPE= <nmr>
##$USER= <she>
##$AMP= (0..31)
100 100 100 100 100 100 100 100 100 100 100 100 100 100 100 100 100 100 
100 100 100 100 100 100 100 100 100 100 100 100 100 100 
##$AQSEQ= 0
##$AQ_mod= 1
##$AUNM= <au_zg>
##$AUTOPOS= <>
##$BF1= 81.014009
##$BF2= 200.13
##$BF3= 200.13
##$BF4= 200.13
##$BF5= 200.13
##$BF6= 200.13
##$BF7= 200.13
##$BF8= 200.13
##$BYTORDA= 1
##$CFDGTYP= 0
##$CFRGTYP= 5
##$CHEMSTR= <none>
##$CNST= (0..31)
1 1 145 1 1 1 1 1 1 1 1 1 1 1 1 1 1 1 1 1 1 1 1 1 1 1 1 1 1 1 1 1 
##$CPDPRG= <waltz16>
##$CPDPRG1= <>
##$CPDPRG2= <waltz16>
##$CPDPRG3= <>
##$CPDPRG4= <mlev>
##$CPDPRG5= <mlev>
##$CPDPRG6= <mlev>
##$CPDPRG7= <mlev>
##$CPDPRG8= <mlev>
##$CPDPRGB= <>
##$CPDPRGT= <>
##$D= (0..31)
0 1 0 0 0 0 0 0 0 0 0 0.03 2e-05 3e-06 0 0 0 0 0 0 0 0 0 0 0 0 0 0 0 0 
0 0 
##$DATE= 1688725975
##$DBL= (0..7)
120 120 120 11 120 120 24 19 
##$DBP= (0..7)
150 150 150 150 150 150 150 150 
##$DBP07= 0
##$DBPNAM0= <>
##$DBPNAM1= <>
##$DBPNAM2= <>
##$DBPNAM3= <>
##$DBPNAM4= <>
##$DBPNAM5= <>
##$DBPNAM6= <>
##$DBPNAM7= <>
##$DBPOAL= (0..7)
0.5 0.5 0.5 0.5 0.5 0.5 0.5 0.5 
##$DBPOFFS= (0..7)
$$ [...]
##$SUBNAM2= <"">
##$SUBNAM3= <"">
##$SUBNAM4= <"">
##$SUBNAM5= <"">
##$SUBNAM6= <"">
##$SUBNAM7= <"">
##$SUBNAM8= <"">
##$SUBNAM9= <"">
##$SW= 501.771253377433
##$SWIBOX= (0..15)
0 1 3 0 0 0 0 0 0 0 0 0 0 0 0 0 
##$SW_h= 40650.406504065
##$TD= 32768
##$TD0= 1
##$TE= 0
##$TE2= 300
##$TE3= 300
##$TEG= 300
##$TL= (0..7)
0 120 53 12 22 120 120 120 
##$TP= (0..7)
150 150 150 150 150 150 150 150 
##$TP07= 0
##$TPNAME0= <>
##$TPNAME1= <>
##$TPNAME2= <>
##$TPNAME3= <>
##$TPNAME4= <>
##$TPNAME5= <>
##$TPNAME6= <>
##$TPNAME7= <>
##$TPOAL= (0..7)
0.5 0.5 0.5 0.5 0.5 0.5 0.5 0.5 
##$TPOFFS= (0..7)
0 0 0 0 0 0 0 0 
##$TUNHIN= 0
##$TUNHOUT= 0
##$TUNXOUT= 0
##$USERA1= <user>
##$USERA2= <user>
##$USERA3= <user>
##$USERA4= <user>
##$USERA5= <user>
##$V9= 5
##$VALIST= <valist>
##$VCLIST= <CCCCCCCCCCCCCCC>
##$VD= 0
##$VDLIST= <DDDDDDDDDDDDDDD>
##$VPLIST= <PPPPPPPPPPPPPPP>
##$VTLIST= <TTTTTTTTTTTTTTT>
##$WBST= 1024
##$WBSW= 4
##$XGAIN= (0..3)
0 0 0 0 
##$XL= 0
##$YL= 0
##$YMAX_a= 5070
##$YMIN_a= -4430
##$ZGOPTNS= <>
##$ZL1= 120
##$ZL2= 120
##$ZL3= 120
##$ZL4= 120
##$ABSF1= 0
##$ABSF2= 0
##$ABSG= 0
##$ABSL= 0
##$ALPHA= 0
##$AQORDER= 0
##$ASSFAC= 0
##$ASSFACI= 0
##$ASSFACX= 0
##$ASSWID= 0
##$AUNMP= <proc_1d>
##$AZFE= 0.1
##$AZFW= 0.5
##$BCFW= 0
##$BC_mod= 2
##$BYTORDP= 0
##$COROFFS= 0
##$CY= -3
##$DATMOD= 1
##$DC= 0
##$DFILT= <>
##$DTYPP= 0
##$F1P= 0
##$F2P= 0
##$FCOR= 1
##$FTSIZE= 65536
##$FT_mod= 6
##$GAMMA= 0
##$GB= 0
##$INTBC= 1
##$INTSCL= 6.047779e-11
##$ISEN= 30
##$LB= 1
##$LEV0= 0
##$LPBIN= 0
##$MAXI= 10000
##$MC2= 0
##$MEAN= 0
##$ME_mod= 0
##$MI= 50
##$NCOEF= 0
##$NC_proc= -5
##$NLEV= 6
##$NOISF1= 182.463
##$NOISF2= 159.3651
##$NSP= 0
##$NTH_PI= 0
##$NZP= 0
##$OFFSET= 248.5645
##$PC= 4
##$PHC0= -10671.06
##$PHC1= 50.28481
##$PH_mod= 1
##$PKNL= yes
##$PPARMOD= 0
##$PSCAL= 0
##$PSIGN= 0
##$REVERSE= no
##$SF= 81.0140089999694
##$SI= 65536
##$SIGF1= 159.3651
##$SIGF2= -187.1042
##$SINO= 113.3802
##$SIOLD= 16384
##$SREGLST= <1H.CDCl3>
##$SSB= 0
##$STSI= 65536
##$STSR= 0
##$SW_p= 40650.406504065
##$SYMM= 0
##$S_DEV= 0
##$TDeff= 32768
##$TDoff= 0
##$TI= <>
##$TILT= no
##$TM1= 0
##$TM2= 0
##$TOPLEV= 0
##$USERP1= <user>
##$USERP2= <user>
##$USERP3= <user>
##$USERP4= <user>
##$USERP5= <user>
##$WDW= 1
##$XDIM= 65536
##$YMAX_p= 328929446
##$YMIN_p= -228556234
$$ End of Bruker specific parameters
$$ ---------------------------------
##NTUPLES= NMR SPECTRUM
##VAR_NAME=  FREQUENCY,     SPECTRUM/REAL,   SPECTRUM/IMAG
##SYMBOL=    X,             R,               I
##VAR_TYPE=  INDEPENDENT,   DEPENDENT,       DEPENDENT
##VAR_FORM=  AFFN,          ASDF,            ASDF
##VAR_DIM=   65536,         65536,           65536
##UNITS=     HZ,            ARBITRARY UNITS, ARBITRARY UNITS
##FACTOR=    0.620285442955139, 1,           1
##FIRST=     20137.2065510682, 0,            0
##LAST=      -20513.1999529968, 0,           0
##MIN=       -20513.1999529968, -228556234,  0
##MAX=       20137.2065510682, 328929446,    0
$$ Real data points
##PAGE= N=1
##DATA TABLE= (X++(R..R)), XYDATA
$$ [...]
42240 -402468 -641205 -526068 -108836 96246 -132567 -490992 -817478 -1300835 -1775502 -1604674
42230 -1604674 -723693 -58750 -288398 -810805 -649734 117742 605513 421224 -46797
42221 -46797 -401196 -554104 -413045 79874 656579 1008447 1240088 1547684 1679454 1299146
42211 1299146 643014 158477 -259661 -905979 -1376608 -1002293 -105372 226768 -227457
42202 -227457 -482324 21737 502760 163038 -496384 -521044 8491 247774 -76586 -490325
42192 -490325 -673886 -693632 -457964 225737 1004774 1131102 445303 -353486 -607243 -388476
42182 -388476 -114996 55018 177796 226601 135728 -34315 -142536 -55975 306939 797015
42172 797015 962007 524823 -83063 -146469 300521 436614 -129778 -728687 -649168 -212823
42162 -212823 -164023 -404961 -178495 635533 1275409 1249661 942123 797079 619027 126736
42152 126736 -381896 -491904 -394996 -543563 -839195 -791663 -371915 -91477 -205408 -393765
42142 -393765 -366160 -291223 -408275 -622555 -767902 -954382 -1329622 -1699212 -1708287 -1307062
42132 -1307062 -779148 -368787 -104956 43502 60246 -44053 -203462 -375187 -542959 -639863
42122 -639863 -578120 -375530 -164575 -57621 -72557 -182706 -327555 -344679 -34164 566411
42112 566411 1024084 821505 -69701 -1019446 -1287217 -748602 13265 340563 120076 -245604
42102 -245604 -346466 -142969 92350 99053 -110080 -274337 -172507 141914 448500 638955
42092 638955 737491 680882 330257 -216592 -573727 -506296 -245264 -175713 -353586 -518199
42082 -518199 -455038 -160494 225924 466622 340622 -90041 -473003 -617279 -754065 -1094905
42072 -1094905 -1362198 -1131846 -484845 92718 351283 383737 179258 -388792 -1063175 -1223997
42062 -1223997 -654872 74446 247410 -210336 -770399 -938276 -688338 -385381 -366791 -552922
42052 -552922 -545697 -219783 2167 -264877 -748433 -905370 -724991 -598115 -519261 -99279
42042 -99279 597003 934665 630148 176502 104486 368547 698368 991963 1090619 741788
42032 741788 114113 -197194 -17389 106882 -191331 -490796 -318800 73468 190655 46564
42022 46564 -90152 -235071 -443044 -477527 -249980 -130663 -309334 -368870 -50425 157752
42012 157752 -132460 -400349 -67496 438854 411722 106369 191995 440702 171989 -350894
42002 -350894 -302245 124650 -52355 -788415 -917423 -129874 414854 -50118 -771597 -880596
41992 -880596 -706274 -863460 -1082363 -892925 -639408 -844775 -1203263 -1119366 -740281 -612430
41982 -612430 -746126 -792370 -745480 -745821 -581636 -95767 297905 197449 -78610 -49778 97300
41971 97300 -8151 -61729 403392 998819 945818 346587 21618 183519 236528 -103933
41961 -103933 -431733 -480947 -444979 -317822 201513 902662 1010077 301470 -451080 -559910
41951 -559910 -288694 -213744 -328735 -301742 -145548 -90304 -110468 -45143 53393 69512 89523
41940 89523 188567 193138 -25005 -251143 -243774 -139085 -219503 -445066 -516253 -291367 89919
41929 89919 396304 471262 359367 344661 611853 815936 408299 -445401 -809860 -214237
41919 -214237 582229 626896 135633 57088 540043 758283 305831 -163421 -51366 209708
41909 209708 -91742 -741416 -884775 -309007 273985 275159 -41481 -111680 91937 144355
41899 144355 -148680 -546590 -793087 -883951 -854926 -621720 -220878 26553 -118686 -393885
41889 -393885 -300057 208628 614922 517052 133531 -45303 129206 430351 645123 717915
41879 717915 630007 432818 337205 481529 653799 552256 300737 335305 707307 890554
41869 890554 488517 -182786 -499985 -305472 20751 125270 16093 -120727 -179815 -181269
41859 -181269 -208144 -306890 -373689 -220545 148765 457898 490721 350895 204653 -51730
41849 -51730 -574322 -1140599 -1294001 -923289 -395780 -80624 -3348 7800 112822 433563
41839 433563 951162 1374962 1387635 1061415 739856 509907 201607 -43159 231904 965020
41829 965020 1302261 661846 -319457 -523720 166699 781980 645757 192831 189391 655004
41819 655004 967912 787734 439252 368036 531227 530484 241804 31872 209802 486546
41809 486546 313884 -310572 -801912 -824857 -701819 -761004 -767298 -424131 -43347 -145755
41799 -145755 -619036 -860139 -653215 -338935 -139708 116120 527503 893732 1094928 1282708
41789 1282708 1559035 1808897 1919322 1829355 1378614 524006 -316008 -623189 -479104 -365321
41779 -365321 -310716 47080 516988 396092 -253640 -367432 482018 1145889 522030 -617662
41769 -617662 -605438 693287 1693947 1340172 363785 -13635 339738 713757 679822 357871
41759 357871 -22326 -292390 -306019 -112038 9077 -59430 -65570 181470 450227 451371 300665
41748 300665 255847 204349 -146565 -660478 -814267 -414219 109882 275201 126318 69960
41738 69960 347196 860817 1360941 1601391 1448675 1063938 873710 1094993 1353168 1094054
41728 1094054 382997 -95670 19491 231262 -81806 -710118 -874977 -325736 331483
41719 331483 464411 146239 -105402 6689 354886 617191 535676 117395 -291036 -283100
41709 -283100 169575 720252 1106637 1350220 1448889 1218811 635133 53358 -151226 8559
41699 8559 257842 411046 439611 372619 278194 188292 -12730 -382801 -594952 -221149 546320
41688 546320 947783 675037 329548 501847 914637 1006384 902084 1107859 1541976 1644008
41678 1644008 1332639 1094609 1097693 950993 519812 319635 779961 1585321 2065375 1915271
41668 1915271 1306525 598643 147990 111975 243272 122635 -268525 -487842 -269426 109422
41658 109422 282380 280996 312795 348582 258573 158837 265608 481031 438714 -7096 -541445
41647 -541445 -695457 -304117 341512 736713 596274 120072 -201833 -104962 170058 183064
41637 183064 -150727 -419218 -192585 410117 769921 437157 -382216 -1126280 -1492506 -1512588
41627 -1512588 -1190298 -517117 155126 290254 -91245 -329751 -60657 249634 77881
41618 77881 -319557 -352349 20680 437281 816992 1232366 1366631 867856 121434 -107433
41608 -107433 204888 322805 -93958 -571803 -694526 -648010 -662695 -610080 -455606 -471732
41598 -471732 -658960 -558729 -29991 349171 90767 -486109 -794401 -780961 -714204 -584364
41588 -584364 -256271 71778 92746 -94167 -132210 49139 194157 127827 -62312 -152565
41578 -152565 57980 530346 838721 550529 -130096 -486657 -208584 273868 556355 774078
41568 774078 1011194 842621 48125 -725348 -722964 -178984 53096 -242489 -473152 -252314
41558 -252314 99232 154654 -59695 -266282 -319551 -244638 -136282 -96714 -139170 -190548 -269626
41547 -269626 -473848 -675813 -547821 -107957 116355 -210096 -706986 -823312 -563026 -255355
41537 -255355 38822 392436 606807 498672 337010 442590 602903 456027 185423 187195
41527 187195 303461 134692 -73800 287337 1051490 1286907 614339 -227449 -373659 207797
41517 207797 947542 1313322 1050275 326304 -191667 82998 861606 1269790 1013484 663928
41507 663928 667753 756102 589917 340480 270159 283361 256569 320741 458359 295805 -307239
41496 -307239 -864596 -845970 -331004 221193 529092 564388 429840 392666 662583 953810
41486 953810 729976 70006 -284757 -9090 342882 338114 391620 879801 1212184 659570
41476 659570 -323942 -557711 246834 1185311 1457915 1175554 773581 371295 12385 -19211
41466 -19211 452063 1079084 1244934 682544 -264985 -967008 -1087428 -868691 -760616 -804433
41456 -804433 -641471 -158413 274564 371180 291679 177681 -172348 -743768 -921005 -265918
41446 -265918 684877 1054836 768584 370252 -13374 -674635 -1406687 -1517439 -902098 -295331
41436 -295331 -220990 -391829 -392013 -259675 -89806 261498 690370 691737 147162 -290676 -95500
41425 -95500 343497 346451 -91545 -498216 -666218 -623290 -270109 304052 524402 100010
41415 100010 -229730 402147 1542577 1890613 1217043 689776 982623 1190746 318951
41406 318951 -1064968 -1626568 -1144546 -557578 -400920 -230485 363307 1072246 1431976
41397 1431976 1376499 1000451 392247 -54134 190854 953648 1295754 755824 103165 261811
41387 261811 938331 1049327 253783 -703129 -1098790 -961623 -628533 -245444 77483 141297
41377 141297 -44050 -204414 -217774 -226711 -211480 112850 766163 1294021 1371167 1248849
41367 1248849 1277255 1296285 886751 39457 -785806 -1192846 -1186451 -1030887 -949097 -934207
41357 -934207 -803627 -511701 -332764 -498078 -735565 -561632 -24233 321039 245088 113844
41347 113844 181480 238066 222496 497816 1077565 1258968 649475 -36694 37489 540455
41337 540455 522077 -113195 -628040 -729734 -832708 -1089840 -1141878 -941990 -913861 -1086487
41327 -1086487 -938512 -377291 -30212 -197663 -326900 -1825 290364 -30770 -679621
41318 -679621 -988175 -860610 -633122 -415599 -202400 -254080 -686968 -968748 -526968 307246
41308 307246 634959 185497 -446167 -713398 -645057 -430397 -104794 185086 135470 -250033
41298 -250033 -545631 -468774 -211135 -2465 288988 817489 1301022 1281373 742143 152038
41288 152038 -95570 -32453 124911 314780 569004 758120 650485 271652 6254 183822
41278 183822 666361 1024523 1053832 905109 743202 537446 215125 -239936 -886405 -1723403
41268 -1723403 -2403370 -2394463 -1619213 -633376 19939 303261 332050 -139 -619428 -919075
41258 -919075 -443386 304210 420126 -118100 -442775 -116715 288797 183996 -174653 -250251
41248 -250251 -87437 -38639 -31570 237364 578896 435809 -261878 -910676 -1008913 -688881
41238 -688881 -355844 -195766 -212180 -382220 -529977 -347889 160876 496397 245539 -327497
41228 -327497 -645018 -646384 -796140 -1247160 -1501303 -1133290 -439991 -4832 92964 190660
41218 190660 350384 296823 43049 17614 371167 641447 438614 64620 9333 136749
41208 136749 -61310 -549236 -733607 -429832 -204929 -484473 -875199 -819256 -485605 -422719
41198 -422719 -594612 -456690 61222 369360 182553 -11563 173891 269275 -354910 -1427907
41188 -1427907 -2094215 -2095650 -1936104 -1908922 -1706463 -1172275 -747116 -794840 -1021070 -993159
41178 -993159 -802562 -751518 -772131 -682784 -691412 -1035410 -1349642 -1057503 -292359 226289
41168 226289 212168 39812 -84658 -429955 -988445 -1149564 -580019 115616 156330 -349931
41158 -349931 -633883 -336696 152541 348718 230284 103372 173313 329170 284912 -40972
41148 -40972 -336112 -272511 -2790 74589 19751 301758 924060 1206275 755147 79628
41138 79628 -197803 -194408 -280212 -263023 214062 839651 1002551 769533 701432 847538 757555
41127 757555 432533 372723 587228 441716 -248412 -768350 -513937 205491 738872 873539
41117 873539 690403 232320 -276870 -420450 -205686 -180949 -550799 -747211 -336919 257131
41107 257131 507621 632314 971339 1103124 514961 -251922 -186358 635480 1138497 895085
41097 895085 616081 813792 1032366 817634 489388 358144 21918 -785767 -1329703 -800214
41087 -800214 295053 649567 -65588 -862384 -918801 -520892 -267400 -129343 191348 516705
41077 516705 428293 -4271 -274739 -139938 161029 366723 492374 614063 666374 571593
41067 571593 366670 115490 -139349 -288051 -207971 19361 134991 47735 -25472 113982
41057 113982 357119 481394 462814 386276 193908 -193598 -571580 -590975 -261840 -41359
41047 -41359 -276944 -749704 -930839 -571546 96493 635313 727552 339678 -229227 -493217
41037 -493217 -206314 289820 349297 -203251 -757377 -629069 4281 252431 -307669 -997368
41027 -997368 -907548 -102853 563285 716010 875315 1424899 1812745 1288737 59277 -884301
41017 -884301 -951963 -463103 -29880 81407 -59760 -262683 -307193 -128299 38645 -22667
41007 -22667 -78886 286736 976045 1385822 1210959 821344 705283 930078 1284196 1532572
40997 1532572 1377363 637818 -293173 -638330 -188849 358380 335325 -80094 -367100 -498416
40987 -498416 -734725 -965231 -872248 -524938 -249738 -106836 -14760 -144627 -594904 -917593
40977 -917593 -659724 -186501 -186196 -481428 -248764 529100 825374 96366 -853202 -1022860
40967 -1022860 -484973 58263 324457 408185 236923 -200075 -455577 -160838 315056 388678
40957 388678 169359 152540 266331 52207 -307807 -58261 887498 1613296 1454411 893468
40947 893468 746375 1006466 1055035 659008 172426 -106497 -278844 -550272 -938007 -1289620
40937 -1289620 -1368287 -965560 -151737 641817 1015692 1027576 998638 962383 616490 -132857
40927 -132857 -879225 -1130162 -826048 -285762 206354 547864 655568 454313 107722 16533
40917 16533 366434 785303 715062 132746 -377206 -385163 -165240 -223355 -510341 -526170 -139999
40906 -139999 183669 109696 -62253 98995 490106 678140 536881 282287 36141 -214426
40896 -214426 -316647 -88941 237463 210616 -100337 -63746 573002 1179279 1067600 443396
40886 443396 30757 6245 -101559 -522309 -873675 -826541 -619350 -617983 -743368 -696221
40876 -696221 -497196 -404006 -412950 -251736 104946 269802 -48156 -598886 -862741 -660676
40866 -660676 -299698 -132680 -150893 -81564 226314 634742 895321 865502 536608 3733
40856 3733 -490617 -624875 -318011 68019 87863 -196814 -260138 127037 472090 187731
40846 187731 -555075 -1003610 -798943 -332931 -47815 143566 448122 605320 201041 -602944
40836 -602944 -1158094 -1141691 -837457 -565318 -314882 -110964 -251743 -834445 -1410188 -1531077
40826 -1531077 -1377509 -1386962 -1467069 -1131163 -363025 224377 212065 -116157 -269202 -148576
40816 -148576 63240 253957 361282 294603 137498 173118 453112 594168 291966 -183331
40806 -183331 -313240 27434 551576 996253 1241619 1156015 725700 290725 286709 727878
40796 727878 1214209 1427273 1345864 1020097 481379 -72007 -320972 -202644 -43591 -184219
40786 -184219 -578091 -847414 -683615 -162414 333320 530058 537214 561383 472875 31690
40776 31690 -482128 -435792 164661 490421 113457 -235447 210961 955621 961699 288800
40766 288800 -55518 250907 485566 245588 52107 262054 403854 119945 -105674 199507
40756 199507 626483 554114 128587 -119396 -198535 -493710 -953203 -1082535 -653265 11521
40746 11521 370894 58732 -829909 -1679885 -1906521 -1656859 -1492845 -1360680 -664254 446452
40736 446452 890787 300129 -196850 318152 1010731 594708 -569178 -1020453 -405485
40727 -405485 252653 315629 207162 284070 294146 188548 373130 849933 1057842 833612
40717 833612 634571 589853 285136 -251062 -366683 30489 127836 -447465 -923813 -662847
40707 -662847 -217040 -324470 -652193 -465115 57556 145794 -311965 -753282 -918333 -996804
40697 -996804 -968620 -611850 -116905 38012 -157680 -264553 -199217 -371596 -874717 -1137738
40687 -1137738 -682451 185131 752991 725706 402414 177192 109047 3198 -210299 -311747
40677 -311747 -99459 214627 176835 -250923 -493219 -72042 693265 1045078 759674 372558
40667 372558 369349 526559 322970 -208270 -427320 66752 863839 1233270 968486 436309
40657 436309 -55020 -485802 -745508 -577756 -90973 196608 113555 118917 458464 628179
40647 628179 253710 -64045 414928 1302522 1572673 1063730 524861 317555 119729 -91426
40637 -91426 118567 631683 688477 139496 -208764 112096 552169 592536 506444 551654
40627 551654 376206 -127851 -314217 118678 389461 -155398 -887661 -889085 -389048 -197167
40617 -197167 -303975 -142842 196140 128601 -309791 -529279 -390881 -237984 -111088 186908
40607 186908 420645 192316 -270053 -427862 -346876 -436001 -490168 28348 867316 1155479
40597 1155479 712911 248564 192639 231561 84529 -128301 -380545 -760275 -945932 -544883
40587 -544883 -513 -190701 -1001720 -1324256 -690128 124459 434281 511828 675448 580574
40577 580574 67950 -211206 219890 799043 798772 420035 266706 317149 213052 84889
40567 84889 268090 557727 540727 401085 623623 1079417 1155354 719334 283113 225126
40557 225126 460453 871042 1428440 1802198 1483858 568671 -92088 102577 685359 737770
40547 737770 130280 -356963 -176034 253732 273477 43194 277654 1052000 1590754 1428309
40537 1428309 1073798 1088915 1140394 637498 -149797 -406600 37772 589867 791677 621519
40527 621519 95792 -621006 -877026 -224856 625101 541319 -329156 -697089 -115914 369482
40517 369482 -48192 -734843 -774392 -316767 -13266 50173 80366 -32640 -292548 -231751
40507 -231751 290064 581533 171602 -309564 -137401 283977 164321 -289068 -302403 76593
40497 76593 135468 -217829 -412407 -328295 -416117 -713462 -693381 -177329 413436 781621
40487 781621 987588 947247 460651 -204927 -491652 -379702 -352889 -508739 -441538 -93038
40477 -93038 38837 -274518 -628514 -648360 -426384 -143776 152820 251228 -135159 -772780
40467 -772780 -967092 -440851 321795 755809 752873 423003 -114373 -537069 -470473 -50026
40457 -50026 133478 -178986 -624475 -817432 -757539 -559778 -301952 -219638 -498340 -800848
40447 -800848 -590427 30447 457418 560800 716767 830169 351890 -498416 -683092 -27188
40437 -27188 215757 -732655 -1795291 -1640969 -768651 -666648 -1473707 -1916012 -1339629 -400331
40427 -400331 307402 962139 1549793 1410222 349942 -705477 -854426 -365007 -34626
40418 -34626 56772 425981 1126910 1540968 1221716 443347 -189681 -376381 -276135 -213046
40408 -213046 -302878 -341415 -95773 310431 469184 208777 -145574 -168768 149481 442727
40398 442727 417832 106984 -269310 -531358 -622969 -568724 -404316 -155927 112195 279701
40388 279701 267150 126286 -31418 -149805 -194938 -105461 65408 46338 -370243 -954082
40378 -954082 -1207330 -961250 -552604 -327338 -243234 -105714 82129 230650 392748 610469
40368 610469 713105 560773 339121 294009 313195 154019 -25904 134978 462277 279324
40358 279324 -588980 -1358969 -1231283 -417625 238579 394783 419769 601315 738794 624201
40348 624201 449510 509771 793637 1057299 1108715 911719 597918 426617 513193 585342
40338 585342 303622 -152506 -203821 314434 875651 1000908 851543 786737 744560 491986
40328 491986 169424 82451 151106 69369 -111362 -55138 269494 562135 730105 963543
40318 963543 1237579 1225791 813850 273763 -164264 -486381 -577653 -255860 215035 208330
40308 208330 -369580 -788413 -493757 82326 214635 -16841 50720 583725 1057521 1070127
40298 1070127 738901 252807 -399082 -1110667 -1556606 -1616417 -1538298 -1510191 -1406044 -1115453
40288 -1115453 -774430 -481972 -137557 220176 281515 -24660 -229662 72268 582745 713978
40278 713978 468800 400116 742818 1104088 1114455 927348 857946 881881 779537 558312
40268 558312 440584 522208 668367 732441 734094 800113 979946 1134784 1055824 743897 473185
40257 473185 443974 492404 372025 207979 322143 639045 696916 350447 27126 65541
40247 65541 192634 -25849 -522489 -867570 -851367 -596266 -269619 -8337 11278 -269908
40237 -269908 -657050 -919682 -998043 -858130 -436016 69519 219895 -57432 -295884 -274356
40227 -274356 -466464 -1179288 -1773432 -1497994 -696371 -296439 -390190 -316264 7910 -33116
40217 -33116 -476563 -545390 -4005 314209 -176215 -888191 -1024970 -680502 -392975 -307901
40207 -307901 -374028 -702563 -1124116 -1036147 -331833 153789 -182468 -711105 -516852 219280
40197 219280 639187 527305 297335 45337 -415338 -819904 -716956 -353269 -397990 -834262
40187 -834262 -979192 -610552 -251721 -273903 -488840 -725944 -1054613 -1277299 -933673 -70210
40177 -70210 602953 608714 277751 192797 474042 823471 932235 677749 189447 -189223
40167 -189223 -215639 -3431 213225 375621 410899 84451 -545122 -895271 -633640 -310389
40157 -310389 -544436 -954205 -749418 -93453 138917 -167916 -248774 130478 270420 -179149
40147 -179149 -603530 -536235 -428713 -731152 -1024004 -747394 -175018 36436 -152159 -240572
40137 -240572 -10930 227700 89567 -474392 -1093033 -1242521 -832783 -445611 -587270 -871162
40127 -871162 -571585 153354 450574 187491 170334 724359 1104767 771230 261717 184256
40117 184256 229211 -78711 -413792 -259785 117234 135231 -127569 -195508 -47812 15640
40107 15640 26795 191471 376359 376683 403890 710931 1021474 923896 573936 436168 546321
40096 546321 542460 234204 -268098 -750969 -918176 -584644 -121901 -170781 -590205 -419326
40086 -419326 615818 1396024 967033 4985 -260392 97901 108734 -329170 -420770 -20605
40076 -20605 131200 -195784 -305299 161339 582801 391287 -88828 -292840 -250425 -298443
40066 -298443 -426572 -357802 -44725 217786 108979 -352260 -726447 -592233 -136558 28191
40056 28191 -227207 -342865 -38112 195093 31874 -28578 364427 600912 200164 -110970
40046 -110970 375572 806438 12551 -1236634 -1088980 414553 1204026 313934 -793985
40037 -793985 -716273 -93890 -74268 -362326 -140417 264593 81594 -359038 -174900 515409
40027 515409 855001 678090 522290 523767 417058 409352 922998 1532094 1250566 10305
40017 10305 -1093986 -1257258 -839970 -521733 -357130 -118926 23357 -236959 -691652 -768969
40007 -768969 -306908 217761 338791 196396 233120 437631 317232 -241338 -558363 -73131
39997 -73131 667312 636147 -155530 -586247 -32742 757165 792657 132021 -501044 -808852
39987 -808852 -954786 -905116 -452216 268225 863066 1204588 1434581 1569064 1499380 1267673
39977 1267673 991045 650122 249553 -27375 -140531 -393933 -931966 -1319133 -1087307
39968 -1087307 -474390 -122632 -211634 -387206 -416326 -393176 -348461 -144934 205084 489602
39958 489602 576750 469242 166917 -240565 -485223 -432900 -314938 -340645 -320394 -42688
39948 -42688 265920 323465 335809 588640 772943 410552 -228258 -403867 -46482 174480
39938 174480 -35991 -222436 -76489 85468 26388 29073 248496 288061 -116985 -562273
39928 -562273 -610400 -459891 -458496 -416883 -27113 378286 174674 -571752 -1068392 -768371
39918 -768371 45042 673497 684499 171860 -407082 -636695 -512464 -330429 -175456 194043
39908 194043 817024 1279448 1283504 1080560 946003 617526 -198394 -1077206 -1307864 -915327
39898 -915327 -557287 -453670 -154704 527757 1083501 1065436 689845 362160 121795 -103335
39888 -103335 -166100 -9698 92635 -15070 -54608 187946 434245 386961 221735 134468
39878 134468 -157802 -829468 -1253198 -728854 281492 566798 -134514 -753044 -463788
39869 -463788 205170 322515 -80095 -253092 87948 509066 606015 429988 215563 130355
39859 130355 290519 675830 1025456 1086588 934411 808065 712281 465802 90789 -152167
39849 -152167 -132102 2894 69778 29096 -90891 -232089 -247315 -24983 267306 269861 -121516
39838 -121516 -535148 -497195 16598 520502 539451 111817 -326363 -526246 -684937 -1003785
39828 -1003785 -1242587 -1045707 -567179 -317387 -394226 -374226 -82443 86938 -105974 -248173
39818 -248173 53588 443615 315448 -265557 -712146 -773184 -664322 -504287 -239805 -60929
39808 -60929 -252221 -586447 -472307 158553 659834 564583 192031 115132 414458 718713
39798 718713 680498 196658 -560853 -1133679 -1069835 -446287 118879 167810 -79098 -83567
39788 -83567 312110 741768 767588 329421 -207003 -383969 -78684 394305 634638 526851
39778 526851 208440 -152789 -410678 -468425 -433018 -519830 -630501 -374804 210651 423371
39768 423371 -145354 -855929 -878242 -409118 -216019 -296233 -36847 411280 134530 -944547
39758 -944547 -1633218 -1142540 -218685 35434 -352192 -632272 -558627 -421976 -339574 -255368
39748 -255368 -323284 -650807 -910443 -724711 -194014 353872 801670 1070937 969058 630103
39738 630103 607635 1051296 1329162 996939 529358 438952 337417 -266979 -851574 -626779
39728 -626779 41043 136990 -330900 -423602 31493 155428 -363995 -640147 -53039 739366
39718 739366 887628 559812 365654 316573 147372 117717 639923 1399500 1619172 1111782
39708 1111782 469385 230099 355842 566793 770409 1025308 1322740 1531004 1492520 1181398
39698 1181398 785355 522759 348695 28932 -414138 -562397 -100965 686866 1131321
39689 1131321 852077 116964 -442463 -420458 26411 420778 525940 519526 545406 395960
39679 395960 -56649 -390296 -111643 518932 762748 534140 553696 1124162 1466808 815864
39669 815864 -345457 -834613 -298801 479420 725340 490319 255906 275305 522302 892006
39659 892006 1189066 1163025 768035 227414 -264892 -688124 -942871 -775968 -211654 207703
39649 207703 -4143 -573431 -737217 -232445 367583 424072 -10524 -427368 -553766 -477993
39639 -477993 -270968 103795 511700 644679 410783 79914 -68230 -40204 21120 70028
39629 70028 98898 18094 -222602 -467745 -446335 -21032 663988 1229136 1323510 1009737
39619 1009737 819686 1168388 1742465 1818305 1237755 654059 629840 903955 863103 393883
39609 393883 -130609 -453953 -581435 -488521 -157696 141321 53049 -332053 -519808 -277118
39599 -277118 69996 138697 13333 56916 351674 558647 351614 -146111 -479448 -407850
39589 -407850 -155850 18221 277183 844715 1303784 863692 -477311 -1619932 -1629858 -857167
39579 -857167 -294521 -244722 -288320 -266140 -454342 -788421 -729215 -118173 478506 561179
39569 561179 301254 67995 -135530 -386872 -442948 -113516 250399 147469 -329875 -603669
39559 -603669 -425478 -155288 -157140 -294208 -223776 54253 205186 18714 -376130 -740385
39549 -740385 -935497 -839948 -316659 507868 1106921 1037853 532158 252215 417745 567695
39539 567695 337081 35569 121737 446711 478274 97018 -292665 -387001 -300461 -237094
39529 -237094 -193486 -61902 207968 566333 790895 554489 -144578 -715097 -531729 224848
39519 224848 686005 355240 -317767 -588671 -301675 140016 423544 580755 669284 562198
39509 562198 201948 -133978 -67876 370562 684694 495523 30679 -189414 -46392 95936
39499 95936 -28341 -286297 -481801 -616638 -683007 -561962 -311172 -198032 -244328 -120443
39489 -120443 264533 491054 276860 -25055 5710 179277 83495 -175423 -180045 73519
39479 73519 216263 139162 82036 177032 326085 431866 404475 128510 -237878 -229115 253148
39468 253148 591096 282095 -264367 -368265 -129424 -101584 -251116 -90203 369011 672646
39458 672646 792836 1041528 1230090 892638 334803 419084 1157866 1536547 1019512 288453
39448 288453 109039 323213 416914 351418 350490 423501 467757 383768 -49306 -834702 -1292304
39437 -1292304 -750492 232699 333190 -644717 -1417678 -1125840 -443524 -239139 -270581 10420
39427 10420 382667 496270 707332 1309766 1707368 1340236 726970 560004 453382 -260338
39417 -260338 -1081129 -973465 -64202 571510 582684 521686 472778 -146142 -1253452 -1823971
39407 -1823971 -1338068 -521814 -210878 -313197 -356046 -339041 -513255 -817069 -997149 -956827
39397 -956827 -682921 -145409 512703 1007346 1296055 1585492 1822830 1583427 700611 -308307
39387 -308307 -715189 -326121 389190 784870 600144 161180 19488 295506 527443 345773
39377 345773 47589 146483 549874 661454 244902 -290026 -515414 -488048 -509532 -694774
39367 -694774 -898195 -867151 -433322 267521 794964 818171 485004 209030 195315 356372
39357 356372 532413 569570 359670 42411 -36549 196523 389949 365647 481639 969902
39347 969902 1322513 956082 193529 -127596 148056 444476 527077 791923 1352201 1629050
39337 1629050 1202729 484943 147172 284653 496018 490556 306811 114526 5693 -125381
39327 -125381 -512295 -1133963 -1484868 -1085570 -205707 342570 201046 -152974 -129890 277451
39317 277451 703052 948400 1058456 1081617 972447 643993 73139 -521448 -689760 -211149
39307 -211149 492858 720535 278862 -366360 -699486 -601280 -234616 133797 192060 -150811
39297 -150811 -521109 -464408 -78485 138465 63979 77238 333357 464957 235603 -2694
39287 -2694 159357 569482 787000 721445 658016 791833 1007683 1053582 780942 289085
39277 289085 -107700 -181702 -67246 -48797 -98990 90999 594082 1071187 1188105 916900
39267 916900 365946 -333718 -855430 -792123 -208071 224600 -37528 -703589 -970266 -469897
39257 -469897 353182 822208 795407 726023 970881 1219441 883386 53614 -374606 162021
39247 162021 1029227 1209813 732385 561925 1078168 1475406 1000494 109706 -178801 311852
39237 311852 790816 646630 152297 -72800 113477 345445 341027 212774 153838 69399
39227 69399 -252078 -716712 -992155 -1009739 -1046713 -1202264 -1189556 -863302 -530718 -410992
39217 -410992 -226491 201460 376959 -198536 -1063175 -1243895 -563859 191086 370363 52999
39207 52999 -429865 -850790 -908562 -410961 232803 371379 87702 114102 630126 945738
39197 945738 663220 330668 479696 755278 597480 192439 96681 357687 624995 783350
39187 783350 900289 857784 605565 510136 868201 1274365 1067978 316809 -202609 -25528
39177 -25528 466676 633626 352529 46899 109072 443681 622166 479341 386135 725467
39167 725467 1271947 1486490 1326456 1231682 1301511 1125630 594572 212351 295510 487806
39157 487806 457661 461307 733427 918077 702061 482432 717631 1060916 899371 417930
39147 417930 321569 707239 1009176 957378 814868 692444 389262 -27297 -205637 -189341
39137 -189341 -412822 -841284 -825778 -132313 536338 513439 157960 309757 1068598 1712178
39127 1712178 1740780 1464063 1426097 1626025 1565783 922349 -61793 -851592 -1104528 -826048
39117 -826048 -227176 379811 650730 457835 92114 -37352 51813 -33741 -381378 -512111
39107 -512111 -41026 715143 1119110 985281 637478 375296 260593 334567 644842 1021406
39097 1021406 1132532 850473 377715 -21577 -260903 -396002 -487568 -514497 -368808 -6639
39087 -6639 355302 372853 33809 -210760 10036 461886 586425 231724 -166269 -144617
39077 -144617 263787 655404 783383 823922 1063613 1394989 1347965 756137 147802 149720
39067 149720 660259 1034102 985179 781069 572687 198372 -194211 -49882 696363 1250938
39057 1250938 990526 342930 95371 292290 451429 478151 619159 732191 368894 -436106
39047 -436106 -1091649 -1206470 -919082 -488695 -67329 111431 -168435 -720151 -1070572 -1028545
39037 -1028545 -797377 -539859 -233770 28890 21913 -250088 -505783 -567023 -489430 -317425
39027 -317425 -48821 146767 37336 -282956 -435395 -250546 67141 308897 490480 630433
39017 630433 574202 180569 -452544 -1015813 -1194947 -931245 -554495 -489769 -719635 -779948
39007 -779948 -438611 -30859 132137 264213 600304 810208 502770 10208 -5630 435959
38997 435959 678286 385765 -169007 -674844 -975793 -793969 -16661 743848 669293 -100157
38987 -100157 -607702 -492837 -375487 -599780 -587235 50050 664724 583450 242786 453484
38977 453484 1047628 1198037 792707 539695 765382 996848 881366 750795 962703 1277476
38967 1277476 1293155 1082517 964680 911642 638446 179595 -63940 84014 292993 207264
38957 207264 -65595 -208882 -243798 -456575 -834109 -983633 -722443 -384652 -347506 -566355
38947 -566355 -803599 -989394 -1053718 -742360 -43675 453022 160809 -645150 -1085257 -773436
38937 -773436 -172296 173480 258995 341452 478395 570179 578781 509177 347729 121143 -118899
38926 -118899 -374427 -616321 -688738 -478465 -75862 391662 860847 1069253 605619 -346555
38916 -346555 -762448 43218 1317922 1777162 1364508 1109090 1334054 1240935 522309 92360
38906 92360 544497 1003574 491154 -411377 -436364 355058 709853 198075 -164655 410566
38896 410566 1224998 1104667 26266 -958327 -1119044 -717181 -319776 -39202 295897
38887 295897 611986 669801 544001 578176 810699 855662 502044 33552 -247926 -375817
38877 -375817 -332575 130858 834794 941203 104757 -676476 -307208 685493 801890 -229713
38867 -229713 -1130182 -1010249 -380782 44373 308855 504260 279871 -292717 -416973 154788
38857 154788 528965 104204 -403355 -247918 27620 -361298 -961648 -898418 -457408 -495017
38847 -495017 -786721 -399035 577444 1089543 831322 539867 523901 203997 -636140 -1312575
38837 -1312575 -1317367 -951246 -551428 -16373 543091 572248 -58616 -699468 -850025 -765971
38827 -765971 -762865 -616174 -121728 351410 388819 180053 202877 588772 1112708 1490370
38817 1490370 1461761 927000 177619 -345102 -589190 -767886 -722280 -58852 948072 1322183
38807 1322183 610592 -439580 -832176 -484674 -58384 -22683 -273682 -430710 -244395
38798 -244395 130110 236111 -56634 -183484 377711 1192790 1388515 942832 586317 481202
38788 481202 84063 -549185 -564679 167631 575902 89504 -356656 128751 943985 1129356
38778 1129356 942037 1062887 1095236 308660 -696755 -611040 541897 1402369 1247167
38769 1247167 660647 235609 -113060 -396932 -305056 58655 217597 252209 640166 1068489
38759 1068489 618742 -602689 -1279361 -766852 59506 374285 546705 959514 946298
38750 946298 -4012 -1004190 -992200 -436466 -481406 -944590 -636095 533347 1229796 663426
38740 663426 -350190 -677082 -225038 445457 1047269 1527931 1685054 1412167 1010014
38731 1010014 808056 704470 426014 41277 -112102 97236 435168 565063 341320
38722 341320 -83907 -377423 -348205 -181967 -223106 -527057 -809921 -838709 -639489 -291073
38712 -291073 204935 724270 942367 672370 156500 -169266 -155584 -49381 -129071 -330507
38702 -330507 -311479 87721 530626 508190 3347 -413951 -309887 53229 153521 -38944
38692 -38944 -167071 -187569 -417999 -853378 -1005587 -652141 -270027 -378014 -793813 -934264
38682 -934264 -617451 -166788 141154 335608 494409 571895 535140 441922 340953 247709
38672 247709 197453 166338 4894 -344964 -624280 -506639 -76088 212084 111456 -129490
38662 -129490 -177726 -70418 -59967 -175209 -196753 -27771 134646 42743 -322634 -751067
38652 -751067 -976044 -833135 -372439 129450 373010 323017 218556 257919 394941 509808
38642 509808 598086 636513 465809 89629 -77539 311591 865275 810372 160821 -88034
38632 -88034 660060 1581141 1463194 407868 -344916 -202769 110317 -93109 -360718 31392
38622 31392 766162 893544 277308 -206351 58924 678141 979484 907909 800275 672678
38612 672678 240744 -468275 -978327 -941565 -565956 -288164 -181279 79402 678572 1317688
38602 1317688 1532177 1209315 615973 11906 -505786 -784199 -581358 54713 612663
38593 612663 617924 212129 -43838 95304 331344 380480 412688 693648 1033255 982418
38583 982418 545216 280861 519985 818493 536702 -231931 -749537 -624341 -254319 -157536
38573 -157536 -297532 -342236 -234621 -148620 -131936 -157758 -323027 -624725 -740699 -441181
38563 -441181 -29539 78438 24962 224768 572000 588678 318753 350372 839803 1221698
38553 1221698 1112620 833173 724604 577939 149092 -284242 -310554 73769 632143 1171252
38543 1171252 1406035 1073921 465077 235033 387790 186579 -515672 -761920 11063
38534 11063 862019 695591 -42714 -181982 270778 382339 62868 108210 559113 517628
38524 517628 -169466 -442593 269118 1076696 991635 279008 -208497 -230688 -41920 228609
38514 228609 452304 353933 35605 58544 509080 659096 133312 -304085 115381 859149
38504 859149 815591 -90928 -903441 -1003124 -630250 -175873 226326 401206 164374 -222176
38494 -222176 -212940 245203 558259 257870 -427891 -907837 -861983 -440287 -19821 150880
38484 150880 125808 68814 -47481 -320982 -552189 -437773 -199189 -431354 -1086291 -1288409
38474 -1288409 -622594 85326 -31911 -524233 -386933 275527 463585 -27104 -315141
38465 -315141 59825 465476 352614 98736 165684 272785 46265 -198938 -28131 302727
38455 302727 334277 278540 628832 1170535 1191814 600878 78290 48772 175417 55350
38445 55350 -178567 -245409 -232984 -357016 -516977 -458426 -194215 41954 133480 122239 50840
38434 50840 27649 314409 1012997 1703621 1742559 1003243 66732 -417499 -349208 -82962
38424 -82962 47673 -21349 -126170 -28892 330057 657809 577947 147927 -143107 -5076
38414 -5076 325747 551348 729729 945007 958863 641131 420956 734084 1232459 1190760
38404 1190760 608543 223581 403371 724540 791249 753279 727993 400416 -344541 -950491
38394 -950491 -893306 -461357 -309292 -539140 -730666 -641436 -380939 -68703 219384 311659
38384 311659 173923 127090 398895 627623 328436 -238017 -246756 555890 1413289 1484967
38374 1484967 855811 342763 482569 973510 1124120 727647 361284 692809 1546176
38365 1546176 1966506 1374087 351696 -43724 434797 1020702 954841 317570 -242513
38356 -242513 -308483 -30281 230407 412474 791549 1454876 1911831 1554899 523300 -297513
38346 -297513 -317835 106901 346054 397694 660596 1109585 1293063 1058238 718289 463590
38336 463590 111239 -422005 -817275 -746339 -301827 155098 402071 471718 488741 498876
38326 498876 408264 94999 -344754 -539935 -203197 470045 911413 707010 -47010 -854509
38316 -854509 -1218201 -1039487 -707311 -660769 -808514 -623944 48740 604378 407014 -317504
38306 -317504 -724951 -409809 168647 358202 99050 -102258 165509 712517 927419 478973
38296 478973 -236633 -516569 -184760 248988 276951 -69784 -429875 -503952 -148457 520846
38286 520846 996612 814597 284591 236412 790894 1042684 395217 -471314 -603449 -140038
38276 -140038 132150 103744 257408 530736 314270 -398213 -815889 -538712 -173730 -439477
38266 -439477 -1212197 -1779082 -1658750 -943387 -106462 394294 510038 581892 780271 804130
38256 804130 430566 16501 -29628 45635 -232350 -702776 -832745 -658455 -708200 -1062745
38246 -1062745 -1224929 -907346 -275333 532724 1412120 1891235 1523729 699169 286985
38237 286985 439273 515659 197986 -165135 -352340 -500376 -474488 15633 536180 213616
38227 213616 -846049 -1474355 -1112789 -501268 -290394 -111908 369053 601650 171851
38218 171851 -267618 11792 663280 962685 941708 960057 833141 313390 -154490 -97610
38208 -97610 90621 -157159 -509375 -332605 101418 56943 -366960 -448985 -112173 96882
38198 96882 146206 535817 1167913 1261654 591094 -87436 -99965 394757 945346 1403999
38188 1403999 1703751 1629856 1146230 571959 224875 169077 353324 670218 893914 904709
38178 904709 914570 1125958 1320338 1206420 979118 999121 1084078 743199 39056 -432999
38168 -432999 -426250 -266745 -148852 137673 621855 898517 717244 355464 158757 98355
38158 98355 18973 3413 245624 739328 1231983 1400936 1115040 644615 451284 586033
38148 586033 563590 116547 -286591 -132377 276430 264221 -163058 -398689 -214813 74120
38138 74120 356087 846608 1407574 1502259 1028617 563868 561877 829742 953577 757894
38128 757894 273769 -236761 -238547 477390 1187717 985307 156339 -76112 664917 1362487
38118 1362487 1178929 576242 311081 251179 -34405 -277342 -19481 410719 351338 -102448
38108 -102448 -313481 -173191 -145591 -380391 -548095 -510209 -450947 -331858 127580 843984
38098 843984 1320963 1316898 1062452 728609 207639 -415651 -698093 -450292 -136357 -306725
38088 -306725 -854988 -1173339 -937561 -427212 -58080 130232 359946 638654 678403 360428
38078 360428 19023 16531 209193 189472 -29097 -30418 253074 332549 -56460 -451785 -346275
38067 -346275 -3085 -81479 -647776 -1082342 -944500 -486031 -215254 -265017 -339295 -147411
38057 -147411 208066 304730 -57486 -460427 -314882 262407 463465 -100967 -790370 -846122
38047 -846122 -473466 -411790 -726892 -768449 -263159 269749 322475 30062 -196881 -196673 -18498
38036 -18498 234487 347872 142428 -199730 -334791 -352292 -671605 -1206910 -1242718 -473822
38026 -473822 396720 578217 245139 103995 290421 380465 282462 376142 766636 1070928
38016 1070928 1076232 1030275 1078063 944490 481952 97748 253152 822519 1303981 1448999
38006 1448999 1349611 1101436 765766 549931 616834 721383 418766 -275754 -765778 -588487
37996 -588487 -10325 316882 156390 -101427 -5916 391710 645797 483689 115443 -58407
37986 -58407 65421 237381 260923 252973 394837 603810 673279 647426 779526 1105080 1339182
37975 1339182 1304654 1200797 1253799 1319850 1120351 742932 566785 700445 842106 788154
37965 788154 720550 761138 581539 -109052 -863127 -851511 -8399 730502 635957 146126
37955 146126 114312 472805 399727 -274390 -696582 -302397 281102 205562 -307450 -395352
37945 -395352 62889 335638 40455 -365914 -460184 -483481 -753241 -1017644 -851883 -323997
37935 -323997 168436 467571 669955 772641 686688 490713 351048 261187 108214 -84344
37925 -84344 -188124 -143734 64691 445334 820669 832593 403640 9211 156974 704245
37915 704245 1018187 755177 185498 -220884 -263378 -78958 48875 -23508 -76280 267467
37905 267467 961596 1416873 1218783 680766 331115 171232 -53545 -153181 227058 770498
37895 770498 750921 186977 -102566 180306 301762 -244638 -786401 -500469 222507 341286
37885 341286 -238923 -575103 -143294 487247 615285 309814 28925 -78708 -68361 181133
37875 181133 753794 1323663 1437749 1084541 630535 262831 -130838 -519925 -586476 -225887
37865 -225887 114955 -63037 -599838 -828525 -469251 -17945 -56595 -470905 -690566 -534947
37855 -534947 -369079 -404880 -335689 91286 531089 478044 36277 -202115 -4150 215008
37845 215008 41462 -370963 -579092 -431239 -138261 71848 147710 150894 184938 349339
37835 349339 633839 886761 964308 856168 624358 336963 115526 69049 71355 -188373
37825 -188373 -752311 -1194009 -1112482 -636364 -142332 320109 895272 1355835 1244741 646869
37815 646869 259954 477539 881871 927220 661175 393180 95449 -335310 -551462 -141382
37805 -141382 584407 840542 440859 39065 135097 365824 88609 -708667 -1456097 -1760100
37795 -1760100 -1755974 -1746776 -1784801 -1720908 -1518348 -1312241 -1103471 -598655 364599 1304608
37785 1304608 1437191 671266 -169326 -385800 -202840 -109893 80320 786299 1598092 1594504
37775 1594504 721203 -36112 -57731 145642 -76899 -501377 -521612 -108825 277376 371617
37765 371617 221614 -69059 -292000 -108241 522278 1118991 1231901 968110 669726 392683
37755 392683 82212 -45444 239287 715546 898024 578432 -56987 -640966 -763817 -247571
37745 -247571 449818 504344 -262979 -1064623 -1195438 -877806 -573702 -82635 879667 1686770
37735 1686770 1403979 218918 -698937 -764611 -496642 -406932 -327894 -104066 -49532 -265213
37725 -265213 -254149 233562 591544 222881 -452493 -548981 5910 442810 306994 -22958
37715 -22958 -70177 77998 141147 238870 626560 1017346 743668 -245009 -1021967 -735324
37705 -735324 245796 757107 318547 -384954 -551380 -164539 368423 842289 1105943 862247
37695 862247 184648 -206835 174679 754440 616258 -191814 -768921 -617345 -69565 459837
37685 459837 902180 1165049 1041594 660624 456999 537920 585050 485618 508054 709245
37675 709245 732974 422729 134234 180887 394277 483322 454753 446213 469045 508322 582887
37664 582887 583572 376209 149296 269691 679952 866202 607617 353356 605558 1241384
37654 1241384 1694773 1596957 1063776 510453 263163 231210 42635 -321003 -298114 428569
37644 428569 1161723 909854 -227207 -1139356 -1207675 -933995 -894381 -895219 -584395 -202459
37634 -202459 -162065 -350654 -388993 -265829 -256882 -435298 -619915 -639914 -427612 -60739
37624 -60739 142304 -139640 -745073 -1084096 -817285 -194734 343018 557585 390720 -19614
37614 -19614 -271609 -104236 145850 16887 -239407 -12197 511626 460671 -296886 -825965
37604 -825965 -562827 -109366 -109630 -283794 -197598 -83345 -147090 95650 916934 1546091
37594 1546091 1206015 378123 41831 164852 2060 -486894 -614190 -168993 352835
37585 352835 642447 830285 920286 774892 590615 653474 747386 526724 265828 419997
37575 419997 654400 257006 -585776 -928380 -513573 -102379 -221189 -514100 -565553 -489477
37565 -489477 -405443 -126369 300400 447323 214439 35118 118387 155984 31444 96982
37555 96982 437470 594665 391855 289333 474739 356377 -445903 -1274065 -1293551 -659837
37545 -659837 -116621 130351 381287 609179 459685 -39493 -459245 -610777 -615990 -408663
37535 -408663 194525 891513 1003274 381446 -306245 -457169 -279298 -332668 -651633 -750275
37525 -750275 -385251 102099 292040 227735 226237 320300 223621 -116851 -279252 89896
37515 89896 731015 1101493 1102744 1075311 1122850 919037 302144 -370702 -677717 -593576 -290737
37504 -290737 142355 503299 388575 -268498 -866190 -843024 -521870 -672030 -1295757 -1499799
37494 -1499799 -751034 306142 661158 204814 -248478 -42625 619302 1052881 868622
37485 868622 286541 -150293 -91445 311223 571673 383535 -59702 -303799 -124976 299969
37475 299969 631137 644792 349927 3798 -21404 408086 941307 1041569 594942 55717
37465 55717 -80315 216563 595176 727114 523008 136464 -105995 55340 496832 794298
37455 794298 757103 671132 826368 1049573 999883 730847 591972 679574 756190 663700 453353
37444 453353 129308 -354577 -809103 -898029 -613202 -346157 -381589 -601613 -780134 -878495
37434 -878495 -940996 -964972 -965537 -902721 -505189 455820 1592801 2032445 1407055 387583
37424 387583 -112116 -11882 36682 -340705 -794264 -851006 -566826 -346380 -317364 -210312
37414 -210312 102471 262209 -86817 -618585 -609336 10730 413057 10116 -640330 -618077
37404 -618077 35617 502089 516462 671839 1302448 1878596 1856601 1489269 1337156 1432077
37394 1432077 1397860 1100786 745871 499853 367739 352430 487598 747290 1035526 1217253
37384 1217253 1169844 923848 688253 586293 515293 459155 649358 1071561 1177780 634805
37374 634805 13601 24838 382485 319761 -14488 195320 830484 777528 -253707 -1109101
37364 -1109101 -900268 -178207 254795 602184 1301989 1959837 2027719 1803013 1788532 1690070
37354 1690070 1019071 165689 -101334 178364 341709 142884 -158166 -397602 -494690 -232772
37344 -232772 288712 471049 150593 97420 794729 1419114 1035084 164956 -6669 503217
37334 503217 681164 257892 -64125 18626 66186 -80326 -69885 102578 25959 -303419
37324 -303419 -505748 -594886 -805834 -834038 -301862 230833 -62551 -756956 -696179 16856
37314 16856 68545 -858779 -1500261 -1041460 -230430 119592 291635 599389 543742 -51869
37304 -51869 -292186 388100 1145341 1087683 706417 827400 1082747 719548 161845 345254
37294 345254 996080 1002420 254148 -234383 14630 386400 361832 167908 72672 -4130
37284 -4130 14486 362279 717911 378457 -572259 -1120699 -724362 -60536 75788 -149463
37274 -149463 -222033 -260689 -595600 -874569 -505775 244163 500356 102806 -178825 102757
37264 102757 431453 283241 -13153 90008 432734 511220 386100 525289 956448 1260665
37254 1260665 1289958 1218573 967622 327380 -338740 -341275 208467 352109 -299913 -908995
37244 -908995 -655814 84389 446601 340877 271424 348352 276365 75814 90820 395649
37234 395649 754762 1026805 1125748 823894 136540 -343541 -97130 527017 768765 535273
37224 535273 394104 612827 866439 889994 817129 797827 765603 655896 481124 186438
37214 186438 -243025 -592418 -632557 -413646 -105523 216141 368535 27524 -715842 -1156573
37204 -1156573 -806675 -65582 406749 564526 691259 709380 436790 137743 136483 244732
37194 244732 228434 403788 1025891 1546510 1340798 769643 613492 830249 838780 668928
37184 668928 768147 961273 731439 332647 470396 1003722 1129356 782855 656689 820260
37174 820260 562454 -241734 -791261 -642640 -281109 -155313 -115908 -40212 -79217 -89577
37164 -89577 266342 711772 580757 -33997 -315792 2773 383931 541462 676372 616083
37154 616083 -82070 -1029818 -1244595 -691628 -348703 -527710 -483435 11910 175735 -205565
37144 -205565 -169627 742716 1538834 1312991 531418 -31491 -464918 -940839 -893562 -21355
37134 -21355 810472 700265 14763 -325325 -151557 192632 679597 1324006 1697191 1503539
37124 1503539 1104110 849446 531816 66910 -55200 355108 662254 448029 262855
37115 262855 598887 963389 814634 588663 835162 1072537 548860 -440657 -1013317 -989141
37105 -989141 -766406 -378987 334208 993087 1084391 846462 866409 1037622 790599 188776
37095 188776 -76642 225158 516462 250892 -412102 -864564 -678913 4364 549454 434380
37085 434380 -124550 -442081 -288401 -78115 -69419 -5839 232708 292194 -2235 -269350
37075 -269350 -227135 -153932 -305982 -415852 -171410 293255 744726 1209342 1646102 1722177
37065 1722177 1258704 546594 7149 -133047 191749 786397 1105014 817147 383779
37056 383779 456555 879957 1041634 980977 1203192 1576330 1510415 1154384 1250048 1787353
37046 1787353 1987891 1671289 1438916 1466748 1383881 1375892 2010883 2856512 2737720 1596680
37036 1596680 667622 579791 729507 715035 849982 1051846 839195 622724 1265875 2195774
37026 2195774 1908979 622375 242118 1217701 1760169 949124 217861 656571 1167088
37017 1167088 701689 222798 834151 1764945 1813747 1255826 875949 566786 185361 320655
37007 320655 992878 1107197 344197 -7753 791217 1661321 1698348 1598641 1907586 1790707
36997 1790707 879704 401270 1048355 1626428 1225735 797205 1158895 1479296 1213544
36988 1213544 1406657 2491226 2976818 2005247 1006803 1122567 1301195 726639 631626
36979 631626 1689709 2170247 952600 -133789 591994 1686446 1282174 369772 651324
36970 651324 1381440 1160445 751162 1311282 1871442 1310388 779187 1483508 2201918 1659109
36960 1659109 1075865 1682050 2153626 1281478 566936 1305432 1891854 1005896 452263
36951 452263 1661402 2609725 1642217 918574 2350900 3730122 2903459 2015024 3261811
36942 3261811 4424704 3330337 2561246 4571246 6475747 5304984 3890484 5461922
36934 5461922 7232746 6025492 5108757 8018904 11054194 10186627 9594267 14014506 18942214
36925 18942214 19101363 19772742 27215554 35427308 37611427 42605268 60733342 81913047
36917 81913047 94105845 117851641 185858658 280426978 328929446 284839295 186538157
36910 186538157 109198685 79566133 68554023 51176014 34982249 30875929 31166497
36903 31166497 26812601 22420239 22850322 22158987 15771206 9914082 10037886 11249490
36895 11249490 8232744 4697169 5357043 7135204 5628470 3060304 3093506 3952934 2804650
36886 2804650 1529312 2586334 3924893 2983898 1436625 1551359 1904601 721753 -374021
36877 -374021 380272 1514219 1450163 1406588 2260342 2224142 507853 -430091 877566 2105222
36867 2105222 1378990 618261 1694107 2838069 2014681 617998 675293 1305862 974102
36858 974102 558578 1294386 2138764 1851250 1363628 1697076 1899134 1279045 1215463 2522196
36848 2522196 3513072 2908494 2180240 2786275 3576420 3239077 2867214 3695648 4606184
36839 4606184 4326243 3977279 5030415 6681895 7554677 8164954 9528789 11101557 12153940
36830 12153940 13445326 15600741 17570355 18465284 19042428 19662624 18881370 15973760 12774580
36821 12774580 10990848 9704203 7590641 5554672 4893893 4748135 3755063 2592483
36813 2592483 2545519 3032529 2805689 2243918 2302514 2492079 1979954 1435078 1748162 2134156
36803 2134156 1490602 479624 330107 689884 552156 242554 629249 1324866 1414212
36794 1414212 1074411 928547 766892 360101 458417 1513092 2479800 2314237 1584778
36785 1584778 1279509 1175961 710396 272077 338622 492988 438779 704651 1324266 1338562
36775 1338562 634860 550481 1588723 2518968 2905821 4181497 6642760 7889846 6344095
36766 6344095 4005174 3343195 3613018 2877516 1666499 1636038 2212555 1702094 557987
36757 557987 496354 1246110 1115014 134347 -155510 427484 679582 468683 747318 1406851
36747 1406851 1417717 866392 806112 1463150 2474438 4178803 6570006 7822695 6312885
36738 6312885 3461973 2043744 2214636 1888911 609098 74015 792221 1162758 410431
36729 410431 -177653 302832 945659 860653 486844 316742 28049 -424165 -410729 73443
36719 73443 159530 -341884 -529257 5569 548753 645562 763399 1108383 1061357 352990
36709 352990 -275471 -125941 564958 1136586 1214580 777719 162882 -46187 273056 501049
36699 501049 332880 468808 1353276 2042204 1571187 667150 595987 1010384 685093 -148841
36689 -148841 -139210 802202 1420073 1349321 1466941 1906727 1689938 700036 192198 770052
36679 770052 1445921 1321993 809506 591686 631140 755210 1091602 1431863 1191978 412415
36669 412415 -139178 -121356 51400 137224 300024 357137 -81368 -629621 -433206 428918
36659 428918 991987 924064 797298 790727 443373 -137300 -163747 464747 950774 1007651
36649 1007651 1192979 1574685 1437827 714667 341918 668149 797288 135846 -605765
36640 -605765 -644468 -280014 -112702 -70607 71791 58362 -263091 -439140 -122945 328297
36630 328297 478427 448871 512836 628230 708384 781225 648798 39537 -713455 -887852
36620 -887852 -473902 -263469 -585941 -800919 -407968 157153 296141 112772 13650 25367
36610 25367 -13456 -22083 159845 492184 842230 1080202 1009007 567036 87534 -56802
36600 -56802 9537 -73169 -275235 -351694 -421873 -730865 -1031709 -909411 -550584 -468864 -631561
36589 -631561 -589025 -283681 10443 315273 739246 944557 680563 510370 1057203 1884467
36579 1884467 2167234 2091188 2417468 3079946 3591528 4444286 6401906 8520197 8752383
36570 8752383 6815676 4694752 3806614 3375404 2334042 1182474 883497 1210937 1376588
36561 1376588 1369985 1587540 1827619 1626189 1089378 621379 268219 -55533 -144769 145017
36551 145017 534463 737395 841066 969110 1021556 988853 1041036 1144785 1113412 1082353
36541 1082353 1286516 1382624 833581 11632 -73767 660504 1128738 737071 229798 363420
36531 363420 719041 518916 -154457 -662264 -746217 -546024 -159406 298935 600386 740499
36521 740499 972492 1259173 1181446 615155 -18704 -361287 -428069 -204837 411238 1125192
36511 1125192 1414128 1383159 1745804 2743194 3792608 4416672 4809788 5324018 6181491
36502 6181491 7823636 10544555 13417677 14583243 13213603 10471442 8018809 6317169
36494 6317169 4942174 3791317 3151740 2984771 2876897 2568648 2106463 1615157 1197282
36485 1197282 918781 758355 700809 813201 996768 883565 378949 29419 302119 787048
36475 787048 791061 444165 413627 748793 903991 751030 636396 554804 239804 -32109
36465 -32109 220171 605266 259840 -637059 -941700 -316202 253876 38816 -409476 -240850
36455 -240850 556484 1391851 1759110 1499528 1036485 1320332 2749835 4272131 4491010
36446 4491010 3517417 2658466 2458017 2314541 1948543 1804854 1856928 1426914 492919 -103311
36436 -103311 -37406 120528 110557 296755 580036 325546 -369690 -636138 -279906 34822
36426 34822 175906 666390 1293562 1211950 658102 828497 1695770 1775562 605117 -392735
36416 -392735 -237422 210700 39056 -234212 43199 411675 363442 295014 494743 485757
36406 485757 171588 294560 1008748 1374886 976718 608762 701287 600090 90304 14029
36396 14029 637714 1045179 880924 1003482 1695264 2000197 1546969 1175912 1112603 560099
36386 560099 -266033 -1076 1251340 1685322 992669 1000325 2114994 2254046 695472
36377 695472 -291614 602024 1502724 1091772 1059681 2460547 3249646 2226552 1721448
36368 1721448 3260246 4525998 4163323 5112043 8760379 10972469 10218753 14429419 30444970
36359 30444970 49437343 53726591 38934985 19575035 10086101 9455675 8856195 5903188
36351 5903188 4276449 4767506 4470884 2661835 1435322 1443994 1440915 1247233 1598772 1889174
36341 1889174 1116083 146382 335348 964026 626563 -14434 505104 1547883 1438514
36332 1438514 505622 385338 1006924 894365 -23255 -409932 -34661 40994 -367159 -338772
36322 -338772 276080 677209 735728 1016870 1310847 885959 83848 -74522 219452 -163522
36312 -163522 -1117307 -1222425 -98973 870960 663104 -16716 -96217 337453 573124 462010
36302 462010 419646 752181 1350710 1719422 1289161 124791 -849437 -881028 -394355 -301080
36292 -301080 -610196 -576014 -42456 307517 75250 -309283 -299959 141286 704630 1001500
36282 1001500 730113 77627 -206916 297211 950502 878133 292231 175281 741204 1092026
36272 1092026 536950 -504780 -1172906 -1168139 -821306 -564920 -558537 -607833 -379169 157420
36262 157420 619367 745665 786982 1039326 1276083 1094814 608918 302806 343397 491608
36252 491608 563543 540588 359339 28341 -179458 -65830 127319 116903 123887 493223
36242 493223 941669 804452 17069 -718459 -828207 -449744 -16114 308775 591455 827708
36232 827708 890828 675539 228616 -214928 -395006 -297107 -125603 50292 368582 772548
36222 772548 896324 631276 472660 894473 1602208 1858369 1453997 934641 847178 1096744
36212 1096744 1145723 668739 -79793 -527742 -413361 -47218 199877 460997 1007284 1464398
36202 1464398 1091664 -11026 -721043 -334156 454478 582429 89940 -172824 57503
36193 57503 198531 -117069 -495220 -455767 -88748 212468 313100 384927 571046 786109
36183 786109 838517 723876 731315 1085337 1491620 1351192 553914 -266944 -486453 -188678
36173 -188678 143456 325984 500125 686504 725666 595282 470016 465960 507463 422700
36163 422700 98045 -357872 -599115 -412960 -106006 -191000 -652866 -948451 -836672 -703551
36153 -703551 -844616 -953035 -673043 -201581 68851 114127 80482 -94680 -428281 -606309
36143 -606309 -397914 -39028 204184 475720 872442 974658 441077 -267916 -435518 -118592
36133 -118592 45993 -118194 -193686 17317 263319 426519 645465 793825 521634 -27441
36123 -27441 -187839 284504 797985 751586 285622 -125920 -384460 -640084 -782594 -555579
36113 -555579 -59542 284585 294383 235047 375931 555869 374239 -224251 -725480 -546374
36103 -546374 262432 992655 1052393 601364 232627 162620 46444 -400147 -934777 -1124803
36093 -1124803 -914102 -579257 -236323 262776 889588 1253273 1117148 853191 980848
36084 980848 1360197 1342969 785331 345561 500885 816149 677961 303381 340401 737902
36074 737902 809996 393842 149610 509980 1007485 996382 549003 239310 340833 582442
36064 582442 559471 201498 -102056 114236 722542 927106 231716 -736446 -921380 -219715
36054 -219715 475238 537321 187858 -188898 -500051 -593500 -279739 92399 -93415 -648329
36044 -648329 -675710 -31729 328701 -75079 -411898 38334 673416 690318 471819 743114
36034 743114 1118696 754537 -92112 -471397 -372774 -613873 -1226982 -1285055 -473325 340827
36024 340827 401562 -39634 -420462 -590988 -523299 -105714 394000 356655 -303327 -872573
36014 -872573 -816758 -465788 -357183 -440983 -393322 -282566 -398553 -658014 -647869 -193940
36004 -193940 425657 826871 897857 816938 767209 686745 409023 66616 94607 635389
35994 635389 1195118 1199654 684364 96629 -350414 -690098 -777240 -409965 175326 459302
35984 459302 332442 191090 304221 501743 547360 440485 279146 128862 46292 -13265
35974 -13265 -211559 -487093 -444468 14421 261610 -245948 -970645 -878477 78880 913971
35964 913971 1079798 1076484 1328302 1373472 707497 -277039 -843758 -928104 -977368 -1113093
35954 -1113093 -1058226 -723758 -360597 -195621 -262404 -493280 -702278 -616168 -186626 264048
35944 264048 427666 369738 303398 235178 96376 6031 93661 223538 190415 46562 -43197
35933 -43197 -110903 -245970 -316200 -202703 -188317 -652627 -1371004 -1585994 -947320 -10955
35923 -10955 446140 328626 135757 169776 230406 96409 -64580 39606 365609 585310
35913 585310 532857 396022 450839 755339 1136007 1356759 1264973 878374 385053 -575
35903 -575 -204084 -276497 -261455 -175125 -81165 -70657 -190873 -466610 -879976 -1213657 -1120762
35892 -1120762 -599963 -185262 -286887 -538194 -311379 254647 413886 10431 -261226
35883 -261226 -7897 245957 15809 -303230 -147882 273407 437180 398194 483098 512480
35873 512480 146609 -295852 -216859 255490 487755 429640 575736 872489 642499 -218146
35863 -218146 -880968 -769217 -326709 -200744 -345751 -407422 -397216 -447195 -371728 -38332
35853 -38332 181139 -103303 -595141 -632150 -103603 420368 458517 140373 -82570 36247
35843 36247 381311 663673 668811 383671 -38515 -377585 -413701 -51026 490873 762132
35833 762132 591163 383587 610190 1091518 1181567 657506 4801 -278805 -268240 -331936
35823 -331936 -599713 -909610 -1037779 -826327 -310715 172546 264099 61050 15522 249928
35813 249928 343990 -3394 -476616 -595767 -345686 -17748 288718 590467 655933 227022
35803 227022 -416694 -595280 -82401 521184 491973 -148657 -704582 -628016 -35785 567746
35793 567746 836821 762737 510290 280719 249809 414944 507070 267779 -158162 -338023
35783 -338023 -133135 82005 -70956 -468322 -686758 -540764 -205001 79242 224973 309393
35773 309393 496838 855522 1185581 1209909 988997 862326 884012 706629 229853 -85890
35763 -85890 85394 347335 181480 -206748 -241591 37150 -1430 -596210 -1214931 -1251069
35753 -1251069 -680545 43222 422715 251942 -171152 -220469 371345 1099282 1244915 682289
35743 682289 -160477 -853906 -1095917 -663841 198027 673685 323119 -163759 77762 673675
35733 673675 519901 -429992 -994871 -522190 261275 504179 365011 390628 583453 679892
35723 679892 722592 789206 665955 285708 15011 58197 53389 -293006 -638666 -538183
35713 -538183 -125902 175032 234820 110066 -222275 -607466 -612494 -121190 366545 443165
35703 443165 365843 480762 562570 290778 -44388 33266 360869 400695 133825 45005
35693 45005 297333 500663 321900 -116746 -480366 -543936 -292455 53356 174813 -8842
35683 -8842 -282754 -518298 -816246 -1119545 -1103956 -734286 -488872 -642715 -745561 -293579
35673 -293579 431158 724165 409056 -71721 -301828 -169984 271590 767121 879854 488955
35663 488955 59897 39887 273063 414006 519834 697121 587442 -82608 -758826 -671540
35653 -671540 -8642 333330 72328 -215541 -165490 -72607 -128981 -32250 358383 668540
35643 668540 651111 608968 837916 1138605 1203960 1057926 818154 445395 24996 -114452
35633 -114452 102258 241387 -44004 -449705 -398578 226745 1025028 1575421 1742723 1636651
35623 1636651 1488865 1470093 1508376 1414996 1212892 1093062 1017159 719687 214870 -97254
35613 -97254 -22686 133993 121125 146330 367856 424716 11183 -431296 -281912 187871
35603 187871 99970 -638441 -1054928 -528217 266917 387399 10180 30298 600461 951801
35593 951801 658703 233901 213853 387059 367136 327803 585020 890576 808445 506851
35583 506851 467529 569429 229914 -532094 -948898 -619783 -91802 -10426 -267838 -372268
35573 -372268 -172099 200949 688116 1161438 1272621 886071 378982 107291 -116756 -561685
35563 -561685 -905995 -617123 151668 634515 437013 -25268 -138956 222428 691045 796032
35553 796032 326796 -458813 -987393 -925056 -526991 -260231 -226858 -217933 -178335 -255088 -433846
35542 -433846 -471806 -232030 154421 483610 665912 738950 819177 962358 981350 583972
35532 583972 -167006 -757103 -775514 -346977 163594 578283 815622 740046 434773 283895
35522 283895 416019 432952 114978 -33209 472072 1176637 1239790 662147 199880 197099
35512 197099 303370 313258 454921 737849 793106 561474 442919 551851 508203 197001
35502 197001 6998 -2758 -397213 -1312467 -1812069 -1037372 432931 1157232 596464 -379366
35492 -379366 -733617 -398007 8130 135609 221269 565266 1007931 1109428 774905 421991
35482 421991 378571 381605 5406 -593963 -817934 -472153 -6145 164871 150121 266782
35472 266782 597579 985037 1147190 758490 -183261 -1022083 -970615 -127604 507977 243771
35462 243771 -542699 -1061963 -1034742 -653452 -106684 438411 723707 664526 486127 348108
35452 348108 159972 -19302 131087 592586 823152 615636 586577 1190313 1751070 1312610
35442 1312610 151373 -498408 -181546 246836 9036 -540120 -679572 -472477 -527281
35433 -527281 -956629 -1195562 -812056 -52321 514583 626369 468170 323442 249470 124792
35423 124792 -80489 -210296 -120632 134453 375654 473978 401384 205511 1505 -96363
35413 -96363 -74160 44576 326180 780328 1106975 931555 382813 38937 102705 83936
35403 83936 -338644 -601313 5627 1175963 1874274 1692664 1201645 903204 606948 120494
35393 120494 -168700 72440 425771 291229 -158890 -253617 91657 243867 -129894 -534150
35383 -534150 -386127 195830 694549 928365 1054081 1050664 692766 38122 -476031 -558374
35373 -558374 -406359 -380566 -548313 -693443 -609637 -252403 248237 608710 586203 272049
35363 272049 22913 -562 18646 12300 277394 924634 1389624 1043449 189882 -140221
35353 -140221 492180 1325147 1356849 547286 -248773 -323763 208837 690768 637863 164628
35343 164628 -224907 -230939 -60214 -83692 -367400 -711844 -938764 -853566 -182871 973322
35333 973322 1808698 1552940 522359 -212077 -230552 -94553 -157195 25894 665214 1032058
35323 1032058 547411 -119272 23990 718340 824979 73299 -585389 -444809 50310
35314 50310 160276 -91575 -135274 290996 868472 1097179 804797 360654 315398 657168
35304 657168 683066 -17840 -770042 -619356 273334 832196 620731 303364 370419 334645
35294 334645 -308360 -1087888 -1217883 -750005 -367218 -336338 -339392 -201741 -172548 -448931
35284 -448931 -852072 -1054447 -893731 -478085 -132539 -117261 -265067 -127350 351569 634090
35274 634090 345184 -115288 -119912 306659 620021 553066 279803 -62166 -468881 -742189
35264 -742189 -590794 -100736 324143 506719 577775 556973 337774 86832 120800 318174
35254 318174 208144 -234286 -471465 -283019 -144154 -394230 -623941 -366606 98092 199120
35244 199120 -36144 -140589 1031 100315 33014 -79130 -212373 -367558 -333818 -66879
35234 -66879 -82334 -786782 -1576111 -1441730 -493751 34193 -472133 -1168233 -1082568 -433578
35224 -433578 15107 179689 426094 659463 555055 369992 602627 1001188 818456 36264
35214 36264 -543627 -533963 -440254 -691444 -1008388 -1081475 -1127868 -1318770 -1306825 -849518 -338056
35203 -338056 -146490 21771 518478 984445 946314 768799 1131099 1795108 1853560 1163853
35193 1163853 566517 538348 591263 337453 204933 517401 691931 163351 -505373 -406102
35183 -406102 173750 67885 -928409 -1589720 -970707 276085 863439 538141 87703
35174 87703 40211 135712 48076 -75296 -15859 85330 37570 11432 253277 564348 475542
35163 475542 -61239 -516977 -447931 -42709 201231 164088 178863 457773 738998 639527
35153 639527 189303 -171985 -87459 362188 784609 847722 528747 103290 -85011 71629
35143 71629 346081 454009 416017 492540 727376 782761 409794 -90059 -160829 305319
35133 305319 864416 1138523 1199444 1208875 1032252 517299 -77229 -323690 -215903 -140727
35123 -140727 -252840 -256577 67922 452155 474352 91948 -384078 -693576 -785549 -688180
35113 -688180 -461916 -245639 -149180 -100928 48028 287395 463667 503582 442177 230784
35103 230784 -260502 -951541 -1443806 -1386558 -897076 -460940 -398520 -538026 -465148 -25963
35093 -25963 493213 668274 353294 -208616 -618621 -632423 -308728 72192 255275 221986
35083 221986 131315 50584 -123558 -393731 -493359 -214991 209694 363145 239354 237401
35073 237401 515909 750666 692149 561849 610937 640416 349786 -102793 -329040 -310689
35063 -310689 -305720 -297927 -71418 216969 122878 -339755 -598642 -371173 -104295 -273014
35053 -273014 -673843 -782580 -488197 -100288 120568 90898 -209076 -619816 -758901 -444717
35043 -444717 -19602 63869 -180807 -423998 -548548 -649788 -684739 -566232 -495879 -731044
35033 -731044 -1063313 -1005594 -518207 -88674 -27612 -130967 -133926 -56010 39316 198250 325769
35022 325769 199161 -86735 -125392 119555 102623 -484537 -1090715 -958073 -135343 613051
35012 613051 758920 469350 197423 161811 226140 83030 -400507 -919702 -987514 -565885
35002 -565885 -175171 -215144 -512099 -759899 -997821 -1302728 -1425681 -1207682 -986736 -1041995
34992 -1041995 -981794 -353226 415963 477371 -154929 -602869 -423228 -86220 -17501 17834
34982 17834 274634 504266 480956 449470 615871 707343 478717 202439 201291 284810 109423
34971 109423 -218783 -335659 -161151 114565 343217 409848 186760 -215402 -441135 -385780
34961 -385780 -351340 -477213 -469981 -192431 12255 -25279 93311 562636 822820 458546
34951 458546 66610 364090 901185 689166 -159389 -523056 30307 704903 795572 579496
34941 579496 593719 841079 1069341 1176953 1040868 543171 288 -53002 301624 425189
34931 425189 190432 180817 542965 563676 -106357 -709909 -577602 -264297 -587027 -1145079
34921 -1145079 -853554 369905 1472152 1716284 1363861 900169 420812 -46577 -296493
34912 -296493 -265176 -133122 14912 220245 330101 140509 -111380 54911 569362 769672
34902 769672 350256 -156371 -122553 369955 767832 752104 420819 52380 -44242 299491
34892 299491 822503 940529 403384 -347698 -720101 -667007 -583164 -695305 -875627 -954227
34882 -954227 -898223 -700495 -351490 54514 368121 546367 628758 594023 399024 120117
34872 120117 -109912 -273735 -421035 -503357 -452425 -379844 -461075 -619897 -588262 -331131
34862 -331131 -137993 -179330 -251522 -159462 -99506 -368061 -852146 -1146110 -1110835 -987553
34852 -987553 -953639 -886653 -639789 -269467 105271 406678 465845 91864 -547861 -899014
34842 -899014 -625906 -47352 260775 96595 -362389 -920047 -1378360 -1415274 -909111 -305239
34832 -305239 -202332 -561537 -750765 -431148 20468 95656 -222530 -592002 -741310 -581936
34822 -581936 -171761 244776 380491 223787 10006 -155658 -330824 -373560 -20919 525062
34812 525062 629821 145272 -237200 10592 410322 242707 -265747 -305924 178097 381826
34802 381826 -84934 -619813 -568221 -75655 339594 514695 542444 395308 109273 16754
34792 16754 322576 657493 497379 -112849 -669503 -933018 -1093354 -1240956 -1150373 -730916
34782 -730916 -312125 -240186 -422432 -510191 -398118 -321495 -504485 -874837 -1130482 -1004487
34772 -1004487 -479869 192780 694281 872551 771690 495913 177459 35658 214472
34763 214472 477172 348407 -212003 -532923 -11164 963051 1334944 689208 -236853 -526726
34753 -526726 -140563 309719 459229 399540 215798 -145811 -568088 -787719 -809505 -915608
34743 -915608 -1172319 -1302057 -1182519 -1100178 -1286474 -1517343 -1440414 -1046743 -545504 -17234
34733 -17234 480032 685590 453634 189401 483425 1262519 1758346 1487134 857816 540128
34723 540128 580934 546677 313579 211012 397994 570659 428277 60523 -305079 -600874
34713 -600874 -746373 -532421 -2663 362206 252396 54604 280129 708184 730672 409718
34703 409718 419402 887552 1128662 783860 411695 513119 725906 564284 279207 294763
34693 294763 391139 226664 131154 495188 835740 472056 -213849 -271151 295099 624489
34683 624489 483456 420154 459017 -7088 -816689 -925030 -142964 340251 -191667 -869115
34673 -869115 -759160 -280300 -120561 106292 899621 1518353 988454 -196739 -780770
34664 -780770 -657461 -678258 -931961 -723525 -110330 74614 -181119 71033 999609 1522533
34654 1522533 1071963 539913 778738 1275739 1146938 536124 117434 -83203 -424390
34645 -424390 -722525 -547204 -162208 -292411 -1032197 -1694394 -1736125 -1260813 -614458 -30137
34635 -30137 267822 90107 -433365 -912427 -1136875 -1195655 -1120106 -744259 -83326 422827
34625 422827 338923 -163094 -400135 34601 761208 1069385 779345 373443 268809 329519
34615 329519 303838 389728 941137 1776847 2255280 2054120 1487413 984467 615286 262882
34605 262882 -47062 -204040 -238365 -309859 -493090 -610860 -315395 496296 1291596 1255127
34595 1255127 303123 -582955 -476183 316379 767452 608573 532367 928102 1280184 1115604
34585 1115604 775627 737856 770207 387668 -246675 -537113 -361942 -145091 -99181 13212
34575 13212 286158 353380 -89752 -763794 -1085576 -831981 -300234 124263 324744 341582
34565 341582 153823 -204022 -442223 -275011 97294 138437 -250937 -515540 -269094 96531
34555 96531 68003 -127465 43371 407894 319173 -175275 -279860 270367 731553 517563
34545 517563 72118 30812 153153 -199205 -923058 -1264912 -905612 -315908 -32811 -85121
34535 -85121 -206377 -240694 -228843 -300670 -502923 -606641 -218890 683222 1458974 1361777
34525 1361777 389692 -662023 -1018649 -616775 11416 335163 236569 -29344 -144902
34516 -144902 17727 375658 736615 874162 653856 234948 18206 185372 405299 253464
34506 253464 -189171 -477322 -451704 -363498 -387820 -436364 -470217 -558144 -564721 -229091 356849
34495 356849 796721 994650 1215722 1460037 1379907 998693 839792 1024839 940091 283055
34485 283055 -221458 171106 1003388 1190037 533107 -108121 -65641 401756 654553 411778
34475 411778 -139157 -576935 -533727 -30519 485687 633989 488353 291645 81623 -92112
34465 -92112 59021 604464 1014220 792897 255510 54879 125537 -170474 -882280 -1242145
34455 -1242145 -797344 -93412 128276 -89122 -165122 115817 398697 349606 90380 -38037
34445 -38037 34007 20515 -281156 -624293 -607383 -256953 44893 229737 625500 1179178
34435 1179178 1218146 457172 -315172 -242766 323434 382203 -151782 -388844 63006 542960
34425 542960 471934 167861 139374 289129 300310 247209 317393 367680 239736 153746 320597
34414 320597 473400 260301 -138438 -260724 -66177 68116 -22691 -82259 129612 500622
34404 500622 719045 589803 216556 -24464 175028 601089 619475 -25041 -739223 -783022
34394 -783022 -282551 -53694 -418186 -746214 -413488 254572 436938 -44207 -554677 -566319
34384 -566319 -237358 38262 186168 280624 217197 -29581 -101312 290504 762109 654624
34374 654624 -20207 -607371 -793956 -900531 -1045147 -789270 -36986 413895 -122083 -1139363
34364 -1139363 -1573443 -1180443 -580661 -187896 127269 416123 467049 290295 140796 4591
34354 4591 -338602 -722055 -714582 -406298 -396745 -864751 -1325168 -1483838 -1615068 -1828042 -1716288
34343 -1716288 -1152470 -717863 -787984 -815050 -186515 702822 986993 599253 236093 233181
34333 233181 233422 -45623 -400416 -604671 -717680 -766754 -587675 -179279 144088 139548 -106867
34322 -106867 -430103 -779932 -1016180 -851657 -270985 239804 214610 -166057 -307472 -33668
34312 -33668 167452 -148625 -743645 -1028369 -824936 -433496 -35434 488326 1036226 1098266
34302 1098266 456895 -296127 -440039 -106230 -42857 -513943 -1026434 -1172067 -1120214 -1089687
34292 -1089687 -898922 -369532 248160 604573 697627 701501 645555 528846 443097 318226
34282 318226 -97145 -687490 -810081 -141428 653492 664854 -45897 -555223 -318899 272893
34272 272893 617425 640795 651976 853705 1195791 1465991 1421706 1056688 767182 965551
34262 965551 1471586 1599690 970876 -34035 -762892 -972090 -851937 -621769 -362582
34253 -362582 -141476 -50986 -93808 -151549 -118538 -33000 -28787 -118978 -79589 289684 761371
34242 761371 796410 255544 -252023 -62649 674303 1256132 1460944 1757746 2374715 2759927
34232 2759927 2359062 1500639 982894 999317 1016394 661899 197670 -8077 -12698 -40144
34222 -40144 -32488 172980 395560 250681 -242613 -544296 -253688 339658 605326 364100
34212 364100 61106 141613 529419 858181 980265 983424 850150 477367 62793 70184
34202 70184 576463 952276 552469 -427255 -1172901 -1267926 -1041219 -847630 -527704 109637
34192 109637 700016 733464 347923 165002 359035 426849 21082 -471884 -484307 -65934
34182 -65934 228187 90663 -207226 -198108 259162 822959 966900 523997 -64544 -250538
34172 -250538 -122853 -278527 -837212 -1079360 -433769 593721 1020508 661152 202742
34163 202742 122641 158236 -87315 -563817 -963033 -1074391 -818819 -299311 80064 -75593
34153 -75593 -615188 -978292 -936040 -775456 -676006 -430029 23802 324915 263454 166531
34143 166531 350332 584206 477288 51194 -424423 -805506 -933715 -557604 152971 452923
34133 452923 -32375 -575543 -246890 717112 1204654 766435 80929 -144899 17433 186352
34123 186352 277715 351258 351204 289736 330555 507167 682028 842148 1028426 977769 398333
34112 398333 -347856 -522665 -139116 -39073 -523617 -756141 -114260 658749 498404 -382817
34102 -382817 -930181 -889484 -926867 -1254982 -1273124 -733119 -245866 -260853 -376764 -118224
34092 -118224 297199 458870 440921 471673 443229 288093 374600 910240 1311086 833496
34082 833496 -358810 -1352078 -1578660 -1232976 -731755 -310370 -87004 -9486 229565 766828
34072 766828 1150093 853711 109883 -365129 -413007 -518733 -817152 -775843 -105654 694844
34062 694844 1038724 914479 534886 -61051 -647609 -669688 -18096 543131 324595 -306811
34052 -306811 -500492 -135314 184259 90083 -240819 -570895 -788491 -739251 -427114 -232500
34042 -232500 -388502 -465078 -9471 551032 442694 -181128 -417440 -40031 253613 163574
34032 163574 284606 899062 1311414 1009565 572622 620440 650059 -76923 -1060141 -1141463
34022 -1141463 -317921 211048 -104872 -369896 291713 1356487 1661408 1020845 341707
34013 341707 286640 494806 295479 -265991 -500312 -35308 696057 1062892 1024515 991388
34003 991388 1073868 940218 473517 95069 184739 532275 670885 487777 191214 -85393
33993 -85393 -293968 -287846 -19328 203496 42596 -351909 -501636 -240391 125670 261583
33983 261583 99184 -264623 -638771 -731895 -403279 80057 332247 347689 369211 330844
33973 330844 -85995 -775633 -1097758 -682604 43086 418059 337476 198640 301774 608680
33963 608680 934823 1101341 995382 700779 485437 495259 577935 557628 513851 594424 732838
33952 732838 801368 884168 1092747 1221467 939146 305130 -235862 -404777 -329052 -191436
33942 -191436 16418 258179 306992 82906 -101194 78878 468350 609570 346477 -12177
33932 -12177 -134119 -29881 89744 146960 265466 551806 874764 906673 458661 -223635
33922 -223635 -643283 -595844 -355093 -206077 -34282 380228 881536 1111874 1034954 880474
33912 880474 648205 156281 -382548 -368921 379559 1245590 1489875 1004740 214378 -421032
33902 -421032 -613525 -363323 -106286 -336250 -841060 -819577 -83194 475011 150293 -434495
33892 -434495 -234175 620374 1054273 648815 50537 -176069 -173244 -166786 -91235 -40160 -290406
33881 -290406 -625074 -390871 478158 1225518 1367645 1265236 1237125 936381 169101 -430247
33871 -430247 -270475 239210 361010 169519 220601 466078 367167 -107976 -425579 -368020
33861 -368020 -249155 -246011 -177070 -5960 32715 -79723 -53352 181157 292785 47377
33851 47377 -363088 -601010 -521573 -206040 70786 -52267 -625627 -1150352 -1098865 -628041
33841 -628041 -358646 -452518 -393114 183219 877807 1019508 498149 -156819 -414781 -271412
33831 -271412 -147158 -334594 -619458 -573584 -201683 -6346 -271076 -615051 -556111 -216909
33821 -216909 -68844 -210488 -376099 -497612 -724662 -946637 -839124 -432551 -142005 -135455
33811 -135455 -127444 62438 172534 -70434 -499746 -692575 -417303 181303 660268 579075
33801 579075 -8830 -442974 -197106 346681 338871 -349731 -965956 -1000783 -830013 -937387
33791 -937387 -1107907 -884840 -388949 -109796 -132193 -116591 77780 252427 311224 385255
33781 385255 483027 424735 221081 157661 351904 540584 512986 472731 664692 847405
33771 847405 570817 -29183 -185152 509181 1408295 1520813 736655 -109374 -367469 -248751
33761 -248751 -214853 -204960 120923 678104 992936 871235 624258 577920 649411 518463
33751 518463 59160 -486328 -714478 -432443 167607 741617 1126386 1290683 1092151 452467
33741 452467 -248817 -446776 -189173 -147826 -603452 -984135 -786495 -373984 -308272 -402741
33731 -402741 -138513 374222 632787 663564 874389 1141919 918008 246921 -158620 22727
33721 22727 329746 335261 149658 -56323 -325658 -498712 -227691 306716 366745 -301333
33711 -301333 -1014094 -1120084 -823889 -601087 -378137 110771 580316 479638 -157204 -701780
33701 -701780 -732809 -447999 -268270 -307353 -289414 104581 815542 1376229 1397856 958459
33691 958459 337756 -355876 -918085 -767612 347294 1523930 1484291 293754 -570400
33682 -570400 -137150 907486 1359477 957139 200260 -498618 -840142 -513438 217110
33673 217110 386339 -428681 -1251771 -944544 119385 562252 -55212 -762300 -622773
33664 -622773 213304 1019678 1336491 1109875 549228 58471 -56434 92824 212657 273600
33654 273600 362252 284751 -164493 -672169 -731264 -436825 -337834 -496280 -378447 178545
33644 178545 579606 364166 -90608 -184711 14675 -18474 -430332 -839742 -940357 -835538
33634 -835538 -731909 -622763 -427552 -249655 -268863 -408468 -336399 81155 494018 457722
33624 457722 20471 -352363 -398647 -268477 -103994 162507 454012 438203 39030 -324704
33614 -324704 -324775 -190900 -249939 -369251 -287721 -157977 -246398 -375896 -237319 -28608 -144710
33603 -144710 -377743 -147442 463046 641935 20068 -738920 -852200 -404464 -10130 121851
33593 121851 289348 638952 886300 756935 402052 201413 254230 243897 -115481 -606796
33583 -606796 -699331 -254286 203359 116539 -357618 -495907 123366 1106861 1642756 1312758
33573 1312758 475016 -155713 -296041 -321029 -584730 -786651 -439212 209031 376781 -71198
33563 -71198 -390522 -153771 114536 -18521 -16034 675585 1419614 1147964 15725 -727325
33553 -727325 -447996 240039 638079 852703 1246173 1726122 1975046 1914859 1632998 1186624
33543 1186624 684507 291573 54847 -52053 13891 163333 24622 -547560 -1011014 -762308
33533 -762308 -64674 319926 301193 470047 957995 1175893 854024 476680 392811 316571
33523 316571 87974 127324 627420 1005399 748528 209000 -55098 -195595 -652767 -1237633
33513 -1237633 -1361842 -955774 -514650 -345342 -298758 -185505 -22308 109632 155944 106846
33503 106846 99821 311564 594538 535135 75240 -314386 -347202 -352378 -622112 -814623 -541658
33492 -541658 -136604 -172658 -480297 -362809 292531 795967 624426 66020 -250555 -72803
33482 -72803 369777 694047 695665 525549 529576 788998 972787 832099 590108 524985 429192
33471 429192 -48144 -678050 -820242 -336695 148396 39349 -538899 -999351 -988716 -664972
33461 -664972 -417527 -427315 -509066 -430185 -320450 -494829 -835936 -790257 -208248 295897
33451 295897 238404 45792 330689 779190 565893 -307749 -966725 -967489 -781164 -800527
33441 -800527 -723510 -297007 84581 48160 -85829 120183 429411 318789 -169708 -549743
33431 -549743 -622586 -532287 -288763 174990 570130 467371 -29354 -334214 -176256 105191
33421 105191 142114 -32211 -256493 -490532 -587360 -253474 439440 840391 410767 -565399
33411 -565399 -1321635 -1508552 -1384182 -1223611 -992761 -650814 -345225 -117175 257280 870378
33401 870378 1357384 1277495 711246 185053 33282 117823 216800 393534 786223 1203181
33391 1203181 1200844 606402 -189109 -561940 -249238 442224 992522 1143540 989044 712610
33381 712610 409713 176837 178376 466606 807616 844890 456253 -119455 -493555 -414262
33371 -414262 80153 664621 911631 632198 101215 -137965 222501 935186 1397728 1206393
33361 1206393 556146 73146 180812 660112 948849 819053 524212 265502 -136041
33352 -136041 -829319 -1498103 -1684443 -1394962 -1045317 -883927 -794461 -624396 -393649 -186994
33342 -186994 -117174 -354847 -888806 -1302688 -1156744 -598231 -209528 -210779 -235030 -7
33332 -7 254444 232671 87852 131898 319458 362572 185237 -40184 -194300 -284686 -295208
33321 -295208 -188792 -31501 39523 -52926 -299597 -621568 -845493 -780785 -412256 67559
33311 67559 453731 654313 642593 463490 282444 220642 151376 -95631 -354630 -282560
33301 -282560 73596 257336 72461 -110324 85235 514489 794510 833258 804498 784923
33291 784923 655970 277979 -326060 -844497 -803371 -112331 583886 534663 -132967 -561810
33281 -561810 -335226 98040 283424 343188 434816 348918 59061 2290 329485 520119
33271 520119 265403 50874 233411 258320 -391097 -1113499 -1026750 -370799 -29540 -57905
33261 -57905 188559 732940 974438 876042 949426 1059998 487187 -660487 -1311200 -1034216
33251 -1034216 -635404 -728647 -824284 -409622 91800 152238 58666 232447 363494 17025
33241 17025 -493697 -616814 -450307 -398285 -396678 -196595 4312 -52646 -48794 395711 863051
33230 863051 595939 -332711 -1035904 -944129 -311978 341626 724471 737578 476238 270347
33220 270347 320061 368282 115989 -203062 -120130 334224 657879 525223 -8787 -756425
33210 -756425 -1365129 -1271691 -316408 719433 848709 124887 -477739 -415659 -104722 -5554
33200 -5554 58883 349045 599722 432136 -17952 -319148 -352830 -349608 -470681 -632277 -671600
33189 -671600 -521204 -275190 -132415 -171031 -201148 -14360 270964 356342 208124 54440
33179 54440 -38944 -230608 -501577 -569848 -328902 -44414 30241 -47883 -119740 -139362 -46459
33168 -46459 273544 716345 905241 623900 121421 -181570 -133670 118248 358591 432744
33158 432744 301650 79113 -85223 -163412 -145364 119273 661727 1038590 693353 -227441
33148 -227441 -880033 -765558 -350433 -341011 -705987 -833683 -434465 150293 470668 445485
33138 445485 293481 219982 225187 134869 -158324 -466113 -442418 8831 618861 1075944
33128 1075944 1261255 1152104 788883 415435 310621 337248 26635 -672189 -1120033 -804393
33118 -804393 -101584 205564 -43386 -295734 -132358 222055 273351 -156165 -787517 -1174751
33108 -1174751 -1121635 -867483 -766233 -777993 -534690 27766 478539 514061 354338 233331
33098 233331 -45579 -600601 -947414 -601198 69002 245982 -219950 -732527 -881675 -790581
33088 -790581 -575173 -174257 199644 144926 -209592 -241753 147009 229870 -410485 -1042134
33078 -1042134 -681034 519396 1384090 1114143 103508 -640648 -564097 13030 374032
33069 374032 225608 -19171 130355 491529 440052 -138866 -602726 -414456 167934 513050
33059 513050 382581 16215 -237264 -109289 460933 1093147 1140263 411554 -512313 -968150
33049 -968150 -947724 -838600 -733257 -438163 4294 254475 105162 -332806 -808698 -1052000
33039 -1052000 -861427 -367929 -74019 -321772 -832161 -1059358 -865007 -529519 -241560
33030 -241560 51230 361215 587156 694585 686973 466779 9787 -408319 -452980 -117635
33020 -117635 384384 950507 1490352 1685583 1271037 460234 -280134 -743886 -906794 -606444
33010 -606444 125506 630865 287420 -428016 -364743 659171 1472073 1159800 293871 9126
33000 9126 476711 966900 1005087 737799 358684 -134302 -608803 -769414 -566402 -288852
32990 -288852 -187491 -247929 -328045 -293686 -55799 321022 614759 734416 873746 1146929
32980 1146929 1256317 867208 187682 -231264 -234424 -178990 -284919 -333505 -184126 -150933
32970 -150933 -518899 -977108 -971945 -521712 -238179 -460447 -753403 -518457 140262 512418
32960 512418 188722 -474458 -886833 -915871 -832598 -783389 -625847 -241640 241424 572977
32950 572977 596386 383593 258594 533996 1037205 1118859 473222 -244193 -112428 819244
32940 819244 1567395 1527271 1106444 865611 741914 550749 593352 1089185 1468967 1032638
32930 1032638 76638 -435792 -246851 -37781 -223164 -345676 14142 455282 412879 95936
32920 95936 151157 640930 942026 621585 -44516 -488634 -457279 -107943 261765 454910
32910 454910 454433 346537 163932 -141600 -537076 -847503 -970641 -1028411 -1150585 -1239094
32900 -1239094 -1164958 -1074884 -1171842 -1217375 -671075 494945 1477454 1484817 716248 121614
32890 121614 241252 679249 804889 582968 442260 572491 710916 566311 141507 -409011
32880 -409011 -978444 -1431547 -1515316 -1063717 -282473 318840 375192 44003 -129657 203567
32870 203567 768179 934873 451730 -254301 -619034 -609049 -613704 -777135 -777709 -340354 327209
32859 327209 790696 890187 778482 580170 256937 -179227 -512499 -499794 -154026 237130
32849 237130 399520 321058 143469 -126400 -592226 -1102303 -1187093 -624660 115986 371231
32839 371231 155494 93887 414001 509449 -176465 -1218456 -1650259 -1189110 -526381 -360853
32829 -360853 -591717 -682927 -482866 -301753 -295388 -196726 201050 604808 566990 137780
32819 137780 -181310 -149543 -86781 -310169 -616277 -617364 -338768 -112854 -39279 45454 139136
32808 139136 33045 -291733 -604850 -792015 -914236 -881240 -491880 98381 377303 133156
32798 133156 -237729 -270542 30480 355264 471471 292140 -109013 -404091 -286687 36331
32788 36331 58918 -185739 -64895 612959 1132819 906042 369489 227026 307121 -25676
32778 -25676 -646763 -747172 -66419 743172 1055719 905591 581786 218268 -36955 5851
32768 5851 213005 168755 -228981 -589394 -586511 -337495 -122986 -102957 -385641 -952718 -1407506
32757 -1407506 -1254133 -603105 -172753 -390419 -900450 -1164583 -1105789 -886960 -501971 23300
32747 23300 374713 330211 163143 263886 541501 597744 366120 174624 214657 315402
32737 315402 285549 177215 103620 -2183 -300962 -782396 -1188512 -1254411 -1025802 -832787
32727 -832787 -844924 -787640 -344571 252327 418627 54578 -231245 69443 706965 1108199
32717 1108199 1137425 1049799 941820 703258 395834 225256 144256 -105466 -494241 -624783
32707 -624783 -294090 165506 294902 53181 -215263 -202006 127268 581369 882629 865515
32697 865515 669173 624189 814487 886268 492832 -172483 -550720 -401623 -31580 205351
32687 205351 316098 419784 401465 118489 -257731 -480121 -679049 -1132295 -1605816 -1454860
32677 -1454860 -564960 295601 412427 39783 -65159 245235 409147 86188 -370188
32668 -370188 -500385 -364238 -333484 -518980 -659266 -490883 -89215 135086 -206691 -1015596
32658 -1015596 -1641776 -1479813 -625128 253306 662266 645949 424122 70767 -280694 -289785
32648 -289785 179905 697663 688189 163090 -296396 -295175 -40338 93029 98414 203472 404692
32637 404692 464594 335874 276157 450423 660797 620407 321815 -20341 -239362 -269145
32627 -269145 -90019 183691 313743 236246 170943 219926 132218 -201936 -360638 -21322
32617 -21322 325604 32746 -524481 -362032 492799 870414 273696 -259562 261584 1296846
32607 1296846 1713882 1410488 1012021 602507 -103233 -748524 -696333 -220543 -211594 -748932
32597 -748932 -1035778 -772136 -521361 -582067 -543806 -213739 -10147 -118779 -166952 -73364
32587 -73364 -312889 -928420 -1177320 -672797 -45554 101730 106948 462302 849453 728919
32577 728919 309878 138139 174149 67073 -23254 310162 862769 991362 556545 42728
32567 42728 -216861 -356067 -512728 -554483 -348060 33412 410866 604754 525291 327486
32557 327486 286865 340925 50715 -705951 -1319186 -1104472 -156677 797519 1194232 963974
32547 963974 322152 -375937 -731033 -614666 -312231 -143897 -118222 -131005 -205719 -282532
32537 -282532 -93235 420425 838165 757623 343614 83680 199861 541705 833922 844864
32527 844864 582023 431255 718493 1069953 777538 -79797 -623100 -523991 -466181 -807784
32517 -807784 -805504 46219 869702 679896 34072 143141 896522 1167188 760852 582528
32507 582528 902758 925319 334065 -53213 369011 1097580 1474814 1577811 1624803 1367944
32497 1367944 684849 61018 -116024 -158036 -432633 -652489 -345593 387690 1044613 1277698
32487 1277698 950434 92770 -837552 -1117621 -598266 11 -35303 -637945 -1335858 -1848975
32477 -1848975 -1936993 -1251241 77243 1145635 1200232 557161 74294 34658 146476 339098
32467 339098 806088 1340846 1361966 750703 127531 80075 478237 748839 571828 130531
32457 130531 -169731 -101516 194857 376117 278435 74140 -12657 -19381 -135252 -383099
32447 -383099 -584301 -587401 -383127 -42456 305474 457883 258817 -215404 -664799 -808759
32437 -808759 -622613 -339277 -216262 -293939 -393477 -329202 -59450 326059 613061 499287
32427 499287 -83593 -638126 -497303 243070 640918 133838 -607023 -624988 -89285 32020
32417 32020 -497430 -909355 -734252 -427014 -397769 -296376 233304 806623 918542 744911
32407 744911 667674 468903 -245090 -1102376 -1244820 -503839 380145 781473 842987 938068
32397 938068 994894 699854 100551 -362810 -415698 -303637 -443642 -777450 -709883 107368
32387 107368 1092850 1239056 355545 -614374 -754793 -295557 -195273 -827915 -1534782 -1482814
32377 -1482814 -622260 322596 623895 193970 -457641 -798092 -735574 -510386 -273610 30749
32367 30749 408792 681134 664311 345494 -109557 -371498 -88486 695076 1353582 1304683
32357 1304683 778960 505829 639855 602758 138483 -168636 171059 708803 734395 348817
32347 348817 173548 268108 96638 -479354 -907774 -813361 -556595 -601617 -754697 -478598
32337 -478598 200067 538572 -39123 -1134971 -1700003 -1176102 -102923 562781 553816 430198
32327 430198 699253 1203766 1490884 1425948 1210024 1028965 913518 790230 516019 29126
32317 29126 -433283 -510775 -243509 -130213 -459387 -865524 -826078 -377010 -29139 -106953
32307 -106953 -427504 -545447 -142776 695699 1446008 1548650 1001607 386349 189081 308111
32297 308111 339801 84661 -355049 -681348 -490761 356559 1302519 1491626 852055 272022
32287 272022 369546 661668 460514 25226 89564 636924 982568 896916 838208 1098538
32277 1098538 1452379 1695229 1856795 1803992 1289187 532575 156160 374566 790128 1095666
32267 1095666 1366032 1513170 1176266 473941 168741 599810 1043963 725497 -19817
32258 -19817 -262364 187416 695148 857882 875784 889211 710895 396123 381724 710936
32248 710936 719258 -8375 -839899 -897319 -351819 -143413 -476183 -470828 393693 1292874
32238 1292874 1139550 126632 -590428 -491245 -147995 -125003 -260093 -257691 -253488 -385449
32228 -385449 -395503 -157861 -139059 -745392 -1512089 -1570282 -833768 -171552 -322157 -1021136
32218 -1021136 -1356838 -810695 163100 595165 84471 -678529 -741467 -142598 199285 -84453
32208 -84453 -233816 376148 1124233 1048772 352206 62671 435438 692240 379793 11260
32198 11260 59548 153848 -203046 -712243 -690446 -99725 393696 311831 -100300 -288503
32188 -288503 -83203 158634 44268 -361947 -668767 -726855 -784328 -970295 -972423 -526872
32178 -526872 46765 185180 -226161 -851147 -1372325 -1570703 -1215955 -403699 233837 267585
32168 267585 217260 834774 1799881 2031918 1338108 760368 992338 1419127 1267629 859950
32158 859950 957725 1458904 1595660 1104710 426673 -91344 -489107 -731183 -573748 -1579
32148 -1579 621845 947624 927977 708494 462808 302436 178926 -24127 -177956 55481
32138 55481 642655 954942 529195 -179469 -276628 466743 1443058 2030276 2076148 1621686
32128 1621686 757825 -98352 -350092 42368 373071 74629 -521550 -668843 -202346
32119 -202346 358914 565945 459604 254497 36439 -94957 60447 505898 888254 887238
32109 887238 617706 406044 303099 115715 -159568 -292109 -233556 -228705 -399693 -538721
32099 -538721 -473767 -336476 -265131 -147015 78757 159075 -82350 -331549 -163896 333110
32089 333110 729053 897576 1034800 1127318 927657 492331 241476 339784 422976 107700
32079 107700 -538525 -1154416 -1429833 -1234745 -707486 -249204 -117157 -49037 325500 780688
32069 780688 754857 316312 193726 681128 1211536 1307016 1229768 1252891 1018659 289012
32059 289012 -268180 115750 1078208 1543465 1183653 651401 433379 291881 -51361 -408277
32049 -408277 -544254 -548767 -538214 -426226 -196132 -9013 146775 543095 1250279 1900357
32039 1900357 2083955 1724253 979989 109522 -494784 -548864 -308206 -352830 -755022 -891488
32029 -891488 -344279 447835 802388 678232 515845 515322 581069 750070 1094357 1293890
32019 1293890 904739 110722 -332688 -68966 407268 495787 282490 274773 648425 1111902
32009 1111902 1339253 1211798 753786 151156 -228350 -148878 153776 218366 -32029 -207657
31999 -207657 -57276 143107 14081 -331623 -429097 -145754 93784 -107203 -540487 -661634
31989 -661634 -357210 -113686 -299215 -581281 -385756 225652 582197 338572 -74353 -119219
31979 -119219 157066 412795 592603 769521 730344 297015 -134739 -30763 374044 299838
31969 299838 -381730 -896257 -720405 -277028 -132206 -178968 -115359 -126186 -444628 -694750
31959 -694750 -387217 221697 457515 214899 -38058 -70409 -12434 214761 829058 1503609
31949 1503609 1496480 669613 -231090 -552053 -448781 -361591 -288676 29334 535668 856246
31939 856246 737599 270765 -222065 -449309 -431645 -496250 -800878 -998388 -715146 -218336
31929 -218336 -106060 -392118 -508671 -289611 -271930 -754910 -1196683 -985778 -321790 178885
31919 178885 391553 644516 978570 1002470 502094 -194728 -560168 -384914 68976 307584
31909 307584 11230 -688886 -1307331 -1381753 -790671 145307 788749 638310 -113406 -673895
31899 -673895 -560736 -149781 21534 99594 469442 826267 550820 -137694 -361936 52112
31889 52112 391954 383358 591914 1137037 1172332 330391 -366619 29268 855635 831907
31879 831907 -28972 -635039 -550530 -371595 -522490 -744736 -833373 -969992 -1163875 -1101412
31869 -1101412 -746374 -510061 -648507 -928933 -999522 -756836 -351162 -95448 -212585 -402261
31859 -402261 5287 1072694 1880745 1704289 1097148 1043824 1453393 1462587 963300 706320
31849 706320 903461 857416 209223 -452126 -579346 -405542 -313099 -234240 -67333 24172
31839 24172 103437 533039 1164458 1223354 517626 4831 475885 1313483 1369101 611642
31829 611642 17335 53732 157142 -242895 -903788 -1199999 -915174 -368870 459 17338
31819 17338 -147838 -201172 -47680 157627 269359 297127 273627 211773 243606 506283 782042
31808 782042 586183 -187282 -997224 -1249309 -903232 -307055 252265 585190 526195 181349
31798 181349 676 234452 515289 359184 -84727 -212180 173848 593855 535181 42911
31788 42911 -429450 -536478 -307257 -27493 69966 27463 39755 99316 -56330 -509887
31778 -509887 -876713 -725356 -194987 120690 -59643 -336888 -178279 355099 651890 292027
31768 292027 -448066 -915925 -788102 -310219 103414 288604 299576 196256 45987 -8295
31758 -8295 116232 320437 485754 631218 746365 657679 316169 41759 156763 508960
31748 508960 707806 703591 722153 736248 501472 91346 -141114 -191581 -438538 -913749
31738 -913749 -1113213 -791347 -407070 -416743 -579703 -408737 30725 248915 61874 -233093
31728 -233093 -324035 -203694 -63470 -69704 -188263 -148863 262217 838950 1144731 1089438
31718 1089438 938333 698881 56757 -856446 -1266898 -782968 -57323 160211 115814 429003
31708 429003 792180 323900 -839491 -1381298 -571084 673920 1049214 550951 220891
31699 220891 593805 1156396 1261648 886858 339670 -219527 -652201 -665415 -199653 250275
31689 250275 185740 -134773 -22997 529742 703558 82357 -570643 -301151 702901 1414501
31679 1414501 1324910 788260 189436 -405497 -754270 -460332 266318 625675 340862 80307
31669 80307 400131 935052 1093989 916208 701601 407320 37988 51096 631260 1071318
31659 1071318 724419 153588 363753 1157286 1329016 469128 -494800 -742508 -550301
31650 -550301 -451087 -287441 298238 1048832 1418944 1352142 1181931 1026373 802797 668398
31640 668398 910186 1391370 1552379 1121509 549049 505949 1042966 1476688 1192432 392152
31630 392152 -180667 -192545 -51704 -198993 -477151 -519803 -430301 -579251 -876764 -787019
31620 -787019 -120833 624891 863863 552274 96746 -135601 -103499 -39364 -151470 -286633
31610 -286633 -10499 779990 1503562 1497129 866524 341781 327039 525955 550349 454488
31600 454488 500309 741609 1041064 1249758 1204117 759571 -2754 -735342 -1103939 -1045422
31590 -1045422 -765858 -594500 -756680 -1112016 -1214554 -852203 -410115 -422515 -871203 -1250276
31580 -1250276 -1244929 -996340 -742771 -559110 -449335 -383369 -257883 -78454 -60515 -248847
$$ [...]
##END NTUPLES=NMR SPECTRUM
##END=
