##TITLE=31Pdec_E3d0606M
 , 24 sc
 7.6.2023
##JCAMPDX= 6.0         $$ Bruker NMR JCAMP-DX V2.0
##DATA TYPE= NMR SPECTRUM
##DATA CLASS= NTUPLES
##ORIGIN= UXNMR, Bruker Analytische Messtechnik GmbH
##OWNER= root
$$ XWIN-NMR		Version 3.5
$$ Wed Jun  7 15:29:17 2023 Russian Standard Time (UT+4h)  she@DPX200
##.OBSERVE FREQUENCY= 81.013821
##.OBSERVE NUCLEUS= ^31P
##.ACQUISITION MODE= SIMULTANEOUS
##.ACQUISITION SCHEME= undefined
##.AVERAGES= 24
##.DIGITISER RES= 16
##SPECTROMETER/DATA SYSTEM= spect
##.PULSE SEQUENCE= zgpg30
##.SOLVENT NAME= CDCl3
##.SHIFT REFERENCE= (INTERNAL, CDCl3, 0, 248.564)
##AUDIT TRAIL= $$ (NUMBER, WHEN, WHO, WHERE, WHAT)
$$ ##TITLE= Audit trail, XWIN-NMR		Version 3.5
$$ ##JCAMPDX= 5.01
$$ ##ORIGIN= Bruker BioSpin GmbH
$$ ##OWNER= she
$$ F:/spectra/data/she/nmr/P31/1/pdata/1/auditp.txt
$$ ##AUDIT TRAIL=  $$ (NUMBER, WHEN, WHO, WHERE, WHAT)
(   1,<2023-06-07 15:28:18.73 +0400>,<she>,<DPX200>,
      <created by zg, POWCHK disabled, PULCHK disabled
       configuration hash MD5:
       00 E9 B6 7A A2 85 ED C7 34 08 36 98 17 FE 4E 26
       data hash MD5: 32K
       1B AB F2 6F 99 E7 FB 63 58 9B EA 0A C9 72 9D AA>)
(   2,<2023-06-07 15:28:20.84 +0400>,<she>,<DPX200>,
      <Start of raw data processing
       efp BC_mod = 2 LB = 1 FT_mod = 6 PKNL = 1 PHC0 = -10646.92 PHC1 = -22.31514 SI = 64K 
       data hash MD5: 64K
       42 32 1D 35 9C 14 85 8B 1E 40 02 6A 9C 4E 4B F1>)
(   3,<2023-06-07 15:28:40.00 +0400>,<she>,<DPX200>,
      <pk PHC0 = -9.876635 PHC1 = 25 
       data hash MD5: 64K
       C9 2E EB 28 39 EC EB FD D5 C8 2D 1A 00 B9 99 21>)
$$ ##END=
$$ 
$$ hash MD5
$$ A6 6C 2C 15 00 CF 6D DA B4 C5 B9 10 A7 BE 58 CA
##$RELAX= 
##$RELAX= 
##$RELAX= 
##$RELAX= 
##$RELAX= 
##$RELAX= 
##$RELAX= 
##$RELAX= 
##$RELAX= 
$$ Bruker specific parameters
$$ --------------------------
##$DU= <F:/spectra>
##$EXPNO= 1
##$NAME= <P31>
##$PROCNO= 1
##$TYPE= <nmr>
##$USER= <she>
##$AMP= (0..31)
100 100 100 100 100 100 100 100 100 100 100 100 100 100 100 100 100 100 
100 100 100 100 100 100 100 100 100 100 100 100 100 100 
##$AQSEQ= 0
##$AQ_mod= 1
##$AUNM= <au_zg>
##$AUTOPOS= <>
##$BF1= 81.014009
##$BF2= 200.13
##$BF3= 200.13
##$BF4= 200.13
##$BF5= 200.13
##$BF6= 200.13
##$BF7= 200.13
##$BF8= 200.13
##$BYTORDA= 1
##$CFDGTYP= 0
##$CFRGTYP= 5
##$CHEMSTR= <none>
##$CNST= (0..31)
1 1 145 1 1 1 1 1 1 1 1 1 1 1 1 1 1 1 1 1 1 1 1 1 1 1 1 1 1 1 1 1 
##$CPDPRG= <waltz16>
##$CPDPRG1= <>
##$CPDPRG2= <waltz16>
##$CPDPRG3= <>
##$CPDPRG4= <mlev>
##$CPDPRG5= <mlev>
##$CPDPRG6= <mlev>
##$CPDPRG7= <mlev>
##$CPDPRG8= <mlev>
##$CPDPRGB= <>
##$CPDPRGT= <>
##$D= (0..31)
0 1 0 0 0 0 0 0 0 0 0 0.03 2e-05 3e-06 0 0 0 0 0 0 0 0 0 0 0 0 0 0 0 0 
0 0 
##$DATE= 1686137298
##$DBL= (0..7)
120 120 120 11 120 120 24 19 
##$DBP= (0..7)
150 150 150 150 150 150 150 150 
##$DBP07= 0
##$DBPNAM0= <>
##$DBPNAM1= <>
##$DBPNAM2= <>
##$DBPNAM3= <>
##$DBPNAM4= <>
##$DBPNAM5= <>
##$DBPNAM6= <>
##$DBPNAM7= <>
##$DBPOAL= (0..7)
0.5 0.5 0.5 0.5 0.5 0.5 0.5 0.5 
##$DBPOFFS= (0..7)
$$ [...]
##$SUBNAM2= <"">
##$SUBNAM3= <"">
##$SUBNAM4= <"">
##$SUBNAM5= <"">
##$SUBNAM6= <"">
##$SUBNAM7= <"">
##$SUBNAM8= <"">
##$SUBNAM9= <"">
##$SW= 501.771253377433
##$SWIBOX= (0..15)
0 1 3 0 0 0 0 0 0 0 0 0 0 0 0 0 
##$SW_h= 40650.406504065
##$TD= 32768
##$TD0= 1
##$TE= 0
##$TE2= 300
##$TE3= 300
##$TEG= 300
##$TL= (0..7)
0 120 53 12 22 120 120 120 
##$TP= (0..7)
150 150 150 150 150 150 150 150 
##$TP07= 0
##$TPNAME0= <>
##$TPNAME1= <>
##$TPNAME2= <>
##$TPNAME3= <>
##$TPNAME4= <>
##$TPNAME5= <>
##$TPNAME6= <>
##$TPNAME7= <>
##$TPOAL= (0..7)
0.5 0.5 0.5 0.5 0.5 0.5 0.5 0.5 
##$TPOFFS= (0..7)
0 0 0 0 0 0 0 0 
##$TUNHIN= 0
##$TUNHOUT= 0
##$TUNXOUT= 0
##$USERA1= <user>
##$USERA2= <user>
##$USERA3= <user>
##$USERA4= <user>
##$USERA5= <user>
##$V9= 5
##$VALIST= <valist>
##$VCLIST= <CCCCCCCCCCCCCCC>
##$VD= 0
##$VDLIST= <DDDDDDDDDDDDDDD>
##$VPLIST= <PPPPPPPPPPPPPPP>
##$VTLIST= <TTTTTTTTTTTTTTT>
##$WBST= 1024
##$WBSW= 4
##$XGAIN= (0..3)
0 0 0 0 
##$XL= 0
##$YL= 0
##$YMAX_a= 36820
##$YMIN_a= -30652
##$ZGOPTNS= <>
##$ZL1= 120
##$ZL2= 120
##$ZL3= 120
##$ZL4= 120
##$ABSF1= 0
##$ABSF2= 0
##$ABSG= 0
##$ABSL= 0
##$ALPHA= 0
##$AQORDER= 0
##$ASSFAC= 0
##$ASSFACI= 0
##$ASSFACX= 0
##$ASSWID= 0
##$AUNMP= <proc_1d>
##$AZFE= 0.1
##$AZFW= 0.5
##$BCFW= 0
##$BC_mod= 2
##$BYTORDP= 0
##$COROFFS= 0
##$CY= -3
##$DATMOD= 1
##$DC= 0
##$DFILT= <>
##$DTYPP= 0
##$F1P= 0
##$F2P= 0
##$FCOR= 1
##$FTSIZE= 65536
##$FT_mod= 6
##$GAMMA= 0
##$GB= 0
##$INTBC= 1
##$INTSCL= 6.047779e-11
##$ISEN= 30
##$LB= 1
##$LEV0= 0
##$LPBIN= 0
##$MAXI= 10000
##$MC2= 0
##$MEAN= 0
##$ME_mod= 0
##$MI= 50
##$NCOEF= 0
##$NC_proc= -3
##$NLEV= 6
##$NOISF1= 182.463
##$NOISF2= 159.3651
##$NSP= 0
##$NTH_PI= 0
##$NZP= 0
##$OFFSET= 248.5645
##$PC= 4
##$PHC0= -10656.8
##$PHC1= 2.68486
##$PH_mod= 1
##$PKNL= yes
##$PPARMOD= 0
##$PSCAL= 0
##$PSIGN= 0
##$REVERSE= no
##$SF= 81.0140089999694
##$SI= 65536
##$SIGF1= 159.3651
##$SIGF2= -187.1042
##$SINO= 113.3802
##$SIOLD= 16384
##$SREGLST= <1H.CDCl3>
##$SSB= 0
##$STSI= 65536
##$STSR= 0
##$SW_p= 40650.406504065
##$SYMM= 0
##$S_DEV= 0
##$TDeff= 32768
##$TDoff= 0
##$TI= <>
##$TILT= no
##$TM1= 0
##$TM2= 0
##$TOPLEV= 0
##$USERP1= <user>
##$USERP2= <user>
##$USERP3= <user>
##$USERP4= <user>
##$USERP5= <user>
##$WDW= 1
##$XDIM= 65536
##$YMAX_p= 279938818
##$YMIN_p= -20090949
$$ End of Bruker specific parameters
$$ ---------------------------------
##NTUPLES= NMR SPECTRUM
##VAR_NAME=  FREQUENCY,     SPECTRUM/REAL,   SPECTRUM/IMAG
##SYMBOL=    X,             R,               I
##VAR_TYPE=  INDEPENDENT,   DEPENDENT,       DEPENDENT
##VAR_FORM=  AFFN,          ASDF,            ASDF
##VAR_DIM=   65536,         65536,           65536
##UNITS=     HZ,            ARBITRARY UNITS, ARBITRARY UNITS
##FACTOR=    0.620285442955139, 1,           1
##FIRST=     20137.2065510682, 0,            0
##LAST=      -20513.1999529968, 0,           0
##MIN=       -20513.1999529968, -20090949,   0
##MAX=       20137.2065510682, 279938818,    0
$$ Real data points
##PAGE= N=1
##DATA TABLE= (X++(R..R)), XYDATA
$$ [...]
39913b18190j10792R1852K58609J79979k7250j48860j72329j77936j34649r965
39903d69531Q6997P6294O4888J36032J52653k284j61197j16124K3049J7341q0643
39892b72525l9592J01026Q0386r9838j44238K1477J00986p0051k42125j77276
39882g41770k6896k0412n4646Q3188K80402K43974j3609j71327o8828J10927J57229
39871b21768Q2789J811l8532l2365J8304M8085k3527j41193j48092j5850J02431
39860c67907J00772N0908L5103Q369o7216j00537k4654N2221J3479m8471K6833
39849c21100J76982J86157K9542q0693l1462L4677j1386p3151k9963L4689k843
39838h8551o3011j2007N9287k3371j62072r0044J58029K24129j5005k06694n1192
$$ plain form
39913 -218190 -328982 -237130 21479 201458 174208 25348 -146981 -324917 -459566 -469531
39903 -469531 -382534 -306240 -241352 -105320 47333 45049 -116148 -232272 -209223 -191882 -272525
39892 -272525 -312117 -211091 -130705 -230543 -374781 -353304 -252318 -322369 -564494 -741770
39882 -741770 -768666 -789078 -843724 -760536 -480134 -236160 -249769 -421096 -489924 -378997 -221768
39871 -221768 -138979 -137168 -175700 -208065 -189761 -141676 -165203 -306396 -454488 -470338 -367907
39860 -367907 -267135 -216227 -181124 -172755 -239971 -340508 -365162 -312941 -299462 -347933 -321100
39849 -321100 -144118 42039 71581 -9112 -40574 -5897 -17283 -90434 -120397 -85708 -88551
39838 -88551 -151562 -163569 -104282 -127653 -289725 -379769 -221740 2389 -12616 -219310 -270502
39827b70502K22931K13965m0483j68858o0364L5166k1652p0593p98N1743j4912
39816a24357p5607k4152K7793l0386r7166m7490M5317N9848M2047Q4553J31661
39805g939R4558L5120M3515N0251m1587j44706j15186J488N8363N1245O2767N4282
39793A42171n0877j54173j05394J8180J7964q6948j05799k8002k2035q5743l1049
39782d91705J36798J68256k934j17370k3128P1720k0435j32503m7602J06232O6828
39771b85843j21520j80356k0892J70018K23309J48363K8599o4630p8084l2984
39761b14020k9969r2389r8415J4396J10041P4761K8779J11673J92938N7424k06114
39750e0895k85563r3227J28270J61136M1760q7529j41081p6217Q1307J72572O3912
$$ plain form
39827 -270502 -47571 166394 125911 -42947 -103311 -68145 -89797 -160390 -161188 -109445 -124357
39816 -124357 -199964 -224116 -196323 -226709 -323875 -371365 -326048 -266200 -224153 -139600 -7939
39805 -7939 86619 121739 165254 215505 173918 29212 -85974 -84486 -26123 25122 87889 142171
39793 142171 91294 -62879 -168273 -150093 -132129 -219077 -324876 -352878 -374913 -460656 -491705
39782 -491705 -354907 -186651 -189585 -306955 -330083 -258363 -278798 -411301 -458903 -352671 -285843
39771 -285843 -407363 -587719 -608611 -438593 -215284 -66921 -38322 -102952 -181036 -214020
39761 -214020 -243989 -336378 -434793 -420397 -310356 -235595 -206816 -95143 97795 155219 -50895
39750 -50895 -336458 -429685 -301415 -140279 -98519 -186048 -327129 -403346 -322039 -149467 -85555
39739h5555j13276r7163J05519J99767M3904j44429j38115j6769K7847k819n72
39728b21661J3828m2453j09459n5937Q9494J59349Q5524l1165q8927r7699j07983
39717d07089j19268q4580L3501K00548K86430J71408p3826k01900p3500J49759
39707a18517K13392J00534J302m538l6946j58591k27542j19638M8754Q0065o865
39696b28590k0251Q5732J29991j171j52018j19640L9334R8109L415o4768N842
39685b24015R1108M9836m6563m1176N7542J07800N8344j4497o6198j26538j79626
39674c33983j49636m1571L1835J6646K23O1639J37910J27127N4554L3046Q6413
39663B4203J10363K5217j01662j33707m3896L8520j0174j33892j55306j5398J35717
$$ plain form
39739 -85555 -198831 -295994 -190475 9292 53196 -91233 -229348 -246117 -218270 -221089 -221661
39728 -221661 -207833 -250286 -359745 -415682 -326188 -166839 -81315 -112480 -201407 -299106 -407089
39717 -407089 -526357 -610937 -577436 -376888 -90458 80950 7124 -194776 -268276 -118517
39707 -118517 94875 195409 196711 192173 155227 -3364 -230906 -350544 -301790 -221725 -228590
39696 -228590 -248841 -163109 -33118 -34289 -186307 -305947 -266613 -168504 -165089 -229857 -224015
39685 -224015 -132907 -83071 -129634 -170810 -113268 -5468 52876 38379 -27819 -154357 -333983
39674 -333983 -483619 -525190 -493355 -476709 -476486 -414847 -276937 -149810 -95256 -62210 24203
39663 24203 134566 159783 58121 -75586 -119482 -80962 -91136 -225028 -380334 -395732 -260015
39652b60015J43719N9832M0553R5647Q2465m7424j47154q5270N4668Q3811m1626
39641b0794j78472j87778q3445K4675P1330P7146Q1042Q7378Q6062P4508L1504
39630F3156p8630k19596k52452r1038J32826J82242J0993j73782j80586m2953
39620f49820Q9836J39640J04131N802p3082l1615P9304P0862q8765j64371J198
39609e16880K04830J64769n5901j61519n9717Q2110J46601J57160J03126m4220
39599B0359j61745j00371L2840Q654j23705j01169P7948J24012k5587o7073J31487
39588a84350K56002O2388j90763j52985N7819Q0115j02793j91144q0600L2531
39578d13780L4646M2582J22721J45347J7914j35767j41514n295J08314P4967n7564
$$ plain form
39652 -260015 -116296 -56464 -15911 79736 162201 114777 -32377 -117647 -62979 20832 -20794
39641 -20794 -199266 -387044 -470489 -445814 -374484 -297338 -216296 -128918 -42856 31652 63156
39630 63156 -15474 -235070 -487522 -578560 -445734 -263492 -252499 -426281 -606867 -649820
39620 -649820 -559984 -420344 -316213 -310411 -383493 -415108 -335804 -264942 -353707 -518078 -516880
39609 -516880 -312050 -147281 -203182 -364701 -424418 -342308 -195707 -38547 64579 20359
39599 20359 -141386 -241757 -208917 -200263 -323968 -425137 -347189 -223177 -248764 -315837 -184350
39588 -184350 71652 134040 -56723 -209708 -151889 -71774 -174567 -365711 -446311 -413780
39578 -413780 -379134 -336552 -213831 -68484 -50570 -186337 -327851 -333146 -224832 -149865 -207429
39567b07429j27032n1776N2851K6614q8490r7298L8438J31504P7414J5493N9746
39556a69965Q8924j4496j16770n1376P9594P4713k5932l7482K9983J3856p2852
39545b01803m7195J07242J78057M9049j31050j73738p8697K5790M7401q654n9488
39534b93086k2573O6958P3590l1931r0752N346J23326R4922j9844o9353p7385
39523b40782j37843j63246j8674J76123J80177K2128m7806K4255M1607p0088j55887
39512c90036j40033j28154j36639l2980J60451K11801N5708o5457J5819J40755
39502c08765J21143K9300L585J366m7942n5220M5626J14831K9848p7272l7001
39491a80501N6074J0503j16078j10895K5018P4704l9211j42200q7771M9162J22101
$$ plain form
39567 -207429 -334461 -386237 -333386 -306772 -395262 -492560 -454122 -322618 -245204 -229711 -169965
39556 -169965 -81041 -95537 -212307 -263683 -184089 -109376 -135308 -172790 -142807 -128951 -201803
39545 -201803 -248998 -141756 36301 85350 -45700 -219438 -298135 -272345 -224944 -233598 -293086
39534 -293086 -315659 -248701 -175111 -207042 -297794 -292448 -169122 -74200 -94044 -163397 -240782
39523 -240782 -378625 -541871 -560545 -384422 -204245 -182117 -229923 -205668 -164061 -234149 -390036
39512 -390036 -530069 -658223 -794862 -827842 -667391 -455590 -399882 -465339 -449520 -308765
39502 -308765 -187622 -158322 -154737 -153371 -201313 -256533 -210907 -96076 -66228 -143500 -180501
39491 -180501 -124427 -113924 -230002 -340897 -315879 -241175 -280386 -422586 -510357 -461195 -339094
39480c39094J07066P2962N7467M4157J4822k3206m7704m4051j6874K5075P7104
39469g2276J04938M5999q6208j48565l8280J15848R1360r8323j99185q5363O4594
39458c05461N5747m0982l7201P7526J46279P3064q5859k05876j86933k8557J29408
39447d08845J27960l787p6484j6212M3199Q583j8303N0196J07837M2037n5961
39436a99780m7754J7213J3074k6840J3983J06919J25483O4318K4250K0814j6557
39425I5123q4385j07171p8186n4841l9541K012L7911J5994k5468j9033P109p854
39413b58330k9129k4K1323m3039j16870o4721P9055J52812J11689N2544J6455
39402g8235m5467j08699o8650O9148J57540J10220k770r3351j50622j62571q2664
$$ plain form
39480 -339094 -232028 -159066 -101599 -57442 -42620 -65826 -113530 -157581 -174455 -149380 -72276
39469 -72276 32662 78661 -7547 -156112 -194392 -78544 12816 -85507 -284692 -370055 -305461
39458 -305461 -249714 -290696 -327897 -250371 -104092 -31028 -116887 -322763 -509696 -538253 -408845
39447 -408845 -280885 -284672 -361156 -377368 -334169 -325586 -343889 -293693 -185856 -143819 -199780
39436 -199780 -247534 -230321 -217247 -244087 -230104 -123185 2298 66616 90866 111680 95123
39425 95123 10738 -96433 -174619 -229460 -269001 -266989 -229078 -213084 -238552 -257585 -250476 -258330
39413 -258330 -287459 -287483 -266160 -309199 -426069 -490790 -411735 -258923 -147234 -94690 -78235
39402 -78235 -123702 -232401 -301051 -231903 -74363 35857 33087 -60264 -210886 -373457 -456121
39391d56121O5423J59077J16033q022r5395q1995J0092R6501R6476K8012k033
39380g1952L8647L5739q1459j78398j00225O2093Q7654l5313j02419k4154N5145
39369c14642J3352p2222p9917j7840L6346M5704L762p4498j12344l8704P7242
39358e33761Q9354k358l9577M5657J29515J04742L3859R863N398l7167q0506o1640
39346c36621N87N3204Q5565Q9732L1465o9087j12893n0705L8814O2157K5700j9389
39334b01471o2304r6263p5089K0162J26916J68807J28939K9055r1807j53639q5389
39323b92083N8311J22968M7699n5244o6037j0579J5433p439k6251o599M1887Q7561
39311i0373Q7726K3437n9880r9985j01308j00289p3208J3742Q7718M6361n5988
$$ plain form
39391 -456121 -390698 -231621 -115588 -123610 -219005 -301000 -290908 -194407 -97931 -69919 -71952
39380 -71952 -33305 2434 -79025 -257423 -357648 -295555 -207901 -243214 -345633 -369787 -314642
39369 -314642 -301290 -373512 -453429 -471269 -434923 -389219 -385457 -459955 -572299 -611003 -533761
39358 -533761 -444407 -446765 -486342 -440685 -311170 -206428 -172569 -162706 -157308 -194475 -274981 -336621
39346 -336621 -336034 -282830 -197265 -107533 -76068 -145155 -258048 -308753 -269939 -207782 -182082 -201471
39334 -201471 -263775 -360038 -435127 -414965 -288049 -119242 9697 38752 -53055 -206694 -292083
39323 -292083 -233772 -110804 -63105 -118349 -184386 -194965 -179532 -186971 -213222 -219821 -177934 -90373
39311 -90373 -2647 20790 -39090 -139075 -240383 -340672 -413880 -400138 -312420 -266059 -322047
39300c22047o5161K1550N0747j1361j6785Q1716J19916J4059o6429J2483J00209
39289h1103J7149j20896r1934N1180P5815k8200m1554R4480J71260O1274p6923
39278C0548o0174M5047N7434l7656r5178l7251O0009R3551M9749j9556p0601q6931
39266g1009o3634j5148J0897k4122q0486o8204J8632O2981m946o9737R827J51666
39254a43283J35033o3625k11339j46755K0506J23309J59373J73725J02872q1268
39244F8548k12715j28620O0364J03916l2524j42939r1309L6055R7499O1761j4314
39233a94278n5758p976R9493J43751N6115o1339p4394j5007l588k7570K6642J39108
39221B5199J44311j2165j67746j57287j6655Q5835L9927j16978k34518j73272
$$ plain form
39300 -322047 -387208 -365658 -314911 -326272 -343057 -261341 -141425 -127366 -193795 -181312 -81103
39289 -81103 -63954 -184850 -276784 -225604 -149789 -177989 -219543 -125063 46197 107471 30548
39278 30548 -29626 15421 72855 35199 -59979 -97230 -37221 56330 106079 86523 15922 -71009
39266 -71009 -134643 -149791 -138894 -163016 -243502 -311706 -293074 -230093 -235039 -304776 -294949 -143283
39254 -143283 -8250 -71875 -283214 -429969 -409463 -286154 -126781 46944 149816 68548
39244 68548 -144167 -272787 -212423 -108507 -141031 -283970 -375279 -339224 -241725 -179964 -194278
39233 -194278 -250036 -258012 -158519 -14768 41347 -19992 -94386 -109393 -112981 -140551 -113909 25199
39221 25199 169510 157345 -10401 -167688 -184343 -98508 -58581 -175559 -410077 -583349
39211e83349L6284J86603J32166j5509n2645K1214M7445N875M0115J63787J83511
39200A65497J2151j52485j10464M1865P3573l2061q5944m861P3516J2888j26007
39189a32332j80819j00400J5009O1394M8214M6265O9327O9551L6286J9631L5674
39178a2200L0234k1110o1707o0782p8053j39333j48227l8414P8158O1452l1537
39167d21519l7571N0845R5505N2348J0323J013l3396p1432j3520J12024J41935
39156a13445L5801m5961L395Q0308N7657l2274r7291j22484j13114l7778P5553
39145c09633J15013M6973k1965k3858k8818p9239q2515J6221J04932Q1939K5396
39134a55554M1796P2701J2908q5831r8674l6371q837l8768n6924l4527P748P2907
$$ plain form
39211 -583349 -547065 -360462 -228296 -243805 -296450 -275236 -227791 -221916 -181801 -18014 165497
39200 165497 177648 25163 -85301 -43436 30137 -1924 -87868 -92729 -19213 -6325 -132332
39189 -132332 -313151 -413551 -398542 -337148 -288934 -242669 -173342 -103791 -67505 -47874 -12200
39178 -12200 18034 -3076 -64783 -125565 -203618 -342951 -491178 -529592 -451434 -389982 -421519
39167 -421519 -459090 -408245 -312740 -260392 -250069 -249056 -282452 -353884 -367404 -255380 -113445
39156 -113445 -77644 -123605 -120210 -39902 17755 -14519 -111810 -234294 -347408 -385186 -309633
39145 -309633 -194620 -147647 -169612 -193470 -222288 -301527 -384042 -367821 -262889 -180950 -155554
39134 -155554 -113758 -41057 -28149 -113980 -212654 -249025 -257862 -296630 -353554 -388081 -380333 -307426
39122c07426J53329J78270J05317N750l9923n7020q8520q7176j4094N2005L6191
39111f3297K446K7434M1668m0378j28019p9602N2512R6524K7967l0815l5651m7124
39099a76335n8912j981Q1783O3520n5644j23970o3887L1839N6431J4816k6968
39088b59308j8936L9797O9856k2408j61394j16247J52143L24530J42678j59387
39078h676j67902P4660J44310p8741k39707j06837R1191J01346L3222O8846J16002
39067B7714L6275m8154K1174J18598M1814j28233j72406j00829q1411j13529o8477
39056d67464K6591L4728j8449K126O0602N740j18550j08952M3322J22383N2944
39045c64979J4941J12283J90113J07978k6196m7718R165O734o2910q9773k4201
$$ plain form
39122 -307426 -154097 24173 129490 135240 95317 38297 -50223 -137399 -151493 -99488 -63297
39111 -63297 -60851 -33417 8251 -32127 -160146 -239748 -187236 -90712 -62745 -93560 -129211 -176335
39099 -176335 -235247 -237228 -155445 -91925 -147569 -271539 -335426 -303587 -247156 -232340 -259308
39088 -259308 -278244 -238447 -168591 -190999 -352393 -468640 -316497 8033 150711 -8676
39078 -8676 -176578 -101918 42392 -36349 -276056 -382893 -291702 -190356 -157134 -88288 27714
39067 27714 63989 15835 37009 155607 197421 69188 -103218 -204047 -285458 -398987 -467464
39056 -467464 -440873 -406145 -424594 -422468 -361866 -356126 -474676 -583628 -540306 -417923 -364979
39045 -364979 -350038 -237755 -47642 60336 34140 -13578 -4413 2321 -60589 -150362 -174563
39034a74563P2199J17919Q3716L678n2827n2434l5013l3438o448N7895M7001j12686
39022h5001k60505j82403M1894J27915L5731K9427K02140K70607L7216k39874
39012b2853k22677j2417M6134p2540q8188O7222J40072J2595r3916r328J00579
39001a55317L9239p3776j0431J70143K03199K7309j39251j32322l6152O279j363
38990a02443J5649M9497M4191J1664P108K2644l31o1767r0219n3015q748j7533
38978a83303n3036n0641q951J1989j6721n3342m6457L984O1214R6204R9005P0261
38966f9794K5035p718j0018M705P568j1896l3159k5637J3285L9679L376p6396
38954a40970j05477k7501P8859P9114l8395j31571p8338P4821J72507J16170n6013
$$ plain form
39034 -174563 -102364 15555 99271 102949 50122 -2312 -37325 -70763 -77211 -19316 27685 -85001
39022 -85001 -345506 -527909 -486015 -358100 -322369 -292942 -90802 179805 217021 -22853
39012 -22853 -245530 -257947 -211813 -284353 -372541 -305319 -165247 -152652 -246568 -255896 -155317
39001 -155317 -116078 -189854 -200285 -30142 173057 200366 61115 -71207 -107359 -101080 -102443
38990 -102443 -86794 -37297 6894 18558 25666 48310 47979 -13788 -104007 -157022 -165770 -183303
38978 -183303 -236339 -286980 -295931 -283942 -300663 -354005 -400462 -396478 -335264 -239060 -140055 -69794
38966 -69794 -44759 -52477 -62495 -57790 -50222 -62118 -95277 -120914 -107629 -67950 -64574 -140970
38954 -140970 -246447 -273948 -195089 -115975 -154370 -285941 -364279 -289458 -116951 -781 -56794
38943e6794k08819k06587k9413J74440K16510Q7299k9557j1435M0212j2689j03720
38932a40553p2643M6194N3947q5043j58530l1411J30113J02085o1972j18410Q888
38921c27335J42610J23796O821o6140n7752k0182K6482R5793J48566J07938k2510
38910A58087j30068j21017k7085N9296J04162J15122N1451j24584l00924k71670
38900d87230j9092J94527J48665l0989o6395N5153R1822l7516j17824j841J37328
38889a33392Q1752q9852j39569k8244P2965O1322r13l6478l3165N477M8746J4248
38877a77103j05590j50548K245J96262J71430m2920j51603l0195J15539J00097
38867g2386J8270K2221N7667M538q1914p0550J0651K7799l6263p8843n2992l409
$$ plain form
38943 -56794 -265613 -472200 -501613 -327173 -110663 -23364 -52921 -64356 -24144 -36833 -140553
38932 -140553 -213196 -167002 -113055 -198098 -356628 -388039 -257926 -155841 -217813 -336223 -327335
38921 -327335 -184725 -60929 -54108 -120248 -178000 -198182 -171700 -75907 72659 180597 158087
38910 158087 28019 -92998 -120083 -60787 43375 158497 209948 85364 -215560 -487230
38900 -487230 -506322 -311795 -163130 -194119 -260514 -205361 -113539 -151055 -268879 -270720 -133392
38889 -133392 -51640 -141492 -281061 -309305 -236340 -175018 -175931 -212409 -245574 -240097 -191351 -177103
38877 -177103 -282693 -433241 -430996 -234734 -63304 -106224 -257827 -288022 -172483 -72386
38867 -72386 -54116 -31895 25772 30310 -51604 -122154 -111503 -83704 -119967 -198810 -251802 -255211
38855b55211L5831N3903J4779q2657j38194o5417O6516J25874J07505R7308R2437
38844E2674J5347j06780j41539n4369L2569K8767j422L6289J14076J22447Q569
38833A06628j65754k66520j87210L2981J96070J32104r3235k40986j80881j9510
38823f86313P8546R5681J20507J72456J61148K2324j59520k04621l3450K06421
38813b26821K67621Q2065j52491k12803j01245K0545O4689N7427O748j04870k01881
38802e01016j54676K4262J59938J42980N9940L6827O2766M9314j4082m8510N014
38791a77243J12169J61994N9291j53015k87743k09788j4366R3041O4846K1613
38781c29201J8019j2429n7421J1071J85048K40328N5261j62564j51274L3070J22563
$$ plain form
38855 -255211 -219380 -165477 -150698 -233355 -371549 -436966 -370450 -244576 -137071 -39763 52674
38844 52674 68021 -38759 -180298 -234667 -202098 -173331 -174753 -138464 -24388 98059 106628
38833 106628 -59126 -325646 -512856 -479875 -283805 -151701 -244936 -485922 -666803 -686313
38823 -686313 -607767 -512086 -391579 -219123 -57975 -35651 -195171 -399792 -433242 -226821
38813 -226821 40800 122865 -29626 -242429 -343674 -323129 -258440 -201013 -194265 -299135 -501016
38802 -501016 -655692 -631430 -471492 -328512 -268572 -231745 -168979 -119665 -133747 -182257 -177243
38791 -177243 -65074 96920 156211 3196 -284547 -494335 -508701 -415660 -350814 -329201
38781 -329201 -311182 -323611 -381032 -369961 -184913 55415 110676 -51888 -203162 -170092 -47529
38770d7529L1232p1425n0056L3720O4500J6584p9247j80423k06781q5798J26364
38759d48859K58266K09373N8923n1991q6742j07814j43451j32008k2427J10314
38749c56416J18672k3391j47634r2306P0511J26850K3886o8724k6743O3625Q2482
38738b29188N9707O6958O4468r40n6080j6143M9953L0497l0128j6553L7409M135
38726c5905r9441j26889m9633L925k4148l7898K6579R8113J10567R9731R7725
38715F2726O1542k6170r7622j02817p2840l5234K6787Q7438O9303k2093p1861
38704a20841l1513o768q6673j87341j63324r14J83635K75041K22599N1355j16655
38693A8601j31885P358J18618N7002r7792j65772j05748k2516Q055L182m111L426
$$ plain form
38770 -47529 -16297 -87722 -137778 -104058 -39558 -22974 -102221 -282644 -489425 -575223 -448859
38759 -448859 -190593 18780 77703 25712 -61030 -168844 -312295 -444303 -466730 -356416
38749 -356416 -237744 -261135 -408769 -501075 -430564 -303714 -279828 -348552 -375295 -311670 -229188
38738 -229188 -169481 -102523 -38055 -38995 -95075 -111218 -61265 -30768 -60896 -77449 -40040 -35905
38726 -35905 -135346 -262235 -311868 -307943 -332091 -369989 -343410 -245297 -134730 -34999 62726
38715 62726 124268 98098 476 -102341 -175181 -210415 -183628 -96190 -26887 -48980 -120841
38704 -120841 -152354 -159122 -245795 -433136 -596460 -597374 -413739 -138698 83901 135256 18601
38693 18601 -113284 -105926 12692 69694 -28098 -193870 -299618 -322134 -314079 -310897 -315008 -311582
38681c11582M8311J09199Q3857p9035k36987j90587K7481J59329P0773o3141k5873
38670d08255J22076J53118K2796q3773n3126j71n3349j39066j04302M3075J54189
38659c46788J48247P2326j6379r4576j10247j7077J10034J27047K5381m0002K6616
38648a15418J33147J49823O7441n4388j68577k02088q2719J02691J33447l8133
38638g4774j66485n8403J24337J18133l0099o7179M3572R9032K4901l0405L009
38627a4361K991q5147j26716l6642P3524R4334P4968P6748N0957k3513m5911M1306
38615H2538J32997J16163J8889q0146j53542j64335o5949N7153L3561j12992j33601
38604b69264O2326K18004J11363q7057q5966O6438Q7352p3255j73121o8703R8594
$$ plain form
38681 -311582 -263271 -154072 -70215 -149250 -386237 -576824 -549343 -390014 -319241 -382382 -408255
38670 -408255 -286179 -133061 -110265 -194038 -247164 -247335 -300684 -439750 -544052 -500977 -346788
38659 -346788 -198541 -126215 -142594 -237170 -347417 -364494 -254460 -127413 -102032 -142034 -115418
38648 -115418 17729 167552 234993 180605 12028 -190060 -272779 -170088 -36641 -74774
38638 -74774 -241259 -299662 -175325 -57192 -87291 -154470 -110898 -11866 13035 -17370 -14361
38627 -14361 -11370 -96517 -223233 -259875 -186351 -92017 -17049 59699 110656 87143 41232 82538
38615 82538 215535 331698 350587 270441 116899 -47436 -113385 -56232 -22671 -135663 -269264
38604 -269264 -206938 11066 122429 35372 -50594 15844 103196 29941 -143180 -211883 -113289
38593a13289J39785L8977r9672j68223j02462N0094J20392J4396j14969n7560
38583b92531J28930J86989M6980p9482m0114M6773K3556n5757n4285L693j2061
38572i7309j06726j45878o2748M8449P4533K7243n701M712J4096N416J9762O0409
38560a63742N2300l0378p4455J3670J17083M7958j34748j58509N7301K47799J77021
38549A51300l1188j11669m5540j2945o6599q6844k0341M6184N0333K9825L0055
38538f7429N4815Q8241P4050n5817k29965k37037k5580J41743M4487j32773p6155
38527d21420J39238J64569l7531j28406L3914J63303L7176j45725j24113J1803
38517c07192L6665j3408M1229J67801J81264P1074m646p181n1384j57051j86900
$$ plain form
38593 -113289 26496 65473 -34199 -202422 -304884 -254790 -134398 -120002 -234971 -292531
38583 -292531 -163601 23388 70368 -9114 -49228 -2455 21101 -34656 -88941 -85248 -97309
38572 -97309 -204035 -349913 -412661 -364212 -289679 -262436 -268137 -263425 -249329 -243913 -224151 -163742
38560 -163742 -111442 -141820 -216275 -202605 -85522 -37564 -172312 -330821 -273520 -25721 151300
38549 151300 120112 8443 -37097 -50042 -116641 -203485 -223826 -177642 -127309 -97484 -67429
38538 -67429 -12614 75627 149677 93860 -136105 -373142 -398722 -256979 -212492 -345265 -421420
38527 -421420 -282182 -117613 -155144 -283550 -249636 -86333 -49157 -194882 -318995 -307192
38517 -307192 -270527 -283935 -242706 -74905 106359 177433 172787 165606 114222 -42829 -229729
38506b29729o9912P9991J17208K4261j08539j75425j18764K2923J31109J29410
38496a97467O4384J1730l6073j04026j26921l3395J02261J31105M4388j6846J8057
38485a42803N2215o184q6954n9815O8402J48800P4999q7381j75458j09125L0223
38474b93081J07324R2547P1559R9343J11787K7581j10625j72161j08718j8202
38464a92646j1822o6713o2022N1328J72647J70598M4899p9989j08008n5727J8721
38453a18734Q7899J20153O0128p9889j76154j35360l1784j049l9281l0065N1318
38442b92818R9634N8009L012J1730N2484N5643N729p6153j59977j86229j04813
38431e33749L2595J06041Q4904N9626Q2489Q4031P100p5918o4052K0752O4253
$$ plain form
38506 -229729 -299641 -219650 -102442 -78181 -186720 -362145 -480909 -457986 -326877 -197467
38496 -197467 -133083 -121353 -157426 -261452 -388373 -421768 -319507 -188402 -144014 -160860 -142803
38485 -142803 -90588 -96772 -183726 -243541 -175139 -26339 48660 -38721 -214179 -323304 -293081
38474 -293081 -185757 -93210 -21651 77692 189479 217060 106435 -65726 -174444 -192646
38464 -192646 -204468 -271181 -333203 -281875 -109228 61370 106269 26280 -81728 -137455 -118734
38453 -118734 -30835 89318 149446 69557 -106597 -241957 -273741 -274790 -314071 -344136 -292818
38442 -292818 -193184 -135175 -132163 -120433 -67949 -12306 -6577 -82730 -242707 -428936 -533749
38431 -533749 -501154 -395113 -310209 -250583 -168094 -84063 -76963 -152881 -216933 -196181 -131928
38420a31928N687j02610j54969q4963O6557J67277J25163L4p7813p8569o9576
38409c35710o4592r822P2783P8365k816m3264K3352R5092O8682r269m2536k5495
38397a95230M098M8847R8673Q9571N191o6875o2796m0128o9516j18172j20565
38386d26902p7902j4618P0217J39401J14033R620m0996J4716N4172j9558j14702
38375b92519j07595l5759L49J1062M7763O6922J7470k9834O429O5127N1635J1430
38363a87520L6896Q7041O6267L443j6947k3040p6297j02110K179J49506J58506
38352I7924K7753q3771j15314j39116j60697r8439L2522J12156J04678Q0616N3119
38341h8569k3098r4740n2369O0917Q6191J0789j7372L5003K5032r3462j64032
$$ plain form
38420 -131928 -126241 -228851 -383820 -468783 -402226 -234949 -109786 -109752 -187565 -266134 -335710
38409 -335710 -400302 -410124 -337341 -258976 -261792 -305056 -281704 -186612 -117930 -127199 -169735 -195230
38397 -195230 -191132 -142285 -43612 45959 51150 -15725 -78521 -118649 -188165 -306337 -426902
38386 -426902 -504804 -519422 -449205 -309804 -195771 -186151 -227147 -212431 -158259 -177817 -292519
38375 -292519 -400114 -435873 -435524 -424462 -376699 -309777 -292307 -322141 -315712 -250585 -198950 -187520
38363 -187520 -150624 -63583 2684 6127 -10820 -33860 -110157 -212267 -210088 -60582 97924
38352 97924 125677 41906 -73408 -212524 -373221 -471660 -439138 -326982 -222304 -141688 -88569
38341 -88569 -111667 -206407 -258776 -197859 -111668 -100879 -118251 -83248 -58216 -151678 -315710
38330c15710r0669K916p17j5131P3134J82167J55453O270j11409j16609n8944
38319b89249O32N7993J17978J47081R5554l4454j45958j23785O217P1511j3791
38308a10271j05884m9882O2649M5663n3898k8274J20559J57533l722j60164j38324
38297b64015j6296O6099R6727R0371J3089q6834q1070P356J926r7694n7117J70920
38285a56538K65717J7123k83999k41506O2012K16917Q9234p5882q8122j7080L2091
38274a80033N9045N7021j628m7535J0253R2168M3544q7110r7775L2110J03505
38263a6435L2919k3878L8661R6393K2898r7904j21615n5860O248M4612Q2806R4191
38251A03036M5598l1015q4711j00590o9203J1826P6001M1789l5428m127J31668
$$ plain form
38330 -315710 -406379 -403463 -404180 -419311 -346177 -164010 -8557 -2287 -113696 -230305 -289249
38319 -289249 -288617 -230624 -112646 34435 129989 95535 -50423 -174208 -167991 -96480 -110271
38308 -110271 -216155 -266037 -203388 -157725 -211623 -239897 -119338 38195 34473 -125691 -264015
38297 -264015 -280311 -214212 -117485 -27114 -14025 -100859 -181929 -174573 -172647 -270341 -327458 -156538
38285 -156538 109179 126302 -157697 -399203 -337191 -120274 -31040 -106922 -195044 -212124 -180033
38274 -180033 -120988 -63967 -65595 -113130 -102877 -10709 32835 -54275 -152050 -119940 -16435
38263 -16435 16484 -7394 31267 127660 150558 52654 -68961 -124821 -118573 -73961 8845 103036
38251 103036 148634 117619 32908 -67682 -136885 -125059 -49058 -7269 -42697 -46824 84844
38240H4844J58673m3193k87648l13483j23679N9875J06987Q4188Q3311R7072P8463
38229a4590J9555m8798p8462l7429L1041K6477o9533j31474n4309P9669J12118
38218a65735M2284J2619P5328J19587N6100n8080j28023j41635j21361n4625N1393
38207c12148J22023J01954L6304j129o889j1784p105J5937J1583m4112p5714j6877
38195a87957M9016m600j19365r6990R5079K30760J26689j02078k10128j41434
38185c61008l9791j0929k8899m7228n2391r730J05128K09298J79212L6194o4099
38174h4243n6125l8791p8960r3946j6150O8717O8548M7164R3902J31531K9127
38163G0774j54092k23082j25731k600M1890M1553K1840n9449j61560j33404N4702
$$ plain form
38240 84844 243517 200324 -87324 -400807 -524486 -464611 -357624 -273436 -190125 -93053 -14590
38229 -14590 4965 -43833 -122295 -159724 -128683 -102206 -171739 -303213 -357522 -277853 -165735
38218 -165735 -123451 -110832 -35504 84083 140183 82103 -45920 -187555 -308916 -363541 -312148
38207 -312148 -190125 -88171 -51867 -52996 -59885 -71669 -78774 -62837 -51254 -95366 -171080 -187957
38195 -187957 -138941 -143541 -262906 -359896 -264817 -34057 92632 -9446 -219574 -361008
38185 -361008 -400799 -411728 -440627 -487855 -540246 -549976 -444848 -235550 -56338 -20144 -84243
38174 -84243 -140368 -179159 -258119 -352065 -368215 -299498 -230950 -183786 -89884 41647 70774
38163 70774 -83318 -306400 -432131 -434731 -392841 -351288 -329448 -388897 -550457 -683861 -629159
38152f29159K05700J57464K1976M734Q9866R7513m158n8781L480N7685R110n2223
38140i6793k0459M4807K9000m8033q2473n5229k3099M811M9725N9540l3884j62290
38128c34377j70378l8731P5991O2569r630l1787p812J3959M8241J07263J17828
38117a66864K5311q0200o5520N3809J38925J19889M9051j9680q2130j10496n1400
38106a89305O7690J27623N8817p3688j56996j44274o6509P022R366n7887r5753
38095e13894j9383J04871J29426L8012k7995J3900P0107L5896l5437k3480P8118
38084a49859J67578J69535Q3545n2430j72023k00465j35700o5123m0823p97J09355
38073b87207K06643J70013K4364q7382r1653l8186J3170M6662L7389l8218j19043
$$ plain form
38152 -629159 -423459 -265995 -244019 -239285 -149419 -51906 -56064 -114845 -111365 -53680 -44570 -96793
38140 -96793 -117252 -72445 -43445 -91478 -173951 -229180 -252279 -247468 -197743 -138203 -172087 -334377
38128 -334377 -504755 -543486 -467495 -404926 -414556 -446343 -454155 -440196 -391955 -284692 -166864
38117 -166864 -141553 -221753 -287273 -233464 -94539 25350 74401 54721 -27409 -137905 -189305
38106 -189305 -121615 6008 64825 -8863 -165859 -310133 -376642 -369620 -360254 -418141 -513894
38095 -513894 -533277 -428406 -298980 -260968 -288963 -275063 -204956 -169060 -204497 -227977 -149859
38084 -149859 17719 187254 270799 218369 46346 -154119 -289819 -354942 -395765 -396562 -287207
38073 -287207 -80564 89449 113813 26431 -65222 -103408 -90238 -43576 -6187 -44405 -163448
38062a63448r3093M6927J66832J50218K5508r8501j52038j21527k3354P7861Q1840
38051a02775l9327j68639j51107K0175J76789J59056o50j14750n9209Q6330J49009
38040d5098P7125k6695p5324r3672j06641n0029J01440K07593J16729r1300j78403
38029a64275o7799P1831R3233N0012L2490p222j28232k23307j42364O5512J96914
38018b23207J59894N1246k3716o5433r6626r7114o5182m1259k9805J3464Q5198
38007c32540J17843R1217O3198N5298J8161m2763l3771N9062R6264j1044j38006
37996e7081j23845j7833J3537m4145n9857k185J3529o0932j18423o9942L2792
37985d94385J00337J15122R4958N5250M2458R5440J44017O5952j19774k41144
$$ plain form
38062 -163448 -256541 -209614 -42782 107436 132944 34443 -117595 -239122 -262476 -184615 -102775
38051 -102775 -142102 -310741 -461848 -441673 -264884 -105828 -106478 -221228 -280437 -194107 -45098
38040 -45098 32027 5332 -69992 -163664 -270305 -320334 -218894 -11301 105428 14128 -164275
38029 -164275 -232074 -160243 -67010 -16998 15492 8270 -119962 -343269 -485633 -420121 -223207
38018 -223207 -63313 -12067 -35783 -101216 -197842 -294956 -360138 -401397 -431202 -417738 -332540
38007 -332540 -214697 -123480 -60282 -4984 13177 -29586 -63357 -4295 91969 80925 -57081
37996 -57081 -180926 -198759 -185222 -229367 -289224 -291409 -277880 -338812 -457235 -527177 -494385
37985 -494385 -394048 -278926 -183968 -128718 -86260 9180 153197 219149 99375 -141769
37975a41769j95613o1532M7387J00454Q5268j3595j11470o9117Q0639J27426k643
37964a54565j17173o1565M6301M3362r691J7709P3250M0337l4035m8380m5770
37953b50220q2863n4882R5197J58075l8361k50918j20967K34860L45995Q3833
37943A19749j83530j80894n6407j2074K338N4540L5164r6676j62318n7676O1825
37932d75959P2474Q6778J69926J39264j01507k90068j67062R5351J41862l9540
37922c68481j53465o0988R0259J50425J22989N7132o575l782P5238J19602N1595
37911G3949l2902k0794K7643M522m8756m8843m8631j09816j28308j2691Q9541
37900b55086K985j45917r9953R9676J64416J5589j16370p3527L5333Q1037R4386
$$ plain form
37975 -141769 -337382 -398914 -351527 -251073 -165805 -179400 -290870 -359987 -279348 -151922 -154565
37964 -154565 -271738 -333303 -287002 -243640 -253331 -235622 -162372 -122035 -156070 -204450 -250220
37953 -250220 -333083 -387965 -292768 -134693 -173054 -423972 -544939 -310079 35916 119749
37943 119749 -63781 -244675 -301082 -313156 -310818 -256278 -221114 -317790 -480108 -537784 -475959
37932 -475959 -403485 -316707 -146781 -7517 -109024 -399092 -566154 -470803 -328941 -368481
37922 -368481 -521946 -582934 -492675 -342250 -219261 -162129 -168704 -172486 -97248 22354 73949
37911 73949 41047 20253 47896 52418 3662 -45181 -93812 -203628 -331936 -344627 -255086
37900 -255086 -252101 -398018 -497971 -398295 -233879 -218290 -334660 -408187 -372854 -291817 -197431
37889a97431J10861N9086q1013j77524j17854K9845J07172M2894r5956j69467
37879d89387q7586P4410J33615L8991m7863j0528K9365n9657j53387o7783J05784
37868e34026J36923L7722O499M9595r319j51907j42093O6740K22454J65435M2673
37857a09304J9213L5491j6732r6380j21165r7694m7220L7708J05116Q4154M0153
37846a66660Q8779J48939L2441j97995k52394n6051J34682J45713R6878Q5869
37836F0201K067j70150j95708L1095K41604J82468q413p9053o8513j38930k18971
37825c62303j41595K0256P5404N2820J12465K10455J54462n6925k18705k15769
37815c69435j13634M525R1750Q8650J1913J0519J42459K08345L4062k01796j98790
$$ plain form
37889 -197431 -86570 -27484 -108497 -286021 -403875 -374030 -266858 -223964 -319920 -489387
37879 -489387 -576973 -502563 -368948 -329957 -377820 -388348 -358983 -418640 -572027 -639810 -534026
37868 -534026 -397103 -359381 -352882 -303287 -312606 -464513 -606606 -539866 -317412 -151977 -109304
37857 -109304 -90091 -54600 -71332 -167712 -288877 -386571 -433791 -396083 -290967 -206813 -166660
37846 -166660 -77881 71058 103499 -94496 -346890 -402941 -268259 -122546 -25668 60201
37836 60201 62268 -107882 -303590 -272495 -30891 151577 143164 64111 -4402 -143332 -362303
37825 -362303 -503898 -483642 -408238 -355418 -242953 -32498 121964 65039 -153666 -369435
37815 -369435 -483069 -478544 -386794 -298144 -286231 -275712 -133253 75092 109154 -92642 -291432
37804b91432j68Q1823m0235j33797n5355N8795P5999O4756J06385J34895Q1468
37793H3134P378j2797j0463m2990r5849j20539r3023j8273N4257M9098j8803j7455
37781b36325R7497J55512J9555j45971q8584J25948J93355K9408j37666j47724
37771a34995r3669p3423l7692K8475L3074j4257K7318J46045J31477n3984j40386
37760a82017K1233J67846K2609k41559k52872p833J50301N8084q7933r0883p107
37749d50131L1020J9145J1377J2051K3158O8056J00850K3280j35661j89201m0113
37738e26169J53811J80325N2906m4218l3123p679l1147l2093M1836J00310M3605
37727a01636o5147q1443P490P2875M1426j4912j0163L6068N1305K222r9885k04251
$$ plain form
37804 -291432 -291600 -209777 -250012 -383809 -439164 -380369 -304370 -239614 -133229 1666 83134
37793 83134 90512 77715 67252 24262 -71587 -192126 -285149 -303422 -249165 -200067 -218870 -236325
37781 -236325 -138828 16684 36239 -109732 -198316 -72368 120987 150395 12729 -134995
37771 -134995 -228664 -302087 -339779 -311304 -278230 -292487 -265169 -119124 12353 -41631 -182017
37760 -182017 -160784 7062 29671 -211888 -464760 -472593 -322292 -264208 -352141 -443024 -450131
37749 -450131 -419111 -399966 -388589 -376538 -353380 -285324 -184474 -161194 -296855 -486056 -526169
37738 -526169 -372358 -192033 -139127 -183345 -216468 -224147 -255294 -287387 -245551 -145241 -101636
37727 -101636 -166783 -248226 -240736 -167861 -126435 -141347 -151510 -115442 -64137 -61915 -161800 -366051
37715c66051k06555l8843J81857K26048N4864q7343p235J48560J20269n9835j29859
37704a64123k0802N4510k5694r2748J6633J77472J67616L685j06250p3956j2264
37693g5921k1156n1037j3471P7388J24667O2236p6607j79988j53526k4313P2303
37682b59425M9138j9693k279R9091J47304O9858l8471o3584l6198n2038q4250
37671a90547j6257J31175J62562j6889k16240j90257K5520J79300J56184O9167
37661I3718M473q8319j87263j25863J17850K70852J20229j37208j55225N1627
37651c5129J43400k6528k17587j81410J4615J49163J39908N3208l4307o6121o420
37640f7208Q9685R7235p954r3842o0457K0322L8218J3157K3679N3754L4221j7131
$$ plain form
37715 -366051 -572606 -611449 -429592 -203544 -148680 -236023 -243258 -94698 25571 -34264 -164123
37704 -164123 -184925 -130415 -156109 -248857 -232224 -54752 112864 116549 10299 -63657 -75921
37693 -75921 -97077 -148114 -161585 -84197 40470 102706 26099 -153889 -307415 -331728 -259425
37682 -259425 -210287 -229980 -232259 -133168 14136 83994 45523 -18061 -54259 -106297 -190547
37671 -190547 -206804 -75629 86933 70044 -146196 -336453 -310933 -131633 24551 93718
37661 93718 98191 9872 -177391 -303254 -185404 85448 205677 68469 -86756 -35129
37651 -35129 108271 81743 -135844 -317254 -302639 -153476 -13568 39640 5333 -60788 -67208
37640 -67208 22477 119712 111758 17916 -42541 -22219 15999 29156 52835 106589 140810 123679
37628A23679j7852L9217O8782J2669r5677j82246j93096j12849K7585J61035K28934
37617F0181K13283J24426q166j25883j68993j35145p5268k7803j704j3331o6936
37606b25339j01067m7340M3983M2256o6106j29398l9644J11421J63513R0743j0630
37595a67608o5344o0412n39Q5995J32556J00071K7981l2698q6361j36307j27160
37584c29826k5464R2784J22316O3260M54j8453j2048n483j2635m7592q9983p4748
37572c37418J9875J14022J19020M4329m5828j18212j43097o5373R2750J77886
37562a42046Q4103p5176j13053k9369L4669M8052R6045J55303R3229p3396j48722
37551g0361o4455O465m5725p6689L1370J14398r093j84809j28500J07417J93607
$$ plain form
37628 123679 105827 145044 213826 226495 130818 -51428 -244524 -357373 -329788 -168753 60181
37617 60181 273464 397890 389724 263841 94848 -40297 -115565 -143368 -145072 -158403 -225339
37606 -225339 -326406 -373746 -329763 -287507 -353613 -483011 -522655 -411234 -247721 -156978 -167608
37595 -167608 -232952 -293364 -293903 -207908 -75352 24719 52700 20002 -66359 -202666 -329826
37584 -329826 -355290 -262506 -140190 -76930 -76476 -94929 -106977 -112460 -125095 -172687 -262670 -337418
37572 -337418 -317543 -203521 -84501 -40172 -86000 -204212 -347309 -412682 -319932 -142046
37562 -142046 -57943 -133119 -246172 -275541 -240872 -192820 -96775 58528 151757 78361 -70361
37551 -70361 -134816 -128351 -174076 -250765 -219395 -104997 -114090 -298899 -427399 -319982 -126375
37540a26375L4420j08213o1239J1023n0993j03194K7093J87488J13560j27013
37530b03443k07834l0122J46333R7105q2303j69034r9783L4779J35576J39290
37520b39436L7387o7214l7180R5637J33951J698j22132o8796O9703J04810L4746
37509e6826j4313k2829n3510p2147o297P1078L6349m8340l2276K2390p6729k54874
37497e08324j91165J55334L77477J87625j37004j63445O7754J70981L4341p9613
37487h6039k3085L2180m2498j02254j5166Q9644N4634l1922r266O2194J2258j31027
37475a90347j78467q3581P354O418j1543J8780N2131M8411L6203J4122o2370j45785
37463d88674j07860M4597J32761P9409L9851J23062J69275J2778j88956j59079
$$ plain form
37540 -126375 -91955 -200168 -261407 -250384 -301377 -404571 -377478 -189990 -76430 -203443
37530 -203443 -411277 -441399 -295066 -197961 -280264 -449298 -549081 -514302 -378726 -239436
37520 -239436 -202049 -269263 -306443 -210806 -76855 -75157 -197289 -266085 -196382 -91572 -56826
37509 -56826 -71139 -93968 -147478 -219625 -225922 -154844 -118495 -166835 -199111 -176721 -253450 -508324
37497 -508324 -699489 -544155 -166678 20947 -116057 -279502 -211748 -40767 -6426 -86039
37487 -86039 -109124 -76944 -119442 -221696 -236862 -147218 -92584 -124506 -133772 -71578 -59320 -190347
37475 -190347 -368814 -452395 -445041 -438623 -450166 -431386 -379255 -330844 -294641 -280519 -342889 -488674
37463 -488674 -596534 -551937 -419176 -339767 -299916 -176854 -7579 5199 -183757 -342836
37453c42836N5589J45573J9824q7754l6423J4154o2904j13850J2360J65602J22178
37442a08487m9499j01675J4987J25561J22710O1243p362q6184j25957n5830P0628
37431a39865J23567R1880P1072O5626j3110j36983j44653O805J49332J47855Q5864
37420C07390J00742J56670J15555l0735j30382p6043M5200M9022j14557k72497
37410A50365k23321l555J41676Q3303k9966k2453M0736l717j21547j36920k5102
37399a50501O5647O1314K5501j2505q3309j31446o0181O5303Q0041j31l79Q5520
37387e5126O5796q5508j34740J5079J26320Q515j64385j42922J4167R3551Q0283
37376a78970R2761J09712L4850o6519n7082J8420J4529m1236l157J07428J24548
$$ plain form
37453 -342836 -287247 -141674 -121850 -209604 -246027 -231873 -294777 -408627 -396267 -230665 -108487
37442 -108487 -157986 -259661 -244674 -119113 3597 64840 57478 -28706 -154663 -210493 -139865
37431 -139865 -16298 75582 146654 212280 199170 62187 -82466 -75661 73671 221526 307390
37420 307390 408132 564802 680357 649622 519240 443197 488397 537419 422862 150365
37410 150365 -72956 -76511 65165 148468 118502 96049 136785 133068 11521 -125399 -150501
37399 -150501 -84854 -23540 1961 -10544 -93853 -225299 -285480 -220177 -140136 -140267 -140646 -55126
37387 -55126 10670 -74838 -209578 -194499 -68179 -59664 -224049 -366971 -352804 -259253 -178970
37376 -178970 -86209 23503 58353 -8166 -65248 -46828 -32299 -73535 -76692 30736 155284
37365A55284L4256L265Q8156J41857O2843n5405r1971o0722l8375n0292p9141
37354A09755r4204n1579M5706R7384K3714q6365p6127M1767R5884R887j04965
37343A0857j36528j05696p2502m1960j5330j8548k9704J2440Q3437P5208k0036
37332b58362n4586N4145J57141O0175j78834k83688j07191J67998K44746P0247
37322a28209j16356j00019N0767J17929M6182k3728j2526j0761p4749r2738K2656
37311c21552J49332J21305j7589r1085n4295j4924l5572p5086r8976j01023m4075
37300e83540P5652J42529N9027o6049m5002R5935J47696M1816o5713o2224j8164
37289b78037q84M1825J18501J08168l5600j54892j01587M6845J22879J07628R0897
$$ plain form
37365 155284 189540 192805 280961 422818 485661 430256 338285 277563 239188 188896 109755
37354 109755 15551 -36028 9678 107062 130776 44411 -31716 10051 105935 115822 10857
37343 10857 -125671 -231367 -303869 -345829 -361159 -379707 -409411 -396971 -313534 -238326 -258362
37332 -258362 -312948 -258803 -101662 -41487 -220321 -504009 -611200 -443202 -198456 -128209
37322 -128209 -244565 -344584 -293817 -175888 -129706 -153434 -165960 -176721 -251470 -344208 -321552
37311 -321552 -172220 -50915 -68504 -159589 -213884 -228808 -264380 -339466 -438442 -539465 -583540
37300 -583540 -507888 -365359 -306332 -372381 -417383 -321448 -173752 -131936 -197649 -259873 -278037
37289 -278037 -278921 -237096 -118595 -10427 -46027 -200919 -302506 -255661 -132782 -25154 65743
37278F5743Q7800M8830j1332m1562o6660j35107j89186j28235J1671Q1399L4767
37267b41872j0798L3339R7007Q3674L1901L9854Q8098O2997m8671j12719m2394
37256a9584O0779M6750p0221j44572j07106k2468M4696R1013R4848J9288o8315
37245g4892k9407J24500J91174N5746j30204j68686q1624j1945J6365O0800Q2096
37234C3923M895j02387j02548o483O3597Q2270J03226Q2812n7826k16045j90353
37223c04919M251J31875Q3068L027J8121N7151L0250j5892k2477k3994l5987l350
37211g8876N3915J7952j08960j44502l229J37345Q9751o7200j15503N364J61488
37200e2455K01579P4878j39058k52169j35221Q3015J34357j7054j19713l4539
$$ plain form
37278 65743 153543 202373 191041 149479 82819 -52288 -241474 -369709 -358038 -276639 -241872
37267 -241872 -252670 -219331 -122324 -38650 -6749 33105 121203 184200 135529 22810 -19584
37256 -19584 41195 87945 17724 -126848 -233954 -256422 -211726 -120713 -25865 -6577 -74892
37245 -74892 -104299 20201 211375 267121 136917 -31769 -113393 -125338 -108973 -48173 33923
37234 33923 38818 -63569 -166117 -172600 -109003 -26733 76493 159305 101479 -114566 -304919
37223 -304919 -300668 -168793 -85725 -82698 -64577 -7426 22824 6932 -15545 -39539 -75526 -78876
37211 -78876 -24961 -7009 -115969 -260471 -263700 -126355 -36604 -103804 -219307 -213943 -52455
37200 -52455 149124 224002 84944 -167225 -302446 -219431 -85074 -102128 -221841 -256380
37190b56380N4418j8649j03080j0003J28663P8836p2393m9607J33214J78578n571
37179E8026j55978p7911O6980M5815q5752r9612M5796J52856P5580p7389r1444
37168a43033N8424J59191N1988j18351r1414J06065J66537l0808k08983j12447
37158a62831R5887J12591j3295M177J76893K16254K0664j66212j62902r2676r2129
37147f3579p5658L0631Q1631l4491j44532m2347J60896K01016O7224k7283j6567
37136A36941l8948j28009j29533J0015J21863Q7994K0274L3008L4380p7814j79882
37125a09711j06472M6122N8649l3233Q633J88921K13531l3577k50529j58233O7543
37114a08356Q0841r6241j49703L525J22202P0753Q07K9012M7310j7827m1413L6543
$$ plain form
37190 -256380 -201962 -220611 -323691 -333694 -205031 -126195 -198588 -248195 -114981 63597 58026
37179 58026 -97952 -175863 -108883 -63068 -148820 -248432 -202636 -49780 25800 -51589 -143033
37168 -143033 -84609 74582 126570 8219 -83195 22870 189407 158599 -50384 -162831
37158 -162831 -66944 45647 32352 36529 213422 429676 450340 284128 121226 28550 -63579
37147 -63579 -139237 -108606 -26975 -61466 -205998 -248345 -87449 113567 180791 153508 136941
37136 136941 97993 -30016 -159549 -149534 -27671 60323 80597 113605 147985 70171 -109711
37125 -109711 -216183 -170061 -111412 -144645 -136012 52909 266440 232863 -17666 -175899 -108356
37114 -108356 -27515 -123756 -273459 -269934 -147732 -76979 -76172 -47160 150 -17677 -59090 -22547
37102b2547M3419j19491k35263r4519J28294J21723p0192j32066O694Q6801k1332
37091c08479j04279K3217J99523J59847o7818k13042j33700L9900J23054J02550
37081a79227R5405J51260J75620P1753r1086j35150j1505J17374R4699j9459n5805
37070B13879J0497M4009l5677j50217j86831j24652j3320R4065J56566J48542
37060A56861P6494k2495r5626r2203j6927L1538l6857j42899j06499P1463J55348
37049b1802J3550j52788r0860J30998K41850J58090K6450m8192p3925k1998J30668
37038B92041K27033P2673k25885l34912j54119N8890Q9692K1779n415j7125l9715
37027a5063K4347J75854K04501Q463j71857q3590J32595J38137r4121k42316r5919
$$ plain form
37102 -22547 20872 -98619 -333882 -428401 -300107 -178384 -248576 -380642 -373948 -287147 -308479
37091 -308479 -412758 -389541 -190018 -30171 -97989 -311031 -444731 -404831 -281777 -179227
37081 -179227 -83822 67438 243058 314811 223725 88575 77070 194444 289143 269684 213879
37070 213879 224376 268385 232708 82491 -104340 -228992 -242312 -148247 8319 156861
37060 156861 233355 210860 115234 23031 6104 37642 785 -142114 -248613 -177150 -21802
37049 -21802 -8252 -161040 -251900 -120902 120948 279038 305488 257296 183371 161373 292041
37038 292041 519074 591747 365862 30950 -123169 -64279 25413 47192 41777 24652 -15063
37027 -15063 9284 185138 389639 398102 226245 142655 275250 413387 319266 76950 -18969
37016a8969J79357K85526J44827n5782r6271M1027J60766J01174l9437l4747J20462
37005G87933J79636J9480j66730j73246p1935k6007r986O1754R7240j3662j29292
36994E55185m4537J29373R3994j47440k59053q1365J36091J26455l0879r8930
36984C78894l6366K1939J1324j0947j467J5289Q745k0558n0297m7947m629K9484
36972B93464o562r0942j28092o0060P4324J80238J69490L0104j10629p1836J38688
36961D18187K62176J08696j51080k00494j6742J27718P5669m8034r9300j00030
36951C76766r8356o4895j1947k2958q4835p5452J4922M7487j1390j7282Q6707
36940A38767J60078J23378Q7090J01547L7076j30195j83824k2097J16257K7927
$$ plain form
37016 -18969 160388 445914 590741 534959 438688 479715 640481 741655 702218 667471 787933
37005 787933 967569 987049 820319 647073 575138 549131 539145 600899 698139 684477 555185
36994 555185 510648 640021 734015 586575 327522 246157 382248 508703 477824 378894
36984 378894 342528 364467 375791 364844 363377 378666 387411 366853 316556 268609 263980 293464
36972 293464 286902 195960 67868 7808 82132 262370 431860 461964 351335 279499 418187
36961 418187 680363 789059 637979 437485 420743 548461 624130 576096 476796 376766
36951 376766 278410 213515 201568 178610 93775 18323 33245 80732 69342 52060 138767
36940 138767 298845 422223 509313 610860 647936 517741 333917 311820 428077 456004
36930D56004j05458l7698J01702L7430j56644j75885N084J20072O3098k395K2158
36919C27468M8426K2656j2675p0544j67492j66100L7716K34744J52238p2908o8304
36908B65225J51635J93294m2876j86593k9460J49565J04152J4373Q3687J55018
36898H58020O0043j1699J36840L02212K19053M3761Q0210K35178J91728k1870
36888B093476r0943L1366O7195r0754k24057j80644q4792p6113j11939j10358
36878A222437p6462l1455J2181k905r4109j37966l5863Q5730N5639l9163J0100
36867I68164J56785J55262k3863j40810p4516K6173L1077K18Q83m97M835Q9105
36855A192816K01986J87948N1917j5368N8614J24178Q2707L9327R1112J70791
$$ plain form
36930 456004 350546 312848 414550 451980 295336 119451 124535 244607 307705 305310 327468
36919 327468 375894 398550 385875 315331 147839 -18261 19455 254199 406437 333529 265225
36908 265225 416860 610154 567278 380685 351225 500790 604942 619315 703002 858020
36898 858020 918063 906364 1043204 1345416 1564469 1608230 1688440 1923618 2115346 2093476
36888 2093476 2002533 2033899 2101094 2010340 1786283 1605639 1520847 1444734 1332795 1222437
36878 1222437 1145975 1114520 1126701 1123796 1029687 891721 855858 941588 997227 958064 968164
36867 968164 1124949 1280211 1256348 1115538 1041022 1067195 1098272 1098490 1099373 1098876 1103711 1192816
36855 1192816 1394802 1582750 1634667 1619299 1677913 1802091 1884798 1924125 2015237 2186028
36845B186028K03884K38443L16271L68436L23957J97590K7999j44959k40788k23531
36835C253330j97532k47269k48069o3383J47934J19550p6670j18717M1043J18192
36825B728409P80q7331j7880M5739J7160O0122K22450K76325J25897J1628Q6613
36814C469912J47322L6968l6022J22463L15148K80827J24438R1654J55834J59658
36804D868202J54497K63915L82800L34394J93690J69757K80724L87834M37424
36795G473237M62938M66539M62756N04494N57993N37784N30277P14341J000518
36786A2710877J098511J023472J117858J463106J751868J882365K129626K556306
36778B5733989K886235L179221L900607N034655N964561O608368P718579R567113
$$ plain form
36845 2186028 2389912 2628355 2944626 3313062 3637019 3834609 3862608 3717649 3476861 3253330
36835 3253330 3055798 2808529 2560460 2497077 2645011 2764561 2687891 2569174 2610217 2728409
36825 2728409 2729189 2641858 2623978 2669717 2686877 2746999 2969449 3245774 3371671 3383299 3469912
36814 3469912 3617234 3654202 3618180 3740643 4055791 4336618 4461056 4552710 4708544 4868202
36804 4868202 5022699 5286614 5669414 6003808 6197498 6367255 6647979 7035813 7473237
36795 7473237 7936175 8402714 8865470 9369964 9927957 10465741 10996018 11710359 12710877
36786 12710877 13809388 14832860 15950718 17413824 19165692 21048057 23177683 25733989
36778 25733989 28620224 31799445 35700052 40734707 46699268 53307636 61026215 70593328
36770G0593328J1443584J3106534J5420693J8662562K1774585K4551336K8372046
36763B03924668L2146884K9479505J4387761r652435l0332399l8073232l4431447
36756A67449305k7561954k2488133j8693178j4845073j1576506r567797q120436
36749E4596228o609836n436467m819936m153731l169393k481164k418718k402852
36741B3104131j985186j536122j415975j342535j060793q49989q96251q70766
36733A3146514n75117l51095m27648m85608k88045j35519k58228l40622j27965
36724A0156667L2284k26507o26921o95561m89288l60194l32829k32790j55513
36715G069348k86203m56794l72658j32147o9990k01201k48083j37275o4732j09471
$$ plain form
36770 70593328 82036912 95143446 110564139 129226701 151001286 175552622 203924668
36763 203924668 236071552 265551057 279938818 270286383 239953984 201880752 167449305
36756 167449305 139887351 117399218 98706040 83860967 72284461 62716664 54596228
36749 54596228 47986392 42549925 37729989 33576258 30406865 27925701 25506983 23104131
36741 23104131 21118945 19582823 18166848 16824313 15763520 14913531 14017280 13146514
36733 13146514 12571397 12220302 11792654 11307046 11019001 10883482 10625254 10284632 10156667
36724 10156667 10188951 9962444 9335523 8639962 8150674 7790480 7457651 7224861 7069348
36715 7069348 6783145 6326351 5953693 5821546 5751556 5550355 5302272 5164997 5100265 4990794
36705D990794j51661j55646j97740k18931p2509J61224K12323L0373j15240l3465
36695D449522J23893J19723k7413j14130n9006J9907J2466l0540n464O0216M0015
36684D589189p8461j42089o1425L8039K1769j9691O4646J85507J35652k9026k9993
36673D674117J84093L38035K73977J90428K81748M22004M28178M03761N52321
36664G748662Q10768R48572R43914J000957J226333J515816J771155K043058K415182
36655B0424417K870376L320425L698273L965746M006298L510644K100402k21481
36647D3675100k743860m436921m825024m330977l669250l121905k575684k008737
36639A5962742j587400j353098j139455q50487n96381m86708m60235m01337l10384
$$ plain form
36705 4990794 4839133 4683487 4485747 4266816 4194307 4355531 4567854 4598227 4482987 4449522
36695 4449522 4573415 4693138 4665725 4551595 4492589 4512496 4524962 4494422 4488958 4549174 4589189
36684 4589189 4510728 4368639 4307214 4345253 4367022 4347331 4411977 4597484 4733136 4704110 4674117
36673 4674117 4858210 5196245 5470222 5660650 5942398 6364402 6792580 7196341 7748662
36664 7748662 8559430 9508002 10451916 11452873 12679206 14195022 15966177 18009235 20424417
36655 20424417 23294793 26615218 30313491 34279237 38285535 41796179 43896581 43675100
36647 43675100 40931240 36494319 31669295 27338318 23669068 20547163 17971479 15962742
36639 15962742 14375342 13022244 11882789 11032302 10435921 9949213 9488978 9087641 8777257
36630H777257k79124l53252m70333n23174m83356m51467n25383o21070n45029
36621D525069k90923j13877j97806l83064l82082j68527K2298J9655j24451k62927
36611B643365k83809j48976M7794J01810o9008k59129k18532j3152P0095m2868
36601A827590j23891k5126J03376Q3950k2542o8266n6098n7399l8108M7288R9429
36590A770203R628j24850j24425j7419R352o5768o2223P3618J42630J4058j32876
36579A491928o7365J35536K00924L7781j83851k96660k80200j61319K0467J31929
36569A029170M3012j42018j57203M2084J81666P1094j14868j30369l1766k4079
36559G66723r2008n9132P9123J60942J45041J20651O9120r0926k31160j15923
$$ plain form
36630 8777257 8498133 8144881 7674548 7151374 6668018 6216551 5691168 5070098 4525069
36621 4525069 4234146 4120269 3922463 3539399 3157317 2988790 3011088 3030743 2906292 2643365
36611 2643365 2359556 2210580 2258374 2360184 2291176 2032047 1813515 1800363 1870458 1827590
36601 1827590 1703699 1678573 1781949 1865899 1843357 1775091 1718993 1661594 1623486 1670774 1770203
36590 1770203 1779831 1654981 1530556 1513137 1522489 1456721 1394498 1468116 1610746 1624804 1491928
36579 1491928 1424563 1560099 1761023 1798804 1614953 1318293 1038093 876774 897241 1029170
36569 1029170 1072182 930164 772961 815045 996711 1067805 952937 822568 790802 766723
36559 766723 674715 615583 694706 855648 1000689 1121340 1190460 1099534 868374 752451
36549G52451J70996K41363l1241k82468j84545Q6429J62371K7095n5510l213J7760
36538I01488p3293j64572j81072j74053j50681l0540J66770K69863J77481M608
36528G45999p6512m7940j7588m1503n9737k313R4640J14093P789j14431j05456
36517D97041J8311Q8631K0765p2430o3353M209J4359k6356k6351J5408J5536l0172
36505D55598k7634N5283J26618J05488K9816j4074j031L9244Q4508J20453J06918
36494A081187N566j47174k40670k04690j01668m5341l3988M0352J82071K16414
36484G52059L4412j88906j89127K5122J86719J31744l8042j56711j64556o0448
36474C32266J07915J75637J3536k02411j44295J54613K51478o5604m02256k98544
$$ plain form
36549 752451 923447 1164810 1133569 851101 666556 752985 915356 942451 886941 883728 901488
36538 901488 828195 663623 482551 308498 157817 127277 294047 563910 741391 745999
36528 745999 669487 621547 603959 562456 502719 500406 595046 709139 716928 602497 497041
36517 497041 515352 603983 624748 552318 488965 493174 507533 481177 454826 470234 485770 455598
36505 455598 427964 483247 609865 715353 745169 731095 730064 769308 853816 974269 1081187
36494 1081187 1086753 939579 698909 494219 392551 347210 313222 353574 535645 752059
36484 752059 786471 597565 408438 433560 620279 752023 713981 557270 392714 332266
36474 332266 440181 615818 629354 426943 282648 437261 688739 623135 220879 -77665
36464g7665J15653L49575K46940O8108j1382p3728j42915q7981Q0209J41669J1869
36453F20352j13890q1261k699k3998p6000k7227P3404Q3964M732l2737K8480R4377
36441E47497M9436r5278j92816j07317J10321K41819J56370j8242p5579r052K8837
36430F35996j3664m3793j6046J2237J5482K0918J153p7377j13373J5471K03253
36419F40257K19951Q1759M2900J60241J77949j8437j46900M4590L58898M45664
36409B006872L23489K84449L99826M67476M20716M54982O85751R56218J098276
36400G098055J166145J253648J222951Q05465m0069r81805j566295j603444j298483
36391F056168j000506q42633o93321m54899k59191k58312l49245l01198j07792
$$ plain form
36464 -77665 37988 387563 634503 702611 691229 617501 474586 386605 466814 608483 620352
36453 620352 506462 425201 422502 398504 322504 295277 368681 452645 457377 424640 453120 547497
36441 547497 596933 501655 308839 201522 311843 553662 710032 691790 616211 607159 635996
36430 635996 622332 578539 562493 574730 590212 611130 612283 534906 421533 437004 640257
36419 640257 860208 941967 984867 1145108 1323057 1304620 1157720 1202310 1561208 2006872
36409 2006872 2330361 2614810 3014636 3482112 3902828 4357810 5043561 5999779 7098055
36400 7098055 8264200 9517848 10740799 11546264 11506195 10524390 8958095 7354651 6056168
36391 6056168 5055662 4213029 3519708 3064809 2805618 2547306 2198061 1896863 1789071
36382A789071K091q0038j89307j64939q5710r7550j60627j38182l7240K0986J5606
36371H74161K9843O3795K8990n8388o6595J9474M1217o5819j24851J4917K08317
36360I65061J99081j7566k14087k54226j93384q9723N9220J79857J50413K0077
36350H04723j2159Q7510J10682m4893j67837m3584K04240K85942J41353l3668
36340A332309p8628j0661P1000P9484j0046j00521m6082J27360K12397J39718
36330A716330J18758K92985M67000M17663K77042L01898M35433M59258M44035
36321D930402O28446R27791J029947R74519J125590J461498J402801N93463n51779
36312A2522678j357095j610479j513383j240004q89889o38084n77467n48564l95925
$$ plain form
36382 1789071 1791162 1711124 1521817 1356878 1271168 1173618 1012991 874809 837569 858555 874161
36371 874161 904004 967799 996789 938401 871806 891280 932497 866678 741827 756744 965061
36360 965061 1164142 1146576 932489 678263 484879 395156 454376 634233 784646 804723
36350 804723 792564 880074 990756 945863 778026 734442 938682 1224624 1365977 1332309
36340 1332309 1253681 1243020 1314020 1393504 1383458 1282937 1236855 1364215 1576612 1716330
36330 1716330 1835088 2128073 2595073 3012736 3289778 3591676 4027109 4486367 4930402
36321 4930402 5558848 6486639 7516586 8491105 9616695 11078193 12480994 13074457 12522678
36312 12522678 11165583 9555104 8041721 6801717 5911828 5273744 4696277 4147713 3751788
36303C751788k44549k73569l85358l69379k40517j41186n6539Q5258J69334O2116
36293B357399q8861m3411J28120J54733J3578o8661l1117m7896j67849k24504
36283A981531j65653j59313k77127l50657k54914r2592J3839Q7679J44796R6018
36273A023607o4812j69940j15383k3231l3925r4659r3743n8377o3874o7601L415
36262B41477Q7407O9091k8854p6975l0677L1486M8149M8090P0100Q4617L1053
36251E74964q5539j61395r1941Q0900J75535Q4238p8060j30068o8065k0579j1061
36240B68929M8876J36448J04400n1702j23029L601J50185J12627k9202n3221N4722
36229F22634J00680k389j15992r9727n27M4313m377o4783n2073L1236J06623R8660
$$ plain form
36303 3751788 3507239 3233670 2848312 2478933 2238416 2097230 2040691 2125949 2295283 2357399
36293 2357399 2268538 2225127 2353247 2507980 2521558 2452897 2421780 2373884 2206035 1981531
36283 1981531 1815878 1656565 1379438 1028781 773867 681275 695114 782793 927589 1023607
36273 1023607 958795 788855 673472 650241 616316 521657 427914 369537 305663 238062 241477
36262 241477 328884 397975 369121 292146 261469 292955 341104 389194 459294 543911 574964
36251 574964 489425 328030 236089 316989 492524 576762 498702 368634 300569 279990 268929
36240 268929 317805 454253 558653 506951 383922 387523 537708 650335 621133 567912 622634
36229 622634 723314 720925 604933 505206 504679 548992 544615 479832 427759 458995 565618 664278
36217F64278J0856p3002p0563J9990J25831J69806J29606M8118j886K3131J02610
36206A148775J75898J90391J24744L000q9606n7135Q4646J83638J28953J3381
36196A906685J0408J07167R8473j13753l42197l30706q3221J27173P4776j64118
36186A290687l08004j98344K3308J04133j327j07293q9244m1103o0954n0232J00263
36175F61890K50108J71397q0289k05620p9892J08303J81688J98116K55983K95869
36165A757553K40368J68497K01939L31738M71647N65870N41776K94828j44714
36156D429502n41912o86512o04841m47718k92082j68674j43126k09865k21083
36147A113689q7940M8289J2963j34032k05277j64509j04465l9075O0031R3556
$$ plain form
36217 664278 675134 602132 531569 551559 677390 847196 976802 1024920 1023034 1046165 1148775
36206 1148775 1324673 1515064 1639808 1642808 1553202 1496067 1580713 1764351 1893304 1906685
36196 1906685 1917093 2024260 2122733 2008980 1666783 1336077 1252856 1380029 1454805 1290687
36186 1290687 982683 784339 807647 911780 910453 803160 713916 672813 611859 561627 661890
36175 661890 911998 1083395 1003106 797486 717594 825897 1007585 1205701 1461684 1757553
36165 1757553 1997921 2166418 2368357 2700095 3171742 3737612 4279388 4574216 4429502
36156 4429502 3887590 3201078 2596237 2148519 1856437 1687763 1544637 1334772 1113689
36147 1113689 1025749 1074038 1087001 952969 747692 583183 478718 439643 499674 593230
36137E93230m6339k22262j83386L9861J39576j7727j99173j64204J4475J24903
36127G8954J19778Q4419M3679k7216q5104o3801Q763M8504L1643o377l9261m8816
36115A45165j1469N2886Q0889O6478P9520J25506R3233o4637k03849j70475l0388
36104A62859L2665m995J6R8517J57554P5969n1497o9944K6757J10351R2617J1406
36092F42275l9182j5486L6341L1725n0656j25071r0991L7452J45369J60643J20670
36081H53089Q6911P0150P0396J11287J85526K40186K72807L58245N03224N74643
36071C326464N01261M56339O40421R05219Q27660K36818n21993r68645r83297
36062D420247p88061n86383m23496l21086l14799l39983k62021p4111O3015K8062
$$ plain form
36137 593230 546891 324629 141243 181104 320680 302953 103780 -60424 -45949 78954
36127 78954 198732 283151 326830 299614 214510 150709 159472 207976 239619 233242 193981 145165
36115 145165 133696 186582 267471 333949 413469 538975 632208 567571 363722 193247 162859
36104 162859 195524 190529 190545 289062 446616 522585 471088 401144 427901 538252 630869 642275
36092 642275 603093 587607 623948 655673 605017 479946 388955 426407 571776 732419 853089
36081 853089 940000 1010150 1080546 1191833 1377359 1617545 1890352 2248597 2751821 3326464
36071 3326464 3827725 4284064 4924485 5829704 6657364 6894182 6372189 5403544 4420247
36062 4420247 3632186 3045803 2622307 2301221 1986422 1646439 1384418 1310307 1373322 1401384
36052A401384j14719k16832k06569j15076j8213J6878j3487l6217O048O8440P6718
36041H48355M6191L5000K8874p312k0385L4222M7931q3535k04817o9332K34057
36030H89249L34992J37659j0370J38174L52681L41779K45530L64033O18347O93783
36020D105857N98646O35298Q14138P27570J41708o16189j047517j034364q27496
36011C497651o55995n38363l98754k17948o9417m7843j43164k14166j60432p0125
36001I81444p8101j36059r5941J6787K7390q7196j49990p8948k126o522k187N7278
35989D45829M6477r1740j85566r5774M0383L4257l6024K8004J86091K12176P0477
35978F54590k1173O2855J73617J40535L1251K6705J40463K09839J42704M4530
$$ plain form
36052 1401384 1286665 1069833 863264 748188 729975 746853 733366 697149 703197 771637 848355
36041 848355 894546 929546 958420 951108 930723 964945 1012876 929341 724524 655192 889249
36030 889249 1224241 1361900 1351530 1489704 1842385 2184164 2429694 2793727 3412074 4105857
36020 4105857 4704503 5339801 6153939 6881509 7023217 6407028 5359511 4325147 3497651
36011 3497651 2841656 2303293 1904539 1686591 1617174 1569331 1426167 1212001 1051569 981444
36001 981444 903343 767284 671343 688130 715520 628324 478334 399386 397260 390738 388551 445829
35989 445829 492306 400566 215000 119226 159609 193866 157842 185846 371937 584113 654590
35978 654590 633417 696272 869889 1010424 1041675 1068380 1208843 1418682 1561386 1605916
35968A605916N4028J36146J34295O236j13344j29474j39046k50044l53102k59359
35958F92252k3027R2219o252j11060m5969P8354P2040l7136q0391r977P5848R6910
35946G93811M4659o4416j68494j57508n531J54398J91152J40896J10900J06695
35936A146562P6091L6892K1169k8261j53764k47363j87362n4433k9703j11166
35926D68662j24921j8006N4052k4067j54883j75061n9564Q4884J48039R2994l0363
35915B61766j21654j26913r3089p6324m0572O3226J62922J37430J0713n5524K2180
35904A44161J49829J90921J04738o2068k25682k90083k11781o2996L7209N8500
35894a67252O0100P2392O4133K2875j6146k6357j3113Q972J4163j9860m9721M740
$$ plain form
35968 1605916 1659944 1796090 1930385 1936621 1823277 1693803 1554757 1304713 951611 692252
35958 692252 669225 761444 755192 644132 598163 676517 748557 711421 631030 621053 696901 793811
35946 793811 838470 774054 605560 448052 442521 596919 788071 928967 1039867 1146562
35936 1146562 1222653 1259545 1280714 1252453 1098689 851326 663964 609531 579828 468662
35926 468662 343741 325735 379787 355720 200837 25776 -33788 51096 199135 292129 261766
35915 261766 140112 13199 -79890 -156214 -196786 -133560 29362 166792 177505 121981 144161
35904 144161 293990 484911 589649 527581 301899 11816 -199965 -262961 -225752 -167252
35894 -167252 -107152 -34760 29373 52248 36102 9745 -3368 5604 19767 -93 -49814 -45074
35882d5074J07162R7307n7904j46672j0017J81572J71814K0581j6734O7888M4511
35871D14434j15334j67300k9591O1467l3334j13475p817J06127P021j76339j65634
35860b19775K5904J42466Q8439J3946L2312Q5436R5267O5226J4602m8576q2895
35849B12352n3441p452j3097m5173k5232M9419J03052Q5194J1005p0066j00745
35838A45816o3266k7156o3944r9106P617J95359K13543J791j58108m3369J59697
35827B68874J44881l9880j01736J3232O9749l5960j16491k4085J10497Q7793p6831
35816C00043j91304j21757O7729J63841J5462k43070k74625L0892L32828K51490
35806C31529r9657k66966r1872J24616J19694M889r594N6013O7052Q818o4485
$$ plain form
35882 -45074 62088 159395 101491 -45181 -55198 126374 298188 318769 302035 369923 414434
35871 414434 299100 131800 102209 163676 130342 16867 9050 115177 122198 -54141 -219775
35860 -219775 -193871 -51405 37034 50980 83292 168728 263995 329221 343823 295247 212352
35849 212352 158911 151459 138362 93189 67957 117376 220428 305622 316627 246561 145816
35838 145816 82550 55394 -8550 -107656 -100039 95320 308863 310654 152546 109177 268874
35827 268874 413755 373875 272139 285371 355120 319160 202669 178584 289081 376874 300043
35816 300043 108739 -13018 54711 218552 234014 -9056 -283681 -252789 80039 331529
35806 331529 231872 -35094 -126966 -2350 117344 122233 112639 168652 235704 244522 180037
35795A80037j51530k25311j80455j140J50402J43838N4766J3551J6962J2575K8152
35784D1847P8395P8404k591l4752O2822J36194J1302k08065k64312j05229P9420
35773a26565J42612J13489O3880J8926O610M4931O9108J605j04359j19785l8435
35762G2017J3910j6279l0986N0085J51838J45129K5398p5789n1711L7901K2792
35751C44305j48198k84932j76123Q7791J89190K3935j44334q5773O4979P7631
35741e1529J5605P1536J68454P7873j32670j50995O0626J74905K6060j32068o7696
35730F0101N3104j8738j79900j55621M4312J57890Q5580p169Q694O2231N5366
35719A65850J0375j5070k4684l4516k1419K4431N5159J9326o3055j05917m8047
$$ plain form
35795 180037 28507 -196804 -377259 -378399 -227997 -84159 -29393 -15842 1120 13695 41847
35784 41847 120242 198646 196055 161303 224125 360319 371621 163556 -100756 -205985 -126565
35773 -126565 16047 129536 193416 212342 218952 263883 332991 334596 230237 110452 72017
35762 72017 85927 69648 38662 88747 240585 385714 411112 335323 283612 321513 344305
35751 344305 196107 -88825 -264948 -177157 12033 35968 -108366 -194139 -129160 -51529
35741 -51529 -35924 35612 204066 281939 149269 -1726 58900 233805 259865 127797 60101
35730 60101 113205 94467 -85433 -241054 -196742 -38852 46728 39559 48253 110484 165850
35719 165850 176225 161155 136471 101955 80536 104967 160126 179452 116397 10480 -37567
35708c7567N3360N4779r1661k28041j69943L0115J51886J35728J35377J99211
35698B33244J54540n7246j88685n3006J35774P7836j24426j34117O5004J59727
35688B68645L9399m8324N0616J45306N2695r4419q9210K3463O5818O325o4247
35677C56067j07033j26688r9130l6453j3152k9133J2608J00458P4782q2051j36657
35666h6382L0636J75489N4539j56784j25764R9233J69539r005j68720j36146m4410
35655a97775k2618J249O9809N9206o9870j27357K1028K18515K46884J30693L6249
35644C66013O851j6590j9705N1006J40179J34022K7472p9243j15804q1232j374
35633D11595O7518N6106j6247l1882N3211J18872N3721p7567j40641j05641j1425
$$ plain form
35708 -37567 15793 70572 -21089 -249130 -419073 -388958 -237072 -101344 34033 233244
35698 233244 387784 330538 141853 88847 224621 302457 178031 43914 108918 268645
35688 268645 308044 259720 310336 455642 508337 413918 324708 348171 413989 420314 356067
35677 356067 249034 122346 23216 -13237 -26389 -55522 -42914 57544 132326 50275 -86382
35666 -86382 -55746 119743 174282 17498 -108266 -9033 160506 151501 -17219 -153365 -197775
35655 -197775 -220393 -219144 -149335 -90129 -159999 -287356 -266328 -47813 199071 329764 366013
35644 366013 372864 356274 336569 387575 527754 661776 689248 610005 494201 412969 411595
35633 411595 479113 535219 518972 487090 540301 659173 712894 635327 494686 389045 377620
35622C77620J27202K51277K24683K8706j29030q1256L8228R611j10857j04594
35612F31590J4223K5595r0198r8744P9376K13728J32402k7520q3599p8392j15686
35601F02775j43270r2352m9257q6802r0414L5745J46592P8342m7739j7328R1290
35590D27582K9308j68610k00249L681J41730K4943j13814J360K40223K59403J1134
35579F56691k05719j64985L7507J71309J39622J6294o7848k8937J03732J96472
35569H54138J43504j468q6378n1834J5214K8434J3718L0898N8542L0274m8043
35558I86999r2505n6674P54j2556j11117k15739k35038j40971K2934J70068K04821
35547E20976Q4143j09851j96891p1315J54742K53057J41328k6810o6139J9282
$$ plain form
35622 377620 504822 756099 980782 1009488 880458 799202 837430 847041 736184 631590
35612 631590 645813 671408 581210 482466 561842 775570 907972 880452 796853 718461 602775
35601 602775 459505 367153 317896 231094 140680 176425 323017 401359 353620 336292 427582
35590 427582 456890 288280 88031 91712 233442 258385 144571 145931 386154 645557 656691
35579 656691 450972 285987 323494 494803 634425 650719 582871 553934 657666 854138
35569 854138 997642 996174 909796 857962 873176 901610 915328 946226 1004768 1035042 986999
35558 986999 894494 837820 838574 826018 714901 499162 264124 123153 146087 316155 520976
35547 520976 605119 495268 298377 227062 381804 634861 776189 749379 683240 702522
35537G02522Q0633L2320o6937j16689q2203k382N1989K9186m9514r5720n3357
35526D29848K8536O5346M5286J1997j7846m0353j0696Q9507J59158Q2640p3884
35515G69539j14420J1206J32160J15023M7717O6738J31973J11206K866p2000n9670
35504A142338k8348m7492j10752j69111j68350p7254N8813J31708R9013M4042
35494H74607M3589N3980J5674j9853J0278L7065l2307j24380q8593N4284J26031
35483I50375M8960p0612j21802j00226l4396M7140O7724k5823j37510j25201k7959
35472D70670j1393q1956o6490Q4539J92495J25666k1100j09138j28936j02219
35462C52138n897J05966R8880j6287n3173M5712R7914N327o0080K6152R3653j6172
$$ plain form
35537 702522 783155 815475 748538 631849 549646 547264 599253 628439 578925 483205 429848
35526 429848 458384 523730 569016 581013 563167 522814 512118 601625 760783 843423 769539
35515 769539 655119 666325 798485 913508 961225 1027963 1159936 1271142 1274008 1202008 1142338
35504 1142338 1113990 1066498 955746 786635 618285 541031 599844 731552 830565 874607
35494 874607 918196 972176 987850 967997 978275 1015340 983033 858653 770060 824344 950375
35483 950375 999335 928723 806921 706695 672299 719439 787163 761340 623830 498629 470670
35472 470670 459277 377321 310831 395370 587865 713531 692431 583293 454357 352138
35462 352138 346241 452207 551087 534800 481627 527339 625253 630580 570500 596652 690305 674133
35450F74133j34875m8517J07340O6464j05357j24869K4222Q7087j4212p9263M619
35439D56772J08237J18670Q0659L6668k9185o1266J0954P7545k8253k04739j77958
35428C88104M4300J40955j8037j68488r2520N2164L7941o7346p1078J3811M0536
35417C00342j7024q1250j21679j25690m1023J08114J78323J13638M7112O2886
35407D23749L4906j25994k46440j36018Q4198J46930L7243k5868M5527J10140
35397C48373O4063j5123l3765j9818l2424n2080k4436M9360J04389P1811m7644
35386D12706j58651j57869n5791M6100R7877J27359J26043M6285o1703o8535K4630
35375C78451N8908l0761j10708p8626j0875K1420P7478J57771J11168r3480k18184
$$ plain form
35450 674133 539258 490741 598081 664545 559188 434319 458541 545628 531416 452153 456772
35439 456772 565009 683679 764338 801006 771821 710555 721509 799054 770801 566062 388104
35428 388104 432404 573359 555322 386834 294314 346478 384419 317073 245995 259806 300342
35417 300342 283318 202068 80389 -45301 -86324 21790 200113 313751 360863 423749
35407 423749 458655 332661 86221 -49797 34401 181331 218574 192706 238233 348373
35397 348373 412436 397313 363548 343730 311306 259226 234790 284150 388539 460350 412706
35386 412706 254055 96186 40395 86495 184372 311731 437774 484059 422356 353821 378451
35375 378451 437359 406598 295890 217264 206389 227809 305287 463058 574226 480746 262562
35364B62562r3063R5069R4468j6438o402R4777P8671n1037r7610k5927J2924j7080
35352C30914r595K1962m8837j78687j64721K0617J64747J37411M3024J53j0921
35341C06067k8162l3390l6282n5724k0769J15820K04409Q3794j01112o7356J33378
35330E00673J58917o6290k16013r6784N8616J7992p5698n965J28904J16665N266
35319E26283j3313N7971O4395k5597j16165j63980j71089r8321L5331P7713m9906
35308A23322j82182j31031L4011J20628J16534J38359J68974Q9142o6800j15738
35298B95219M831J50802J70527N5844j01070j86535j23662M2171J50053J04704
35288E62884j0746q5355j35919j97336j89513n9491O1744M0400k2741M6182J79949
$$ plain form
35364 262562 169499 264568 359036 342598 336196 430973 509644 458607 360997 335070 347994 330914
35352 330914 321319 343281 294444 115757 -48964 -28347 136400 273811 316835 316988 306067
35341 306067 277905 244515 208233 152509 131740 247560 451969 535763 434651 367295 500673
35330 500673 659590 593300 377287 280503 339119 357111 281413 275448 404352 521017 526283
35319 526283 512970 570941 635336 609739 493574 329594 158505 60184 95515 173228 123322
35308 123322 -58860 -189891 -155880 -35252 81282 219641 388615 477757 410957 295219
35298 295219 300050 450852 621379 677223 576153 389618 265956 308127 458180 562884
35288 562884 552138 466783 330864 133528 -55985 -115476 -53732 -13332 -36073 10109 190058
35277A90058J63806o641j18887q1433j3272J5209P1281J44338R7655p5422j74777
35266B11915q5841M8047O4473J1156K127R451m4800j17097j21389q0833n2852
35255a55643N626J38373K28957J22777j12535k25331j06610O8167Q6405k4386
35245B5800o2666N8342J93461J54260n1706k24833k01604k5032J28383J42891
35235A37296M5484o4184j00683k9544J04740J78444R0452j01571k05122j02972
35225d7660R7029J80860Q4308l7046k1595P5546O1704r7017j84083k7330K13117
35214B97833K21982l0261k26986j41932O4406J12290p511r8557q7068o0219m2827
35203A150K7148J10010P7135n6561j16671l6731M8732M3002K9044Q1929J20706
$$ plain form
35277 190058 353864 347223 228336 146903 133631 148840 220121 364459 462114 386692 211915
35266 211915 126074 174121 238594 249750 251877 261328 216528 99431 -21958 -102791 -155643
35255 -155643 -150017 -11644 217313 340090 227555 2224 -104386 -36219 50186 25800
35245 25800 -36866 21476 214937 369197 317491 92658 -108946 -133978 -5595 137296
35235 137296 182780 118596 17913 -11631 93109 271553 362005 260434 55312 -47660
35225 -47660 49369 230229 314537 277491 255896 331442 393146 296129 112046 84716 297833
35214 297833 519815 489554 262568 120636 185042 297332 289821 191264 104196 43977 1150
35203 1150 28298 138308 215443 158882 42211 5480 54212 97214 126258 208187 328893
35192C28893O7878k774j3433l2333j23410j78540q1107O7750Q7610Q483K570O7399
35180A98986K4012j45532k09119l6190J70012J53265k7277j00611K1247J50934
35170A99727J20303j3852j06296j16677p9924J625J15262J57030L7851j42586
35160A72463j70118o99J53319R5358r7370j93201j14977r63J8215l0190n6540
35149b24703m1462j7215Q835N0769J02292J38590J35534P4721l2533j21645j26461
35138e3278o1187M485M9250J03452J48496J16074J3601n8991o1588o8084j10689
35127B1541j02443o227N8254R985k4181Q2877J94505R0995j45179j99399L035
35116a6237J70508P9789j12876j43323j7115P1279M9311K09j8350j0791L2861
$$ plain form
35192 328893 396771 393997 380564 348231 224821 46281 -34826 32924 120534 129017 131587 198986
35180 198986 222998 77466 -131653 -167843 2169 155434 128157 27546 48793 199727
35170 199727 320030 306178 199882 83205 3281 4906 120168 277198 315049 172463
35160 172463 2345 1646 154965 250323 152953 -40248 -155225 -156188 -137973 -168163 -224703
35149 -224703 -266165 -283380 -274545 -223776 -121484 17106 152640 227361 194828 73183 -53278
35138 -53278 -114465 -109980 -60730 42722 191218 307292 320893 261902 200314 132230 21541
35127 21541 -80902 -87129 -28875 -18890 -43071 39806 234311 325306 180127 -19272 -16237
35116 -16237 154271 234060 121184 -22139 -39254 32025 81336 81545 63195 52404 85265
35105H5265R7368R7081J1282k7748O0423J24193Q475j45752r4269Q9962J04934
35094D11214q0172j61857j4198R1593m9487k13350j04044J68675K67418J24072
35084D39864l9704r0030q9606p9065k2033M0222J9930k7533L0817J43491J10674
35073D37027q3006k03332j08168N3365Q5355J1958k4294L665J0438l9747q3259
35062F0002m5519O5382J37087N0850j43141k18622n9908J27114P9880j10648j18614
35051a76137R4479J95327J1197j73477n3604K22860K84929P1257j48475j89339
35041A39017j19730n0642l70J5357m2450j28497j27800k0257Q3027J00491P6695
35030g5159P8086P4534j1113j62770k39861j27754Q7936J77303N3862q6190l5166
$$ plain form
35105 85265 182633 279714 290996 263248 323671 447864 456339 310587 216318 306280 411214
35094 411214 331042 169185 154987 246580 197093 -16257 -120301 48374 315792 439864
35084 439864 400160 310130 220524 141459 119426 159648 179578 152045 182862 326353 437027
35073 437027 354021 150689 42521 95886 181241 193199 168905 172570 183008 143261 60002
35062 60002 14483 79865 216952 267802 124661 -93961 -153869 -26755 53125 -57523 -176137
35051 -176137 -81658 113669 124866 -48611 -102215 120645 405574 476831 328356 139017
35041 139017 19287 -31355 -31725 -16368 -58818 -187315 -315115 -335372 -252345 -151854 -75159
35030 -75159 2927 77461 66348 -96422 -336283 -464037 -376101 -198798 -144936 -231126 -266292
35019b66292J08503R5669n9983r9454L9755J16630J3821n8146M2488J09058m1422
35008F27k00036r2501J46977J86424K1554q0581n2842n9791j15341n4176J09811
34997a89875J54707K6990o9847k1051N1917M5999P828m0473j40572k15250j15971
34986e05598R5404J80490Q7237L481J1475k833m8263J5805J37914O3218k01875
34975a63545k98639p7283J35248P1084n5086L0229J65730P3079j18377r8108Q0385
34964b55283J24089K7500K7480J14868M3274j84263k66794r7603P9828R6597Q6840
34953b03467J66937K04239P4917r9342j50131j06759q1822o7903J769J03747J58588
34942G73J36361N9693j5739j710J22303K04199P9000j49909j95000m664J31484
$$ plain form
35019 -266292 -157789 -62120 -122103 -221557 -181802 -65172 -51351 -109497 -67009 42049 627
35008 627 -199409 -291910 -144933 41491 63045 -17536 -70378 -130169 -245510 -299686 -189875
34997 -189875 -35168 -8178 -78025 -99076 -47159 -1160 6668 -33805 -174377 -389627 -505598
34986 -505598 -410194 -229704 -142467 -138986 -127511 -130344 -178607 -162802 -24888 38330 -163545
34975 -163545 -462184 -539467 -404219 -333135 -388221 -357992 -192262 -119183 -237560 -335668 -255283
34964 -255283 -131194 -103694 -76214 38654 81928 -102335 -369129 -466732 -386904 -290307 -203467
34953 -203467 -36530 167709 242626 143284 -6847 -113606 -195428 -263331 -261562 -157815 773
34942 773 137134 196827 181088 179378 301681 505880 584880 434971 239971 235307 366791
34931C66791R368j84099j67471J9825J16580L1362q8099j10058m2264O3163J52140
34920A67238J41552J0087j08437p7111L0160L7673l7956j2417J34488J84127J8562
34909D87966j76102j79445l8388N8827O5864N1624R432q8895j26482K4158K24532
34898C13091J90499p5236k35050r9530R4165N5115j26422j49767L4063J89506
34888A90434J60689K9597p2129j00780m8564O1819J26459P0950k340M4337J28675
34877E89147N9231j14747j40200J7068Q9691m9592j71612q6340L9631L73p7715
34866A54935J0818J34078K9398j96239j75843J23716L09768J46509j17227j58332
34856B61581l1159P464p6718r6246K4267J41322J15747j4527j15133j13753m3617
$$ plain form
34931 366791 376159 192060 24589 44414 160994 192356 104257 -5801 -48065 15098 167238
34920 167238 308790 318877 210440 133329 163489 201162 163206 150789 285277 469404 487966
34909 487966 311864 132419 94031 152858 218722 270346 279778 190883 64401 88559 313091
34898 313091 503590 428354 193304 93774 187939 243054 116632 -33135 928 190434
34888 190434 351123 380720 308591 207811 159247 221066 347525 418475 416135 460472 589147
34877 589147 648378 533631 393431 410499 500190 450598 278986 192646 232277 232650 154935
34866 154935 165753 299831 329229 132990 -42853 80863 390631 537140 419913 261581
34856 261581 230422 237886 161168 64922 89189 230511 346258 331731 216598 102845 59228
34845E9228K2255M9782O0847P6746P0738J5489m4244l6792J9295K7557l4853o9712
34833B16336j3882M6174R300n2713K3556K22962L07648J26744j36328j73994K7657
34822F03460J67887P0838n8324L4417K39217K57277R7947P4018K67427L41074
34812B095238M9928l46124m36918k30369p1556j16279j99455j83668j28829q5042
34802C46926O977J30511J41158L722j11574p8402P262R388m2170n3202l6505m4156
34790B79935m2557N43L387r5422j68250m9305J79709K50278P7433j11406r4320
34779B30025N0379R3405n782p6435k3989L7437p183q0603m4389O7109R1544j0904
34767C20614r9410o5854K3078M9064K898m4091m9825j9199K4729L9438k053m4202
$$ plain form
34845 59228 81483 131265 192112 268858 339596 355085 310841 274049 293344 320901 286048 216336
34833 216336 202454 248628 257928 205215 228771 451733 759381 886125 749797 575803 603460
34822 603460 771347 842185 783861 818278 1057495 1314772 1412719 1486737 1754164 2095238
34812 2095238 2145166 1799042 1362124 1131755 1060199 943920 744465 560797 431968 346926
34802 346926 353903 484414 625572 629294 517720 439318 446580 455968 413798 360596 324091 279935
34790 279935 237378 237921 241308 145886 -22364 -71669 108040 358318 435751 324345 230025
34779 230025 280404 373809 368027 291592 267603 305040 297857 217254 172865 239974 331518 320614
34767 320614 221204 155350 178428 227492 230390 186299 136474 117275 142004 181442 179389 135187
34755A35187n512O9863M3756p6317q5166J16864L13930K38722m8339k30642j43042
34744C29304O2160J46935M5970j11619j43356J2306K04989K18087N6394m2162
34734G79008K8962O0333j13765k73991j26130J88075K53747R384j74477q4429
34724E46717M8970j4858j47230j15204L3228Q8335J0948p2527q9915n7028J4706
34713B46142R4969J04286K9307k1271K1852P8467O9454N0476P8235P6135k1676
34702H06376j08875n3384Q1172J24164M8214k3519k0925N321M444m875J0427M9776
34690I18316Q4531P5461J4837l5637j4742K7441l672o1272N108J81809K48778
34679A440958J03993n7103l3639P9216O9805m5602p8947J2520R0526Q6337Q2496
$$ plain form
34755 135187 129675 199538 243294 166977 81811 198675 512605 751327 702988 472346 329304
34744 329304 391464 538399 584369 472750 329394 341700 546689 764776 821170 779008
34734 779008 807970 868303 754538 480547 354417 542492 796239 805623 631146 546717
34724 546717 595687 580829 433599 318395 351623 439958 450906 378379 288464 231436 246142
34713 246142 341111 445397 474704 453433 475285 553752 623206 673682 751917 828052 806376
34702 806376 697501 644117 725289 849453 897667 874148 853223 858544 862988 858113 868540 918316
34690 918316 1002847 1078308 1093145 1057508 1042766 1070207 1066535 1005263 1010371 1192180 1440958
34679 1440958 1544951 1487848 1454209 1533425 1603230 1557628 1478681 1491201 1581727 1668064 1750560
34668A750560J34459J76726J38753M0039m9392o4683K4004J62937K28647J66780
34658B708830P6842Q6106J90337K88209L08423K37535J09559L8597J46793L68014
34648D559245M58174L23152J89020K82279M88459N48847M83447N50050Q21159
34639H703832J069215J110646J049817J108487J362003J713164K032415K280288
34631B0429867K542956K945598L504905M126740M769499N480671O227029O872796
34623E6900061P378637P702821P318831N263099J199484l705842p509864r155289
34615F5391938r075222q252304p235071o164818n158694m276811l429054k631019
34607A9168945k124208k002772j965722j697276j280827r86188q53085p53556
$$ plain form
34668 1750560 1885019 2061745 2200498 2240537 2191145 2126462 2150466 2313403 2542050 2708830
34658 2708830 2785672 2871778 3062115 3350324 3658747 3896282 4005841 4044438 4191231 4559245
34648 4559245 5017419 5340571 5529591 5811870 6300329 6849176 7332623 7882673 8703832
34639 8703832 9773047 10883693 11933510 13041997 14404000 16117164 18149579 20429867
34631 20429867 22972823 25918421 29423326 33550066 38319565 43800236 50027265 56900061
34623 56900061 64278698 71981519 79300350 84563449 85762933 82057091 74547227 65391938
34615 65391938 56316716 48064412 40829341 34664523 29505829 25229018 21799964 19168945
34607 19168945 17044737 15041965 13076243 11378967 10098140 9111952 8258867 7505311
34599G505311o80301o79318o39057m43240k33150k34363l92538m48257l23688
34590C431399j81185j32789j36856j65319k37979k89962k23440r9783p5648j40818
34580A747620j28561o745N6588l0951j44272j50658r0612o3846p8657r9203j19287
34569H91416j13486l2275Q2604R9727k693o3971K2275J13114J1787k09189k62984
34558E36325l9697K19291K22068n000j74777j25502j049l359j01925j17648j9198
34547C89529M0294j5880o9455j7170N5850K4319p5518j24015j06900q6138n5538
34536d0622K1854Q3890M0222n1367m2896P1467J41514R6370L3331K9865K3402
34525D07030m6146j08485q0163j3672j9082r2470j23251n1416N9516J08353P1164
$$ plain form
34599 7505311 6825010 6145692 5506635 5063395 4830245 4595882 4203344 3755087 3431399
34590 3431399 3250214 3117425 2980569 2815250 2577271 2287309 2063869 1964086 1888438 1747620
34580 1747620 1619059 1612314 1668902 1637951 1493679 1343021 1252409 1188563 1109906 1010703 891416
34569 891416 777930 745655 828259 927986 925293 861322 883597 996711 1008498 799309 536325
34558 536325 496628 715919 937987 932987 758210 632708 631659 628300 526375 408727 389529
34547 389529 429823 413943 344488 327318 383168 407487 331969 207954 101054 14916 -40622
34536 -40622 -18768 65122 105344 53977 11081 82548 224062 320432 353763 383628 407030
34525 407030 360884 252399 172236 158564 139482 47012 -76239 -127655 -68139 40214 111378
34514A11378K0181L4136R1138Q2665l3719j45500j25746k0256K0357k5530l4035
34503b4931K9620L6272o6749j12814L3654K11862J55515j04261k48241j07404
34493a97477J11734J35398o473p1453K6620J23842P5104m9082r8032n5784k1169
34482b6772l6112m2635M58M9013M3121j0936n1393k5320N8805J18988O5940p5328
34470F7829j50437n7290R5792J21350J6960m4831N374M0619k0928o5435P359Q6512
34458A02874K9563p9737m9645J11197K01318J19869k5177j02993r7425m8099N954
34447A67699Q891o4859j40261j26586n4771j3806Q835P5433J30740P0768m5653
34436A6430n9635J8236K4503n7500o3975L4826N4175p3646j52082m5693R6421
$$ plain form
34514 111378 131559 165695 256833 339498 305779 160279 34533 14277 34634 9104 -24931
34503 -24931 4689 40961 -25788 -138602 -104948 106914 262429 158168 -90073 -197477
34493 -197477 -85743 49655 43182 -28271 -1651 122191 197295 148213 50181 -5603 -26772
34482 -26772 -62884 -105519 -105061 -56048 -12927 -23863 -75256 -100576 -41771 77217 143157 67829
34470 67829 -82608 -139898 -44106 77244 94204 49373 54747 95366 74438 9003 16362 102874
34458 102874 132437 52700 3055 114252 315570 435439 410262 307269 209844 161745 167699
34447 167699 176590 111731 -28530 -155116 -209887 -223693 -214858 -139425 -8685 62083 16430
34436 16430 -43205 -24969 -466 -57966 -121941 -87115 -32940 -106586 -258668 -304361 -207940
34425b07940J14365R4217J42782J36294m2646k07800j16510J11978J46386n1275
34415A19851j84774q3096R0161J31963N6043k1402n5135m7808o25M7083L8472
34404I0733r164k8820j3779R30L2899J00488J22715K5431r5675r2431o317L41
34392A27351p4845p9646J4049O5803J9092k7292k8925m7689n9724M0900J89510
34381A38584J63579n9386k14107j37635K640J3233l9794k2799J9389R363K0265
34370a06668R7844R4367q1131k19948q7066J92934K93283J37891n8795j35017
34360A27694j16811n7269K3761O2475J5639k7264K6166R0471M0955m7664k2169
34349A15984O6462N1135m1938m6980J6006l0911j70884j80415j7176Q7124J0939
$$ plain form
34425 -207940 -93575 642 143424 279718 237072 29272 -87238 24740 171126 119851
34415 119851 -64923 -148019 -57858 74105 130148 108746 53611 5803 5178 52261 90733
34404 90733 81569 52749 38970 39900 72799 173287 296002 321433 225758 133327 127010 127351
34392 127351 52506 -27140 -13091 52712 71804 44512 15587 -32102 -91826 -50926 138584
34381 138584 302163 242777 28670 -108965 -106325 -93092 -132886 -155685 -136296 -126933 -106668
34370 -106668 -8824 85543 4412 -215536 -302602 -109668 183615 321506 262711 127694
34360 127694 10883 -46386 -22625 39850 55489 28225 54391 144862 185817 138153 115984
34349 115984 182446 233581 191643 144663 160669 129758 -41126 -221541 -238717 -151593 -140654
34338a40654o9211J501J14113J25804R5942J18986J22340J5980j16355j50277
34328A18169j11407p9382l4454M8913Q8171L1043j7628K9453O5706k7910j40143
34317b9469q2402R2014J49188K6517r6267q9636l2105k1871j2265O4768J42014
34306A10486J10869M550l8357J8032M8760m0638j54988j39061k2603N917j04778
34295b01811j61076j7800J68920J60529K485n7293L5334Q7373J0803m5949Q123
34284a0362M3152l5712j02297l7981N5427M6608J072L0788P6425L6048k7985j1366
34272F3817K8049j0434o7141m5980k2187j01077j82362j13236K1090K8653m6699
34261d47507p563J20981J13192n9480j66486r6281J503J8993M4072J16013J09833
$$ plain form
34338 -140654 -209865 -208364 -94251 31553 127495 246481 368821 384801 268446 118169
34328 118169 6762 -72620 -107074 -58161 30010 61053 43425 72878 138584 110674 -29469
34317 -29469 -111871 -19857 129331 155848 59581 -30055 -62160 -84031 -96296 -31528 110486
34306 110486 221355 225905 187548 205580 254340 213702 58714 -80347 -102950 -97033 -201811
34295 -201811 -362887 -380687 -211767 -51238 -48753 -106046 -70712 16661 27464 -18485 -10362
34284 -10362 32790 -2922 -105219 -143200 -87773 -41165 -40093 -9305 67120 103168 75183 63817
34272 63817 91866 81432 14291 -31689 -53876 -154953 -337315 -450551 -429461 -400808 -447507
34261 -447507 -455070 -334089 -220897 -280377 -446863 -543144 -541641 -522648 -478576 -362563 -252730
34250b52730n666n6435L6151Q6218m6518j98199j56850Q778R1774O4360L5542
34239c93575K3549q223P3R4972J46300K9735j11428m9437J36413J43993p2049
34228e9677k09627q4962R8553R3427k8502o1220k0311n8076j37474p1464J33835
34217d05498K40332J34908l659K039O3958J1455j12360j33890m3570L729m0605
34206b83161n3324K7416R1168M7335l0164m1604j1944k315J0986N9547R0187O3712
34194c2161M5083P3538N0722r3183k24286j77709k6000K9912j7310J99J03652
34183b67543J19972p25o9721L3656J54084J05361m1482q1201K5874J37787J46218
34172B62280O8256l2099r5452p1962K2749Q0454J7866r7446j19679j4550R5075
$$ plain form
34250 -252730 -258396 -314831 -278680 -192462 -238980 -437179 -594029 -585251 -493477 -429117 -393575
34239 -393575 -370026 -378249 -378176 -283204 -136904 -107169 -218597 -268034 -131621 12372 -59677
34228 -59677 -269304 -354266 -255713 -162286 -190788 -252008 -272319 -330395 -467869 -539333 -405498
34217 -405498 -165166 -30258 -33917 -31878 32080 43535 -68825 -202715 -246285 -242556 -283161
34206 -283161 -336485 -309069 -217901 -170566 -200730 -242334 -254278 -256593 -245607 -186060 -95873 -32161
34194 -32161 12922 86460 137182 43999 -180287 -357996 -383996 -354084 -371394 -371195 -267543
34183 -267543 -147571 -148296 -218017 -184361 -30277 75084 33602 -47599 -21725 116062 262280
34172 262280 330536 298437 202985 131023 153772 234226 252092 154646 34967 20417 115492
34161A15492Q0932m2457j39948j09668J663N7583P829n0769l1207K368n0883j36603
34149b95668j14150J1311R5436R7374J28378K15310K12515M5294j31081j42371
34139A22348k9652N3430N6895K0653m0949j03606q2164M5431J50662J22313L0675
34128C46036p957k3390q9678j38298o7748M0386K8712o3619n9541M8275Q2026
34117I5204j5819r4017n9393j1640k9467k7236O1048J34999J03104N0264P1728
34106B78775P2146p4563k49449j99216P7966K68162J42205j34340k18893l2974
34096g0181J66488J47694j3837q8222k1456K4684o0579j76433j67662l3364J01439
34085a91429J46813R7563j0683j00565o8635Q5484J92433J04498p7601j19032
$$ plain form
34161 115492 196424 153967 14019 -95649 -93986 -36403 -28574 -79343 -110550 -108182 -159065 -295668
34149 -295668 -409818 -398507 -303071 -205697 -77319 137991 350506 395800 264719 122348
34139 122348 92696 146126 203021 223674 182725 79119 -3045 42386 193048 315361 346036
34128 346036 338079 314689 225011 86713 18965 59351 88063 24444 -35097 13178 95204
34117 95204 79385 -14632 -74025 -85665 -115132 -142368 -81320 53679 156783 207047 278775
34106 278775 350921 276358 26909 -172307 -94341 173821 316026 181686 -37207 -70181
34096 -70181 96307 244001 230164 141942 120486 145170 84591 -91842 -259504 -292868 -191429
34085 -191429 -44616 52947 42264 -58301 -126936 -41452 150981 255479 177878 58846
34075E8846J3968J07270L0251o8364j0686J12221P1626j37533k64511j53397M3423
34064a96886R0940r418o3523Q202P4844L3476k0877K5421Q2297o715j67343j59484
34052c09066M1370J63694M1656j23369p8574Q4771R1572p6261j73159q5458L7696
34041c85128O9494O6603Q0131M0749o3354r9969j3594M6312l5031j25922m5917
34030d65626J44686K31650J41914j4079j31265j80093j37724j2377Q8376O2082
34020b72456k9963m1814L9752R6294P9104N6746N9128L1765k7780l8693J3094
34009c4823L4030j1417k9861L3963Q7578M0036n1011q4529p1332p2135o6959j3175
33997b39635L5047N911l7877K1632J42834J47309j8371j86291j87963n6153O2268
$$ plain form
34075 58846 72814 180084 210335 141971 131285 243506 315132 177599 -86912 -240309 -196886
34064 -196886 -105946 -115364 -178887 -170685 -95841 -62365 -83242 -57821 24476 17761 -149582 -309066
34052 -309066 -267696 -104002 -62346 -185715 -264289 -179518 -87946 -164207 -337366 -422824 -385128
34041 -385128 -315634 -249031 -168900 -128151 -191505 -291474 -305068 -258756 -293787 -419709 -465626
34030 -465626 -320940 -89290 52624 38545 -92720 -272813 -410537 -422914 -334538 -272456
34020 -272456 -302419 -344233 -304481 -208187 -129083 -72337 -13209 18556 -9224 -47917 -34823
34009 -34823 -793 -12210 -42071 -8108 79470 119506 68495 -16034 -87366 -159501 -226460 -239635
33997 -239635 -204588 -198677 -236554 -214922 -72088 75221 56850 -129441 -317404 -373557 -311289
33986c11289R8657Q3696M6521j1853p2753j01324q5326l1794N0720J28952J39442
33975f6351N7363n2980j02879p3543p947N5807R1412O4429j9032o7029M146J27697
33963A1093J32770l1093j97138j74926Q316J38555P6379q7971j68490j14367l9226
33952d46098l2883l6043L8357J27851Q5320q1491j70631m9285J55095K27091J40937
33941d1780M1936J3208R529l669l625r157p1559j38626q5543O4035J10020l6814
33929a52045j87425j27165P8768J86117J00250n3859j40382j29800k9986J34658
33919c20869K59495K23166N6852o9650p2718m9934r8813j60973j34188m3385J1646
33908c99371J8908M5068Q8976O6216m1227j21941p5992M4242R7517K8423p8808
$$ plain form
33986 -311289 -212632 -128936 -82415 -94268 -167021 -268345 -353671 -385465 -334745 -205793 -66351
33975 -66351 -8988 -61968 -164847 -238390 -246337 -190530 -99118 -34689 -53721 -120750 -116604 11093
33963 11093 143863 112770 -84368 -259294 -250978 -112423 -36044 -124015 -292505 -406872 -446098
33952 -446098 -478981 -515024 -476667 -348816 -263496 -344987 -515618 -564903 -409808 -182717 -41780
33941 -41780 156 13364 22893 19224 15599 6442 -65117 -203743 -289286 -225251 -115231 -152045
33929 -152045 -339470 -466635 -387867 -201750 -101500 -155359 -295741 -425541 -455527 -320869
33919 -320869 -61374 161792 218644 148994 76276 26342 -72471 -233444 -367632 -411017 -399371
33908 -399371 -380463 -335395 -246419 -180203 -221430 -343371 -419363 -375121 -277604 -249181 -327989
33897c27989j12425m8813N1068J18695J28275R3660M1696j2045o6676j12655j18088
33886c65297o3778J5798O3793P1154O9090N4941j611o3882l7681P1123J11184
33875g5166p515j51613j37408M692R5858R1055J04458J57336J14299o6764k14459
33864h5227j81527m9860J9832J2107L893L517j7577k3646J7224M1207n033m7487
33852c12577j0858K7607k7709q8194j1617J24871J16731j6592l0057J44487K50845
33841A66937R3961j43807j65312J0544J07237R847j06711q0423J3990K6754l3183
33830a00166n0281j127L2569J6286K940J9673K9996L1203P1558J23672O9933r6459
33818A49797j84886o3187J07846Q4530q9085j50535l0067P1748M7828L9190J20891
$$ plain form
33897 -327989 -440414 -489227 -438159 -319464 -191189 -97529 -55833 -67878 -134554 -247209 -365297
33886 -365297 -429075 -413277 -349484 -278330 -209240 -154299 -155910 -219792 -257473 -186350 -75166
33875 -75166 -82681 -234294 -371702 -367010 -271152 -180097 -75639 81697 195996 129232 -85227
33864 -85227 -266754 -316614 -296782 -284675 -280782 -277265 -294842 -318488 -301264 -260057 -265090 -312577
33852 -312577 -323435 -295828 -323537 -411731 -423348 -298477 -181746 -198338 -228395 -83908 166937
33841 166937 260898 117091 -48221 -37677 69560 79407 -27304 -107727 -93737 -66983 -100166
33830 -100166 -150447 -151574 -119005 -102719 -99779 -80106 -50110 -18907 52651 176323 246256 149797
33818 149797 -35089 -98276 9570 94100 5015 -145520 -175587 -103839 -56011 -16821 104070
33807A04070J18724p2460k33724j36668P2583Q8711p8925j51190l5268P1132L7886
33796b15129j7645K5481R6657P7028k4587j18570j39856o7767M8275P8838l7989
33785b95264j49679n4412J83465K73009R2292j42693j79251l0788J19536J76967
33775f818J74024J39750N3229q6795k07530j97561k7031J56652J45238n1266j64658
33764g2766l1149J49454J11873n8672q5576K6273K4146j15873j33160L9393J30846
33753a5211J783j07935N7J42154P8663r7982j65268j22834p5722J2434J66161
33742a83700K04179Q432j88842j12649J09773J53091J6131l1504N8660P0267m9667
33731E4171j05572k8814K3821N352N6329J59950Q4240j84202k99770o7437K11356
$$ plain form
33807 104070 222794 150334 -83390 -220058 -147475 -58764 -137689 -288879 -324147 -253015 -215129
33796 -215129 -232774 -207293 -110636 -33608 -58195 -176765 -316621 -384388 -336113 -257275 -295264
33785 -295264 -444943 -499355 -315890 -42881 49411 -93282 -272533 -303321 -183785 -6818
33775 -6818 167206 306956 360185 273390 65860 -131701 -158732 -2080 143158 91892 -72766
33764 -72766 -103915 45539 157412 98740 13164 39437 63583 -52290 -185450 -146057 -15211
33753 -15211 -13428 -121363 -121306 20848 99511 1529 -163739 -286573 -362295 -349861 -183700
33742 -183700 20479 28911 -159931 -272580 -162807 -9716 6415 -25089 33571 103838 54171
33731 54171 -51401 -80215 -56394 -51042 5287 165237 249477 65275 -234495 -301932 -90576
33720i0576J71271q0402j65544m649J40874J11541J8549k7533p4553j48050j37304
33709b86376J8316J72242J32390q0829k40431j66925Q0861K75291K53652O7754
33699B25945r6915j25032n8497N288K9251K3683q508n0285m6398K1938P3014K1528
33687A5012q0254r7578j2745M0824j6801q3155l2700Q1754J08192K9322k4898
$$ plain form
33720 -90576 80695 293 -165251 -169900 -29026 82515 101064 73531 -1022 -149072 -286376
33709 -286376 -268060 -95818 36572 -44257 -284688 -451613 -370752 -95461 158191 225945
33699 225945 129030 3998 -54499 -49211 -19960 3723 -4785 -55070 -101468 -79530 -6516 15012
33687 15012 -65242 -162820 -175565 -134741 -151542 -234697 -267397 -185643 -77451 -48129 -73027
$$ [...]
##END NTUPLES=NMR SPECTRUM
##END=
