##TITLE=31Pdec_E3d0307-4
 CDCl3, 24 sc
 4.7.2023
##JCAMPDX= 6.0         $$ Bruker NMR JCAMP-DX V2.0
##DATA TYPE= NMR SPECTRUM
##DATA CLASS= NTUPLES
##ORIGIN= UXNMR, Bruker Analytische Messtechnik GmbH
##OWNER= root
$$ XWIN-NMR		Version 3.5
$$ Tue Jul  4 14:35:34 2023 Russian Standard Time (UT+4h)  she@DPX200
##.OBSERVE FREQUENCY= 81.013821
##.OBSERVE NUCLEUS= ^31P
##.ACQUISITION MODE= SIMULTANEOUS
##.ACQUISITION SCHEME= undefined
##.AVERAGES= 24
##.DIGITISER RES= 16
##SPECTROMETER/DATA SYSTEM= spect
##.PULSE SEQUENCE= zgpg30
##.SOLVENT NAME= CDCl3
##.SHIFT REFERENCE= (INTERNAL, CDCl3, 0, 248.564)
##AUDIT TRAIL= $$ (NUMBER, WHEN, WHO, WHERE, WHAT)
$$ ##TITLE= Audit trail, XWIN-NMR		Version 3.5
$$ ##JCAMPDX= 5.01
$$ ##ORIGIN= Bruker BioSpin GmbH
$$ ##OWNER= she
$$ F:/spectra/data/she/nmr/P31/1/pdata/1/auditp.txt
$$ ##AUDIT TRAIL=  $$ (NUMBER, WHEN, WHO, WHERE, WHAT)
(   1,<2023-07-04 14:34:26.43 +0400>,<she>,<DPX200>,
      <created by zg, POWCHK disabled, PULCHK disabled
       configuration hash MD5:
       00 E9 B6 7A A2 85 ED C7 34 08 36 98 17 FE 4E 26
       data hash MD5: 32K
       4B 4D 18 C9 8E CD 86 34 0E 9F C6 E3 E8 7F 06 BC>)
(   2,<2023-07-04 14:34:29.10 +0400>,<she>,<DPX200>,
      <Start of raw data processing
       efp BC_mod = 2 LB = 1 FT_mod = 6 PKNL = 1 PHC0 = -10851.26 PHC1 = 439.4848 SI = 64K 
       data hash MD5: 64K
       ED 92 71 BD B8 7A 74 1A 31 BA 1F 48 08 C8 8E 35>)
(   3,<2023-07-04 14:34:46.10 +0400>,<she>,<DPX200>,
      <pk PHC0 = 1.249596 PHC1 = 0 
       data hash MD5: 64K
       DF 70 93 C4 1C 5C E7 3D 93 87 7E F1 10 43 3F 24>)
$$ ##END=
$$ 
$$ hash MD5
$$ 34 A8 65 72 09 F8 8F 7F 98 3B 06 39 1A F3 CA ED
##$RELAX= 
##$RELAX= 
##$RELAX= 
##$RELAX= 
##$RELAX= 
##$RELAX= 
##$RELAX= 
##$RELAX= 
##$RELAX= 
$$ Bruker specific parameters
$$ --------------------------
##$DU= <F:/spectra>
##$EXPNO= 1
##$NAME= <P31>
##$PROCNO= 1
##$TYPE= <nmr>
##$USER= <she>
##$AMP= (0..31)
100 100 100 100 100 100 100 100 100 100 100 100 100 100 100 100 100 100 
100 100 100 100 100 100 100 100 100 100 100 100 100 100 
##$AQSEQ= 0
##$AQ_mod= 1
##$AUNM= <au_zg>
##$AUTOPOS= <>
##$BF1= 81.014009
##$BF2= 200.13
##$BF3= 200.13
##$BF4= 200.13
##$BF5= 200.13
##$BF6= 200.13
##$BF7= 200.13
##$BF8= 200.13
##$BYTORDA= 1
##$CFDGTYP= 0
##$CFRGTYP= 5
##$CHEMSTR= <none>
##$CNST= (0..31)
1 1 145 1 1 1 1 1 1 1 1 1 1 1 1 1 1 1 1 1 1 1 1 1 1 1 1 1 1 1 1 1 
##$CPDPRG= <waltz16>
##$CPDPRG1= <>
##$CPDPRG2= <waltz16>
##$CPDPRG3= <>
##$CPDPRG4= <mlev>
##$CPDPRG5= <mlev>
##$CPDPRG6= <mlev>
##$CPDPRG7= <mlev>
##$CPDPRG8= <mlev>
##$CPDPRGB= <>
##$CPDPRGT= <>
##$D= (0..31)
0 1 0 0 0 0 0 0 0 0 0 0.03 2e-05 3e-06 0 0 0 0 0 0 0 0 0 0 0 0 0 0 0 0 
0 0 
##$DATE= 1688466865
##$DBL= (0..7)
120 120 120 11 120 120 24 19 
##$DBP= (0..7)
150 150 150 150 150 150 150 150 
##$DBP07= 0
##$DBPNAM0= <>
##$DBPNAM1= <>
##$DBPNAM2= <>
##$DBPNAM3= <>
##$DBPNAM4= <>
##$DBPNAM5= <>
##$DBPNAM6= <>
##$DBPNAM7= <>
##$DBPOAL= (0..7)
0.5 0.5 0.5 0.5 0.5 0.5 0.5 0.5 
##$DBPOFFS= (0..7)
$$ [...]
##$SUBNAM2= <"">
##$SUBNAM3= <"">
##$SUBNAM4= <"">
##$SUBNAM5= <"">
##$SUBNAM6= <"">
##$SUBNAM7= <"">
##$SUBNAM8= <"">
##$SUBNAM9= <"">
##$SW= 501.771253377433
##$SWIBOX= (0..15)
0 1 3 0 0 0 0 0 0 0 0 0 0 0 0 0 
##$SW_h= 40650.406504065
##$TD= 32768
##$TD0= 1
##$TE= 0
##$TE2= 300
##$TE3= 300
##$TEG= 300
##$TL= (0..7)
0 120 53 12 22 120 120 120 
##$TP= (0..7)
150 150 150 150 150 150 150 150 
##$TP07= 0
##$TPNAME0= <>
##$TPNAME1= <>
##$TPNAME2= <>
##$TPNAME3= <>
##$TPNAME4= <>
##$TPNAME5= <>
##$TPNAME6= <>
##$TPNAME7= <>
##$TPOAL= (0..7)
0.5 0.5 0.5 0.5 0.5 0.5 0.5 0.5 
##$TPOFFS= (0..7)
0 0 0 0 0 0 0 0 
##$TUNHIN= 0
##$TUNHOUT= 0
##$TUNXOUT= 0
##$USERA1= <user>
##$USERA2= <user>
##$USERA3= <user>
##$USERA4= <user>
##$USERA5= <user>
##$V9= 5
##$VALIST= <valist>
##$VCLIST= <CCCCCCCCCCCCCCC>
##$VD= 0
##$VDLIST= <DDDDDDDDDDDDDDD>
##$VPLIST= <PPPPPPPPPPPPPPP>
##$VTLIST= <TTTTTTTTTTTTTTT>
##$WBST= 1024
##$WBSW= 4
##$XGAIN= (0..3)
0 0 0 0 
##$XL= 0
##$YL= 0
##$YMAX_a= 7428
##$YMIN_a= -7679
##$ZGOPTNS= <>
##$ZL1= 120
##$ZL2= 120
##$ZL3= 120
##$ZL4= 120
##$ABSF1= 0
##$ABSF2= 0
##$ABSG= 0
##$ABSL= 0
##$ALPHA= 0
##$AQORDER= 0
##$ASSFAC= 0
##$ASSFACI= 0
##$ASSFACX= 0
##$ASSWID= 0
##$AUNMP= <proc_1d>
##$AZFE= 0.1
##$AZFW= 0.5
##$BCFW= 0
##$BC_mod= 2
##$BYTORDP= 0
##$COROFFS= 0
##$CY= -3
##$DATMOD= 1
##$DC= 0
##$DFILT= <>
##$DTYPP= 0
##$F1P= 0
##$F2P= 0
##$FCOR= 1
##$FTSIZE= 65536
##$FT_mod= 6
##$GAMMA= 0
##$GB= 0
##$INTBC= 1
##$INTSCL= 6.047779e-11
##$ISEN= 30
##$LB= 1
##$LEV0= 0
##$LPBIN= 0
##$MAXI= 10000
##$MC2= 0
##$MEAN= 0
##$ME_mod= 0
##$MI= 50
##$NCOEF= 0
##$NC_proc= -4
##$NLEV= 6
##$NOISF1= 182.463
##$NOISF2= 159.3651
##$NSP= 0
##$NTH_PI= 0
##$NZP= 0
##$OFFSET= 248.5645
##$PC= 4
##$PHC0= -10850.01
##$PHC1= 439.4848
##$PH_mod= 1
##$PKNL= yes
##$PPARMOD= 0
##$PSCAL= 0
##$PSIGN= 0
##$REVERSE= no
##$SF= 81.0140089999694
##$SI= 65536
##$SIGF1= 159.3651
##$SIGF2= -187.1042
##$SINO= 113.3802
##$SIOLD= 16384
##$SREGLST= <1H.CDCl3>
##$SSB= 0
##$STSI= 65536
##$STSR= 0
##$SW_p= 40650.406504065
##$SYMM= 0
##$S_DEV= 0
##$TDeff= 32768
##$TDoff= 0
##$TI= <>
##$TILT= no
##$TM1= 0
##$TM2= 0
##$TOPLEV= 0
##$USERP1= <user>
##$USERP2= <user>
##$USERP3= <user>
##$USERP4= <user>
##$USERP5= <user>
##$WDW= 1
##$XDIM= 65536
##$YMAX_p= 309461218
##$YMIN_p= -128409526
$$ End of Bruker specific parameters
$$ ---------------------------------
##NTUPLES= NMR SPECTRUM
##VAR_NAME=  FREQUENCY,     SPECTRUM/REAL,   SPECTRUM/IMAG
##SYMBOL=    X,             R,               I
##VAR_TYPE=  INDEPENDENT,   DEPENDENT,       DEPENDENT
##VAR_FORM=  AFFN,          ASDF,            ASDF
##VAR_DIM=   65536,         65536,           65536
##UNITS=     HZ,            ARBITRARY UNITS, ARBITRARY UNITS
##FACTOR=    0.620285442955139, 1,           1
##FIRST=     20137.2065510682, 0,            0
##LAST=      -20513.1999529968, 0,           0
##MIN=       -20513.1999529968, -128409526,  0
##MAX=       20137.2065510682, 309461218,    0
$$ Real data points
##PAGE= N=1
##DATA TABLE= (X++(R..R)), XYDATA
$$ [...]
##PAGE= N=2
##DATA TABLE= (X++(I..I)), XYDATA
$$ plain form
39833 246981 316721 412634 419684 316349 185138 116949 140631 226313 339855 470649 572195
39822 572195 527051 290734 50638 67052 325730 539843 548067 484363 473963 443050 381893
39811 381893 488010 801949 989016 802021 507382 472440 549416 331106 -111354 -254461
39801 -254461 112403 604863 802435 707020 553471 499058 599456 810014 938081 839642
39791 839642 667439 649573 671794 445791 65542 -51193 166427 296928 95317 -132809
39781 -132809 -32692 310837 613687 776084 798176 640174 404376 352783 513443 572493
39771 572493 383608 250039 426639 677030 664435 492136 476959 614244 657415 562054
39761 562054 477233 420396 310507 222701 275986 350280 239280 24718 -17895 139654 225733
$$ packed form
39833B46981O9740R5913P050j03335j31211o8189K3682Q5682J13542J30794J01546
39822E72195m5144k36317k40096J6414K58678K14113Q224o3704j0400l0913o1157
39811C81893J06117L13939J87067j86995k94639l4942P6976k18310m42460j43107
39801b54461L66864M92460J97572r5415j53549n4413J00398K10558J28067r8439
39791H39642j72203j7866K2221k26003l80249j16735K17620J30501k01611k28126
39781a32809J00117L43529L02850J62397K2092j58002k35798n1593J60660N9050
39771E72493j88885j33569J76600K50391j2595j72299j5177J37285M3171r5361
39761E62054q4821n6837j09889q7806N3285P4294j11000k14562m2613J57549Q6079
$$ plain form
39750 225733 71141 -172757 -239271 310 465396 895753 1008482 777844 494323 423802
39740 423802 524830 627153 702498 767764 723515 547934 473155 670801 913630 877524
39730 877524 654389 602237 770895 874374 818147 848166 1101711 1362209 1381033 1162563
39720 1162563 825963 453965 195220 248449 572710 817968 726101 458002 359864 517654
39710 517654 708541 732299 633189 577727 610841 607503 476802 349765 450448 764072 978944
39699 978944 849716 490113 185027 42701 -9594 -12853 31945 46760 -26702 -66676 75013
39688 75013 304181 401173 379591 472057 735481 923043 828714 552040 321524 221989 204610
39677 204610 240846 354677 562865 840600 1101840 1211632 1093450 827486 574915 418586
$$ packed form
39750B25733j54592k43898o6514K39581M65086M30357J12729k30638k83521p0521
39740D23802J01028J02323P5345O5266m4249j75581p4779J97646K42829l6106
39730H77524k23135n2152J68658J03479n6227L0019K53545K60498J8824k18470
39720A162563l36600l71998k58745N3229L24261K45258r1867k68099r8138J57790
39710E17654J90887K3758r9110n5462L3114l338j30701j27037J00683L13624K14872
39699I78944j29228l59603l05086j42326n2295l259M4798J4815p3462l9974J41689
39688G5013K29168R6992k1582R2466K63424J87562r4329k76674k30516r9535j7379
39677B04610L6236J13831K08188K77735K61240J09792j18182k65964k52571j56329
$$ plain form
39667 418586 337640 289409 236261 154989 110372 236239 534657 793888 838572 751983 698915
39656 698915 662620 556916 463400 503078 579306 531030 453367 548920 725792 706718 521199
39645 521199 489356 663241 700485 434097 174108 226334 456226 594408 668069 801823
39635 801823 831820 511864 -3983 -257482 -68524 270882 424279 379244 298595 214171
39625 214171 45219 -156960 -168737 127459 511563 615829 369825 105750 119213 283654
39615 283654 296573 169634 168803 322312 362598 219653 184951 408060 587334 436441 166211
39604 166211 160209 385876 510868 466765 482797 604213 599074 407325 302385 458659 666960
39593 666960 669390 532979 478164 523697 529677 463730 397564 318889 162168 -15342 -86483
$$ packed form
39667D18586q0946m8231n3148q1272m4617J25867K98418K59231M4684q6589n3068
39656F98915l6295j05704r3516L9678P6228m8276p7663R5553J76872j9074j85519
39645E21199l1843J73885L7244k66388k59989N2226K29892J38182P3661J33754
39635H01823K9997l19956n15847k53499J88958L39406J53397m5035q0649q4424
39625B14171j68952k02179j1777K96196L84104J04266k46004k64075J3463J64441
39615B83654J2919j26939q31J53509M0286j42945l4702K23109J79274j50893k70230
39604A66211o002K25667J24992m4103J6032J21416n139j91749j04940J56274K08301
39593F66960K430j36411n4815M5533N980o5947o6166p8675j56721j77510p1141
$$ plain form
39582 -86483 -63328 -66851 -96737 -27973 146153 274958 309455 394178 607520 813824 904284
39571 904284 976760 1089415 1043533 689765 297344 265164 524444 613609 382024 222091
39561 222091 458323 871153 1065360 1015869 958661 966379 949899 923684 949918 924246 726665
39550 726665 511631 539088 759305 874386 801089 760248 873925 976002 908725 755599
39540 755599 680232 731794 874103 1011204 946795 551861 35567 -190329 -4690 291140
39530 291140 414054 415099 440100 451822 382220 330490 384173 424257 340325 287515 476080
39519 476080 806449 967555 849948 630453 465300 323076 153494 26311 14429 62363
39509 62363 74539 82874 229960 563058 906021 1025316 930105 881186 1017717 1120913 933860
$$ packed form
39582h6483K3155l523k9886O8764J74126J28805L4497Q4723K13342K06304R0460
39571I04284P2476J12655m5882l53768l92421l2180K59280Q9165k31585j59933
39561B22091K36232M12830J94207m9491n7208P718j6480k6215K6234k5672j97581
39550G26665k15034K7457K20217J15081p3297m0841J13677J02077o7277j53126
39540G55599p5367N1562J42309J37101o4409l94934n16294k25896J85639K95830
39530B91140J22914J045K5001J1722o9602n1730N3683M0084q3932n2810J88565
39519D76080L30369J61106j17607k19495j65153j42224j69582j27183j1882M7934
39509F2363J2176Q335J47086L33098L42963J19295r5211m8919J36531J03196j87053
$$ plain form
39498 933860 597780 488288 656816 769711 654738 550351 658609 795349 740559 650314
39488 650314 787182 1033710 1040285 771828 566881 659156 922956 1121181 1172415 1125892
39478 1125892 1054036 1016391 1003940 912142 676772 404826 258304 265901 369990 567089
39468 567089 836926 1018534 954276 708997 476807 341146 300498 418904 709656 955368
39458 955368 920317 700175 593179 665604 731105 719144 730399 732023 565287 306102 246558
39447 246558 426851 557475 521662 549618 717660 710535 369479 75747 207666 545348
39437 545348 650849 568003 637281 795410 632277 120703 -259793 -232235 -77785 -99338
39427 -99338 -146017 51161 372861 468201 268914 68334 136132 443553 748298 825492
$$ packed form
39498I33860l36080j09492J68528J12895j14973j04387J08258J36740n4790r0245
39488F50314J36868K46528O575k68457k04947R2275K63800J98225N1234m6523
39478A125892p1856l7645j2451r1798k35370k71946j46522P597J04089J97099
39468E67089K69837J81608o4258k45279k32190j35661m0648J18406K90752K45712
39458I55368l5051k20142j06996P2425O5501j1961J1255J624j66736k59185n9544
39447B46558J80293J30624l5813K7956J68042p125l41056k93732J31919L37682
39437E45348J05501q2846O9278J58129j63133n11574l80496K7558J54450k1553
39427i9338m6679J97178L21700R5340j99287k00580O7798L07421L04745P7194
$$ plain form
39417 825492 639348 376769 283736 407106 538148 461802 214193 38121 112350 368244
39407 368244 572872 588110 532295 626235 872500 1009618 856472 560137 369756 311224
39397 311224 277479 295755 435200 553386 464535 317526 443086 806371 1000256 869285
39387 869285 734033 825020 897328 683179 383952 360614 577098 710331 648030 542558
39377 542558 496634 508829 625211 843279 954166 771427 443303 270277 300369 371255
39367 371255 440189 571319 705203 766950 891856 1179056 1336476 1018175 459229 269964
39357 269964 561423 795236 627493 378966 434565 654604 706705 588307 456413 265030
39347 265030 -35344 -199234 -4178 318678 389196 287453 428885 873082 1182084 1035919
$$ packed form
39417H25492j86144k62579r3033J23370J31042p6346k47609j76072P4229K55894
39407C68244K04628J5238n5815R3940K46265J37118j53146k96335j90381n8532
39397C11224l3745J8276J39445J18186q8851j47009J25560L63285J93885j30971
39387H69285j35252R0987P2308k14149k99227k3338K16484J33233o2301j05472
39377E42558m5924J2195J16382K18068J10887j82739l28124j73026L0092P0886
39367C71255O8934J31130J33884O1747J24906K87200J57420l18301n58946j89265
39357B69964K91459K33813j67743k48527N5599K20039N2101j18398j31894j91383
39347B65030l00374j63890J95056L22856P0518j01743J41432M44197L09002j46165
$$ plain form
39337 1035919 632084 335383 213187 113991 23365 104455 414409 755780 883344 792989
39327 792989 710035 780504 879239 808930 597016 443602 425984 438612 410234 382170 367949
39316 367949 350107 427032 709807 1033177 1056841 742592 434236 346814 305345 161294
39306 161294 103980 280607 440139 323819 150867 295977 658278 789405 558478 266585
39296 266585 133057 77314 35860 109265 303090 442124 450807 461768 560008 655200 674732
39285 674732 645223 523577 212888 -158489 -244737 75217 483327 619324 505290 398142
39275 398142 399327 445903 571235 888206 1301385 1484145 1262412 873965 694185 776867
39265 776867 839276 692315 476464 378053 321332 160957 36160 217488 626711 848115
$$ packed form
39337A035919m03835k96701j22196r9196r0626Q1090L09954L41371J27564r0355
39327G92989q2954P0469R8735p0309k11914j53414j7618J2628k8378k8064j4221
39316C67949j7842P6925K82775L23370K3664l14249l08356q7422m1469j44051
39306A61294n7314J76627J59532j16320j72952J45110L62301J31127k30927k91893
39296B66585j33528n5743m1454P3405J93825J39034Q683J0961R8240R5192J9532
39285F74732k9509j21646l10689l71377q6248L19954M08110J35997j14034j07148
39275C98142J185M6576J25332L16971M13179J82760k21733l88447j79780Q2682
39265G76867O2409j46961k15851r8411n6721j60375j24797J81328M09223K21404
$$ plain form
39255 848115 697737 467708 461775 581838 579084 457579 376685 353170 322061 337765 463555
39244 463555 591693 605211 588970 659749 732895 689061 613722 615541 569793 333106 68543
39233 68543 43178 219606 363645 445271 595492 755473 723605 507099 305063 190880
39223 190880 115527 140976 327454 471151 331811 60594 6999 154557 184046 73345
39213 73345 149130 485858 734402 679019 531804 516041 556901 561059 626895 775409 805438
39202 805438 620834 411037 326011 251879 81274 -62541 -38956 113443 319232 554934
39192 554934 705300 622496 421501 398040 559810 602564 467411 499905 852651 1143406
39182 1143406 991855 553676 223306 98222 29393 -49684 -112749 -136930 -9196 395200
$$ packed form
39255H48115j50378k30029n933J20063k754j21505q0894k3515l1109J5704J25790
39244D63555J28138J3518j6241P0779P3146m3834p5339J819m5748k36687k64563
39233F8543k5365J76428J44039Q1626J50221J59981l1868k16506k02036j14183
39223A90880p5353K5449J86478J43697j39340k71217n3595J47558K9489j10701
39213G3345P5785L36728K48544n5383j47215j5763M0860M158O5836J48514L0029
39202H05438j84604k09797q5026p4132j70605j43815K3585J52399K05789K35702
39192E54934J50366q2804k00995k3461J61770M2754j35153L2494L52746K90755
39182A143406j51551m38179l30370j25084o8829p9077o3065k4181J27734M04396
$$ plain form
39172 395200 867323 953031 620661 447913 827361 1371921 1498021 1233730 979623 784823
39162 784823 421508 -14169 -157319 21202 167230 106656 28174 85397 206875 335156
39152 335156 495812 585552 433052 140055 53305 303901 633138 765905 727691 692162
39142 692162 706337 683763 559346 376449 273424 375109 634861 840118 856190 780152
39132 780152 756709 757694 678758 540341 433950 364807 301008 284855 350585 431032 474747
39121 474747 529154 585910 525958 383529 450626 875210 1335601 1399758 1080498 752611
39111 752611 629973 622815 636022 696509 788870 815344 733323 568033 348490 193238 328783
39100 328783 787636 1204573 1190248 836320 582744 643719 832993 911005 834063 676735
$$ packed form
39172C95200M72123Q5708l32370j72748L79448N44560J26100k64291k54107j94800
39162G84823l63315m35677j43150J78521J46028o0574p8482N7223J21478J28281
39152C35156J60656Q9740j52500k92997q6750K50596L29237J32767l8214l5529
39142F92162J4175k2574j24417j82897j03025J01685K59752K05257J6072p6038
39132G80152k3443R85p8936j38417j06391o9143o3799j6153O5730Q0447M3715
39121D74747N4407N6756n9952j42429O7097M24584M60391O4157l19260l27887
39111G52611j22638p158J3207O0487R2361K6474q2021j65290k19543j55252J35545
39100C28783M58853M16937j4325l53928k53576O0975J89274P8012p6942j57328
$$ plain form
39090 676735 545529 548801 648749 609828 310307 1763 -1021 220672 343603 315642 357629
39079 357629 506913 551455 439471 375420 434528 435739 312894 286419 501595 756317 767752
39068 767752 527953 254381 132970 210102 404695 551077 542688 463293 460752 515029 493927
39057 493927 404703 385403 460866 523349 547289 596334 627103 541228 436805 519125 713785
39046 713785 671445 266239 -187279 -362486 -322319 -310251 -337738 -205047 159164 568718
39036 568718 782506 742742 610236 586085 692866 774447 738285 679282 668914 584204 337835
39025 337835 129253 196758 422496 499606 433615 516638 790396 915784 685899 338734
39015 338734 206529 327631 560104 823670 1048327 1101426 966496 844395 912283 1098991
$$ packed form
39090F76735j31206L272R9948l8921k99521l08544k784K21693J22931k7961M1987
39079C57629J49284M4542j11984o4051N9108J211j22845k6475K15176K54722J1435
39068G67752k39799k73572j21411P7132J94593J46382q389p9395k541N4277k1102
39057D93927q9224j9300P5463O2483K3940M9045L0769q5875j04423Q2320J94660
39046G13785m2340m05206m53518j75207M0167J2068k7487J32691L64211M09554
39036E68718K13788l9764j32506k4151J06781Q1581l6162n9003j0368q4710k46369
39025C37835k08582O7505K25738P7110o5991Q3023K73758J25388k29885l47165
39015C38734j32205J21102K32473K63566K24657N3099j34930j22101O7888J86708
$$ plain form
39005 1098991 1211803 1157395 951983 667200 455468 469566 666955 845774 931173 1028231
38995 1028231 1129641 1033047 688872 376118 330131 411160 377574 299723 414235 687069
38985 687069 837955 775985 719769 832556 983504 982188 862110 774960 724221 597588 430081
38974 430081 424370 635363 814217 732166 540013 573232 848108 1032190 947919 797810
38964 797810 775159 776235 708310 763711 1068787 1323131 1186048 841817 746555 922994 968758
38953 968758 734085 519438 537757 613016 541951 397225 332476 375703 509103 683387
38943 683387 725792 552359 462266 807271 1346308 1432707 955459 544651 625393 842386
38933 842386 773738 657005 887918 1235893 1183924 791378 597416 786362 1019772 1056805
$$ packed form
39005A098991J12812n4408k05412k84783k11732J4098J97389J78819Q5399R7058
38995A028231J01410r6594l44175l12754m5987Q1029l3586p7851J14512K72834
38985F87069J50886o1970n6216J12787J50948j316j20078q7150n0739j26633j67507
38974D30081n711K10993J78854q2051j92153L3219K74876J84082q4271j50109
38964G97810k2651J076o7925N5401L05076K54344j37083l44231r5262J76439M5764
38953I68758k34673k14647J8319P5259p1065j44726o4749M3227J33400J74284
38943F83387M2405j73433r0093L45005N39037Q6399m77248m10808Q0742K16993
38933H42386o8648j16733K30913L47975n1969l92546j93962J88946K33410L7033
$$ plain form
38923 1056805 1005709 929483 706180 394090 297846 502893 703783 680506 631382 811623
38913 811623 1098633 1182230 1026054 872280 857303 868821 798840 728449 756381 775168 588394
38902 588394 240088 60679 290067 758762 1072279 1043946 798553 514657 279043 192407
38892 192407 372636 758314 1088133 1175499 1070361 900300 725059 605383 613910 692574
38882 692574 698378 665388 778337 991960 987884 696814 536824 824539 1214100 1118953 540109
38871 540109 53742 14801 176903 171690 20708 736 208513 447587 496195 390656
38861 390656 405855 707980 1057392 1036733 634021 350010 548110 950863 1065940 885386
38851 885386 770769 801200 726529 547334 614894 1011837 1303608 1164342 871242 852024
$$ packed form
38923A056805n1096p6226k23303l12090r6244K05047K00890k3277m9124J80241
38913H11623K87010Q3597j56176j53774j4977J1518o9981p0391K7932J8787j86774
38902E88394l48306j79409K29388M68695L13517k8333k45393k83896k35614q6636
38892A92407J80229L85678L29819Q7366j05138j70061j75241j19676Q527P8664
38882F92574N804l2990J12949K13623m076k91070j59990K87715L89561r5147n78844
38871E40109m86367l8941J62102n213j50982j9972K07777K39074M8608j05539
38861C90656J5199L02125L49412k0659m02712k84011J98100M02753J15077j80554
38851H85386j14617L0431p4671j79195O7560L96943K91771j39266k93100j9218
$$ plain form
38841 852024 1030569 999493 667998 355210 302654 431798 591738 758566 930639 1047202
38831 1047202 1081268 1057339 953825 753593 593922 653473 853053 905860 747582 657031
38821 657031 797145 904604 694766 358671 308195 546448 682951 553251 415843 458121
38811 458121 512169 441206 442299 696071 1005328 1086588 988590 904469 786396 521155 316065
38800 316065 470205 833644 938131 677232 436203 480293 620475 615138 532179 529872 587089
38789 587089 643338 743341 861637 830759 621263 452853 451351 447279 312799 234194 396208
38778 396208 631577 681117 614110 667348 800998 758590 514341 340113 416422 642688
38768 642688 864780 1050091 1168331 1102082 798997 413052 194796 259194 487085 648632
$$ packed form
38841H52024J78545l1076l31495l12788n2556J29144J59940J66828J72073J16563
38831A047202L4066k3929j03514k00232j59671N9551J99580N2807j58278r0551
38821F57031J40114J07459k09838l36095n0476K38253J36503j29700j37408M2278
38811D58121N4048p0963J093K53772L09257Q1260r7998q4121j18073k65241k05090
38800C16065J54140L63439J04487k60899k41029M4090J40182n337q2959k307N7217
38789E87089N6249J00003J18296l0878k09496j68410j502m072j34480p8605J62014
38778C96208K35369M9540o7007N3238J33650m2408k44249j74228P6309K26266
38768F42688K22092J85311J18240o6249l03085l85945k18256O4398K27891J61547
$$ plain form
38758 648632 637057 574873 639935 811070 901892 849594 807889 894337 1006869 988185 834916
38747 834916 644625 487050 422581 502752 643785 652518 505160 445767 656779 975784
38737 975784 1112108 1023835 898997 859258 866337 861539 835819 791074 736107 675086 549560
38726 549560 306695 80962 130273 479363 812418 874846 805922 886421 1113485 1242353
38716 1242353 1142248 911485 716317 668718 772961 872797 779948 559563 500911 682395
38706 682395 815357 700650 550619 591545 642750 461036 256069 407330 815993 1014684
38696 1014684 861500 663287 614803 573362 452589 408363 505983 570204 511918 484000 562751
38685 562751 563097 335721 17263 -153019 -71577 249697 709538 1049189 1018637 717426
$$ packed form
38758F48632j1575o2184O5062J71135R0822n2298m1705Q6448J12532j8684j53269
38747H34916j90291j57575o4469Q0171J41033Q733j47358n9393K11012L19005
38737I75784J36324q8273j24838l9739P079m798k5720m4745n4967o1021j25526
38726E49560k42865k25733M9311L49090L33055O2428o8924Q0499K27064J28868
38716A242353j00105k30763j95168m7599J04243R9836r2849k20385n8652J81484
38706F82395J32962j14707j50031M0926N1205j81714k04967J51261M08663J98691
38696A014684j53184j98213m8484m1441j20773m4226R7620O4221n8286k7918P8751
38685E62751L46k27376l18458j70282Q1442L21274M59841L39651l0552l01211
$$ plain form
38675 717426 530228 631395 811137 880772 934077 1047869 1045139 804801 553804 571944
38665 571944 788687 935911 941254 899749 793575 545040 278774 232623 409786 576730
38655 576730 632581 737318 994265 1211797 1122635 731359 314569 121797 178125 369729
38645 369729 623693 942603 1297322 1572492 1662720 1581727 1426422 1264559 1112644 988146
38635 988146 907196 853036 820327 855877 964176 1019000 902175 703730 621118 658801 623920
38624 623920 472916 443159 693658 993562 997161 751842 679168 1006556 1426988 1467602
38614 1467602 1086800 715749 697789 867705 817842 474291 192451 260347 527046 657471
38604 657471 586883 513267 533366 540359 486027 499059 652612 805624 811245 753765 825014
$$ packed form
38675G17426j87198J01167J79742O9635N3305J13792k730k40338k50997J8140
38665E71944K16743J47224N343m1505j06174k48535k66266m6151J77163J66944
38655E76730N5851J04737K56947K17532q9162l91276m16790j92772N6328J91604
38645C69729K53964L18910L54719K75170R0228q0993j55305j61863j51915j24498
38635I88146q0950n4160l2709L5550J08299N4824j16825j98445q2612L7683l4881
38624F23920j51004k9757K50499K99904L599k45319p2674L27388M20432M0614
38614A467602l80802l71051j7960J69916m9863l43551k81840O7896K66699J30425
38604F57471p0588p3616K0099O993n4332J3032J53553J53012N621n7480P1249
$$ plain form
38593 825014 1032500 1175999 1102513 873789 666072 583478 601458 642736 659891 649200 623800
38582 623800 605958 632923 718878 796210 759360 623384 585207 826722 1255631 1537291 1433293
38571 1433293 1055626 729178 631149 639864 558126 407126 397269 615938 880202 982547
38561 982547 967882 1015970 1126424 1134406 1032680 1028596 1190312 1268927 1051900 725587 654679
38550 654679 877393 1050971 909178 591721 456289 671576 1064703 1325819 1311381 1135296
38540 1135296 978155 873280 748782 618371 588318 685596 832832 995029 1168913 1218603
38530 1218603 968730 536250 306668 444315 682797 771571 846192 1100040 1359308 1340092
38520 1340092 1139001 1070015 1126343 1026904 762053 652692 798598 881649 685627 470854
$$ packed form
38593H25014K07486J43499p3486k28724k07717q2594J7980M1278J7155j0691k5400
38582F23800j7842K6965Q5955P7332l6850j35976l8177K41515M28909K81660j03998
38571A433293l77667l26448r8029Q715q1738j51000r857K18669K64264J02345
38561I82547j4665M8088J10454P982j01726m084J61716P8615k17027l26313p0908
38550F54679K22714J73578j41793l17457j35432K15287L93127K61116j4438j76085
38540A135296j57141j04875j24498j30411l0053R7278J47236J62197J73884M9690
38530A218603k49873m32480k29582J37647K38482Q8774P4621K53848K59268j9216
38520A340092k01091o8986N6328r9439k64851j09361J45906Q3051j96022k14773
$$ plain form
38510 470854 595048 998603 1318821 1371307 1277548 1180096 1054796 844307 636448 603875
38500 603875 775897 950213 910542 710376 619837 761280 944318 946720 807939 711018
38490 711018 710237 742788 796891 885344 942027 921382 914041 996120 1071229 1041016 1000885 1057479
38478 1057479 1101762 1016702 950425 1064150 1151018 899686 459936 309919 555010 796314
38468 796314 769496 683571 778475 942638 981003 935152 908563 846081 713897 666122 810131
38457 810131 998525 1050710 1003391 966589 915021 800395 697154 666165 644498 628730 772268
38446 772268 1113290 1394348 1365882 1112182 873558 708343 552262 450730 469944 497479
38436 497479 403164 313786 453189 761939 957213 960180 981227 1135916 1246431 1144074
$$ packed form
38510D70854J24194M03555L20218N2486r3759r7452j25300k10489k07859l2573
38500F03875J72022J74316l9671k00166r0539J41443J83038K402j38781r6921
38490G11018p81L2551N4103Q8453N6683k0645p341Q2079P5109l0213m0131N6594
38478A057479M4283q5060o6277J13725Q6868k51332m39750j50017K45091K41304
38468G96314k6818q5925R4904J64163L8365m5851k6589o2482j32184m7775J44009
38457H10131J88394N2185m7319l6802n1568j14626j03241l0989k1667j5768J43538
38446G72268L41022K81058k8466k53700k38624j65215j56081j01532J9214K7535
38436D97479r4315q9378J39403L08750J95274K967K1047J54689J10515j02357
$$ plain form
38426 1144074 961095 954744 1153675 1330015 1275255 994114 652705 430089 414269 553014
38416 553014 676108 633630 463421 369712 467542 605267 563298 394469 370861 548204
38406 548204 623325 389078 114937 202941 601987 892718 898564 847455 892363 858574 629059
38395 629059 445329 566125 862209 1038265 1096934 1266785 1539174 1603708 1303327 900648
38385 900648 755484 889324 1025484 985717 871292 830243 812631 692373 539701 566546
38375 566546 794014 998909 1075925 1207700 1487100 1606002 1238797 601804 253243 355964
38365 355964 516931 425692 276801 381217 669152 838033 801255 729987 747071 801662
38355 801662 820596 828058 901949 1072072 1246765 1246855 999375 692220 604376 765634 932584
$$ packed form
38426A144074j82979o351J98931J76340n4760k81141l41409k22616j5820J38745
38416E53014J23094m2478j70209r3709R7830J37725m1969j68829k3608J77343
38406E48204P5121k34247k74141Q8004L99046K90731N846n1109M4908l3789k29515
38395F29059j83730J20796K96084J76056N8669J69851K72389O4534l00381m02679
38385I00648j45164J33840J36160l9767j14425m1049j7612j20258j52672K6845
38375E66546K27468K04895P7016J31775K79400J18902l67205o36993l48561J02721
38365C55964J60967r1239j48891J04416K87935J68881l6778p1268J7084N4591
38355H01662J8934P462P3891J70123J74693R0k47480l07155q7844J61258J66950
$$ plain form
38344 932584 931022 855930 876034 1001596 1121932 1139650 1011049 785045 637301 719797 954661
38333 954661 1135178 1219214 1310339 1370601 1250056 1031370 994103 1137421 1121062 857191
38323 857191 751009 1060217 1402423 1315441 1001288 1001638 1319318 1431776 1145146 869563
38313 869563 925981 1081162 1013774 843354 868435 1044493 1076693 896867 721744 682184
38303 682184 686218 676289 763594 1001617 1216350 1214881 1054025 943212 937727 901048 775935
38292 775935 712687 834358 1003086 971343 723511 517492 555682 725914 753788 571820
38282 571820 432289 590716 929202 1035798 718696 292373 183697 367253 459079 331959
38272 331959 290330 550226 904766 1095837 1176210 1231737 1080778 638407 303965 496262
$$ packed form
38344I32584j562p5092K0104J25562J20336J7718j28601k26004j47744Q2496K34864
38333I54661J80517Q4036R1125O0262j20545k18686l7267J43318j6359k63871
38323H57191j06182L09208L42206q6982l14153L50L17680J12458k86630k75583
38313H69563N6418J55181o7388j70420K5081J76058L2200j79826j75123l9560
38303F82184M034r929Q7305K38023K14733j469j60856j10813n485l6679j25113
38292G75935o3248J21671J68728l1743k47832k06019L8190J70232K7874j81968
38282E71820j39531J58427L38486J06596l17102m26323j08676J83556R1826j27120
38272C31959m1629K59896L54540J91071Q0373N5527j50959m42371l34442J92297
$$ plain form
38262 496262 966265 1099099 826323 676057 887349 1065854 897333 654860 683375 823766
38252 823766 747975 553876 593563 881912 1086604 1055887 1005390 1132147 1304454 1259554
38242 1259554 980670 741372 771611 967382 1029520 869674 709441 714602 751848 674533
38232 674533 612411 704881 771664 625488 522670 815012 1259634 1250005 753949 419141
38222 419141 607193 927266 985028 1004325 1299030 1620114 1542901 1175027 964227 1008541
38212 1008541 1034098 929513 855283 866326 814387 655115 564610 699398 1018939 1353805
38202 1353805 1527748 1453354 1212798 994372 895513 876811 908725 985474 991328 806913 588759
38191 588759 648555 977892 1210654 1156387 1022903 986849 936980 822405 842297 1050122
$$ packed form
38262D96262M70003J32834k72776j50266K11292J78505j68521k42473K8515J40391
38252H23766p5791j94099L9687K88349K04692l0717n0497J26757J72307m4900
38242A259554k78884k39298L0239J95771O2138j59846j60233N161L7246p7315
38232F74533o2122R2470O6783j46176j02818K92342M44622r629m96056l34808
38222D19141J88052L20073N7762J9297K94705L21084p7213l67874k10800M4314
38212A008541K5557j04585p4230J1043n1939j59272r0505J34788L19541L34866
38202A353805J73943p4394k40556k18426r8859j8702L1914P6749N854j84415k18154
38191E88759N9796L29337K32762n4267j33484l6054m9869j14575J9892K07825
$$ plain form
38181 1050122 1173232 1095310 1103048 1345445 1487810 1284139 1054851 1131144 1234861 962694
38171 962694 542580 487403 742006 821367 648313 606324 808286 926480 790296 616474
38161 616474 565709 533580 469923 503344 666110 834592 977327 1142380 1216569 1048771
38151 1048771 792565 760798 952468 1087931 1088717 1129797 1221830 1156102 910532 730660 746328
38140 746328 839385 914892 976054 948435 789835 732651 1002078 1336012 1276393 938001 914924
38129 914924 1314841 1499282 1054617 467808 425754 853836 1122323 957871 684817 654092
38119 654092 828571 981160 1050774 1181073 1463375 1715972 1620408 1142459 671221 556749
38109 556749 657208 625026 501820 619818 962563 1115129 943817 847762 1127913 1518740
$$ packed form
38181A050122J23110p7922P738K42397J42365k03671k29288P6293J03717k72167
38171I62694m20114n5177K54603P9361j73054m1989K01962J18194j36184j73822
38161F16474n0765l2129o3657L3421J62766J68482J42735J65053P4189j67798
38151A048771k56206l1767J91670J35463P86M1080R2033o5728k45570j79872J5668
38140G46328R3057P5507O1162k7619j58600n7184K69427L33934n9619l38392k3077
38129I14924L99917J84441m44665n86809m2054M28082K68487j64452k73054l0725
38119F54092J74479J52589O9614J30299K82302K52597r5564m77949m71238j14472
38109E56749J00459l2182j23206J17998L42745J52566j71312r6055K80151L90827
$$ plain form
38099 1518740 1611778 1397771 1103868 805156 522163 445240 699384 1048417 1162089 1061035
38089 1061035 1001655 1031879 982206 844770 837876 1055446 1309662 1403936 1377182 1384840 1466207
38078 1466207 1528375 1493710 1379038 1243744 1115555 990461 883917 833613 834801 829131 805029
38067 805029 850938 1030266 1245216 1314853 1167977 891346 628485 500960 565274 752858
38057 752858 908553 971768 1039996 1172092 1261187 1232647 1214045 1317521 1397951 1270857 1053379
38046 1053379 1006035 1118241 1163418 1121930 1206151 1445253 1587572 1499965 1356694 1314435
38036 1314435 1277219 1127517 947360 849246 792854 732350 765889 965798 1200795 1295695
38026 1295695 1265919 1242867 1242447 1148808 898468 584552 383146 409015 618946 853312 1006300
$$ packed form
38099A518740R3038k14007k93903k98712k82993p6923K54144L49033J13672j01054
38089A061035n9380L0224m9673j37436o894K17570K54216R4274k6754P658Q1367
38078A466207O2168l4665j14672j35294j28189j25094j06544n0304J188n670k4102
38067H05029M5909J79328K14950O9637j46876k76631k62861j27525O4314J87584
38057G52858J55695O3215O8228J32096Q9095k8540j8602J03476Q0430j27094k17478
38046A053379m7344J12206M5177m1488Q4221K39102J42319q7607j43271m2259
38036A314435l7216j49702j80157r8114n6392o0504L3539J99909K34997R4900
38026A295695k9776k3052m20r3639k50340l13916k01406K5869K09931K34366J52988
$$ plain form
38015 1006300 1122225 1268301 1384494 1373903 1280577 1226986 1211049 1132114 1009847 1004654 1186748
38004 1186748 1419706 1515628 1417973 1220357 1077415 1082893 1179800 1240115 1267437 1392307 1596428
37993 1596428 1636524 1399889 1139750 1133553 1282871 1320713 1253045 1264897 1307169 1159473 869145
37982 869145 746808 885672 1026622 980387 882911 924812 1078717 1214180 1295525 1368790
37972 1368790 1480388 1641614 1768270 1706688 1459166 1274734 1317138 1379635 1196810 898687
37962 898687 811392 918549 934178 860330 1005895 1398310 1634215 1465096 1144091 1006603
37952 1006603 1034124 1029057 941828 823780 680878 555825 572218 748025 922636 981329
37942 981329 1002404 1093225 1217786 1255978 1136153 909170 779823 965619 1377421 1602837
$$ packed form
38015A006300J15925J46076J16193j0591r3326n3591j5937p8935j22267n193J82094
38004A186748K32958R5922r7655j97616j42942N478R6907O0315K7322J24870K04121
37993A596428M0096k36635k60139o197J49318L7842o7668J1852M2272j47696k90328
37982H69145j22337J38864J40950m6235r7476M1901J53905J35463Q1345P3265
37972A368790J11598J61226J26656o1582k47522j84432M2404O2497j82825k98123
37962H98687q7295J07157J5629p3848J45565L92415K35905j69119l21005j37488
37952A006603K7521n067q7229j18048j42902j25053J6393J75807J74611N8693
37942I81329K1075R0821J24561L8192j19825k26983j29347J85796M11802K25416
$$ plain form
37932 1602837 1429349 1177764 1202362 1302455 1090111 740900 778567 1190934 1423608 1299278
37922 1299278 1251596 1473252 1532407 1168805 841871 1024074 1444386 1549539 1346712 1255138
37912 1255138 1371803 1412562 1266336 1143800 1181588 1248411 1190546 1045805 968988 1057082
37902 1057082 1253286 1399349 1437195 1508755 1708877 1829438 1616861 1226268 1071352 1225422
37892 1225422 1360112 1316622 1304971 1436649 1509196 1416544 1339690 1343866 1226444 982856 970793
37881 970793 1337003 1706698 1738264 1577126 1466100 1351381 1216258 1329730 1726745 1891229
37871 1891229 1477716 954930 944767 1254802 1236597 879511 810739 1253556 1694450 1710699
37861 1710699 1530106 1533719 1663138 1621049 1369091 1141227 1103056 1203585 1313716 1389528
$$ packed form
37932A602837j73488k51585K4598J00093k12344l49211L7667M12367K32674j24330
37922A299278m7682K21656N9155l63602l26934J82203M20312J05153k02827r1574
37912A255138J16665M0759j46226j22536L7788O6823n7865j44741p6817Q8094
37902A057082J96204J46063L7846P1560K00122J20561k12577l90593j54916J54070
37892A225422J34690m3490j1651J31678P2547r2652p6854M176j17422k43588j2063
37881I70793L66210L69695L1566j61138j11026j14719j35123J13472L97015J64484
37871A891229m13513n22786j0163L10035j8205l57086o8772M42817M40894J6249
37861A710699j80593L613J29419m2089k51958k27864l8171J00529J10131P5812
$$ plain form
37851 1389528 1486501 1634777 1738470 1682279 1527205 1449727 1463402 1399035 1220397 1122103
37841 1122103 1205197 1304679 1284111 1246996 1284142 1279030 1174565 1162258 1348425 1483245 1317716
37830 1317716 1018318 919648 1044815 1177375 1246199 1322692 1369242 1305393 1225979 1263544 1318539
37819 1318539 1195466 930863 738947 707062 768637 887072 1045258 1145024 1130191 1119805
37809 1119805 1231130 1382016 1447070 1469800 1533890 1585291 1582098 1640477 1803289 1846741 1579389
37798 1579389 1179840 976645 1031158 1185424 1370179 1594545 1762072 1770318 1695500 1649711
37788 1649711 1572671 1376124 1149023 1008425 916468 855912 971409 1282470 1486271 1349330
37778 1349330 1083814 1012047 1069771 1005183 875397 934324 1161508 1307342 1311864 1302722 1277451
$$ packed form
37851A389528R6973J48276J03693n6191j55074p7478J3675o4367j78638r8294
37841A122103Q3094R9482k0568l7115L7146n112j04465j2307J86167J34820j65529
37830A317716k99398r8670J25167J32560O8824P6493M6550o3849p9414L7565N4995
37819A318539j23073k64603j91916l1885O1575J18435J58186R9766j4833j0386
37809A119805J11325J50886O5054K2730O4090N1401l193N8379J62812M3452k67352
37798A579389l99549k03195N4513J54266J84755K24366J67527Q246p4818m5789
37788A649711p7040j96547k27101j40598r1957o0556J15497L11061K03801j36941
37778A349330k65516p1767N7724o4588j29786N8927K27184J45834M522r142k5271
$$ plain form
37767 1277451 1168404 1121874 1310202 1551767 1537082 1360568 1374521 1555650 1521272 1220058
37757 1220058 1086889 1345437 1619237 1497369 1129967 954956 1071463 1192399 1098847 878318
37747 878318 734982 744676 832074 905321 964493 1069450 1219253 1328825 1354500 1366842 1447767
37736 1447767 1590113 1743573 1868146 1905712 1823114 1725885 1773749 1925510 1948693 1762344
37726 1762344 1575705 1585175 1726508 1829148 1815764 1660347 1383874 1182903 1283414 1554842
37716 1554842 1591594 1325340 1188435 1455327 1808001 1846297 1655898 1510123 1354876 1028294
37706 1028294 726646 781034 1127364 1409337 1482147 1454350 1372853 1228677 1152182 1260400
37696 1260400 1418235 1446701 1429681 1533410 1693103 1762311 1777307 1791092 1685040 1453407
$$ packed form
37767A277451j09047m6530J88328K41565j4685j76514J3953J81129l4378l01214
37757A220058j33169K58548K73800j21868l67402j75011J16507J20936r3552k20529
37747H78318j43336R694Q7398P3247N9172J04957J49803J09572K5675J2342Q0925
37736A447767J42346J53460J24573L7566q2598r7229M7864J51761K3183j86349
37726A762344j86639R470J41333J02640j3384j55417k76473k00971J00511K71428
37716A554842L6752k66254j36905K66892L52674L8296j90399j45775j55247l26582
37706A028294l01648N4388L46330K81973P2810k7797q1497j44176p6495J08218
37696A260400J57835K8466j7020J03729J59693O9208J4996J3785j06052k31633
$$ plain form
37686 1453407 1393126 1643828 1827387 1570390 1120373 983570 1193264 1418902 1564026 1729575
37676 1729575 1792774 1594787 1400673 1596891 2027525 2190498 2019743 1911126 2012521 2052093
37666 2052093 1888047 1706741 1627671 1570820 1545099 1645267 1763869 1711541 1584499 1609705
37656 1609705 1712801 1673930 1588669 1681044 1787963 1590437 1260486 1264957 1563519 1634921
37646 1634921 1329127 1078185 1188569 1499139 1808748 2077360 2150415 1874894 1550412 1648349
37636 1648349 2010086 1986100 1481792 1145841 1316391 1517432 1328490 1066203 1168762 1480500
37626 1480500 1617817 1580298 1552455 1499321 1375673 1373369 1567346 1660854 1467128 1304684
37616 1304684 1500049 1800286 1735472 1356438 1161610 1387214 1753452 1901386 1795621 1653350
$$ packed form
37686A453407o0281K50702J83559k56997m50017j36803K09694K25638J45124J65549
37676A729575O3199j97987j94114J96218M30634J62973j70755j08617J01395L9572
37666B052093j64046j81306p9070n6851k5721J00168J18602n2328j27042K5206
37656A609705J03096l8871q5261R2375J06919j97526l29951M471K98562P1402
37646A634921l05794k50942J10384L10570L09609K68612P3055k75521l24482R7937
37636A648349L61737k3986n04308l35951J70550K01041j88942k62287J02559L11738
37626A480500J37317l7519k7843n3134j23648k304J93977R3508j93726j62444
37616A304684J95365L00237o4814l79034j94828K25604L66238J47934j05765j42271
$$ plain form
37606 1653350 1634716 1659818 1531130 1254025 1112870 1269888 1447604 1307162 1008728 988912
37596 988912 1252111 1367285 1187036 1053101 1178180 1334486 1343730 1397987 1642323 1853515
37586 1853515 1812193 1654996 1602938 1637739 1667099 1730362 1847630 1922864 1931676 1936774 1857888
37575 1857888 1582004 1349541 1568583 2124360 2379789 2067717 1678229 1691012 1923744 1988648
37565 1988648 1924989 1942178 1914100 1613373 1204678 1065131 1260732 1539105 1702270 1709275
37555 1709275 1559665 1327306 1184196 1212036 1332608 1515077 1809883 2093581 2116474 1941151
37545 1941151 1953864 2247148 2398085 2123855 1752990 1705757 1870689 1895550 1800916 1872154
37535 1872154 2138956 2361664 2406597 2306593 2071634 1734406 1475444 1447651 1569720 1674342
$$ packed form
37606A653350j8634K5102j28688k77105j41155J57018J77716j40442k98434j9816
37596I88912K63199J15174j80249j33935J25079J56306R244N4257K44336K11192
37586A853515m1322j57197n2058L4801K9360O3263J17268P5234Q812N098p8886
37575A857888k75884k32463K19042N55777K55429l12072l89488J2783K32732O4904
37565A988648o3659J7189k8078l00727m08695j39547J95601K78373J63165P005
37555A709275j49610k32359j43110K7840J20572J82469K94806K83698K2893j75323
37545A941151J2713K93284J50937k74230l70865m7233J64932K4861r4634P1238
37535A872154K66802K22708M4933j00004k34959l37228k58962k7793J22069J04622
$$ plain form
37525 1674342 1720450 1713796 1628044 1567788 1755385 2155974 2386265 2231405 1982853 2001408
37515 2001408 2213311 2331101 2311907 2267585 2159910 1951874 1867312 2110995 2460976 2514005
37505 2514005 2253317 2026451 2020971 2101679 2142020 2183292 2227652 2160867 1967662 1810046 1792458
37494 1792458 1802201 1691462 1527115 1537260 1801443 2082269 2064528 1752229 1481921 1476406
37484 1476406 1565138 1498489 1347262 1340748 1464761 1537062 1575677 1737759 1949708 1969903 1808659
37473 1808659 1728210 1827578 1980864 2164720 2447935 2660974 2518487 2120385 1899985 2007830
37463 2007830 2169504 2205182 2227576 2255202 2132114 1950345 2040117 2375419 2490010 2180745
37453 2180745 1814383 1730155 1811541 1865115 1948436 2087262 2121908 2055732 2104405 2217766 2066883
$$ packed form
37525A674342M6108o654q5752o0256J87597M00589K30291j54860k48552J8555
37515B001408K11903J17790j9194m4322j07675k08036q4562K43683L49981N3029
37505B514005k60688k26866n480Q0708M0341M1272M4360o6785j93205j57616j7588
37494A792458R743j10739j64347J0145K64183K80826j7741l12299k70308n515
37484A476406Q8732o6649j51227o514J24013P2301L8615J62082K11949K0195j61244
37473A808659q0449R9368J53286J83856K83215K13039j42487l98102k20400J07845
37463B007830J61674L5678K2394K7626j23088j81769Q9772L35302J14591l09265
37453B180745l66362q4228Q1386N3574Q3321J38826L4646o6176M8673J13361j50883
$$ plain form
37442 2066883 1699076 1619885 1962347 2188591 1953379 1651496 1704935 1907156 1944475 1994832
37432 1994832 2268104 2460077 2241965 1869065 1751276 1811628 1794525 1797527 1945683 1951403
37422 1951403 1600739 1304402 1535714 2046742 2276384 2230216 2288999 2415567 2275148 1974210
37412 1974210 1960814 2250651 2395588 2205743 1931702 1745312 1580465 1489344 1643786 1949339
37402 1949339 2101117 2038440 1950589 1873138 1699611 1552714 1691840 2035221 2196544 2052672
37392 2052672 1902772 1986139 2160542 2161509 1954038 1740955 1746143 2002990 2305310 2449068
37382 2449068 2518862 2712045 2881973 2650478 2085380 1783407 2030015 2370681 2364098 2251686
37372 2251686 2410451 2626884 2516814 2283845 2393222 2760411 2932516 2878938 2928419 3054308
$$ packed form
37442B066883l67807p9191L42462K26244k35212l01883N3439K02221L7319N0357
37432A994832K73272J91973k18112l72900j17789O0352j7103L002J48156N720
37422A951403l50664k96337K31312N11028K29642m6168N8783J26568j40419l00938
37412A974210j3396K89837J44937j89845k74041j86390j64847r1121J54442L05553
37402A949339J51778o2677q7851p7451j73527j46897J39126L43381J61323j43872
37392B052672j49900Q3367J74403R67k07471k13083N188K56847L02320J43758
37382B449068O9794J93183J69928k31495n65098l01973K46608L40666o583j12412
37372B251686J58765K16433j10070k32969J09377L67189J72105n3578M9481J25889
$$ plain form
37362 3054308 2911600 2546088 2402870 2577931 2662146 2440515 2217025 2287822 2527044 2662771
37352 2662771 2630166 2521757 2446675 2505015 2684503 2789440 2680721 2511323 2494625 2566574
37342 2566574 2551633 2513165 2608300 2722991 2612228 2322649 2137627 2165024 2282636 2414323
37332 2414323 2565465 2664889 2648106 2613765 2659630 2684409 2570576 2397401 2264651 2129581
37322 2129581 2031087 2171679 2512347 2645135 2405758 2223570 2446487 2729127 2619547 2369090
37312 2369090 2513493 2940130 3084964 2883133 2794854 2949377 2979313 2758482 2647169 2849244
37302 2849244 3066278 2986741 2712055 2529639 2564165 2749612 2909452 2857344 2631080 2540101
37292 2540101 2754171 3016987 3044624 2971403 3041985 3124043 2985121 2823327 2988056 3326421
$$ packed form
37362C054308j42708l65512j43218J75061Q4215k21631k23490P0797K39222J35727
37352B662771l2605j08409p5082N8340J79488J04937j08719j69398j6698P1949
37342B566574j4941l8468R5135J14691j10763k89579j85022K7397J17612J31687
37332B414323J51142R9424j6783l4341M5865K4779j13833j73175j32750j35070
37322B129581r8494J40592L40668J32788k39377j82188K22917K82640j09580k50457
37312B369090J44403M26637J44834k01831q8279J54523K9936k20831j11313K02075
37302B849244K17034p9537k74686j82416L4526J85447J59840n2108k26264r0979
37292B540101K14070K62816K7637p3221P0582Q2058j38922j61794J64729L38365
$$ plain form
37282 3326421 3361740 3042556 2785335 2814169 2959236 3088064 3251031 3390753 3353314 3210321
37272 3210321 3182445 3252892 3216392 3063513 2960265 2921737 2860073 2849850 2981606 3083565
37262 3083565 2968567 2805994 2851969 2983295 2925289 2760927 2757338 2862416 2846852 2772629
37252 2772629 2836381 2927085 2837921 2726593 2846533 3029291 2986092 2893063 3060001 3246586
37242 3246586 3012881 2578839 2571139 3000484 3271777 3204611 3259517 3660418 4026885 4037051
37232 4037051 3816208 3525931 3169221 2923344 3065056 3433425 3541561 3333296 3243918 3406673
37222 3406673 3435544 3171097 3016589 3275121 3689990 3909573 3947317 3944787 3898035 3826173
37212 3826173 3831181 3836221 3639253 3331034 3256593 3469291 3643812 3617676 3580151 3633799 3630871
$$ packed form
37282C326421L5319l19184k57221K8834J45067J28828J62967J39722l7439j42993
37272C210321k7876P0447l6500j52879j03248l8528o1664j0223J31756J01959
37262C083565j14998j62573M5975J31326n8006j64362l589J05078j5564p4223
37252B772629O3752R0704q9164j11328J19940J82758m3199r3029J66938J86585
37242C246586k33705m34042p700M29345K71293o7166N4906M00901L66467J0166
37232D037051k20843k90277l56710k45877J41712L68369J08136k08265q9378J62755
37222C406673K8871k64447j54508K58532M14869K19583L7744k530m6752p1862
37212C826173N008N040j96968l08219p4441K12698J74521k6136l7525N3648k928
$$ plain form
37201 3630871 3567313 3684033 4021657 4287122 4309081 4239523 4178988 3994248 3649640 3357851
37191 3357851 3258682 3254461 3255628 3295180 3354645 3377923 3463562 3721042 3958082 3868556 3517756
37180 3517756 3282688 3331844 3518945 3739469 4001323 4183464 4125001 3931870 3830912 3787284
37170 3787284 3646542 3550363 3768271 4182545 4384242 4251241 4040385 3966053 4051522 4284431
37160 4284431 4546683 4547077 4212061 3940666 4058954 4285408 4215854 4032368 4146815 4423738
37150 4423738 4425028 4206806 4171759 4296260 4224578 4018534 4089959 4436021 4619897 4489335
37140 4489335 4301970 4196996 4132022 4229840 4572826 4792971 4510935 4033233 3951022 4220785
37130 4220785 4349424 4305846 4469585 4806189 4892589 4695569 4582068 4634985 4661826 4740332
$$ packed form
37201C630871o3558J16720L37624K65465K1959o9558o0535j84740l44608k91789
37191C357851r9169m221J167L9552N9465K3278Q5639K57480K37040q9526l50800
37180C517756k35068M9156J87101K20524K61854J82141n8463j93131j00958m3628
37170C787284j40742r6179K17908M14274K01697j33001k10856p4332Q5469K32909
37160D284431K62252L94l35016k71395J18288K26454o9554j83486J14447K76923
37150D423738J290k18222l5047J24501p1682k06044P1425L46062J83876j30562
37140D489335j87365j04974o4974R7818L42986K20145k82036m77702q2211K69763
37130D220785J28639m3578J63739L36604Q6400j97020j13501N2917K6841P8506
$$ plain form
37120 4740332 5033885 5258706 5091869 4860535 5008748 5195301 4871891 4437163 4703889
37111 4703889 5449264 5712789 5420585 5425963 5916136 6108962 5730321 5510692 5865969 6242655
37101 6242655 6182516 5998550 5980265 5879043 5581728 5422108 5475144 5376509 5126785 5218822
37091 5218822 5696354 5956442 5765962 5613135 5773840 5890359 5765317 5726775 5900088 5921159
37081 5921159 5669462 5537803 5725621 5971438 6148912 6408972 6640186 6543399 6279596 6259459
37071 6259459 6333319 6058190 5672161 5809812 6326926 6493848 6317119 6506472 7112067 7415650
37061 7415650 7269553 7305113 7652230 7689313 7282317 7063329 7226370 7207851 6812115 6539525
37051 6539525 6591888 6642695 6715505 7154907 7654518 7507436 6874276 6593270 6762398 6789793
$$ packed form
37120D740332K93553K24821j66837k31334J48213J86553l23410m34728K66726
37111D703889P45375K63525k92204N378M90173J92826l78641k19629L55277L76686
37101F242655o0139j83966j8285j01222k97315j59620N3036r8635k49724R2037
37091E218822M77532K60088j90480j52827J60705J16519j25042l8542J73313K1071
37081E921159k51697j31659J87818K45817J77474K60060K31214r6787k63803k0137
37071F259459P3860k75129l86029J37651N17114J66922j76729J89353O05595L03583
37061G415650j46097L5560L47117L7083m06996k18988J63041j8519l95736k72590
37051F539525N2363N0807P2810M39402M99611j47082o33160k81006J69128K7395
$$ plain form
37041 6789793 6712095 7005262 7248407 6631437 5690533 5731016 6550667 6692505 6026070 5943683
37031 5943683 6741203 7060152 6434746 6138162 6786790 7294137 7056641 7047617 7763100 8136211
37021 8136211 7577848 7156723 7627760 8132864 7977120 7891119 8404820 8738623 8437903 8368259
37011 8368259 8973579 9280138 8728622 8252807 8473892 8624770 8325214 8519518 9516752
37002 9516752 10062468 9582287 9362997 10203726 10908210 10518975 10046008 10461400 10919330
36993 10919330 10544084 10122982 10447673 10783279 10512594 10483088 11238538 11781160 11532176
36984 11532176 11546077 12336548 12633835 11846402 11499637 12522080 13403258 12910861 12339772
36975 12339772 13053253 14032190 13970949 13649647 14107082 14571212 14290894 14296175 15299160 16045228
$$ packed form
37041F789793p7698K93167K43145o16970r40904M0483Q19651J41838o66435q2387
37031E943683P97520L18949o25406k96584O48628N07347k37496r024P15483L73111
37021H136211n58363m21125M71037N05104j55744q6001N13701L33803l00720o9644
37011H368259O05320L06559n51516m75815K21085J50878k99556J94304R97234
37002I516752N45716m80181k19290Q40729P04484l89235m72967M15392M57930
36993A0919330l75246m21102L24691L35606k70685k9506P55450N42622k48984
36984A1532176J3901P90471K97287p87433l46765J022443Q81178m92397n71089
36975A2339772P13481R78937o1241l21302M57435M64130k80318N281J002985P46068
$$ plain form
36965 16045228 15737022 15733234 16837478 17478902 16713987 16286712 17413844 18402293 17921990
36956 17921990 17642796 18955005 20150584 19715401 19294824 20409675 21455127 21064719 21061422
36947 21061422 22794799 24136793 23602555 23637676 26039453 28156053 27752315 27400621 29545288
36938 29545288 31684336 31392722 31435131 34445712 37419105 37442918 37762815 41623838 45577814
36929 45577814 46175400 47410606 53299884 59357767 60781087 62323124 69327067 76489042
36921 76489042 78304287 82244880 95566833 108181142 109725425 114548704 139144991 156554062
36913 156554062 111848061 -2160484 -117519147 -163733257 -144249344 -114619733 -105630313
36906 -105630313 -102416034 -88949291 -74482805 -70393837 -70369961 -65471449 -59299070 -57236619
$$ packed form
36965A6045228l08206l788J104244O41424p64915m27275J127132R88449m80303
36956A7921990k79194J312209J195579m35183m20577J114851J045452l90408l297
36947B1061422J733377J341994n34238L5121K401777K116600m03738l51694K144667
36938B9545288K139048k91614M2409L010581K973393K3813L19897L861023L953976
36929D5577814N97586J235206N889278O057883J423320J542037P003943P161975
36921G6489042J815245L940593J3321953J2614309J544283M823279K4596287J7409071
36913A56554062m4706001j14008545j15358663m6214110J9483913K9629611Q989420
36906a05630313L214279J3466743J4466486M088968K3876M898512O172379K062451
$$ plain form
36898 -57236619 -55227925 -49021698 -43106927 -41912476 -41568059 -37827723 -33881058 -33505636
36890 -33505636 -33825003 -31256115 -28196450 -27851101 -28113931 -26111736 -23742974 -23568776 -23770783
36881 -23770783 -21952677 -19806772 -19602778 -19859553 -18581823 -17213309 -17546713 -18069685 -16975791
36872 -16975791 -15629743 -15680845 -15807050 -14528424 -13270681 -13534210 -13895032 -12818877 -11666910
36863 -11666910 -11966762 -12391118 -11357596 -10072265 -10134006 -10537545 -9834681 -8953939 -9154416
36854 -9154416 -9391900 -8377531 -7153044 -7055175 -7161182 -6251322 -5295754 -5507777 -5877851
36845 -5877851 -5113933 -4147654 -4248900 -4474124 -3480481 -2162584 -1986030 -2272915 -1603085
36836 -1603085 -461588 -93606 -84342 571935 1243468 758671 -457116 -1507821 -3103147
$$ packed form
36898e7236619K008694O206227N914771J194451L44417L740336L946665L75422
36890c3505636l19367K568888L059665L45349k62830K002195K368762J74198k02007
36881b3770783J818106K145905K03994k56775J277730J368514l33404n22972J093894
36872a6975791J346048n1102j26205J278626J257743k63529l60822J076155J151967
36863a1666910k99852m24356J033522J285331o1741m03539P02864Q80742k00477
36854i154416k37484J014369J224487R7869j06007R09860R55568k12023l70074
36845e877851P63918R66279j01246k25224R93643J317897J76554k86885O69830
36836a603085J141497L67982R264O56277O71533m84797j215787j050705j595326
$$ plain form
36827 -3103147 -6319077 -10325604 -13438438 -15477010 -17145900 -18120631 -17751269 -16738674
36819 -16738674 -16175660 -15758518 -14714683 -13570695 -13219663 -13171219 -12518152 -11733582 -11728823
36810 -11728823 -12014192 -11584510 -10796325 -10594962 -10670616 -10140164 -9322585 -9108619 -9243645
36801 -9243645 -8899617 -8297985 -8161426 -8212555 -7782206 -7240496 -7286063 -7501960 -7143511 -6635560
36791 -6635560 -6726390 -6898385 -6267633 -5385826 -5446847 -6257753 -6659206 -6473394 -6414425 -6506646
36781 -6506646 -6188236 -5627609 -5444415 -5469079 -5152735 -4764722 -4823158 -4876147 -4269710 -3528226
36771 -3528226 -3450422 -3479956 -2716996 -2021750 -3145604 -5926040 -8220889 -8731862 -8235624
36762 -8235624 -7849374 -7649226 -7348315 -7011664 -6676667 -6231975 -5882437 -5917926 -6046616 -5775127
$$ packed form
36827c103147l215930m006527l112834k038572j668890r74731L69362J012595
36819a6738674N63014M17142J043835J143988L51032M8444O53067P84570M759
36810a1728823k85369M29682P88185K01363p5654N30452Q17579K13966j35026
36801i243645L44028O01632J36559n1129M30349N41710m5567k15897L58449N07951
36791f635560r0830j71995O30752Q81807o1021q10906m01453J85812N8969r2221
36781f506646L18410N60627J83194k4664L16344L88013n8436n2989O06437P41484
36771c528226P7804k9534P62960O95246j123854k780436k294849n10973M96238
36762h235624L86250K00148L00911L36651L34997M44692L49538l5489j28690K71489
$$ plain form
36752 -5775127 -5269978 -4997368 -4828203 -4423701 -4088202 -4201047 -4263782 -3649191 -2805183 -2487322
36742 -2487322 -2377112 -1930150 -2038479 -4021604 -7152446 -9072366 -8839062 -7854647 -7485021
36733 -7485021 -7446152 -7064127 -6568676 -6360414 -6203702 -5897695 -5782538 -5955566 -5868199 -5270681
36723 -5270681 -4744170 -4757116 -4936609 -4793543 -4507830 -4492763 -4722190 -4911291 -4922628 -4712395
36713 -4712395 -4304792 -3984848 -4053100 -4304399 -4267512 -3990448 -3975631 -4278426 -4345564 -3906707
36703 -3906707 -3403779 -3329002 -3657087 -4095082 -4419779 -4447571 -4114845 -3683543 -3500042 -3563477
36693 -3563477 -3677846 -3866952 -4194877 -4394350 -4206615 -3867556 -3693122 -3471033 -2930248
36684 -2930248 -2496365 -2758931 -3419873 -3663025 -3416437 -3315754 -3507390 -3488737 -3163789 -3046374
$$ packed form
36752e775127N05149K72610J69165M04502L35499j12845o2735O14591Q44008L17861
36742b487322J10210M46962j08329j983125l130842j919920K33304R84415L69626
36733g485021L8869L82025M95451K08262J56712L06007J15157j73028Q7367N97518
36723e270681N26511j2946j79493J43066K85713J5067k29427j89101j1337K10233
36713d712395M07603L19944o8252k51299L6887K77064J4817l02795o7138M38857
36703c906707N02928P4777l28085m37995l24697k7792L32726M31302J83501o3435
36693c563477j14369j89106l27925j99473J87735L39059J74434K22089N40785
36684b930248M33883k62566o60942k43152K46588J00683j91636J8653L24948J17415
$$ plain form
36674 -3046374 -3261249 -3299087 -2989134 -2812282 -2974763 -3035527 -2779302 -2635471 -2839925 -2939873
36664 -2939873 -2584631 -2159199 -2160283 -2466045 -2651120 -2592447 -2410316 -2198217 -2096009 -2265694
36654 -2265694 -2574642 -2654962 -2418819 -2141817 -1972200 -1811106 -1728370 -1958779 -2377997 -2528930
36644 -2528930 -2314143 -2141128 -2248114 -2416834 -2476414 -2525849 -2517000 -2219399 -1787043 -1749032
36634 -1749032 -2193584 -2546059 -2424948 -2146254 -2085493 -2110829 -2000557 -1895570 -1944714 -1951383
36624 -1951383 -1749247 -1528706 -1456171 -1371101 -1178514 -1119309 -1309115 -1428073 -1237541 -1002911
36614 -1002911 -1017020 -1102551 -1016857 -969129 -1234036 -1555386 -1471387 -1031981 -676344 -534336
36604 -534336 -359072 -91887 4007 -178410 -390314 -407693 -297327 -202740 -127159 -33990
$$ packed form
36674c046374k14875l7838L09953J76852j62481o0764K56225J43831k04454r9948
36664b939873L55242M25432j084l05762j85075N8673J82131K12099J02208j69685
36654b265694l08948q0320K36143K77002J69617J61094Q2736k30409m19218j50933
36644b528930K14787J73015j06986j68720n9580m9435Q849K97601M32356L8011
36634a749032m44552l52475J21111K78694O0761k5336J10272J04987m9144o669
36624a951383K02136K20541P2535Q5070J92587N9205j89806j18958J90532K34630
36614a002911j4109q5531Q5694M7728k64907l21350Q3999M39406L55637J42008
36604e34336J75264K67185R5894j82417k11904j7379J10366R4587P5581R3169
$$ plain form
36594 -33990 57193 182126 447533 820102 1074715 1098949 1101405 1330302 1693736 1899793
36584 1899793 1932424 2100301 2556269 3070162 3429889 3764899 4231055 4683272 5004967 5450568
36574 5450568 6197948 6890605 7261928 7834813 8939594 9135093 6062136 -469368 -7379643
36565 -7379643 -11281124 -11790438 -10970907 -10317834 -9671707 -8698912 -7839063 -7474679 -7300911
36556 -7300911 -6975141 -6622020 -6360168 -6004684 -5539594 -5277396 -5275785 -5156789 -4749989 -4371033
36546 -4371033 -4228026 -4094510 -3817918 -3615694 -3591269 -3465419 -3084309 -2725086 -2606099 -2542554
36536 -2542554 -2371488 -2266046 -2325809 -2301858 -2060071 -1891202 -2001768 -2094361 -1839467 -1410313
36526 -1410313 -1152603 -1036372 -837658 -591700 -461390 -379319 -206716 -59452 -110256 -225321
$$ packed form
36594c3990R1183J24933K65407L72569K54613K4234K456K28897L63434K06057
36584A899793L2631J67877M55968N13893L59727L35010M66156M52217L21695M45601
36574E450568P47380O92657L71323N72885J104781J95499l072957o531504o910275
36565g379643l901481n09314Q19531O53073O46127R72795Q59849L64384J73768
36556g300911L25770L53121K61852L55484M65090K62198J611J18996M06800L78956
36546d371033J43007J33516K76592K02224K4425J25850L81110L59223J18987O3545
36536b542554J71066J05442n9763K3951K41787J68869j10566r2593K54894M29154
36526a410313K57710J16231J98714K45958J30310Q2071J72603J47264n0804j15065
$$ plain form
36516 -225321 -136797 159151 477717 775673 1116836 1444695 1666125 1842015 2066508 2310783
36506 2310783 2585067 3019548 3544683 3798790 3697934 3771781 4460782 5381627 5912727 6253118
36496 6253118 6984635 7490668 5856560 1056908 -5310577 -10269145 -12269847 -12157538 -11549226
36487 -11549226 -11108043 -10629378 -10027844 -9535507 -9183155 -8716742 -8074649 -7531425 -7269072
36478 -7269072 -7124053 -6887070 -6592739 -6353925 -6120032 -5792012 -5437752 -5200702 -5069796
36469 -5069796 -4906938 -4672895 -4493764 -4492382 -4620505 -4673311 -4478072 -4099253 -3808269 -3761220
36459 -3761220 -3774126 -3574997 -3217179 -3006256 -3023002 -2999437 -2739298 -2393374 -2205996 -2230807
36449 -2230807 -2398696 -2595445 -2567156 -2106599 -1542300 -1652540 -2717855 -3946580 -4301697
$$ packed form
36516b25321Q8524K95948L18566K97956L41163L27859K21430J75890K24493K44275
36506B310783K74284M34481N25135K54107j00856P3847O89001R20845N31100L40391
36496F253118P31517N06033j634108m799652o367485m958568k000702J12309O08312
36487a1549226M41183M78665O01534M92337L52352M66413O42093N43224K62353
36478g269072J45019K36983K94331K38814K33893L28020L54260K37050J30906
36469e069796J62858K34043J79131J382j28123n2806J95239L78819K90984M7049
36459c761220j2906J99129L57818K10923j6746K3565K60139L45924J87378k4811
36449b230807j67889j96749K8289M60557N64299j10240j065315j228725l55117
$$ plain form
36440 -4301697 -3742599 -3177335 -3245461 -3642587 -3736523 -3402409 -3001549 -2823905 -2855888 -2987400
36430 -2987400 -3179246 -3394424 -3531999 -3530371 -3475696 -3502003 -3585158 -3555237 -3366205 -3213774
36420 -3213774 -3257430 -3358617 -3296429 -3138285 -3127703 -3253394 -3242236 -3006551 -2786671 -2763154
36410 -2763154 -2812349 -2764908 -2650531 -2552132 -2444485 -2313764 -2236711 -2218310 -2138140 -1968761
36400 -1968761 -1871401 -1973822 -2201997 -2391209 -2421199 -2240834 -1939436 -1767825 -1872645 -2047897
36390 -2047897 -1990665 -1746289 -1621870 -1712229 -1808601 -1732450 -1484121 -1146041 -905620 -1009657
36380 -1009657 -1390520 -1568234 -1272449 -849099 -640662 -396420 145003 589831 535733 372643
36370 372643 579282 783375 561030 551423 1467324 2583263 2772567 2515446 3052338 4052580
$$ packed form
36440d301697N59098N65264o8126l97126r3936L34114M00860J77644l1983j31512
36430b987400j91846k15178j37575J628N4675k6307q3155K9921J89032J52431
36420c213774m3656j01187O2188J58144J0582j25691J1158K35685K19880K3517
36410b763154m9195M7441J14377R8399J07647J30721P7053J8401Q0170J69379
36400a968761R7360j02421k28175j89212k9990J80365L01398J71611j04820j75252
36390b047897N7232K44376J24419r0359r6372P6151K48329L38080K40421j04037
36380a009657l80863j77714K95785M23350K08437K44242N41423M44828n4098j63090
36370C72643K06639K04093k22345r607R15901J115939J89304k57121N36892J000242
$$ plain form
36360 4052580 4320867 4380617 5653072 7330607 7470609 7356485 10303892 14576420 12484969
36351 12484969 351359 -14399181 -21040006 -18190281 -13575779 -12638947 -13260349 -12049790
36343 -12049790 -9992453 -9466888 -9912638 -9515804 -8532331 -8214519 -8280449 -7780651 -7088779
36334 -7088779 -7031810 -7167977 -6665104 -5920254 -5767850 -5946362 -5735597 -5310973 -5196315 -5146064
36324 -5146064 -4774008 -4551708 -5004511 -5579939 -5444504 -4822068 -4495873 -4531259 -4482220 -4352869
36314 -4352869 -4414881 -4528308 -4476585 -4499334 -4739461 -4715903 -4116893 -3539698 -3637715 -4085722
36304 -4085722 -4194490 -4003509 -3940417 -3920110 -3632840 -3280671 -3225381 -3311322 -3249370 -3209059
36294 -3209059 -3341020 -3258115 -2743527 -2404539 -2788282 -3386244 -3409043 -3053359 -3047731 -3366031
$$ packed form
36360D052580K68287N9750J272455J677535J40002j14124K947407M272528k091451
36351A2484969j2133610j4750540o640825K849725M614502R36832o21402J210559
36343a2049790K057337N25565m45750L96834R83473L17812o5930M99798O91872
36334g088779N6969j36167N02873P44850J52404j78512K10765M24624J14658N0251
36324e146064L72056K22300m52803n75428J35435O22436L26195l5386M9039J29351
36314d352869o2012j13427N1723k2749k40127K3558N99010N77195r8017m48007
36304d085722j08768J90981O3092K0307K87270L52169N5290q5941O1952M0311
36294c209059j31961Q2905N14588L38988l83743n97962k2799L55684N628l18300
$$ plain form
36284 -3366031 -3395870 -3082662 -2927056 -3048866 -3159045 -3284914 -3649922 -3980080 -3786776 -3247022
36274 -3247022 -2997851 -3127286 -3143113 -2895391 -2767057 -2926253 -3082590 -3052422 -2974408 -2910819
36264 -2910819 -2757005 -2583327 -2607296 -2802462 -2909326 -2806755 -2575453 -2315180 -2167078 -2303225
36254 -2303225 -2628730 -2787552 -2717366 -2781975 -3059807 -3064380 -2613131 -2348824 -2771928 -3334472
36244 -3334472 -3255074 -2743440 -2571409 -2819054 -2945378 -2830245 -2835439 -2981447 -2925955 -2695740
36234 -2695740 -2659135 -2807178 -2774471 -2537375 -2428029 -2502204 -2511672 -2423952 -2380165 -2277412 -2000363
36223 -2000363 -1876813 -2237370 -2719818 -2728756 -2397597 -2325568 -2535288 -2535537 -2303752 -2304077 -2544705
36212 -2544705 -2523169 -2182829 -2046762 -2265830 -2384390 -2240968 -2269586 -2639081 -2867227 -2622201
$$ packed form
36284c366031k9839L13208J55606j21810j10179j25869l65008l30158J93304N39754
36274c247022K49171j29435j5827K47722J28334j59196j56337L0168P8014O3589
36264b910819J53814J73678k3969j95166j06864J02571K31302K60273J48102j36147
36254b303225l25505j58822P0186o4609k77832m573M51249K64307m23104n62544
36244c334472P9398N11634J72031k47645j26324J15133n194j46008N5492K30215
36234b695740L6605j48043L2707K37096J09346p4175r468Q7720M3787J02753K77049
36223b000363J23550l60557m82448q938L31159P2029k09720k49K31785l25k40628
36212b544705K1536L40340J36067k19068j18560J43422k8618l69495k28146K45026
$$ plain form
36202 -2622201 -2235524 -2091879 -2113338 -2149585 -2301404 -2555296 -2635149 -2501625 -2488719 -2690897
36192 -2690897 -2741025 -2465115 -2229833 -2332757 -2536593 -2530328 -2405012 -2349188 -2282372 -2109833
36182 -2109833 -1974308 -1963974 -1917323 -1774288 -1753882 -1918191 -1945234 -1657984 -1433599 -1710371
36172 -1710371 -2334797 -2768431 -2795146 -2700242 -2807275 -3077092 -3183298 -2891388 -2350111 -1958847
36162 -1958847 -1885517 -1861197 -1616167 -1312981 -1248342 -1330321 -1286982 -1261333 -1663390 -2426759
36152 -2426759 -2945818 -2866742 -2481616 -2207219 -2111995 -2119209 -2256575 -2484570 -2608281 -2556267
36142 -2556267 -2481146 -2464251 -2405427 -2294830 -2280101 -2369560 -2383057 -2282385 -2231895 -2264734 -2231335
36131 -2231335 -2139153 -2168673 -2284349 -2240402 -2063529 -2076895 -2298199 -2292142 -1860189 -1433925
$$ packed form
36202b622201L86677J43645k1459l6247j51819k53892p9853J33524J2906k02178
36192b690897n0128K75910K35282j02924k03836O265J25316N5824O6816J72539
36182b109833J35525J0334M6651J43035K0406j64309k7043K87250K24385k76772
36172a710371o24426m33634k6715R4904j07033k69817j06206K91910N41277L91264
36162a958847P3330K4320K45030L03186O4639q1979M3339K5649m02057p63369
36152b426759n19059P9076L85126K74397R5224p214j37366k27995j23711N2014
36142b556267P5121J6895N8824J10597J4729q9459j3497J00672N0490l2839L3399
36131b231335R2182k9520j15676M3947J76873j3366k21304O057M31953M26264
$$ plain form
36121 -1433925 -1466237 -1791587 -1933861 -1773304 -1570916 -1526709 -1613106 -1721280 -1756379 -1695003
36111 -1695003 -1671631 -1846921 -2101555 -2089938 -1720511 -1344604 -1321239 -1611713 -1936796 -2105780
36101 -2105780 -2055436 -1806898 -1544416 -1514488 -1692938 -1768954 -1598077 -1425048 -1491140 -1677549
36091 -1677549 -1756856 -1771249 -1899077 -2105989 -2195780 -2122598 -2025502 -1993558 -1974138 -1896617 -1759179
36080 -1759179 -1601896 -1471143 -1392109 -1340881 -1286776 -1275400 -1399007 -1665950 -1964498 -2162993
36070 -2162993 -2196185 -2089436 -1969217 -1987936 -2137720 -2206037 -2034975 -1753378 -1615186 -1672573
36060 -1672573 -1752596 -1703916 -1537015 -1375346 -1369413 -1573507 -1821002 -1850058 -1637419 -1434062
36050 -1434062 -1389837 -1391156 -1378692 -1488519 -1685477 -1647855 -1318191 -1165314 -1485613 -1826798
$$ packed form
36121a433925l2312l25350j42274J60557K02388M4207q6397j08174l5099O1376
36111a695003K3372j75290k54634J1617L69427L75907K3365k90474l25083j68984
36101b105780N0344K48538K62482K9928j78450p6016J70877J73029o6092j86409
36091a677549p9307j4393j27828k06912q9791P3182R7096L1944J9420P7521J37438
36080a759179J57283J30753P9034N1228N4105J1376j23607k66943k98548j98495
36070b162993l3192J06749J20219j8719j49784o8317J71062K81597J38192n7387
36060a672573q0023M8680J66901J61669N933k04094k47495k9056K12639K03357
36050a434062M4225j319J2464j09827j96958L7622L29664J52877l20299l41185
$$ plain form
36040 -1826798 -1630948 -1129302 -983995 -1266132 -1450350 -1302065 -1105619 -1045808 -1001147 -975675
36030 -975675 -1133702 -1350699 -1301131 -1053886 -1017692 -1235056 -1320129 -1189942 -1238600 -1618499
36020 -1618499 -1948413 -1968320 -1936887 -2112263 -2329440 -2371919 -2328410 -2314502 -2230946 -2034668
36010 -2034668 -1886704 -1842224 -1764539 -1691569 -1862262 -2219017 -2340758 -2068638 -1752369 -1674035
36000 -1674035 -1682626 -1606725 -1547812 -1527712 -1342841 -1041016 -1031638 -1399189 -1621242 -1358217 -1031732
35989 -1031732 -1158919 -1554808 -1722473 -1676628 -1804075 -2133078 -2293607 -2101204 -1731642 -1382139
35979 -1382139 -1127581 -1051038 -1197716 -1436961 -1599275 -1676713 -1721358 -1698749 -1626296 -1674232
35969 -1674232 -1916446 -2147348 -2148903 -1981716 -1836364 -1772331 -1768486 -1835654 -1910007 -1834200 -1607984
$$ packed form
36040a826798J95850N01646J45307k82137j84218J48285J96446N9811M4661K5472
36030i75675j58027k16997M9568K47245L6194k17364q5073J30187m8658l79899
36020a618499l29914j9907L1433j75376k17177m2479M3509J3908Q3556J96278
36010b034668J47964M4480P7685P2970j70693l56755j21741K72120L16269P8334
36000a674035q591P5901N8913K0100J84871L01825R378l67551k22053K63025L26485
35989a031732j27187l95889j67665M5845j27447l29003j60529J92403L69562L49503
35979a382139K54558P6543j46678k39245j62314p7438m4645K2609P2453m7936
35969a674232k42214k30902j555J67187J45352O4033L845o7168p4353P5807K26216
$$ plain form
35958 -1607984 -1457730 -1514471 -1643049 -1716379 -1793352 -1875436 -1779773 -1453552 -1150944 -1090093
35948 -1090093 -1165350 -1177105 -1110047 -1023398 -914671 -842862 -931294 -1122899 -1212757 -1218861 -1378775
35937 -1378775 -1676285 -1779939 -1601898 -1476742 -1588928 -1686712 -1607550 -1596147 -1781020 -1818032
35927 -1818032 -1451646 -1001433 -864121 -924529 -906032 -926276 -1204108 -1536731 -1601326 -1532910
35917 -1532910 -1676595 -1944746 -1931283 -1564894 -1201463 -1117018 -1256569 -1423327 -1449437 -1285840
35907 -1285840 -1121560 -1219810 -1468507 -1414407 -965961 -649034 -835505 -1164228 -1173425 -1073031
35897 -1073031 -1316198 -1750772 -1845401 -1545091 -1278384 -1254929 -1335932 -1478359 -1726702 -1849282
35887 -1849282 -1560607 -1075029 -905143 -1123843 -1326368 -1301570 -1234732 -1245553 -1227208 -1181001
$$ packed form
35958a607984J50254n6741j28578p3330p6973q2084R5663L26221L02608O0851
35948a090093p5257j1755O7058Q6649J08727P1809q8432j91605q9858o104j59914
35937a378775k97510j03654J78041J25156j12186r7784P9162J1403j84873l7012
35927a818032L66386M50213J37312o0408J8497k0244k77832l32623o4595O8416
35917a532910j43685k68151J3463L66389L63431Q4445j39551j66758k6110J63597
35907a285840J64280r8250k48697N4100M48446L16927j86471l28723r197J00394
35897a073031k43167m34574r4629L00310K66707K3455q1003j42427k48343j22580
35887a849282K88675M85578J69886k18700k02525K4798O6838j0821J8345M6207
$$ plain form
35877 -1181001 -1249614 -1378181 -1366903 -1269922 -1311255 -1412616 -1270789 -921054 -740416 -837679
35867 -837679 -928706 -913003 -1078841 -1552815 -1974263 -1954605 -1555431 -1125213 -916797 -1000384
35857 -1000384 -1306862 -1626810 -1755551 -1708095 -1637422 -1584333 -1523220 -1555601 -1754001 -1903040
35847 -1903040 -1754778 -1472455 -1420842 -1568127 -1553283 -1343730 -1315580 -1586672 -1775902 -1615664
35837 -1615664 -1353494 -1294337 -1323699 -1178203 -906966 -774456 -881280 -1096279 -1237550 -1198284
35827 -1198284 -1029283 -945152 -1070521 -1189501 -1012718 -684356 -660538 -1012468 -1250995 -1022865
35817 -1022865 -622641 -563989 -920304 -1348183 -1550555 -1478395 -1250678 -1094091 -1219102 -1570299
35807 -1570299 -1825613 -1781256 -1586564 -1476512 -1463693 -1449311 -1442516 -1471243 -1430965 -1230922 -988590
$$ packed form
35877a181001o8613j28567J1278R6981m1333j01361J41827L49735J80638r7263
35867h37679r1027J5703j65838m73974m21448J9658L99174M30218K08416q3587
35857a000384l06478l19948j28741M7456P0673N3089O1113l2381j98400j49039
35847a903040J48262K82323N1613j47285J4844K09553K8150k71092j89230J60238
35837a615664K62170N9157k9362J45496K71237J32510j06824k14999j41271L9266
35827a198284J69001Q4131j25369j18980J76783L28362K3818l51930k38527K28130
35817a022865M00224N8652l56315m27879k02372P2160K27717J56587j25011l51197
35807a570299k55314M4357J94692J10052J2819J4382O795k8727M0278K00043K42332
$$ plain form
35796 -988590 -904893 -1026315 -1253381 -1473405 -1569618 -1443843 -1179204 -1046315 -1185280 -1399215
35786 -1399215 -1420461 -1254483 -1084791 -972176 -870392 -832160 -934363 -1049147 -969882 -772506
35776 -772506 -767688 -1027022 -1241194 -1186375 -1054280 -1089013 -1142064 -937915 -635141 -680024 -1094658
35765 -1094658 -1376528 -1255922 -1089253 -1203870 -1299299 -984641 -566411 -646836 -1094800 -1160831
35755 -1160831 -676795 -387155 -810328 -1455681 -1625710 -1428227 -1404726 -1570974 -1506876 -1181873
35745 -1181873 -1017250 -1167176 -1318978 -1259795 -1152127 -1154170 -1185327 -1180473 -1214177 -1255382 -1127014
35734 -1127014 -841382 -684300 -816111 -1030839 -1064485 -948376 -905452 -1032568 -1212785 -1261603
35724 -1261603 -1089956 -786759 -563970 -559886 -710444 -867163 -970924 -1026109 -1005140 -904450
$$ packed form
35796i88590Q3697j21422k27066k20024r6213J25775K64639J32889j38965k13935
35786a399215k1246J65978J69692J12615J01784L8232j02203j14784P9265J97376
35776g72506M818k59334k14172N4819J32095l4733n3051K04149L02774m4883m14634
35765a094658k81870J20606J66669j14617r5429L14658M18230q0425m47964o6031
35755a160831M84036K89640m23173o45353j70029J97483K3501j66248O4098L25003
35745a181873J64623j49926j51802N9183J07668k043l1157M854l3704m1205J28368
35734a127014K85632J57082j31811k14728l3646J16109M2924j27116j80217m8818
35724a261603J71647L03197K22789M084j50558j56719j03761n5185K0969J00690
$$ plain form
35714 -904450 -805877 -761033 -714598 -649120 -659220 -757211 -798435 -767780 -909242 -1328902 -1699866
35703 -1699866 -1681043 -1443537 -1419527 -1660946 -1824278 -1707887 -1434274 -1152011 -915710 -828429
35693 -828429 -955602 -1116090 -1082856 -954962 -1001511 -1195523 -1276422 -1234135 -1319039 -1565192
35683 -1565192 -1723594 -1717196 -1748285 -1873077 -1880045 -1712300 -1615819 -1703622 -1734356 -1523488 -1264267
35672 -1264267 -1225495 -1377890 -1512953 -1524255 -1411589 -1201934 -1006282 -974184 -1078454 -1121913
35662 -1121913 -1040163 -995345 -1081886 -1153815 -1059701 -865742 -734137 -730542 -831854 -978945 -1062374
35651 -1062374 -999387 -871985 -862968 -1039062 -1304864 -1523370 -1552398 -1273165 -782811 -439262
35641 -439262 -467240 -640326 -636108 -559190 -739166 -1118629 -1286315 -1101888 -855944 -781974
$$ packed form
35714i04450R8573M4844M6435O5478j0100r7991m1224L0655j41462m19660l70964
35703a699866J8823K37506K4010k41419j63332J16391K73613K82263K36301Q7281
35693h28429j27173j60488L3234J27894m6549j94012q0899M2287q4904k46153
35683a565192j58402O398l1089j24792o968J67745R6481q7803l0734K10868K59221
35672a264267L8772j52395j35063j1302J12666K09655J95652L2098j04270m3459
35662a121913Q1750M4818q6541p1929R4114J93959J31605L595j01312j47091q3429
35651a062374O2987J27402R017j76094k65802k18506k9028K79233M90354L43549
35641d39262k7978j73086M218P6918j79976l79463j67686J84427K45944P3970
$$ plain form
35631 -781974 -822309 -917269 -1105641 -1273133 -1220091 -1063956 -1157688 -1509520 -1705233 -1524022
35621 -1524022 -1206954 -985672 -796940 -638804 -739684 -1110553 -1342119 -1156218 -828113
35612 -828113 -762923 -931842 -1012659 -866284 -633036 -536581 -748395 -1243837 -1697377 -1774871
35602 -1774871 -1590174 -1550448 -1704827 -1673382 -1328189 -1049561 -1091469 -1180192 -1041079 -873200
35592 -873200 -941272 -1087600 -1040031 -884075 -854796 -939182 -1022725 -1147221 -1302133 -1272405 -1036433
35581 -1036433 -982142 -1331065 -1667457 -1493612 -980247 -674249 -678155 -644646 -453710 -363704
35571 -363704 -504466 -674961 -693464 -603512 -499700 -433094 -493188 -725869 -974310 -1024994
35561 -1024994 -894170 -784110 -803945 -896831 -963262 -910244 -695996 -463267 -464420 -707727
$$ packed form
35631g81974m0335r4960j88372j67492N3042J56135r3732l51832j95713J81211
35621a524022L17068K21282J88732J58136j00880l70869k31566J85901L28105
35612h28113O5190j68919q0817J46375K33248R6455k11814m95442m53540p7494
35602a774871J84697L9726j54379L1445L45193K78628m1908q8723J39113J67879
35592h73200o8072j46328M7569J55956K9279q4386q3543j24496j54912K9728K35972
35581a036433N4291l48923l36392J73845N13365L05998l906L3509J90936R0006
35571c63704j40762j70495j8503Q9952J03812O6606o0094k32681k48441n0684
35561a024994J30824J10060j9835r2886o6431N3018K14248K32729j153k43307
$$ plain form
35551 -707727 -886643 -831776 -779804 -963119 -1193707 -1151187 -869315 -631286 -567070 -639650
35541 -639650 -827521 -1019472 -941336 -522617 -142215 -166578 -434974 -560324 -534641 -618662
35531 -618662 -802322 -845514 -768245 -838443 -1086489 -1244592 -1188603 -1081125 -1051625 -1052368 -1048690
35520 -1048690 -1067637 -1057058 -952302 -851759 -881895 -957195 -929383 -875170 -952018 -1079396 -1074844
35509 -1074844 -992949 -992384 -986408 -810323 -639868 -809988 -1243622 -1484577 -1324140 -1009793
35499 -1009793 -798062 -677292 -592463 -586450 -626543 -591267 -505772 -532870 -698848 -878674 -1040402
35488 -1040402 -1229098 -1343593 -1242124 -1045353 -1009693 -1119357 -1132601 -999971 -885691 -817622
35478 -817622 -710718 -707250 -1048389 -1582465 -1847975 -1707407 -1469589 -1331824 -1170754 -970420
$$ packed form
35551g07727j78916N4867N1972j83315k30588M2520K81872K38029O4216p2580
35541f39650j87871j91951P8136M18719L80402k4363k68396j25350K5683q4021
35531f18662j83660m3192P7269p0198k48046j58103N5989J07478K9500p43L678
35520a048690j8947J0579J04756J00543l0136p5300K7812N4213p6848j27378M552
35509a074844Q1895N65N976J76085J70455j70120m33634k40955J60437L14347
35499a009793K11731J20770Q4829O013m0093L5276Q5495k7098j65978j79826j61728
35488a040402j88696j14495J01469J96771L5660j09664j3244J32630J14280O8069
35478h17622J06904L468l41139n34076k65510J40568K37818J37765J61070K00334
$$ plain form
35468 -970420 -947620 -1090564 -1064406 -783202 -606811 -732011 -850510 -697298 -502146 -566811
35458 -566811 -782815 -911436 -984292 -1076100 -1023274 -741000 -506117 -550090 -676660 -661256
35448 -661256 -688642 -943259 -1107907 -838118 -471460 -605248 -1102056 -1218461 -743159 -312096
35438 -312096 -412835 -708502 -679751 -430362 -421003 -733139 -1043939 -1159974 -1181584 -1203715
35428 -1203715 -1177052 -1070624 -941218 -827104 -735119 -714155 -786690 -837703 -739711 -575155
35418 -575155 -562260 -747548 -938788 -978460 -923516 -895307 -905531 -921305 -967791 -1047836 -1060070
35407 -1060070 -921764 -705385 -548238 -495723 -528549 -648277 -811908 -883585 -806177 -723287
35397 -723287 -751312 -738608 -490447 -151288 -70385 -311488 -599047 -752490 -839479 -863798
$$ packed form
35468i70420K2800j42944K6158K81204J76391j25200j18499J53212J95152o4665
35458e66811k16004j28621p2856r1808N2826K82274K34883m3973j26570J5404
35448f61256k7386k54617j64648K69789L66658j33788m96808j16405M75302M31063
35438c12096j00739k95667K8751K49389R359l12136l10800j16035k1610k2131
35428a203715K6663J06428J29406J14114R1985K0964p2535n1013R7992J64556
35418e75155J2895j85288j91240l9672N4944K8209j0224j5774m6486q0045j2234
35407a060070J38306K16379J57147N2515l2826j19728j63631p1677P7408Q2890
35397g23287k8025J2704K48161L39159Q0903k41103k87559j53443q6989k4319
$$ plain form
35387 -863798 -689444 -399094 -343790 -637212 -945796 -999243 -953405 -983212 -897412 -527592
35377 -527592 -165214 -163794 -361765 -374158 -249657 -324634 -575826 -675665 -625497 -760205 -1097197
35366 -1097197 -1243315 -1059689 -884654 -906955 -814079 -349006 176795 253256 -201080 -836240
35356 -836240 -1276122 -1325591 -1009362 -621942 -535979 -759937 -875700 -598920 -194411 -117311
35346 -117311 -419175 -751239 -838722 -724420 -604689 -611042 -737581 -874169 -926860 -931875 -974233
35335 -974233 -1001276 -871458 -611412 -438281 -464790 -561827 -587357 -576672 -626895 -758691 -960135
35324 -960135 -1200493 -1355066 -1310034 -1178713 -1182957 -1278196 -1176387 -818044 -501894 -410085
35314 -410085 -340477 -115395 71635 -6760 -218045 -342598 -495478 -888095 -1334006 -1415729
$$ packed form
35387h63798J74354K90350N5304k93422l08584n3447M5838k9807Q5800L69820
35377e27592L62378J420j97971j2393J24501p4977k51192r9839N0168j34708l36992
35366a097197j46118J83626J75035k2301R2876M65073N25801P6461m54336o35160
35356h36240m39882m9469L16229L87420Q5963k23958j15763K76780M04509P7100
35346a17311l01864l32064q7483J14302J19731o353j26539j36588n2691n015m2358
35335i74233k7043J29818K60046J73131k6509r7037k5530J0685n0223j31796k01444
35324i60135k40358j54573M5032J31321m244r5239J01809L58343L16150R1809
35314d10085O9608K25082J87030p8395k11285j24553j52880l92617m45911q1723
$$ plain form
35304 -1415729 -1094917 -771336 -712958 -766181 -702552 -555741 -488486 -546891 -687375 -891646
35294 -891646 -1119027 -1249197 -1201965 -1062008 -976882 -949220 -831701 -561867 -317325 -331255
35284 -331255 -570944 -743745 -682869 -573769 -660490 -870445 -945858 -848104 -763654 -757618 -726750
35273 -726750 -701681 -858500 -1147794 -1243854 -1014277 -748777 -740264 -898958 -978410 -943002 -899180
35262 -899180 -881059 -916928 -1093491 -1334623 -1340812 -999731 -642495 -611441 -772747 -770579 -586318
35251 -586318 -488183 -548698 -588070 -541268 -522694 -534260 -442992 -280190 -265140 -470018 -702892
35240 -702892 -777026 -696666 -557557 -461173 -525871 -774953 -1019337 -1058757 -972699 -981706 -1067606
35229 -1067606 -1026498 -884641 -910927 -1150609 -1303741 -1206607 -1089925 -1145438 -1156121 -867806
$$ packed form
35304a415729L20812L23581N8378n3223O3629J46811O7255n8405j40484k04271
35294h91646k27381j30170M7232J39957Q5126K7662J17519K69834K44542j3930
35284c31255k39689j72801O0876J09100q6721k09955p5413R7754Q4450O036L0868
35273g26750K5069j56819k89294r6060K29577K65500Q513j58694p9452L5408M3822
35262h99180J8121l5869j76563k41132o189L41081L57236L1054j61306K168J84261
35251e86318R8135o0515l9372M6802J8574j1566R1268J62802J5050k04878k32874
35240g02892p4134Q0360J39109R6384o4698k49082k44384l9420Q6058r007q5900
35229a067606M1108J41857k6286k39682j53132R7134J16682n5513j0683K88315
$$ plain form
35219 -867806 -489287 -439803 -712928 -885771 -761275 -619661 -712524 -844858 -703011 -366635
35209 -366635 -178482 -215485 -234432 -141318 -146823 -329280 -404327 -202092 -75727 -427583 -1002466
35198 -1002466 -1141751 -720053 -326875 -403509 -679207 -696251 -469818 -302845 -292121 -391836
35188 -391836 -688198 -1193613 -1563897 -1445664 -988220 -629464 -492413 -388408 -295411 -362260
35178 -362260 -482304 -364835 -87682 -97553 -522315 -924729 -947235 -814574 -928055 -1264822
35168 -1264822 -1478298 -1394973 -1143817 -921543 -838818 -898470 -970534 -886259 -661254 -498148
35158 -498148 -487917 -483389 -369621 -261207 -292173 -397418 -463258 -527433 -664971 -829611 -967801
35147 -967801 -1130806 -1307429 -1318043 -1075604 -794444 -714284 -753944 -686725 -543079 -550941 -727409
$$ packed form
35219h67806L78519M9484k73125j72843J24496J41614r2863j32334J41847L36376
35209c66635J88153l7003j8947R3114n505j82457p5047K02235J26365l51856n74883
35198a002466j39285M21698L93178p6634k75698j7044K26433J66973J0724r9715
35188c91836k96362n05415l70284J18233M57444L58756J37051J04005R2997o6849
35178c62260j20044J17469K77153r871m24762m02414k2506J32661j13481l36767
35168a264822k13476Q3325K51156K22274Q2725n9652p2064Q4275K25005J63106
35158d98148J0231M528J13768J08414l0966j05245o5840o4175j37538j64640j38190
35147i67801j63005j76623j0614K42439K81160Q0160l9660O7219J43646p862j76468
$$ plain form
35136 -727409 -822650 -699334 -529816 -547265 -764082 -991221 -1026582 -821257 -565688 -568474
35126 -568474 -906781 -1249341 -1209049 -832936 -527089 -511696 -610652 -626675 -637986 -769585
35116 -769585 -902366 -834361 -599183 -407960 -352757 -371956 -458568 -674732 -940980 -1030766
35106 -1030766 -872404 -692133 -716928 -847021 -802228 -550671 -384832 -507233 -713939 -648908
35096 -648908 -293285 -13008 -103212 -447119 -699343 -677303 -464058 -232105 -118876 -214191
35086 -214191 -484323 -703369 -643754 -395359 -328767 -636531 -1056838 -1201758 -1042698 -872782
35076 -872782 -855123 -850702 -715937 -534288 -447986 -445987 -459246 -519547 -659337 -766967 -726136
35065 -726136 -622552 -618845 -675751 -610035 -418398 -324604 -467317 -736295 -970474 -1129548
$$ packed form
35136g27409r5241J23316J69518j7449k16817k27139l5361K05325K55569k786
35126e68474l38307l42560M0292L76113L05847J5393r8956j6023j1311j31599
35116g69585j32781O8005K35178J91223N5203j9199q6612k16164k66248q9786
35106a030766J58362J80271k4795j30093M4793K51557J65839j22401k06706O5031
35096f48908L55623K80277r0204l43907k52224K2040K13245K31953J13229r5315
35086b14191k70132k19046N9615K48395O6592l07764m20307j44920J59060J69916
35076h72782J7659M421J34765J81649Q6302J999j3259o0301j39790j07630M0831
35065g26136J03584L707n6906O5716J91637R3794j42713k68978k34179j59074
$$ plain form
35055 -1129548 -1203369 -1145602 -993423 -875436 -802846 -642622 -410020 -360823 -609170 -866620
35045 -866620 -812781 -563829 -486783 -663151 -853833 -938253 -1042595 -1197932 -1194699 -903216
35035 -903216 -511850 -315007 -409274 -666147 -856766 -775003 -428493 -149556 -300161 -798306
35025 -798306 -1163758 -1122378 -909332 -828021 -781347 -500329 -54330 176178 -15072 -445130
35015 -445130 -805058 -952031 -934670 -876806 -857945 -830290 -682168 -441199 -318042 -440587
35005 -440587 -646687 -686961 -552264 -440968 -466766 -565902 -648383 -683476 -678638 -717980 -944830
34994 -944830 -1327572 -1535041 -1292430 -813814 -596866 -779184 -998687 -957237 -804728 -807950
34984 -807950 -922951 -936534 -835260 -767253 -749020 -662068 -492912 -364261 -347600 -417939 -565317
$$ packed form
35055a129548p3821N7767J52179J17987P2590J60224K32602M9197k48347k57450
35045h66620N3839K48952P7046j76368j90682q4420j04342j55337L233K91483
35035i03216L91366J96843r4267k56873j90619Q1763L46510K78937j50605m98145
35025g98306l65452M1380K13046Q1311M6674K81018M45999K30508j91250m30058
35015d45130l59928j46973J7361N7864J8861K7655J48122K40969J23157j22545
35005d40587k06100m0274J34697J11296k5798r9136q2481l5093M838l9342k26850
34994i44830l82742k07469K42611M78616K16948j82318k19503M1450J52509l222
34984h07950j15001j3583J01274O8007J8233Q6952J69156J28651J6661p0339j47378
$$ plain form
34973 -565317 -773017 -903353 -802279 -550639 -437260 -611724 -895263 -1015567 -925881 -797154
34963 -797154 -757485 -744867 -626988 -406940 -253129 -298590 -451651 -501008 -418174 -416593 -625355
34952 -625355 -849744 -827086 -620273 -529764 -646996 -745409 -655028 -501384 -465105 -512447 -516190
34941 -516190 -484587 -501433 -553481 -581494 -614912 -700259 -771710 -748243 -694551 -727216 -814037
34930 -814037 -828086 -761765 -724802 -755681 -792091 -805328 -806309 -747343 -597086 -493491 -614054
34919 -614054 -876258 -981296 -812188 -586662 -531786 -596628 -599970 -501310 -398914 -384103 -504331
34908 -504331 -747439 -964294 -945523 -691915 -472652 -481728 -570564 -485414 -260318 -180482 -398474
34897 -398474 -747029 -927607 -793629 -479738 -303841 -459949 -766107 -856722 -676878 -562534
$$ packed form
34973e65317k07700j30336J01074K51640J13379j74464k83539j20304Q9686J28727
34963g97154L9669J2618J17879K20048J53811m5461j53061m9357Q2834J581k08762
34952f25355k24389K2658K06813R0509j17232r8413R0381J53644L6279m7342l743
34941e16190L1603j6846n2048k8013l3418q5347p1451K3467N3692l2665q6821
34930h14037j4049O6321L6963l0879l6410j3237r81N8966J50257J03595j20563
34919f14054k62204j05038J69108K25526N4876o4842l342R8660J02396J4811j20228
34908e04331k43108k16855J8771K53608K19263r076q8836Q5150K25096P9836k17992
34897c98474l48555j80578J33978L13891J75897j56108l06158r0615J79844J14344
$$ plain form
34887 -562534 -702654 -801972 -545196 -154597 -101489 -398711 -613942 -558231 -508901 -656877
34877 -656877 -760868 -571452 -278871 -260258 -564038 -884570 -945836 -741036 -475529 -387343
34867 -387343 -535370 -699158 -613858 -342480 -224386 -396189 -613692 -668413 -696017 -854200
34857 -854200 -957517 -750419 -375807 -221533 -366622 -504426 -414833 -227433 -174770 -318685
34847 -318685 -568967 -772741 -751413 -455946 -138344 -164768 -570549 -972101 -1017715 -775329
34837 -775329 -563656 -533497 -566101 -520993 -435725 -452589 -610447 -756034 -688596 -394252 -82360
34826 -82360 42762 -29381 -207477 -456707 -734731 -883773 -792698 -612665 -586578 -684698
34816 -684698 -662214 -497125 -473961 -718740 -931731 -787137 -389914 -98808 -47290 -97971
$$ packed form
34887e62534j40120r9318K56776L90599N3108k97222k15231N5711M9330j47976
34877f56877j03991J89416K92581J8613l03780l20532o1266K04800K65507Q8186
34867c87343j48027j63788Q5300K71378J18094j71803k17503n4721k7604j58183
34857h54200j03317K07098L74612J54274j45089j37804Q9593J87400N2663j43915
34847c18685k50282k03774K1328K95467L17602k6424m05781m01552m5614K42386
34837g75329K11673L0159l2604M5108Q5268j6864j57858j45587O7438K94344L11892
34826h2360J25122p2143j78096k49230k78024j49042R1075J80033K6087r8120
34816f84698K2484J65089K3164k44779k12991J44594L97223K91106N1518n0681
$$ plain form
34806 -97971 -173356 -345507 -602780 -779606 -777483 -672578 -545735 -370518 -148396 -11319
34796 -11319 -73350 -257066 -367383 -305137 -149908 -69165 -194043 -539804 -976930 -1285874
34786 -1285874 -1300517 -1039202 -702556 -525816 -592575 -765792 -828194 -724354 -631414 -735952
34776 -735952 -971153 -1061218 -831953 -396884 -16732 140916 67931 -154050 -396637 -523255
34766 -523255 -503124 -469044 -550629 -653226 -539268 -178144 125180 72252 -246554 -462070
34756 -462070 -376832 -141347 15074 42925 6418 -58808 -107272 -53100 76902 86240 -126285
34745 -126285 -358147 -363363 -224432 -212394 -336641 -340565 -154074 -10826 -18017 45472 306275
34734 306275 484731 291821 -101411 -324391 -361028 -469068 -655396 -657918 -458817 -394950
$$ packed form
34806i7971p5385j72151k57273j76826K123J04905J26843J75217K22122J37077
34796a1319o2031j83716j10317O2246J55229Q0743j24878l45761m37126l08944
34786a285874j4643K61315L36646J76740o6759j73217o2402J03840R2940j04538
34776g35952k35201r0065K29265M35069L80152J57648p2985k21981k42587j26618
34766e23255K0131L4080q1585j02597J13958L61124L03324n2928l18806k15516
34756d62070Q5238K35485J56421K7851l6507o5226m8464N4172J30002R338k12525
34745a26285k31862n216J38931J2038j24247l924J86491J43248p191O3489K60803
34734C06275J78456j92910l93232k22980l6637j08040j86328k522J99101O3867
$$ plain form
34724 -394950 -630259 -872519 -808353 -538400 -356810 -326866 -331194 -373982 -542827 -741903
34714 -741903 -734821 -473229 -191016 -128295 -282456 -453369 -444634 -224483 29710 68940 -161276
34703 -161276 -430880 -497874 -414086 -419591 -572772 -672671 -575835 -405149 -351422 -408623 -427074
34692 -427074 -330592 -151528 74082 293664 361625 158608 -182494 -343782 -212402 -63206
34682 -63206 -204613 -543397 -704433 -552309 -358710 -389563 -550082 -586735 -462609 -326579
34672 -326579 -231933 -129605 -80581 -207292 -421583 -462495 -276644 -120859 -173487 -273276
34662 -273276 -214363 -101925 -183383 -452116 -668506 -718615 -711443 -723935 -682402 -559878 -498379
34651 -498379 -615025 -797072 -809498 -567060 -225304 -21900 -68526 -272280 -423463 -379126
$$ packed form
34724c94950k35309k42260O4166K69953J81590K9944m328m2788j68845j99076
34714g41903P082K61592K82213O2721j54161j70913Q735K20151K54193L9230k30216
34703a61276k69604o6994Q3788n505j53181r9899R6836J70686N3727n7201j8451
34692d27074R6482J79064K25610K19582O7961k03017l41102j61288J31380J49196
34682f3206j41407l38784j61036J52124J93599l0853j60519l6653J24126J36030
34672c26579R4646J02328M9024j26711k14291m0912J85851J55785n2628r9789
34662b73276N8913J12438q1458k68733k16390n0109P172j2492M1533J22524O1499
34651d98379j16646j82047j2426K42438L41756K03404m6626k03754j51183M4337
$$ plain form
34641 -379126 -196047 -78992 -174297 -417434 -609323 -641661 -594165 -568561 -495843 -239419
34631 -239419 122093 311189 242819 197339 408872 656679 563510 201700 35060 248493
34621 248493 514655 525665 387404 312639 272172 196707 225060 468792 779564 1019478
34611 1019478 1285941 1552111 1393295 523248 -609656 -1261176 -1307556 -1235338 -1314919 -1345704
34601 -1345704 -1231964 -1219789 -1397013 -1464799 -1242497 -985740 -956459 -1035344 -1011042 -933848
34591 -933848 -926336 -923680 -852370 -818594 -888475 -918309 -816919 -733567 -776278 -802357 -710338 -665260
34579 -665260 -779442 -843332 -667315 -439878 -426417 -534965 -515348 -392780 -358208 -393888
34569 -393888 -349170 -248111 -208456 -208322 -228532 -413114 -742455 -802413 -333378 212304 202509
$$ packed form
34641c79126J83079J17055r5305k43137j91889l2338M7496K5604P2718K56424
34631b39419L61512J89096o8370m5480K11533K47807r3169l61810j66640K13433
34621B48493K66162J1010j38261p4765m0467p5465K8353K43732L10772K39914
34611A019478K66463K66170j58816q70047j132904o51520m6380P2218p9581l0785
34601a345704J13740J2175j77224o7786K22302K56757K9281p8885K4302P7194
34591i33848P512K656P1310L3776o9881k9834J01390Q3352m2711k6079R2019M5078
34579f65260j14182o3890J76017K27437J3461j08548J9617J22568L4572l5680
34569c93888M4718J01059L9655J34k0210j84582l29341n9958M69035N45682r795
$$ plain form
34558 202509 -245592 -482876 -388349 -496431 -981915 -1264977 -944272 -497366 -581102 -1062793
34548 -1062793 -1252676 -859534 -270818 1216 -188697 -610921 -894000 -818864 -534751 -393698
34538 -393698 -496816 -600762 -557591 -545329 -676152 -702381 -419305 -96662 -134237 -460988
34528 -460988 -658741 -571248 -409199 -318703 -242219 -206090 -351495 -602999 -663424 -471736
34518 -471736 -354622 -545129 -814312 -804058 -533215 -330129 -377311 -554220 -676814 -682035
34508 -682035 -578778 -398444 -235441 -202217 -287436 -352763 -318439 -265553 -297734 -386643 -439589
34497 -439589 -453496 -489181 -529459 -496616 -415022 -417732 -550505 -701320 -784234 -848354 -911348
34486 -911348 -849285 -614701 -423814 -506216 -755381 -865973 -760509 -616303 -501024 -294070
$$ packed form
34558B02509m48101k37284R4527j08082m85484k83062L20705M46906q3736m81691
34548a062793j89883L93142N88716K72034j89913m22224k83079P5136K84113J41053
34538c93698j03118j03946M3171J2262j30823k6229K83076L22643l7575l26751
34528d60988j97753Q7493J62049R0496P6484L6129j45405k51504o0425J91688
34518d71736J17114j90507k69183J0254K70843K03086m7182j76909j22594n221
34508f82035J03257J80334J63003L3224q5219o5327L4324N2886l2181q8909n2946
34497d39589j3907l5685m0278L2843Q1594k710j32773j50815q2914o4120o2994
34486i11348O2063K34584J90887q2402k49165j10592J05464J44206J15279K06954
$$ plain form
34476 -294070 -7302 143653 99013 75084 165194 125290 -213851 -593679 -679013 -550645
34466 -550645 -526762 -653268 -717490 -663912 -633915 -635045 -529468 -359931 -339186 -464751 -483502
34455 -483502 -328077 -247756 -361599 -418946 -232114 -55973 -229075 -631135 -834385 -702757
34445 -702757 -517148 -511485 -574089 -484501 -233539 3066 84753 8955 -135360 -259078 -348629
34434 -348629 -448837 -538982 -497106 -290088 -123918 -227695 -508028 -621067 -421198 -129607
34424 -129607 16609 55084 96759 65244 -116541 -246619 -75330 243280 278860 -51117
34414 -51117 -319679 -192825 107237 174575 27021 35143 348297 685234 685869 246774 -481581
34403 -481581 -1209100 -1610460 -1549146 -1263508 -1149762 -1304087 -1446811 -1333258 -1028145 -701807
$$ packed form
34476b94070K86768J50955m4640k3929R0110l9904l39141l79828q5334J28368
34466e50645K3883j26506o4222N3578K9997j130J05577J69537K0745j25565j8751
34455d83502J55425Q0321j13843n7347J86832J76141j73102m02060k03250J31628
34445g02757J85609N663o2604Q9588K50962K36605Q1687p5798j44315j23718q9551
34434c48629j00208r0145M1876K07018J66170j03777k80333j13039J99869K91591
34424a29607J46216L8475M1675l1515j81785j30078J71289L18610L5580l29977
34414e1117k68562J26854L00062O7338j47554Q122L13154L36937O35m39095p28355
34403d81581p27519m01360O1314K85638J13746j54325j42724J13553L05113L26338
$$ plain form
34393 -701807 -394567 -137584 -101456 -394217 -808682 -978361 -763634 -360588 -72980 -76618
34383 -76618 -336703 -644972 -799504 -832136 -959254 -1221431 -1336644 -1082998 -676046 -520734
34373 -520734 -677554 -845431 -838569 -787089 -820796 -828961 -660710 -373863 -150592 -86783 -160275
34362 -160275 -302765 -426429 -469221 -464912 -485517 -508993 -468317 -427644 -533554 -763379 -920680
34351 -920680 -940445 -983468 -1130702 -1213696 -1100585 -927903 -841779 -715221 -400882 -112981
34341 -112981 -212496 -649431 -953534 -834350 -504244 -304562 -273891 -261338 -267161 -425961
34331 -425961 -720033 -930065 -907717 -762604 -712555 -817020 -928392 -886874 -696832 -487742
34321 -487742 -356981 -314916 -348913 -436651 -492007 -425884 -311056 -348269 -562369 -658502 -350651
$$ packed form
34393g01807L07240K56983L6128k92761m14465j69679K14727M03046K87608l638
34383g6618k60085l08269j54532l2632j27118k62177j15213K53646M06952J55312
34373e20734j56820j67877O862N1480l3707q165J68251K86847K23271O3809p3492
34362a60275j42490j23664m2792M309k0605k3476M0676M0673j05910k29825j57301
34351i20680j9765m3023j47234q2994J13111J72682Q6124J26558L14339K87901
34341a12981r9515m36935l04103J19184L30106J99682L0671J2553n823j58800
34331d25961k94072k10032K2348J45113N0049j04465j11372M1518J90042K09090
34321d87742J30761M2065l3997q7738n5356O6123J14828l7213k14100r6133L07851
$$ plain form
34310 -350651 227157 613189 519007 105471 -240112 -286578 -123866 -47491 -261253 -615293
34300 -615293 -716648 -421140 -97873 -193840 -626400 -891205 -745794 -461629 -347272 -357960
34290 -357960 -317101 -225493 -158423 -103005 -93271 -265995 -565413 -643225 -332855 -2857 -98958
34279 -98958 -494809 -673947 -468871 -228059 -253842 -446561 -576802 -593321 -550631 -482849
34269 -482849 -459293 -561927 -721647 -759780 -651122 -558533 -562427 -562230 -497768 -451722 -467110
34258 -467110 -480686 -508714 -668934 -923769 -1030213 -866423 -607904 -466523 -449292 -476363
34248 -476363 -528400 -572413 -558361 -581853 -796379 -1068903 -1045608 -716884 -549253 -801312
34238 -801312 -1078618 -930732 -560502 -472478 -659463 -687414 -478249 -431424 -720980 -990970
$$ packed form
34310c50651N77808L86032r4182m13536l45583m6466J62712P6375k13762l54040
34300f15293j01355K95508L23267r5967m32560k64805J45411K84165J14357j0688
34290c57960M0859R1608O7070N5418R734j72724k99418p7812L10370L29998r6101
34279i8958l95851j79138K05076K40812k5783j92719j30241j6519M2690O7782
34269d82849K3556j02634j59720l8133J08658R2589l894J97O4462M6046j5388
34258d67110j3576k8028j60220k54835j06444J63790K58519J41381J7231k7071
34248d76363n2037m4013J4052k3492k14526k72524K3295L28724J67631k52059
34238h01312k77306J47886L70230Q8024j86985k7951K09165M6825k89556k69990
$$ plain form
34228 -990970 -909668 -613029 -399279 -315285 -262748 -253986 -332932 -411872 -378656 -263805 -184640
34217 -184640 -217912 -384149 -633545 -808268 -763014 -558476 -390197 -316751 -234948 -125664
34207 -125664 -100648 -167556 -180695 -92912 -36696 -83937 -149292 -204994 -339965 -496691 -412583
34196 -412583 3048 442618 531942 232277 -220935 -599998 -771250 -700466 -540474 -542577
34186 -542577 -731959 -855487 -790105 -763842 -973828 -1232186 -1257017 -1101029 -983007 -874592
34176 -874592 -612239 -300570 -213674 -324239 -307393 -63657 95362 -100539 -496165 -719331
34166 -719331 -611440 -344570 -216355 -381486 -701480 -860992 -719762 -490877 -445315 -539370
34156 -539370 -534684 -400996 -334531 -405765 -470940 -452628 -432719 -424313 -333110 -214120 -271927
$$ packed form
34228i90970Q1302K96639K13750Q3994N2537Q762p8946p8940L3216J14851P9165
34217a84640l3272j66237k49396j74723M5254K04538J68279P3446Q1803J09284
34207a25664K5016o6908j3139Q7783N6216m7241o5355n5702j34971j56726Q4108
34196d12583M15631M39570Q9324k99665m53212l79063j71252P0784J59992k103
34186e42577j89382j23528O5382K6263k09986k58358k4831J55988J18022J08415
34176h74592K62353L11669Q6896j10565J6846K43736J59019j95901l95626k23166
34166g19331J07891K66870J28215j65131l19994j59512J41230K28885M5562r4055
34156e39370M686J33688O6465p1234o5175J8312J9909Q406R1203J18990n7807
$$ plain form
34145 -271927 -497077 -602769 -477295 -393367 -548332 -695285 -547647 -315153 -432732 -860511
34135 -860511 -1074401 -790355 -341036 -206628 -438614 -709137 -740926 -519846 -211660 -36682
34125 -36682 -155087 -522354 -870559 -934210 -697519 -370476 -161295 -143342 -301593 -587682
34115 -587682 -894594 -1063486 -996968 -760158 -527299 -419340 -411663 -397969 -310983 -164194
34105 -164194 -16045 51946 -57405 -376856 -762953 -954882 -842986 -631221 -611590 -789678
34095 -789678 -876961 -687919 -386938 -240226 -260682 -259656 -157482 -40788 47827 145137 169633
34084 169633 -61587 -507345 -814294 -733240 -459407 -353568 -460676 -552023 -545756 -576757
34074 -576757 -657666 -599360 -372569 -265796 -500084 -888088 -1079696 -1002688 -852719 -759922
$$ packed form
34145b71927k25150j05692J25474Q3928j54965j46953J47638K32494j17579m27779
34135h60511k13890K84046M49319J34408k31986k70523l1789K21080L08186J74978
34125c6682j18405l67267l48205o3651K36691L27043K09181J7953j58251k86089
34115e87682l06912j68892O6518K36810K32859J07959P677J3694Q6986J46789
34105a64194J48149O7991j09351l19451l86097j91929J11896K11765J9631j78088
34095g89678q7283J89042L00981J46712k0456J026J02174J16694Q8615R7310K4496
34084A69633k31220m45758l06949Q1054K73833J05839j07108r1347O267l1001
34074e76757q0909N8306K26791J06773k34288l88004j91608P7008J49969R2797
$$ plain form
34064 -759922 -703309 -702732 -840673 -1052255 -1099376 -850280 -454349 -149537 -1252 66278 66037
34053 66037 -74364 -332732 -528802 -526673 -432760 -472889 -670798 -777663 -599465 -292655
34043 -292655 -192462 -388032 -634965 -709903 -678610 -719308 -818121 -792637 -567587 -292351
34033 -292351 -176031 -280778 -480158 -571841 -442907 -172099 34033 32040 -141410 -344017
34023 -344017 -473887 -526330 -560643 -640982 -767819 -852464 -812047 -694007 -628850 -648563 -651372
$$ packed form
34064g59922N6613N77j37941k11582m7121K49096L95931L04812J48285O7530k41
34053F6037j40401k58368j96070K129R3913m0129j97909j06865J78198L06810
34043b92655J00193j95570k46933p4938L1293m0698r8813K5484K25050K75236
34033b92351J16320j04747j99380r1683J28934K70808K06132j993j73450k02607
34023c44017j29870n2443l4313q0339j26837q4645M0417J18040O5157j9713k809
$$ [...]
##END NTUPLES=NMR SPECTRUM
##END=
