##TITLE=31Pdec_E3d0307-3
 CDCl3, 24 sc
 4.7.2023
##JCAMPDX= 6.0         $$ Bruker NMR JCAMP-DX V2.0
##DATA TYPE= NMR SPECTRUM
##DATA CLASS= NTUPLES
##ORIGIN= UXNMR, Bruker Analytische Messtechnik GmbH
##OWNER= root
$$ XWIN-NMR		Version 3.5
$$ Tue Jul  4 14:17:14 2023 Russian Standard Time (UT+4h)  she@DPX200
##.OBSERVE FREQUENCY= 81.013821
##.OBSERVE NUCLEUS= ^31P
##.ACQUISITION MODE= SIMULTANEOUS
##.ACQUISITION SCHEME= undefined
##.AVERAGES= 24
##.DIGITISER RES= 16
##SPECTROMETER/DATA SYSTEM= spect
##.PULSE SEQUENCE= zgpg30
##.SOLVENT NAME= CDCl3
##.SHIFT REFERENCE= (INTERNAL, CDCl3, 0, 248.564)
##AUDIT TRAIL= $$ (NUMBER, WHEN, WHO, WHERE, WHAT)
$$ ##TITLE= Audit trail, XWIN-NMR		Version 3.5
$$ ##JCAMPDX= 5.01
$$ ##ORIGIN= Bruker BioSpin GmbH
$$ ##OWNER= she
$$ F:/spectra/data/she/nmr/P31/1/pdata/1/auditp.txt
$$ ##AUDIT TRAIL=  $$ (NUMBER, WHEN, WHO, WHERE, WHAT)
(   1,<2023-07-04 14:16:14.43 +0400>,<she>,<DPX200>,
      <created by zg, POWCHK disabled, PULCHK disabled
       configuration hash MD5:
       00 E9 B6 7A A2 85 ED C7 34 08 36 98 17 FE 4E 26
       data hash MD5: 32K
       AA 9A 3E BE AE BF 1A 8E 3E 5F C2 97 E6 8F 78 A4>)
(   2,<2023-07-04 14:16:20.84 +0400>,<she>,<DPX200>,
      <Start of raw data processing
       efp BC_mod = 2 LB = 1 FT_mod = 6 PKNL = 1 PHC0 = -10680.54 PHC1 = 42.48483 SI = 64K 
       data hash MD5: 64K
       59 01 CD 12 EB 68 36 37 B4 54 73 64 D9 77 37 37>)
(   3,<2023-07-04 14:16:36.79 +0400>,<she>,<DPX200>,
      <pk PHC0 = 3.584155 PHC1 = 0 
       data hash MD5: 64K
       E6 17 2A 33 A3 D4 A7 A7 E1 8E AC 48 C7 56 E4 06>)
$$ ##END=
$$ 
$$ hash MD5
$$ 91 85 20 B9 3D 72 0C 8B 73 67 CA 0D C0 79 7E AA
##$RELAX= 
##$RELAX= 
##$RELAX= 
##$RELAX= 
##$RELAX= 
##$RELAX= 
##$RELAX= 
##$RELAX= 
##$RELAX= 
$$ Bruker specific parameters
$$ --------------------------
##$DU= <F:/spectra>
##$EXPNO= 1
##$NAME= <P31>
##$PROCNO= 1
##$TYPE= <nmr>
##$USER= <she>
##$AMP= (0..31)
100 100 100 100 100 100 100 100 100 100 100 100 100 100 100 100 100 100 
100 100 100 100 100 100 100 100 100 100 100 100 100 100 
##$AQSEQ= 0
##$AQ_mod= 1
##$AUNM= <au_zg>
##$AUTOPOS= <>
##$BF1= 81.014009
##$BF2= 200.13
##$BF3= 200.13
##$BF4= 200.13
##$BF5= 200.13
##$BF6= 200.13
##$BF7= 200.13
##$BF8= 200.13
##$BYTORDA= 1
##$CFDGTYP= 0
##$CFRGTYP= 5
##$CHEMSTR= <none>
##$CNST= (0..31)
1 1 145 1 1 1 1 1 1 1 1 1 1 1 1 1 1 1 1 1 1 1 1 1 1 1 1 1 1 1 1 1 
##$CPDPRG= <waltz16>
##$CPDPRG1= <>
##$CPDPRG2= <waltz16>
##$CPDPRG3= <>
##$CPDPRG4= <mlev>
##$CPDPRG5= <mlev>
##$CPDPRG6= <mlev>
##$CPDPRG7= <mlev>
##$CPDPRG8= <mlev>
##$CPDPRGB= <>
##$CPDPRGT= <>
##$D= (0..31)
0 1 0 0 0 0 0 0 0 0 0 0.03 2e-05 3e-06 0 0 0 0 0 0 0 0 0 0 0 0 0 0 0 0 
0 0 
##$DATE= 1688465773
##$DBL= (0..7)
120 120 120 11 120 120 24 19 
##$DBP= (0..7)
150 150 150 150 150 150 150 150 
##$DBP07= 0
##$DBPNAM0= <>
##$DBPNAM1= <>
##$DBPNAM2= <>
##$DBPNAM3= <>
##$DBPNAM4= <>
##$DBPNAM5= <>
##$DBPNAM6= <>
##$DBPNAM7= <>
##$DBPOAL= (0..7)
0.5 0.5 0.5 0.5 0.5 0.5 0.5 0.5 
##$DBPOFFS= (0..7)
$$ [...]
##$SUBNAM2= <"">
##$SUBNAM3= <"">
##$SUBNAM4= <"">
##$SUBNAM5= <"">
##$SUBNAM6= <"">
##$SUBNAM7= <"">
##$SUBNAM8= <"">
##$SUBNAM9= <"">
##$SW= 501.771253377433
##$SWIBOX= (0..15)
0 1 3 0 0 0 0 0 0 0 0 0 0 0 0 0 
##$SW_h= 40650.406504065
##$TD= 32768
##$TD0= 1
##$TE= 0
##$TE2= 300
##$TE3= 300
##$TEG= 300
##$TL= (0..7)
0 120 53 12 22 120 120 120 
##$TP= (0..7)
150 150 150 150 150 150 150 150 
##$TP07= 0
##$TPNAME0= <>
##$TPNAME1= <>
##$TPNAME2= <>
##$TPNAME3= <>
##$TPNAME4= <>
##$TPNAME5= <>
##$TPNAME6= <>
##$TPNAME7= <>
##$TPOAL= (0..7)
0.5 0.5 0.5 0.5 0.5 0.5 0.5 0.5 
##$TPOFFS= (0..7)
0 0 0 0 0 0 0 0 
##$TUNHIN= 0
##$TUNHOUT= 0
##$TUNXOUT= 0
##$USERA1= <user>
##$USERA2= <user>
##$USERA3= <user>
##$USERA4= <user>
##$USERA5= <user>
##$V9= 5
##$VALIST= <valist>
##$VCLIST= <CCCCCCCCCCCCCCC>
##$VD= 0
##$VDLIST= <DDDDDDDDDDDDDDD>
##$VPLIST= <PPPPPPPPPPPPPPP>
##$VTLIST= <TTTTTTTTTTTTTTT>
##$WBST= 1024
##$WBSW= 4
##$XGAIN= (0..3)
0 0 0 0 
##$XL= 0
##$YL= 0
##$YMAX_a= 10618
##$YMIN_a= -10773
##$ZGOPTNS= <>
##$ZL1= 120
##$ZL2= 120
##$ZL3= 120
##$ZL4= 120
##$ABSF1= 0
##$ABSF2= 0
##$ABSG= 0
##$ABSL= 0
##$ALPHA= 0
##$AQORDER= 0
##$ASSFAC= 0
##$ASSFACI= 0
##$ASSFACX= 0
##$ASSWID= 0
##$AUNMP= <proc_1d>
##$AZFE= 0.1
##$AZFW= 0.5
##$BCFW= 0
##$BC_mod= 2
##$BYTORDP= 0
##$COROFFS= 0
##$CY= -3
##$DATMOD= 1
##$DC= 0
##$DFILT= <>
##$DTYPP= 0
##$F1P= 0
##$F2P= 0
##$FCOR= 1
##$FTSIZE= 65536
##$FT_mod= 6
##$GAMMA= 0
##$GB= 0
##$INTBC= 1
##$INTSCL= 6.047779e-11
##$ISEN= 30
##$LB= 1
##$LEV0= 0
##$LPBIN= 0
##$MAXI= 10000
##$MC2= 0
##$MEAN= 0
##$ME_mod= 0
##$MI= 50
##$NCOEF= 0
##$NC_proc= -4
##$NLEV= 6
##$NOISF1= 182.463
##$NOISF2= 159.3651
##$NSP= 0
##$NTH_PI= 0
##$NZP= 0
##$OFFSET= 248.5645
##$PC= 4
##$PHC0= -10676.96
##$PHC1= 42.48483
##$PH_mod= 1
##$PKNL= yes
##$PPARMOD= 0
##$PSCAL= 0
##$PSIGN= 0
##$REVERSE= no
##$SF= 81.0140089999694
##$SI= 65536
##$SIGF1= 159.3651
##$SIGF2= -187.1042
##$SINO= 113.3802
##$SIOLD= 16384
##$SREGLST= <1H.CDCl3>
##$SSB= 0
##$STSI= 65536
##$STSR= 0
##$SW_p= 40650.406504065
##$SYMM= 0
##$S_DEV= 0
##$TDeff= 32768
##$TDoff= 0
##$TI= <>
##$TILT= no
##$TM1= 0
##$TM2= 0
##$TOPLEV= 0
##$USERP1= <user>
##$USERP2= <user>
##$USERP3= <user>
##$USERP4= <user>
##$USERP5= <user>
##$WDW= 1
##$XDIM= 65536
##$YMAX_p= 469665137
##$YMIN_p= -10592527
$$ End of Bruker specific parameters
$$ ---------------------------------
##NTUPLES= NMR SPECTRUM
##VAR_NAME=  FREQUENCY,     SPECTRUM/REAL,   SPECTRUM/IMAG
##SYMBOL=    X,             R,               I
##VAR_TYPE=  INDEPENDENT,   DEPENDENT,       DEPENDENT
##VAR_FORM=  AFFN,          ASDF,            ASDF
##VAR_DIM=   65536,         65536,           65536
##UNITS=     HZ,            ARBITRARY UNITS, ARBITRARY UNITS
##FACTOR=    0.620285442955139, 1,           1
##FIRST=     20137.2065510682, 0,            0
##LAST=      -20513.1999529968, 0,           0
##MIN=       -20513.1999529968, -10592527,   0
##MAX=       20137.2065510682, 469665137,    0
$$ Real data points
##PAGE= N=1
##DATA TABLE= (X++(R..R)), XYDATA
$$ [...]
$$ plain form
39959 388405 285048 205843 151579 166497 214050 137741 -79937 -211520 -117235 30058 59881
39948 59881 108896 339231 566748 506753 245269 116132 198965 283907 279196 297413 337860
39937 337860 235409 -6787 -139574 -29529 147421 182740 94394 -2900 -100722 -238849
39927 -238849 -376524 -445385 -454863 -466459 -520067 -620836 -732831 -768510 -656001 -426979 -177898
39916 -177898 36251 198028 261629 198395 83283 26885 34070 25801 -19677 -42556 5137
39905 5137 127507 306366 465306 467065 255015 -47165 -275236 -403919 -485512 -494067 -371231
39894 -371231 -165971 11652 123341 164251 76839 -133972 -276143 -162851 93213 161537
39884 161537 -120409 -577043 -899589 -909183 -661044 -407876 -399358 -595392 -666210 -413177
$$ packed form
39959C88405j03357p9205n4264J4918M7553p6309k17678j31583R4285J47293K9823
39948E9881M9015K30335K27517n9995k61484j29137Q2833Q4942m711J8217M0447
39937C37860j02451k42196j32787J10045J76950L5319q8346r7294r7822j38127
39927b38849j37675o8861r478j1596n3608j00769j11995l5679J12509K29022K49081
39916a77898K14149J61777O3601o3234j15112n6398P185q269m5478k2879M7693
39905E137J22370J78859J58940J759k12050l02180k28071j28683q1593q555J22836
39894c71231K05260J77623J11689M0910q7412k10811j42171J13292K56064O8324
39884A61537k81946m56634l22546r594K48139K53168Q518j96034p0818K53033
$$ plain form
39874 -413177 -61814 50041 -69538 -179935 -256262 -482034 -824675 -982450 -837044 -658116
39864 -658116 -723560 -958961 -1086105 -962501 -665779 -374696 -242291 -269988 -269002 -68769
39854 -68769 230478 361612 241941 43504 -89334 -187548 -289369 -329345 -263935 -145877
39844 -145877 -24557 79009 84995 -74276 -272728 -277752 -66080 128502 124998 -19081 -150472
39833 -150472 -160931 15376 319297 475489 253762 -136931 -210236 155520 536417 548354
39823 548354 304215 103103 -36170 -261313 -523188 -621272 -497665 -252954 32250 291482
39813 291482 396424 294347 137802 89316 81884 -41593 -244129 -359607 -367107 -368832 -335142
39802 -335142 -127885 193949 339525 165376 -101103 -172550 -100980 -159387 -379032 -465716
$$ packed form
39874d13177L51363J11855j19579j10397p6327k25772l42641j57775J45406J78928
39864f58116o5444k35401j27144J23604K96722K91083J32405k7697R86K00233
39854f8769K99247J31134j19671j98437j32838r8214j01821l9976O5410J18058
39844a45877J21320J03566N986j59271j98452n024K11672J94582l504j44079j31391
39833a50472j0459J76307L03921J56192k21727l90693p3305L65756L80897J1937
39823E48354k44139k01112j39273k25143k61875r8084J23607K44711K85204K59232
39813B91482J04942j02077j56545m8486p432j23477k02536j15478p500j725L3690
39802c35142K07257L21834J45576j74149k66479p1447P1570n8407k19645q6684
$$ plain form
39792 -465716 -267704 -83197 -255566 -608593 -644195 -301034 -100573 -374219 -755205 -758757
39782 -758757 -506718 -414132 -433414 -213749 111440 -8352 -594673 -929354 -563630 26646
39772 26646 168163 -100682 -301551 -320490 -399970 -538373 -448067 -89321 191764 127755
39762 127755 -160452 -373893 -347894 -132971 74261 82753 -96997 -253488 -243856 -139363
39752 -139363 -20993 161756 373332 369334 32354 -365256 -499454 -411201 -297506 -92223
39742 -92223 356424 826522 895452 564426 288968 320159 398454 227409 -90032 -276673
39732 -276673 -284129 -262008 -291033 -332717 -351938 -360106 -392417 -498685 -677670 -791447 -654755
39721 -654755 -262087 153143 321604 155625 -203535 -476562 -442905 -167469 19792 -101484
$$ packed form
39792d65716J98012J84507j72369l53027l5602L43161K00461k73646l80986l552
39782g58757K52039R2586j9282K19665L25189j19792n86321l34681L65724N90276
39772B6646J41517k68845k00869j8939p9480j38403R0306L58746K81085o4009
39762A27755k88207k13441K5999K14923K07232Q492j79750j56491R632J04493
39752a39363J18370J82749K11576l998l36980l97610j34198Q8253J13695K05283
39742i2223M48647M70098O8930l31026k75458L1191P8295j71045l17441j86641
39732b76673p456K2121k9025m1684j9221q168l2311j06268j78985j13777J36692
39721f54755L92668M15230J68461j65979l59160k73027L3657K75436J87261j21276
$$ plain form
39711 -101484 -357803 -428692 -286644 -162263 -126255 2649 290968 507025 428278 136985
39701 136985 -120502 -229069 -247866 -267269 -318233 -355547 -291289 -116654 24537 2719 -88773
39690 -88773 -62541 48202 26787 -159286 -286014 -240689 -193860 -274667 -341734 -272679 -234380
39679 -234380 -393283 -544126 -357085 96541 397884 341763 124650 -60784 -278346 -555795
39669 -555795 -649615 -368397 50295 185450 -7666 -155743 7051 319745 467045 358089
39659 358089 128658 -53707 -61830 144546 389566 356953 -15380 -362318 -338542 -92732
39649 -92732 -4709 -82953 -23533 180729 179669 -89149 -200477 69158 321040 176067 -66011
39638 -66011 97003 521992 625295 299182 33781 119468 283127 235614 88182 27719
$$ packed form
39711a01484k56319p0889J42048J24381L6008J28904K88319K16057p8747k91293
39701A36985k57487j08567j8797j9403n0964l7314O4258J74635J41191k1818r1492
39690h8773K6232J10743k1415j86073j26728M5325M6829q0807o7067O9055L8299
39679b34380j58903j50843J87041M53626L01343n6121k17113j85434k17562k77449
39669e55795r3820K81218M18692J35155j93116j48077J62794L12694J47300j08956
39659C58089k29431j82365q123K06376K45020l2613l72333l46938K3776K45810
39649i2732Q8023p8244N9420K04262j060k68818j11328K69635K51882j44973k42078
39638f6011J63014M24989J03303l26113k65401Q5687J63659m7513j47432o0463
$$ plain form
39628 27719 -8068 -94129 -95800 68958 218998 192820 102685 98859 121923 99355 135171 264682
39616 264682 273820 44133 -160123 -75702 103468 38329 -152136 -49157 367587 645245
39606 645245 527006 264438 142560 96440 -644 -24898 139421 293025 189878 -58938
39596 -58938 -161601 -111516 -155499 -346356 -459930 -399005 -370694 -530055 -691454 -589167
39586 -589167 -274299 -47317 -66873 -209454 -297724 -306752 -314265 -361549 -417807 -431213 -388973
39575 -388973 -346222 -371859 -430804 -373856 -117359 217824 440560 508586 489366 364683 80077
39564 80077 -201494 -145578 312713 747684 662845 66721 -531556 -674463 -375187 -2703
39554 -2703 125669 6653 -125694 -98108 4106 -18137 -174069 -266739 -202735 -130005 -168205
$$ packed form
39628B7719l5787q6061j671J64758J50040k6178r0135l826K3064k2568L5816J29511
39616B64682R138k29687k04256Q4421J79170o5139j90465J02979M16744K77658
39606F45245j18239k62568j21878m6120r7084k4254J64319J53604j03147k48816
39596e8938j02663N0085m3983j90857j13574O0925K8311j59361j61399J02287
39586e89167L14868K26982j9556j42581q8270r028p513m7284n6258j3406M2240
39575c88973M2751k5637n8945N6948K56497L35183K22736O8026j9220j24683k84606
39564H0077k81571N5916M58291M34971q4839n96124n98277j42907K99276L72484
39554b703J28372j19016j32347K7586J02214k2243j55932r2670O4004P2730l8200
$$ plain form
39543 -168205 -200661 -111485 -45271 -170296 -314035 -166001 190008 300981 -25569 -444626
39533 -444626 -581354 -526647 -584810 -740585 -695421 -362320 -19465 79671 18833 26932 128007
39522 128007 145445 3118 -142238 -122194 -1729 13305 -118165 -201662 -92297 78116
39512 78116 81544 -76622 -168652 -69785 93591 164840 176672 246468 346450 314171 84390
39501 84390 -190102 -289324 -151918 94543 307880 463968 580636 588965 403185 109768
39491 109768 -57416 12095 177329 257586 247845 229972 206289 163358 182280 307412 393230
39480 393230 274962 25307 -162886 -290458 -505511 -761299 -793177 -504629 -149379 -23926
39470 -23926 -143863 -311783 -358846 -241657 -36269 90810 22529 -151013 -230053 -169087
$$ packed form
39543a68205l2456Q9176O6214j25025j43739J48034L56009J10973l26550m19057
39533d44626j36728N4707n8163j55775M5164L33101L42855R9136o0838Q099J01075
39522A28007J7438j42327j45356K0044J20465J5034j31470q3497J09365J70413
39512G8116L428j58166r2030R8867J63376P1249J1832O9796R9982l2279k29781
39501H4390k74492r9222J37406K46461K13337J56088J16668Q329j85780k93417
39491A09768j67184O9511J65234Q0257r741j7873k3683m2931J8922J25132Q5818
39480C93230j18268k49655j88193j27572k15053k55788l1878K88548L55250J25453
39470b3926j19937j67920m7063J17189K05388J27079o8281j73542p9040O0966
$$ plain form
39460 -169087 -91618 -43724 63250 234728 342105 348969 358048 360153 193866 -132528 -350414
39449 -350414 -324360 -273178 -396228 -538284 -484021 -350173 -366587 -447499 -336474 -66478
39439 -66478 90187 82145 129326 305754 416820 355057 262010 231395 139127 -82501 -247154
39428 -247154 -177036 17329 104829 42930 -59374 -165744 -290973 -328208 -134886 188463
39418 188463 316392 95297 -230534 -338667 -274314 -364285 -689645 -895617 -668150 -198594
39408 -198594 70872 43456 -2805 55704 12293 -207777 -288136 13149 422499 515177 340139
39397 340139 308106 539717 711403 583061 341234 295897 472655 638457 578465 254028
39387 254028 -188567 -497539 -510266 -315368 -137107 -64933 -12106 79747 149359 136213 49747
$$ packed form
39460a69087P7469M7894J06974J71478J07377O864R079K105j66287l26394k17886
39449c50414K6054N1182j23050j42056N4263J33848j6414q0912J11025K69996
39439f6478J56665q042M7181J76428J11066o1763r3047l0615r2268k21628j64653
39428b47154P0118J94365Q7500o1899j02304j06370j25229l7235J93322L23349
39418A88463J27929k21095l25831j08133O4353q9971l25360k05972K27467M69556
39408a98594K69466k7416m6261N8509m3411k20070q0359L01285M09350R2678j75038
39397C40139l2033K31611J71686j28342k41827m5337J76758J65802n9992l24437
39387B54028m42595l08972j2727J94898J78261P2174N2827R1853O9612j3146q6466
$$ plain form
39376 49747 -91362 -262268 -385000 -407359 -396671 -419013 -394927 -252212 -127255 -166673 -210240
39365 -210240 7108 362702 423937 75677 -293078 -342380 -171799 -10862 124022 254067
39355 254067 256785 126671 122264 353824 489125 214908 -221155 -309695 13892 337082
39345 337082 376995 267960 243776 325031 365743 226603 -91418 -366156 -319373 -8079
39335 -8079 139836 -107421 -421163 -416379 -257807 -329561 -519451 -399823 -27278 77471
39325 77471 -189976 -296874 61562 465005 453957 197975 77267 34112 -174605 -399470
39315 -399470 -302994 31915 187897 31771 -171448 -219702 -168335 -82645 45219 118379
39305 118379 1254 -199463 -207959 30323 295531 449005 560773 648258 588465 377584
$$ packed form
39376D9747j41109j70906j22732k2359J0688k2342K4086J42715J24957l9418m3567
39365b10240K17348L55594O1235l48260l68755m9302J70581J60937J34884J30045
39355B54067K718j30114m407K31560J35301k74217m36063q8540L23587L23190
39345C37082L9913j09035k4184Q1255M0712j39140l18021k74738M6783L11294
39335h079J47915k47257l13742M784J58572p1754j89890J19628L72545J04749
39325G7471k67447j06898L58436M03443j1048k55982j20708m3155k08717k24865
39315c99470R6476L34909J55982j56126k03219m8254N1367Q5690J27864P3160
39305A18379j17125k00717q496K38282K65208J53474J11768Q7485n9793k10881
$$ plain form
39295 377584 207924 179755 177041 127004 129213 204323 176675 -20438 -160019 -52736 136070
39284 136070 134655 -34283 -158136 -211981 -337620 -496870 -444148 -92186 319890 495920
39274 495920 358080 10890 -391384 -664041 -649194 -394518 -184939 -264449 -560041 -773337
39264 -773337 -717654 -480728 -270402 -186763 -168520 -107846 21985 142577 156727 56138
39254 56138 -62704 -95693 -33701 41693 49654 -25019 -146876 -267455 -329688 -276760 -117317
39243 -117317 19935 -29514 -278796 -538382 -626253 -594427 -637523 -776375 -781018 -494962 -115246
39232 -115246 3876 -223111 -541114 -694358 -663881 -535588 -329038 -76137 86183 74810
39222 74810 15799 58419 106254 -43764 -315946 -372416 -90627 217384 216630 -11672 -144107
$$ packed form
39295C77584j69660k8169k714n0037K209P5110k7648j97113j39581J07283J88806
39284A36070j415j68938j23853n3845j25639j59250N2722L51962M12076J76030
39274D95920j37840l47190m02274k72657J4847K54676K09579p9510k95592k13296
39264g73337N5683K36926K10326Q3639J8243O0674J29831J20592J4150j00589
39254E6138j18842l2989O1992P5394P961p4673j21857j20579o2233N2928J59443
39243a17317J37252m9449k49282k59586q7871L1826m3096j38852m643K86056L79716
39232a15246J19122k26987l18003j53244L0477J28293K06550K52901J62320j1373
39222G4810n9011M2620M7835j50018k72182n6470K81789L08011p54k28302j32435
$$ plain form
39211 -144107 -85260 -14933 -35236 -46394 -4852 -58794 -313625 -627977 -768804 -665330 -412950
39200 -412950 -131560 68049 74385 -115982 -316094 -315708 -137644 -16900 -105071 -298472 -403369
39189 -403369 -376022 -309927 -242937 -109039 93150 205384 88652 -159198 -294380 -230190
39179 -230190 -109363 -39739 76927 334545 574431 534249 199824 -166891 -354233 -406641
39169 -406641 -480524 -623585 -747003 -739342 -579865 -380379 -287327 -293878 -227875 -6407 223175
39158 223175 333492 445006 668240 771927 457931 -102321 -408700 -321653 -185818 -197672
39148 -197672 -133832 108371 205643 -25955 -208818 15099 346337 280771 -85854 -283802
39138 -283802 -303051 -544778 -984459 -1066373 -582129 -60190 -12411 -272089 -399694 -346725
$$ packed form
39211a44107N8847P0327k0303j1158M1542n3942k54831l14352j40827J03474K52380
39200d12950K81390J99609O336j90367k00112L86J78064J20744q8171j93401j04897
39189d03369K7347O6095O6990J33898K02189J12234j16732k47850j35182O4190
39179b30190J20827O9624J16666K57618K39886m0182l34425l66715j87342n2408
39169d06641p3883j43061j23418P661J59477J99486R3052o551O6003K21468K29582
39158B23175J10317J11514K23234J03687l13996n60252l06379Q7047J35835j1854
39148a97672O3840K42203R7272k31598j82863K23917L31238o5566l66625j97948
39138b83802j9249k41727m39681q1914M84244N21939M7779k59678j27605N2969
$$ plain form
39128 -346725 -337464 -387001 -354616 -310941 -450238 -686312 -682239 -323758 96667 250022 143398
39117 143398 28637 65684 197213 308444 383888 455093 469582 334096 104655 8053
39107 8053 183022 480426 625334 522741 310789 178840 232557 452680 657115 588095
39097 588095 194933 -231915 -362137 -195584 19665 140316 195033 182207 53975 -111325
39087 -111325 -147744 -30959 101317 142273 76069 -89591 -274769 -307264 -157308 -67992
39077 -67992 -205744 -342301 -212527 -20356 -147058 -461959 -453015 -49645 239973 127705
39067 127705 -56167 30921 229277 240726 89838 -64559 -209398 -288662 -95799 335707
39057 335707 559953 262885 -292582 -653994 -730882 -675239 -519826 -275965 -125740 -163484
$$ packed form
39128c46725R261m9537L2385M3675j39297k36074M073L58481M20425J53355j06624
39117A43398j14761L7047J31529J11231P5444P1205J4489j35486k29441r6602
39107H053J74969K97404J44908j02593k11952j31949N3717K20123K04435o9020
39097E88095l93162m26848j30222J66553K15249J20651N4717j2826j28232j65300
39087a11325l6419J16785J32276M0956o6204j65660j85178l2495J49956Q9316
39077f7992j37752j36557J29774J92171j26702l14901Q944M03370K89618j12268
39067A27705j83872Q7088J98356J1449j50888j54397j44839p9264J92863M31506
39057C35707K24246k97068n55467l61412p6888N5643J55413K43861J50225l7744
$$ plain form
39047 -163484 -165347 61862 326787 361460 240614 161980 61413 -177017 -357306 -232844
39037 -232844 39304 109227 -34889 -126377 -88794 -73925 -127463 -156254 -145703 -129208 -69642
39026 -69642 -20439 -185826 -526954 -594221 -145367 355657 339777 -19586 -117833 118735
39016 118735 215069 1022 -175802 -127783 -106790 -278168 -437133 -413596 -335105 -345894 -415349
39005 -415349 -495179 -534421 -359549 68143 344188 61191 -488659 -621687 -276045 -72031
38995 -72031 -273036 -398888 -114352 197543 141450 -21548 94381 286033 131750 -258433
38985 -258433 -400191 -142953 231040 471876 542420 447731 216044 -23755 -181488 -318617
38975 -318617 -454948 -451882 -279449 -172836 -285445 -406205 -294602 -101190 -145603 -404549
$$ packed form
39047a63484j863K27209K64925L4673j20846p8634j00567k38430j80289J24462
39037b32844K72148O9923j44116r1488L7583J4869n3538k8791J0551J6495N9566
39026f9642M9203j65387l41128o7267M48854N01024j5880l59363r8247K36568
39016A18735R6334k14047j76824M8019K0993j71378j58965K3537P8491j0789o9455
39005d15349p9830l9242J74872M27692K76045k82997n49850j33028L45642K04014
38995g2031k01005j25852K84536L11895n6093j62998J15929J91652j54283l90183
38985b58433j41758K57238L73993K40836P0544r4689k31687k39799j57733j37129
38975c18617j36331L066J72433J06613j12609j20760J11603J93412m4413k58946
$$ plain form
38965 -404549 -524657 -302446 74102 253488 66757 -313737 -512662 -341157 -34649 68175
38955 68175 14323 93967 255987 129633 -282385 -454237 -118316 294054 323996 142253
38945 142253 125483 189795 48512 -185182 -197761 -61946 -91872 -258235 -261124 -92324 -30201
38934 -30201 -122404 -146522 -76584 -136667 -352601 -457373 -307589 -48877 175546 353088
38924 353088 412050 239702 -58395 -217112 -164856 -36780 148602 477588 787515 718990
38914 718990 240936 -211142 -271324 -44140 160321 224911 210251 175765 172806 233905 257460
38903 257460 94414 -159076 -185962 103411 374024 294398 -27041 -236325 -217369 -151314
38893 -151314 -167397 -165087 -12024 232966 366608 257648 -24921 -283724 -364373 -245976
$$ packed form
38965d04549j20108K22211L76548J79386j86731l80494j98925J71505L06508J02824
38955F8175n3852P9644J62020j26354m12018j71852L35921M12370K9942j81743
38945A42253j6770O4312j41283k33694j2579J35815k9926j66363k889J68800O2123
38934c0201r2203k4118O9938o0083k15934j04772J49784K58712K24423J77542
38924C53088N8962j72348k98097j58717N2256J28076J85382L28986L09927o8525
38914G18990m78054m52078o0182K27184K04461O4590j4660l4486k959O1099K3555
38903B57460j63046k53490k6886K89373K70613p9626l21439k09284J8956O6055
38893a51314j6083K310J53063K44990J33642j08960k82569k58803q0649J18397
$$ plain form
38883 -245976 641 273242 458174 491836 439258 408026 349004 95283 -325161 -606181
38873 -606181 -540177 -300708 -163297 -125290 -45432 11132 -110717 -297008 -265797 9659
38863 9659 298432 495106 657973 687683 382614 -115465 -347366 -163247 49312 -45718
38853 -45718 -277212 -346132 -317941 -409633 -556988 -567049 -511051 -575454 -643648 -436748 -40062
38842 -40062 116630 -122614 -392994 -327782 -40974 113704 65294 53512 208011 334329
38832 334329 171319 -266825 -688205 -825134 -683435 -494574 -467881 -624130 -841452 -988688
38822 -988688 -995779 -870168 -702126 -605970 -598599 -576587 -461211 -299528 -146634 65312 396560
38811 396560 687639 674902 352065 26065 -81506 -111293 -287840 -514983 -492094 -186313
$$ packed form
38883b45976K46617K72601J84932L3662n2578l1232n9022k53721m20444k81020
38873f06181O6004K39469J37411L8007P9858N6564j21849j86291L1211K75456
38863I659K88773J96674J62867K9710l05069m98079k31901J84119K12559r5030
38853d5718k31494o8920K8191r1692j47355j0061N5998o4403o8194K06900L96686
38842d0062J56692k39244k70380O5212K86808J54678m8410j1782J54499J26318
38832C34329j63010m38144m21380j36929J41699J88861K6693j56249k17322j47236
38822i88688p091J25611J68042R6156P371K2012J15376J61683J52894K11946L31248
38811C96560K91079j2737l22837l26000j07571k9787j76547k27143K2889L05781
$$ plain form
38801 -186313 70391 14049 -225277 -329142 -165871 147764 424164 521695 401121 203661
38791 203661 181621 413605 667802 681974 489816 314548 233079 146142 19675 -71078
38781 -71078 -122408 -205874 -284281 -247543 -163090 -254428 -545136 -733072 -547110 -90711 271442
38770 271442 267149 -85695 -503420 -633252 -389849 -121783 -248501 -699740 -957411 -727559
38760 -727559 -297492 -88456 -132681 -211031 -264215 -368852 -450925 -340538 -86672 29183
38750 29183 -168899 -536228 -745061 -575566 -120417 254098 248445 -24260 -168868 -21497
38740 -21497 175058 185493 100681 71790 2495 -216164 -373773 -184570 233729 440633
38730 440633 210077 -256894 -632959 -761414 -671926 -498795 -395182 -406714 -453353 -487469
$$ packed form
38801a86313K56704n6342k39326j03865J63271L13635K76400R7531j20574j97460
38791B03661k2040K31984K54197J4172j92158j75268q1469q6937j26467r0753
38781g1078n1330q3466p8407L6738Q4453r1338k90708j87936J85962M56399L62153
38770B71442m293l52844m17725j29832K43403K68066j26718m51239k57671K29852
38760g27559M30067K09036m4225p8350n3184j04637q2073J10387K53866J15855
38750B9183j98082l67329k08833J69495M55149L74515n653k72705j44608J47371
38740b1497J96555J0435q4812k8891o9295k18659j57609J89203M18299K06904
38730D40633k30556m66971l76065j28455Q9488J73131J03613j1532m6639l4116
$$ plain form
38720 -487469 -532616 -493879 -175756 329989 543053 176409 -394887 -595682 -415759 -321874
38710 -321874 -513644 -698580 -606053 -332076 -108746 -47958 -171504 -410475 -525153 -296255
38700 -296255 148963 437019 400880 207176 44981 -50404 -69171 -3308 31448 -88817
38690 -88817 -256758 -268247 -161204 -120232 -93308 124782 437315 493763 249174 51955
38680 51955 71578 70448 -100444 -217436 -123152 -39051 -144995 -202232 59636 457313 612714
38669 612714 492642 347271 264529 125056 -79687 -182256 -77887 168294 420250 541798
38659 541798 446333 201684 -1051 -71441 -86648 -76376 46141 231098 229235 -29555 -237448
38648 -237448 -129559 108421 132249 -34781 -79000 111546 342501 447962 447037 378347 224703
$$ packed form
38720d87469m5147L8737L18123N05745K13064l66644n71296k00795J79923R3885
38710c21874j91770j84936R2527K73977K23330O0788j23546k38971j14678K28898
38700b96255M45218K88056l6139j93704j62195r5385j8767O5863L4756j20265
38690h8817j67941j1489J07043M0972K6924K18090L12533N6448k44589j97219
38680E1955J9623j130j70892j16992R4284Q4101j05944n7237K61868L97677J55401
38669F12714j20072j45371q2742j39473k04743j02569J04369K46181K51956J21548
38659E41798r5465k44649k02735p0390j5207J0272J22517J84957j863k58790k07893
38648b37448J07889K37980K3828j67030m4219J90546K30955J05461r25o8690j53644
$$ plain form
38637 224703 24108 -126387 -189204 -185860 -125489 -52243 -66378 -152780 -118580 108853 268503
38626 268503 105224 -203995 -283430 -145433 -166964 -454691 -630117 -409477 -66569 -51725
38616 -51725 -355011 -544401 -357641 13182 242635 257934 211863 212156 219364 176768 114294
38605 114294 81950 54843 -26329 -147258 -215011 -159204 13 172332 253692 197076 74136
38594 74136 24553 93163 182328 226654 297467 407925 359772 22952 -321251 -234075 264700
38583 264700 650278 555606 184602 -80653 -194906 -342930 -539451 -612256 -476152 -202513
38573 -202513 107074 340507 352684 93942 -293936 -621496 -801591 -779052 -489499 -40172
38563 -40172 242476 151003 -133708 -281475 -189181 39074 304548 497817 460818 222728
$$ packed form
38637B24703k00595j50495o2817L344O0371P3246j4135q6402L4200K27433J59650
38626B68503j63279l09219p9435J37997k1531k87727j75426K20640L42908J4844
38616e1725l03286j89390J86760L70823K29453J5299m6071K93P208m2596o2474
38605A14294l2344k7107q1172j20929o7753N5807J59217J72319Q1360n6616j22940
38594G4136m9583O8610Q9165M4326P0813J10458m8153l36820l44203Q7176M98775
38583B64700L85578r4672l71004k65255j14253j48024j96521p2805J36104K73639
38573b02513L09587K33433J2177k58742l87878l27560j80095K2539K89553M49327
38563d0172K82648r1473k84711j47767R2294K28255K65474J93269l6999k38090
$$ plain form
38553 222728 98290 264953 425330 236119 -104429 -136791 104805 135612 -177133 -402992
38543 -402992 -279328 -127551 -264551 -447771 -293041 73956 218016 66782 -36908 106184
38533 106184 306413 320288 139750 -114578 -360125 -523944 -516416 -344437 -164965 -134340
38523 -134340 -221225 -210263 85467 590838 971660 951613 624871 343628 289225 316206
38513 316206 260441 176751 134694 5549 -307605 -593172 -580701 -372438 -302604 -400258 -345708
38502 -345708 -11900 308275 356904 269045 263311 257388 77319 -160229 -204696 -84644 -30031
38491 -30031 -51689 50811 264730 313888 124733 4134 173889 408353 377928 149439
38481 149439 62979 222839 394200 381168 257503 182846 186878 208100 203821 142459 -9446
$$ packed form
38553B22728j24438J66663J60377j89211l40548l2362K41596L0807l12745k25859
38543d02992J23664J51777j37000j83220J54730L66997J44060j51234j03690J43092
38533A06184K00229J3875j80538k54328k45547j63819P528J71979J79472L0625
38523a34340q6885J0962K95730N05371L80822k0047l26742k81243n4403K6981
38513C16206n5765q3690m2057j29145l13154k85567J2471K08263O9834r7654N4550
38502c45708L33808L20175M8629q7859n734n923j80069k37548m4467J20052N4613
38491c0031k1658J02500K13919M9158j89155j20599J69755K34464l0425k28489
38481A49439q6460J59860J71361j3032j23665p4657M032K1222m279o1362j51905
$$ plain form
38470 -9446 -212255 -334328 -279269 -89616 127354 328912 522798 654720 610418 369445
38460 369445 87587 -50983 -33653 13042 28441 55539 64751 -64613 -284996 -311004 -15623
38449 -15623 275747 178379 -174117 -297929 -70363 126228 31987 -137065 -133381 -88714 -218358
38438 -218358 -424004 -484298 -402445 -298418 -191008 -140559 -326160 -671241 -695397 -141638
38428 -141638 513320 640067 323898 125772 158618 30898 -338158 -515502 -288457 -14607
38418 -14607 -29987 -202555 -302969 -371221 -459477 -412858 -183260 -16774 -66005 -136350 -68819
38407 -68819 -48608 -252832 -494412 -519099 -394124 -304031 -206033 4183 200352 204969 78002
38396 78002 -44413 -200365 -416151 -485971 -256797 44853 97100 -51353 -112317 -19080
$$ packed form
38470i446k02809j22073N5059J89653K16970K01558J93886J31922m4302k40973
38460C69445k81858j38570J7330M6695J5399K7098R212j29364k20383k6008K95381
38449a5623K91370r7368l52496j23812K27566J96591r4241j69052L684M4667j29644
38438b18358k05646o0294Q1853J04027J07410N0449j85601l45081k4156N53759
38428a41638O54958J26747l16169j98126L2846j27720l69056j77344K27045K73850
38418a4607j5380j72568j00414o8252q8256M6619K29598J66486m9231p0345O7531
38407f8819K0211k04224k41580k4687J24975R0093R7998K10216J96169M617j26967
38396G8002j22415j55952k15786o9820K29174L01650N2247j48453o0964R3237
$$ plain form
38386 -19080 59196 44820 -19434 -162743 -398474 -540919 -418427 -182102 -98382 -130435 -53258
38375 -53258 103714 96436 -90450 -208002 -155797 -84956 -69861 -21375 34806 -50435 -201242
38364 -201242 -116736 243977 506207 395864 125675 41152 119321 87634 -122005 -330381
38354 -330381 -452129 -594178 -773312 -766486 -387145 194444 572617 555606 357747 272616
38344 272616 288799 200875 12037 -49517 58890 79257 -106612 -220096 -22088 243411
38334 243411 185599 -116817 -232038 -49245 67377 -155082 -536169 -756255 -734466 -560066
38324 -560066 -308363 -85723 -45071 -185775 -297390 -244259 -150712 -164013 -197801 -93841
38314 -93841 84273 125109 -18452 -173180 -189935 -97024 618 53519 63244 30120 -43404
$$ packed form
38386a9080P8276j4376o4254j43309k35731j42445J22492K36325Q3720l2053P7177
38375e3258J56972p278j86886j17552N2205P0841J5095M8486N6181q5241j50807
38364b01242Q4506L60713K62230j10343k70189q4523P8169l1687k09639k08376
38354c30381j21748j42049j79134O826L79341N81589L78173j7011j97859q5131
38344B72616J6183q7924j88838o1554J08407K0367j85869j13484J98008K65499
38334B43411n7812l02416j15221J82793J16622k22459l81087k20086K1789J74400
38324e60066K51703K22640M0652j40704j11615N3131R3547j3301l3788J03960
38314i3841J78114M0836j43561j54728j6755R2911R7642N2901R725l3124p3524
$$ plain form
38303 -43404 -127920 -175127 -148709 -53451 53607 94502 40694 -41690 -39202 86077 215738
38292 215738 159292 -133244 -467882 -589803 -470458 -325604 -326149 -393860 -346444 -153486 51809
38281 51809 166773 223783 305134 418221 468719 351091 90613 -116879 -79137 166618
38271 166618 379013 377373 196652 -22668 -176746 -209665 -127203 -51453 -122463 -286497 -328225
38260 -328225 -176974 -13693 11678 -15517 25967 73347 19618 -83360 -136383 -173942 -256283
38249 -256283 -299561 -198222 -26168 50971 -9586 -128416 -225270 -237178 -143074 -58695 -132393
38238 -132393 -266971 -202301 8234 -45055 -468011 -751812 -492068 -56877 -41683 -347376
38228 -347376 -401112 -113249 57237 -55632 -109039 40633 86540 -75842 -78931 234402
$$ packed form
38303d3404q4516m7207K6418R5258J07058M0895n3808q2384K488J25279J29661
38292B15738n6446k92536l34638j21921J19345J44854n45o7711M7416J92958K05295
38281E1809J14964N7010Q1351J13087N0498j17628k60478k07492L7742K45755
38271A66618K12395j640j80721k19320j54078l2919Q2462P5750p1010j64034m1728
38260c28225J51251J63281K5371k7195M1484M7380n3729j02978n3023l7559q2341
38249b56283m3278J01339J72054P7139o0557j18830r6854j1908R4104Q4379p3698
38238a32393j34578O4670K10535n3289m22956k83801K59744M35191J5194l05693
38228c47376n3736K87863J70486j12869n3407J49672M5907j62382l089L13333
$$ plain form
38218 234402 433757 196144 -117053 -34558 277964 345608 144419 1944 -43477 -227923
38208 -227923 -503375 -528657 -239814 27846 64732 36964 100393 129218 6549 -110550
38198 -110550 -42920 93712 53825 -171611 -361939 -383464 -314118 -257140 -195966 -94301 -22452
38187 -22452 -68557 -163109 -125785 67040 177745 -8394 -359062 -525030 -398120 -246906
38177 -246906 -312377 -455140 -384735 -122092 9367 -146889 -347086 -281545 15380 239642
38167 239642 221427 83281 -7996 -80553 -250024 -473249 -558583 -415771 -171121 -2188
38157 -2188 36962 -18326 -134154 -245605 -234223 -64667 120638 177077 172130 257624 358987
38146 358987 215281 -204699 -538283 -447860 -76984 118398 -43280 -262986 -196883 82672
$$ packed form
38218B34402J99355k37613l13197Q2495L12522O7644k01189j42475m5421j84446
38208b27923k75452k5282K88843K67660L6886k7768O3429K8825j22669j17099
38198a10550O7630J36632l9887k25436j90328k1525O9346N6978O1174J01665P1849
38187b2452m6105r4552L7324J92825J10705j86139l50668j65968J26910J51214
38177b46906o5471j42763P0405K62643J31459j56256k00197O5541K96925K24262
38167B39642j8215j38146r1277p2557j69471k23225q5334J42812K44650J68933
38157b188L9150n5288j15828j11451J1382J69556J85305N6439m947Q5494J01363
38146C58987j43706m19980l33584R0423L70876J95382j61678k19706O6103K79555
$$ plain form
38136 82672 209433 14768 -285525 -397827 -272082 -43656 194859 413932 525538 432616
38126 432616 205781 50338 50433 73286 -11634 -128682 -96918 126184 371641 412032 180804
38115 180804 -126531 -202949 48706 393726 554720 529252 463059 331353 30119 -275276
38105 -275276 -267914 -5222 60995 -251021 -540871 -417040 -52778 162136 210131 287323
38095 287323 307706 54295 -289887 -261345 208910 659501 716298 493182 284669 188107
38085 188107 168280 222046 312109 330577 263939 240857 319816 381816 321910 202434 126799
38074 126799 84108 2237 -136199 -284316 -364167 -303600 -131616 -19419 -109334 -319061
38064 -319061 -436197 -378388 -229517 -64582 99902 217746 248772 255826 299651 286070 113002
$$ packed form
38136H2672J26761j94665l00293j12302J25745K28426K38515K19073J11606r2922
38126D32616k26835j55443R5K2853q4920j17048L1764K23102K45457M0391k31228
38115A80804l07335p6418K51655L45020J60994k5468o6193j31706l01234l05395
38105b75276P362K62692O6217l12016k89850J23831L64262K14914M7995P7192
38095B87323K0383k53411l44182K8542M70255M50591N6797k23116k08513r6562
38085A88107j9827N3766R0063J8468o6638k3082P8959O2000n9906j19476p5635
38074A26799m2691q1871j38436j48117p9851O0567J71984J12197q9915k09727
38064c19061j17136N7809J48871J64935J64484J17844L1026P054M3825j3581j73068
$$ plain form
38053 113002 -86888 -94622 28332 -6636 -270700 -495752 -462308 -259504 -70043 69312
38043 69312 178957 216965 180677 163525 194992 169831 36207 -88559 -87705 -3122 55104
38032 55104 31507 -96997 -312366 -463976 -365940 -78460 90178 -11902 -147505 -27026
38022 -27026 268797 411309 284924 98313 36063 11759 -135364 -335302 -341521 -75629
38012 -75629 232295 327130 241540 176631 139437 -64834 -443184 -683872 -575817 -343771
38002 -343771 -336786 -539313 -656145 -576105 -454930 -379449 -257219 -76648 1329 -88215 -167296
37991 -167296 -61907 146720 233941 111541 -89926 -179753 -104558 8000 16177 -41248 -9333
37980 -9333 123029 196998 176488 247178 478293 605273 372196 -79892 -404878 -481851 -413551
$$ packed form
38053A13002j99890p734J22954l4968k64064k25052L3444K02804J89461J39355
38043F9312J09645L8008l6288j7152L1467k5161j33624j24766Q54Q4583N8226
38032E5104k3597j28504k15369j51610R8036K87480J68638j02080j35603J20479
38022b7026K95823J42512j26385j86611o2250k4304j47123j99938o219K65892
38012g5629L07924R4835q5590o4909l7194k04271l78350k40688J08055K32046
38002c43771O985k02527j16832Q0040J21175P5481J22230J80571P7977q9544p9081
37991a67296J05389K08627Q7221j22400k01467q9827P5195J12558Q177n7425L1915
37980i333J32362P3969k0510P0690K31115J26980k33077m52088l24986p6973O8300
$$ plain form
37969 -413551 -262021 -77662 -52037 -312136 -644637 -734730 -609297 -545087 -619523 -673429
37959 -673429 -649451 -630651 -589672 -431782 -250411 -217445 -265799 -206379 -94407 -125727 -238501
37948 -238501 -204151 -53115 2020 5808 165344 364299 286501 24277 1924 226716 213984
37937 213984 -180281 -449954 -226849 164586 273526 165288 118945 95587 -66432 -234918
37927 -234918 -183189 -52 53284 -62544 -193914 -254855 -220228 -36676 229294 324405
37917 324405 106323 -238216 -439906 -451323 -378036 -303767 -304065 -414856 -480396 -279784 102433
37906 102433 324986 298335 280870 338378 149088 -399653 -846962 -756102 -347686 -147194
37896 -147194 -260464 -398029 -420171 -442647 -496906 -449869 -252295 -22115 108938 90986
$$ packed form
37969d13551J51530J84359K5625k60099l32501r0093J25433O4210p4436n3906
37959f73429K3978J8800M0979J57890J81371L2966m8354N9420J11972l1320j12774
37948b38501L4350J51036N5135L788J59536J98955p7798k62224k2353K24792j2732
37937B13984l94265k69673K23105L91435J08940j08238m6343k3358j62019j68486
37927b34918N1729J83137N3336j15828j31370o0941L4627J83552K65970R5111
37917C24405k18082l44539k01690j1417P3287P4269k98j10791o5540K00612L82217
37906A02433K22553k6651j7465N7508j89290n48741m47309R0860M08416K00492
37896a47194j13270j37565k2142k2476n4259M7037J97574K30180J31053j7952
$$ plain form
37886 90986 -29593 -99940 911 147402 91869 -135790 -230960 -111488 -69392 -257946
37876 -257946 -392658 -216736 72347 169462 140183 205154 280864 105989 -311334 -685195
37866 -685195 -800721 -648516 -332070 -34120 57021 -53909 -182268 -254766 -360049 -445290
37856 -445290 -298047 40464 218525 109056 6746 80178 67319 -199057 -414191 -310399
37846 -310399 -118914 -122070 -159716 -30847 25661 -222693 -447707 -243945 136061 154676
37836 154676 -143452 -287591 -223197 -309064 -557782 -575308 -289596 -94566 -158841 -176652
37826 -176652 23338 146416 -54413 -352096 -394673 -184689 15393 49661 -27296 -70181
37816 -70181 27553 220481 322754 243604 145554 221471 410438 501441 400620 134803 -227058
$$ packed form
37886I0986j20579p0347J00851J46491n5533k27659r5170J19472M2096j88554
37876b57946j34712J75922K89083R7115k9279O4971P5710j74875m17323l73861
37866f85195j15526J52205L16446K97950R1141j10930j28359p2498j05283q5241
37856d45290J47243L38511J78061j09469j02310P3432j2859k66376k15134J03792
37846c10399J91485l156l7646J28869N6508k48354k25014K03762L80006J8615
37836A54676k98128j44139O4394q5867k48718j7526K85712J95030o4275j7811
37826a76652J99990J23078k00829k97683m2577K09984K00082L4268p6957m2885
37816g0181R7734J92928J02273p9150r8050P5917J88967R1003j00821k65817l61861
$$ plain form
37805 -227058 -460832 -248916 355702 783229 630097 248164 218815 461679 406179 -72241
37795 -72241 -481437 -495618 -353593 -353205 -425640 -398677 -307640 -245656 -178938 -69757 23357
37784 23357 62540 72199 40523 -39614 -66609 20531 59683 -113157 -344791 -363672 -216500
37773 -216500 -170830 -246865 -218995 -58022 15668 -63016 -124698 -134518 -268008 -540105 -704802
37762 -704802 -627629 -456403 -332387 -218490 -95868 -52455 -93532 -119188 -143123 -268234
37752 -268234 -408075 -331976 -51180 138035 77499 -72454 -151457 -192630 -194724 -21379 299852
37741 299852 454187 239009 -97854 -132942 219086 617691 657353 227732 -415793 -870817
37731 -870817 -919287 -672511 -389105 -227597 -221898 -348077 -479156 -420127 -170863 -20942
$$ packed form
37805b27058k33774K11916O04618M27527j53132l81933k9349K42864n5500m78420
37795g2241m09196j4181J42025L88p2435K6963R1037O1984O6718J09181R3114
37784B3357L9183R659l1676q0137k6995Q7140L9152j72840k31634j8881J47172
37773b16500M5670p6035K7870J60973P3690p8684o1682r820j33490k72097j64697
37762g04802P7173J71226J24016J13897J22622M3413m1077k5656k3935j25111
37752b68234j39841P6099K80796J89215o0536j49953p9003m1173k094J73345L21231
37741B99852J54335k15178l36863l5088L52028L98605L9662m29621o43525m55024
37731h70817m8470K46776K83406J61508N699j26179j31079N9029K49264J49921
$$ plain form
37721 -20942 -179976 -453837 -520645 -377482 -232357 -101449 133418 358106 307459 8406
37711 8406 -213744 -201857 -117179 -91954 -62960 -21326 -106636 -325374 -442879 -312192 -113433
37700 -113433 -105318 -258075 -277737 24466 454226 583410 248162 -164623 -139893 263185
37690 263185 462925 207466 -45099 144794 522394 604723 443890 388776 377267 103199
37680 103199 -272921 -261252 127299 340015 151160 -42735 43973 138526 -41276 -279039
37670 -279039 -233754 30266 210485 219013 189873 198607 195202 123094 -13355 -119846 -39390
37659 -39390 251369 501499 436226 120474 -139537 -210341 -199651 -165208 -53419 81652
37649 81652 95668 9598 -20762 694 -88476 -306397 -481017 -511077 -440167 -299259 -112260
$$ packed form
37721b0942j59034k73861o6808J43163J45125J30908K34867K24688n0647k99053
37711H406k22150J1887Q4678K5225K8994M1634q5310k18738j17505J30687J98759
37700a13433Q115j52757j9662L02203M29760J29184l35248m12785K4730M03078
37690B63185J99740k55459k52565J89893L77600Q2329j60833n5114j1509k74068
37680A03199l76120J1669L88551K12716j88855j93895Q6708R4553j79802k37763
37670b79039M5285K64020J80219Q528k9140Q734l405p2108j36449j06491Q0456
37659c9390K90759K50130o5273l15752k60011p0804J0690L4443J11789J35071
37649H1652J4016q6070l0360K1456q9170k17921j74620l0060P0910J40908J86999
$$ plain form
37638 -112260 -5409 -67893 -179770 -216183 -280939 -451122 -487673 -194142 116996 6387
37628 6387 -352269 -354760 127438 567267 577196 371737 294333 330579 287720 128288 -38614
37617 -38614 -71604 140772 506482 676818 446374 93494 -9831 45233 -37736 -150362
37607 -150362 10600 270532 172776 -202197 -306994 -45593 94198 -71713 -142579 64254
37597 64254 164555 -35107 -116479 221105 602364 568780 225003 -105302 -389132 -644455
37587 -644455 -651412 -343425 -92093 -175814 -322791 -186270 88471 193979 199971 292037 281470
37576 281470 -98730 -608525 -728845 -395143 -70945 -108914 -376834 -516576 -319006 145503
37566 145503 578709 673703 423289 139001 62998 90909 -3919 -222134 -363942 -295490
$$ packed form
37638a12260J06851o2484j11877l6413o4756j70183l6551K93531L11138j10609
37628F387l58656k491M82198M39829R929k05459p7404L6246m2859j59432j66902
37617c8614l2990K12376L65710J70336k30444l52880j03325N5064q2969j12626
37607a50362J60962K59932r7756l74973j04797K61401J39791j65911p0866K06833
37597F4254J00301j99662q1372L37584L81259l3584l43777l30305k83830k55323
37587f44455o957L07987K51332q3721j46977J36521K74741J05508N992R2066j0567
37576B81470l80200n09795j20320L33702L24198l7969k67920j39742J97570M64509
37566A45503M33206R4994k50414k84288p6003K7911r4828k18215j41808O8452
$$ plain form
37556 -295490 -67051 160124 241280 175074 105199 113407 93728 -24072 -70467 105064 323407
37545 323407 341339 284605 429027 672105 676746 460260 341147 342746 191115 -92548 -175435
37534 -175435 -41874 -39399 -193567 -98819 336347 657036 606182 495888 556733 514709 168283
37523 168283 -161047 -151217 22156 91963 154876 339262 452422 355327 283184 396501 409895
37512 409895 86056 -271691 -259393 19078 215285 312447 496566 690615 649912 369848
37502 369848 60123 -142235 -185107 -32633 184048 187812 -47011 -179563 3243 275846
37492 275846 375454 376209 406043 339859 86693 -123192 -61676 134415 200287 111510 -2316
37481 -2316 -56287 50469 385153 710455 626710 158330 -198750 -187229 -90516 -136337 -136661
$$ packed form
37556b95490K28439K27175Q1156o6206o9875Q208j9679j17800m6395J75531K18343
37545C23407J7932n6734J44422K43078M641k16486j19113J599j51631k83663q2887
37534a75435J33561K475j54168R4748M35166L20689n0854j10294O0845m2024l46426
37523A68283l29330R830J73373O9807O2913J84386J13160r7095p2143J13317J3394
37512D09895l23839l57747J2298K78471J96207R7162J84119J94049m0703k80064
37502C69848l09725k02358m2872J52474K16681L764k34823j32552J82806K72603
37492B75846R9608P55K9834o6184k53166k09885O1516J96091O5872q8777j13826
37481b316n3971J06756L34684L25302q3745m68380l57080J1521R6713m5821l24
$$ plain form
37470 -136661 5912 8750 -202650 -186092 273682 639825 381779 -194173 -442555 -311818
37460 -311818 -188603 -154831 -31236 86290 -45019 -299692 -341666 -181457 -100756 -144899
37450 -144899 -136216 -69642 -69701 -66943 87985 299721 375488 364536 412701 439372 308161 155217
37438 155217 189681 318009 318051 244601 314119 505323 597940 510646 331956 136167 4988
37427 4988 77505 347951 577696 609640 571638 584111 521285 280587 26941 -64513 -63535
37416 -63535 -83091 -92438 -104594 -233027 -393577 -318218 -39001 68974 -80802 -109239 135598
37405 135598 277557 129233 89965 375297 470081 -47605 -679825 -714127 -329996 -237637
37395 -237637 -514282 -594505 -270682 57957 127420 138486 262789 358925 310412 242797 278614
$$ packed form
37470a36661J42573K838k11400J6558M59774L66143k58046n75952k48382J30737
37460c11818J23215L3772J23595J17526j31309k54673m1974J60209Q0701m4143
37450a44899Q683O6574n9K758J54928K11736P5767j0952M8165K6671j31211j52944
37438A55217L4464J28328M2p3450O9518J91204R2617q7294j78690j95789j31179
37427D988P2517K70446K29745L1944l8002J2473o2826k40698k53646r1454R78
37416f3535j9556r347j2156j28433j60550P5359K79217J07975j49776k8437K44837
37405A35598J41959j48324l9268K85332R4784n17686o32220l4302L84131R2359
37395b37637k76645q0223L23823L28639O9463J1066J24303R6136m8513o7615L5817
$$ plain form
37384 278614 352565 346179 228097 59217 -30797 45601 178337 180261 95078 116932 184660
37373 184660 55844 -145209 33926 602070 932750 631529 83875 -186657 -196470 -176951
37363 -176951 -90859 97473 138548 -73605 -217354 -92364 7192 -119869 -124524 282563
37353 282563 743034 790941 552997 408563 366728 270615 205872 224915 79411 -315649
37343 -315649 -582003 -459253 -198954 5981 372763 864935 897394 291561 -203556 -36711
37333 -36711 228525 -79623 -542137 -407922 81989 191152 9541 164236 567940 580982
37323 580982 208765 63761 242176 237441 -69931 -258041 -194569 -183738 -275976 -196071 36019
37312 36019 107383 11202 11161 86402 15490 -121117 -117854 -127307 -352459 -502320 -221465 187529
$$ packed form
37384B78614P3951o386j18082j68880r0014P6398J32736J924q5183K1854O7728
37373A84660j28816k01053J79135N68144L30680l01221n47654k70532r813J9519
37363a76951Q6092J88332M1075k12153j43749J24990R9556j27061m655M07087
37353B82563M60471M7907k37944j44434m1835r6113o4743J9043j45504l95060
37343c15649k66354J22750K60299K04935L66782M92172L2459o05833m95117J66845
37333c6711K65236l08148m62514J34215M89911J09163j81611J54695M03704J3042
37323E80982l72217j45004J78415m735l07372j88110O3472J0831r2238P9905K32090
37312C6019P1364r6181m1P5241p0912j36607L263r453k25152j49861K80855M08994
$$ plain form
37300 187529 171913 -179820 -360799 -310637 -327710 -364292 -165614 104068 113207 21089 170485
37289 170485 387699 323007 187023 365406 610417 445379 73554 25150 199066 151821
37279 151821 41406 329510 800343 848374 519576 309157 183744 -179602 -455514 -96740
37269 -96740 503288 455762 -130041 -303176 120108 343189 56008 -122984 117338 262821
37259 262821 5406 -235115 -157286 -37647 -38900 104985 429753 529969 254719 -53389
37249 -53389 -154754 -117438 77863 454607 641614 307090 -143522 -119753 109119 -127613
37239 -127613 -608024 -494375 193550 560612 309161 54229 91263 45055 -101149 167176
37229 167176 793296 1030612 717058 554625 815522 891222 490638 183733 321844 457314
$$ packed form
37300A87529j5616l51733j80979N0162j7073l6582J98678K69682R139r2118J49396
37289A70485K17214o4692j35984J78383K45011j65038l71825m8404J73916m7245
37279A51821j10415K88104M70833M8031l28798k10419j25413l63346k75912L58774
37269i6740O00028m7526n85803j73135M23284K23081k87181j78992K40322J45483
37259B62821k57415k40521P7829J19639j253J43885L24768J00216k75250l08108
37249e3389j01365L7316J95301L76744J87007l34524m50612K3769K28872k36732
37239a27613m80411J13649O87925L67062k51451k54932L7034m6208j46204K68325
37229A67176O26120K37316l13554j62433K60897P5700m00584l06905J38111J35470
$$ plain form
37219 457314 295530 235170 481276 559541 219132 -40067 167740 507716 619956 671681
37209 671681 822999 867733 752391 744727 809708 557488 48409 -137993 129613 309656
37199 309656 156132 70992 252410 350113 226464 209229 339841 237127 -49693 47523
37189 47523 587309 905372 708202 477099 500013 424281 92272 -85121 71158 194612
37179 194612 153240 272827 521479 394991 -96559 -266341 113848 447416 393946 368545
37169 368545 622878 771961 611023 507143 621088 605983 387267 361167 546590 456007
37159 456007 65270 -39741 270735 445171 325195 400738 736004 736157 296928 86644
37149 86644 340698 475137 250930 195330 477148 499776 50627 -244490 -49956 166289
$$ packed form
37219D57314j61784o0360K46106P8265l40409k59199K07807L39976J12240N1725
37209F71681J51318M4734j15342p664O4981k52220n09079j86402K67606J80043
37199C09656j53524q5140J81418R7703j23649j7235J30612j02714k86820R7216
37189D7523N39786L18063j97170k31103K2914p5732l32009j77393J56279J23454
37179A94612m1372J19587K48652j26488m91550j69782L80189L33568n3470k5401
37169C68545K54333J49083j60938j03880J13945j5105k18716k6100J85423r0583
37159D56007l90737j05011L10476J74436j19976P5543L35266J53m39229k10284
37149H6644K54054J34439k24207n5600K81818K2628m49149k95117J94534K16245
$$ plain form
37139 166289 135350 206869 405466 219712 -292950 -379734 51761 193902 -154835 -173931
37129 -173931 418884 770151 435111 157776 445392 691553 447132 281380 597283 805785
37119 805785 475888 159786 306474 471852 340362 403846 893241 1157018 829472 514837
37109 514837 623747 661454 344477 247745 640254 856709 538638 329639 643659 923860
37099 923860 789243 698291 838081 649312 99425 50908 673571 925344 352977 -79054
37089 -79054 247427 559439 298465 197741 757166 1182660 913989 706420 1089149 1250037
37079 1250037 617573 72029 366469 779289 560802 285567 524720 630613 137011
37070 137011 -94679 521007 1006748 551970 70918 527944 1127795 790883 118355 216184
$$ packed form
37139A66289l0939P1519J98597j85754n12662q6784M31495J42141l48737j9096
37129a73931N92815L51267l35040k77335K87616K46161k44421j65752L15903K08502
37119H05785l29897l16102J46688J65378j31490O3484M89395K63777l27546l14635
37109E14837J08910L7707l16977r6732L92509K16455l18071k08999L14020K80201
37099I23860j34617r0952J39790j88769n49887m8517O22663K51773n72367m32031
37089g9054L26481L12012k60974j00724N59425M25494k68671k07569L82729J60888
37079A250037o32464n45544K94440M12820k18487k75235K39153J05893m93602
37070A37011k31690O15686M85741m54778m81052M57026N99851l36912o72528R7829
$$ plain form
37060 216184 749103 827570 737983 1147149 1587193 1328797 849307 940315 1245473 1078822
37050 1078822 781558 936525 1173292 1013651 919516 1305763 1569882 1251679 1018059 1400117
37040 1400117 1820977 1942976 2498952 3608749 3904266 2705552 1432037 1365172 1659893
37031 1659893 1168485 553743 818103 1318704 1101584 752960 1099874 1479413 1074394
37022 1074394 556291 690703 809936 361183 321861 1295441 1958325 1316710 691822 1400504
37012 1400504 2315927 1971707 1253995 1583498 2178274 1693508 957977 1417464 2318375
37003 2318375 2100372 1248684 1156785 1455349 1052152 555445 1101913 1995419 1975490 1570904
36993 1570904 1816685 2040507 1329502 675118 1191063 1808415 1265974 655294 1337915
$$ packed form
37060B16184N32919P8467q9587M09166M40044k58396m79490R1008L05158j66651
37050A078822k97264J54967K36767j59641r4135L86247K64119l18203k33620L82058
37040A400117M20860J21999N55976J109797K95517j198714j273515o6865K94721
37031A659893m91408o14742K64360N00601k17120l48624L46914L79539m05019
37022A074394n18103J34412J19233m48753l9322R73580O62884o41615o24888P08682
37012A400504R15423l44220p17712L29503N94776m84766p35531M59487R00911
37003B318375k18003q51688r1899K98564m03197m96707N46468Q93506j9929m04586
36993A570904K45781K23822p11005o54384N15945O17352n42441o10680O82621
$$ plain form
36984 1337915 2167883 1610058 756413 1251058 2074575 1519095 533616 866719 1670740
36975 1670740 1263634 496780 1005207 1887491 1533274 925869 1665407 2616980 2072547
36966 2072547 1239287 1915985 2817234 2023894 876341 1450094 2469221 1882069 1062896
36957 1062896 2075305 3312861 2498787 1366970 2448161 3964806 3156473 1822920
36949 1822920 2948739 4715152 3861440 2101993 2859839 4542531 3757798 2227218 3419157
36940 3419157 5383402 4445762 2814572 4498249 7061589 6086010 4216549 6352167
36932 6352167 9652729 8697021 6603385 9545400 14325161 14199280 12835588 18070289
36924 18070289 26056464 27956520 28077624 36543678 48399050 52527012 57253000 79223750
$$ packed form
36984A337915Q29968n57825q53645M94645Q23517n55480r85479L33103Q04021
36975A670740m07106p66854N08427Q82284l54217o07405P39538R51573n44433
36966B072547q33260O76698R01249p93340j147553N73753J019127n87152q19173
36957A062896J012409J237556q14074j131817J081191J516645q08333j333553
36949A822920J125819J766413q53712j759447P57846J682692p84733j530580J191939
36940C419157J964245r37640j631190J683677K563340r75579j869461K135618
36932F352167L300562r55708k093636K942015M779761j25881j363692N234701
36924A8070289P986175J900056J21104Q466054J1855372M127962M725988K1970750
$$ plain form
36916 79223750 109673030 128657421 156555192 242847916 379302242 469665137 430331620
36909 430331620 294898120 172725763 120772351 105508691 82728183 57212067 49526949
36902 49526949 51737088 44867975 31787820 25907461 25240943 20007712 12801498 11867621
36894 11867621 14175744 11727268 6786690 6459335 8900354 7791159 4617393 4762365
36886 4762365 6577944 5127455 2204576 2642248 4767674 3841997 1269885 1600736 3710922
36877 3710922 3301841 1219620 1404853 3153884 2856619 1157492 1395693 2946433 2672668
36868 2672668 1152642 1301502 2540134 2170247 885505 1340421 2810946 2604815 1278830
36859 1278830 1357069 2343823 1961495 913614 1566508 3209922 3324539 2334199 2561549
$$ packed form
36916G9223750L0449280J8984391K7897771Q6292724J36454326R0362895l9333517
36909D30331620j35433500j22172357n1953412j5263660k2780508k5516116p685118
36902D9526949K210139o869113j3080155n880359o66518n233231p206214r33877
36894A1867621K308123k448476m940578l27355K441019j109195l173766J44972
36886D762365J815579j450489k922879M37672K125426r25677k572112L30851K110186
36877C710922m09081k082221J85233J749031k97265j699127K38201J550740k73765
36868B672668j520026J48860J238632l69887j284742M54916J470525k06131j325985
36859A278830P8239R86754l82328j047881O52894J643414J14617r90340K27350
$$ plain form
36850 2561549 3652531 3487824 2524261 2865200 4036616 3948583 3110800 3709995 5348143
36841 5348143 5805576 5301062 5967070 7702758 8485690 8361418 9349915 11696611 13779306
36832 13779306 15496875 18378424 22487128 26266320 29133489 31313390 31662030 28771954
36824 28771954 23869521 19660936 16674541 13542344 10310809 8425115 7802807 6922541
36816 6922541 5631414 5089543 5155975 4533622 3301930 2708816 2685002 2089433 1135160
36807 1135160 1054543 1633621 1558288 928196 975090 1563706 1409600 537088 151292 320750
36797 320750 96741 -368806 -128196 482666 364679 -128431 197294 993785 997916 585548
36787 585548 1175798 2449172 2751381 2015785 1676636 1869487 1400255 421382 387814 1234121
$$ packed form
36850B561549J090982j64707r63563L40939J171416q8033q37783N99195J638148
36841E348143M57433n04514O66008J735688P82932j24272R88497K346696K082695
36832A3779306J717569K881549M108704L779192K867169K179901L48640k890076
36824B8771954m902433m208585k986395l132197l231535j885694o22308q80266
36816F922541j291127n41871O6432o22353j231692n93114k3814n95569r54273
36807A135160q0617N79078p5333o30092M6894N88616j54106q72512l85796J69458
36797C20750k24009m65547K40610O10862j17987m93110L25725P96491M131m12368
36787E85548N90250J273374L02209p35596l39149J92851m69232r78873l3568Q46307
$$ plain form
36777 1234121 1314655 418536 165133 998592 1450799 986099 978486 2046111 2897740 2902835
36767 2902835 3543754 5935263 8663443 9493088 8011551 5520018 3328090 2011224
36759 2011224 1516595 1330880 1059643 960335 1296924 1504137 981479 300637 393401 949512
36749 949512 988430 596260 594503 915693 935406 977956 1723116 2580527 2659128 2939982 5117811
36738 5117811 8325374 9515669 7548512 4623308 3021111 2569842 2161278 1742489 1639304
36729 1639304 1484747 987440 620701 679225 679347 344130 145441 321429 393672 141645
36719 141645 33830 269045 396841 251695 264074 535620 597592 337863 181722 182511
36709 182511 -44534 -374034 -238213 265283 436036 193109 99958 188747 10086 -170150
$$ packed form
36777A234121Q0534q96119k53403Q33459M52207m64700p613J067625Q51629N095
36767B902835O40919K391509K728180Q29645j481537k491533k191928j316866
36759B011224m94629j85715k71237r9308L36589K07213n22658o80842R2764N56111
36749I49512L8918l92170j757L21190J9713M2550P45160Q57411P8601K80854K177829
36738E117811L207563J190295j967157k925204j602197m51269m08564m18789j03185
36729A639304j54557m97307l66739N8524J22l35217j98689J75988P2243k52027
36719A41645j07815K35215J27796j45146J2379K71546O1972k59729j56141P89
36709A82511k27045l29500J35821N03496J70753k42927r3151Q8789j78661j80236
$$ plain form
36699 -170150 377165 1314367 1420917 526243 -167821 15714 409421 426912 432168 734526
36689 734526 962674 898941 838746 795534 440064 36805 257485 879914 933131 332984
36679 332984 47099 406459 647134 427278 363619 666902 673331 211369 49000 456277
36669 456277 667430 320436 103320 387900 540108 224162 99058 518781 779246 413080
36659 413080 76861 368762 826711 877532 805394 1026480 1286213 1258190 1126821 1022223
36649 1022223 713476 318634 399735 920593 1094200 690628 441559 700673 839932 504811
36639 504811 300583 603142 828183 576008 399204 685473 839204 380753 -120960 -39383
36629 -39383 274633 241182 10597 -64867 -122769 -265880 -139981 313006 480978 78860
$$ packed form
36699a70150N47315R37202J06550q94674o94064J83535L93707J7491N256L02358
36689G34526K28148o3733o0195m3212l55470m03259K20680O22429N3217o00147
36679C32984k85885L59360K40675k19856o3659L03283O429m61962j62369M07277
36669D56277K11153l46994k17116K84580J52208l15946j25104M19723K60465l66166
36659D13080l36219K91901M57949N0821p2138K21086K59733k8023j31369j04598
36649A022223l08747l94842Q1101N20858J73607m03572k49069K59114J39259l35121
36639E04811k04228L02559K25041k52175j76804K86269J53731m58451n01713Q1577
36629c9383L14016l3451k30585p5464n7902j43111J25899M52987J67972m02118
$$ plain form
36619 78860 -301087 -224141 -124781 -376897 -557959 -295188 35234 101667 225455 568575
36609 568575 641427 269756 86889 378565 447039 -120058 -579975 -282682 213470 192810
36599 192810 -10810 162818 379543 154029 -107473 138120 517929 478782 361929 702214
36589 702214 1131122 1037198 704128 743716 965338 839090 550969 590178 786554 724243
36579 724243 617990 854673 1184125 1257497 1385371 1868003 2261496 2282408 2653971 3922920
36569 3922920 5301639 6100476 7469507 10835198 14977301 16692545 14614900 10710091
36561 10710091 7587807 5861697 4755890 3886335 3405626 3204533 2939479 2542703 2160504
36552 2160504 1835811 1559461 1365305 1193149 932606 667282 558319 498746 267152 -5933
$$ packed form
36619G8860l79947P6946R9360k52116j81062K62771L30422O6433J23788L43120
36609E68575P2852l71671j82867K91676O8474n67097m59917K97293M96152k0660
36599A92810k03620J73628K16725k25514k61502K45593L79809l9147j16853L40285
36589G02214M28908r3924l33070L9588K21622j26248k88121L9209J96376o2311
36579G24243j06253K36683L29452P3372J27874M82632L93493K0912L71563J268949
36569C922920J378719P98837J369031L365691M142103J715244k077645l904809
36561A0710091l122284j726110j105807q69555m80709k01093k65054l96776l82199
36552B160504l24693k76350j94156j72156k60543k65324j08963n9573k31594k73085
$$ plain form
36542 -5933 38355 392142 634847 515506 209876 -18306 -82265 -15603 56920 -41678 -269603
36531 -269603 -281688 101270 544152 644873 495558 426386 440362 338564 197218 259646
36521 259646 499839 702264 828804 942224 953425 808090 714592 831688 971068 955818
36511 955818 969266 1162964 1272703 1090590 971782 1330476 1917036 2155040 1974215 1788387
36501 1788387 1863343 2199569 2803821 3585758 4234962 4668616 5298316 6410342 7757353
36492 7757353 9357635 12059150 16245807 20282155 21491220 18936870 14407251 10428475
36484 10428475 8047633 6775189 5850043 4948520 4065094 3288465 2705294 2326273 2100935
36475 2100935 1983769 1900631 1749095 1555470 1473326 1490896 1379158 1101198 955703 1076658
$$ packed form
36542e933M4288L53787K42705j19341l05630k28182o3959O6662P2523r8598k27925
36531b69603j2085L82958M42882J00721j49315o9172J3976j01798j41346O2428
36521B59646K40193K02425J26540J13420J1201j45335r3498J17096J39380j5250
36511I55818J3448J93698J09739j82113j18808L58694N86560K38004j80825j85828
36501A788387P4956L36226O04252P81937O49204M33654O29700J112026J347011
36492G757353J600282K701515M186657M036348J209065k554350m529619l978776
36484A0428475k380842j272444r25146r01523q83426p76629n83171l79021k25338
36475B100935j17166q3138j51536j93625q2144J7570j11738k77960j45495J20955
$$ plain form
36465 1076658 1151506 935206 655047 553484 449874 172979 -9719 121194 257886 105476
36455 105476 -42371 144348 357215 185374 -112511 -77714 156217 300753 638545 1412796
36445 1412796 2014411 1897808 1867690 3076109 4911892 5401785 3903888 1977133 1146424
36436 1146424 1135945 975996 656479 730623 1111519 1266026 1150243 1136114 1291332 1368403
36426 1368403 1298810 1207873 1120568 1015752 982569 1060442 1134941 1156490 1193974 1183600 985209
36415 985209 750785 791962 1017823 1025197 820548 837501 1109866 1120663 696200 330414
36405 330414 315519 285228 7749 -119057 140566 300180 -14298 -327876 -98077 333617
36395 333617 305248 -110851 -349704 -277777 -176707 -123523 -40746 -62975 -249167 -266218 49417
$$ packed form
36465A076658P4848k16300k80159j01563j03610k76895j82698J30913J36692j52410
36455A05476j47847J86719K12867j71841k97885L4797K33931J44536L37792P74251
36445A412796O01615j16603l0118J208419J835783M89893j497897j926755q30709
36436A146424j0479j59949l19517P4144L80896J54507j15783j4129J55218P7071
36426A368403o9593r0937q7305j04816l3183P7873P4499K1549L7484j0374j98391
36415I85209k34424M1177K25861P374k04649J6953K72365J0797m24463l65786
36405C30414j4895l0291k77479j26806K59623J59614l14478l13578K29799M31694
36395C33617k8369m16099k38853P1927J01070N3184Q2777k2229j86192j7051L15635
$$ plain form
36384 49417 220778 -129787 -515777 -308146 209560 339871 128051 110455 257426 152025
36374 152025 -60129 67505 305172 106123 -266502 -119090 351876 372155 79646 310364
36364 310364 955522 1072357 693571 839918 1541214 1711055 1339968 1708530 2834192
36355 2834192 3114741 2472740 3094803 5497339 7052137 7096127 10178218 19670740 30155854
36346 30155854 31876586 22933847 11826081 6566225 6197837 5478435 3262448 2072381
36338 2072381 2383013 2150607 966071 572308 1361426 1690146 929839 371504 647577
36329 647577 730419 102959 -269473 125401 368036 -110613 -458758 -6034 526096 333146
36319 333146 -194727 -383510 -383236 -537532 -609181 -413769 -361167 -660796 -812925 -533551
$$ packed form
36384D9417J71361l50565l85990K07631N17706J30311k11820j7596J46971j05401
36374A52025k12154J27634K37667j99049l72625J47412M70966K0279k92509K30718
36364C10364O45158J16835l78786J46347P01296J69841l71087L68562J125662
36355B834192K80549o42001O22063K402536J554798M3990L082091R492522J0485114
36346C0155854J720732q942739j1107766n259856l68388p19402k215987j190067
36338B072381L10632k32406j184536l93763P89118L28720p60307n58335K76073
36329F47577Q2842o27460l72432L94874K42635m78649l48145M52724N32130j92950
36319C33146n27873j88783K74j54296p1649J95412N2602k99629j52129K79374
$$ plain form
36309 -533551 -335117 -536592 -575486 -37974 469122 294513 -155105 -146921 186286 262222
36299 262222 119484 192432 427176 454092 336590 402346 578920 558466 395843 356245
36289 356245 395286 313715 182479 139572 49413 -182375 -284633 -76392 106356 -71015
36279 -71015 -351066 -320170 -86268 5662 -1252 116662 236106 116093 -114800 -214955
36269 -214955 -291416 -498423 -584645 -289110 100247 149341 -27674 -47255 32229 -114764
36259 -114764 -410810 -498748 -377863 -327426 -331699 -162252 76242 59228 -162905 -222316 -45560
36248 -45560 90960 81467 88788 137877 58031 -153481 -287487 -257054 -184001 -187000 -307021
36237 -307021 -521489 -642514 -439900 -80242 -91619 -590087 -961920 -728848 -283999 -232178
$$ packed form
36309e33551J98434k01475l8894N37512N07096j74609m49618Q184L33207P5936
36299B62222j42738P2948K34744K6916j17502O5756J76574k0454j62623l9598
36289C56245L9041q1571j31236m2907r0159k31788j02258K08241J82748j77371
36279g1015k80051L0896K33902R1930o914J17914J19444j20013k30893j00155
36269b14955p6461k07007q6222K95535L89357M9094j77015j9581P9484j46993
36259a14764k96046q7938J20885N0437m273J69447K38494j7014k22133n9411J76756
36248d5560J36520r493P321M9089p9846k11512j34006L0433P3053k999j20021
36237c07021k14468j21025K02614L59658j1377m98468l71833K33072M44849N1821
$$ plain form
36227 -232178 -430341 -354578 -69350 -54231 -277776 -250563 71273 208866 17214 -95884
36217 -95884 84486 257733 194163 89016 139762 230696 225355 201089 239928 281245 271567
36206 271567 218826 101031 -40157 -8178 259224 448109 257230 -119905 -279706 -216660
36196 -216660 -226923 -356903 -409801 -379316 -401826 -383880 -167584 29293 -140555 -524961
36186 -524961 -619034 -331327 -90036 -155176 -309521 -300740 -164875 -37891 2905 -112069
36176 -112069 -343435 -444857 -277279 -89492 -131356 -180016 106087 551685 696181 509377
36166 509377 342278 302110 238344 218764 406796 561238 304726 -162041 -275986 -19171
36156 -19171 73644 -169131 -347507 -277393 -258224 -391710 -343894 -34483 88670 -229108
$$ packed form
36227b32178j98163P5763K85228J5119k23545K7213L21836J37593j91652j13098
36217i5884J80370J73247o3570j05147N0746R0934n341k4266L8839M1317r678
36206B71567n2741j17795j41188L1979K67402J88885j90879l77135j59801O3046
36196b16660j0263j29980n2898L0485k2510J7946K16296J96877j69848l84406
36186e24961r4073K87707K41291o5140j54345Q781J35865J26984M0796j14974
36176a12069k31366j01422J67578J87787m1864m8660K86103M45598J44496j86804
36166E09377j67099m0168o3766j9580J88032J54442k56512m66767j13945K56815
36156a9171R2815k42775j78376P0114J9169j33486M7816L09411J23153l17778
$$ plain form
36146 -229108 -615482 -665595 -471697 -272725 -52500 207682 297297 102518 -172747 -338970
36136 -338970 -447827 -524103 -438739 -218819 -119908 -224620 -318140 -297886 -341796 -539114 -722659
36125 -722659 -792761 -841478 -847857 -632551 -230129 62946 109020 43878 -67489 -287191 -490490
36114 -490490 -442713 -229889 -154044 -181341 -4819 327522 432089 294407 314470 526511
36104 526511 458098 -9357 -320728 -117498 186985 96143 -231527 -341648 -142264 175266
36094 175266 485911 667235 555003 262713 186474 428663 590052 376971 14866 -190943
36084 -190943 -292906 -428752 -498920 -385331 -160425 105468 390688 483981 167118 -272991
36074 -272991 -277529 115260 276776 25854 -91109 171798 283170 -67631 -313560 30712
$$ packed form
36146b29108l86374n0113J93898J98972K20225K60182Q9615j94779k75265j66223
36136c38970j08857p6276Q5364K19920R8911j04712r3520K0254m3910j97318j83545
36125g22659p0102m8717o379K15306M02422K93075M6074o5142j11367k19702k03299
36114d90490M7777K12824P5845k7297J76522L32341J04567j37682K0063K12041
36104E26511o8413m67455l11371K03230L04483r0842l27670j10121J99384L17530
36094A75266L10645J81324j12232k92290p6239K42189J61389k13081l62105k05809
36084a90943j01963j35846p0168J13589K24906K65893K85220R3293l16863m40109
36074b72991m538L92789J61516k50922j16963K62907J11372l50801k45929L44272
$$ plain form
36064 30712 473722 340836 -131559 -276056 -93255 -69552 -252242 -297397 -206353 -285220
36054 -285220 -515839 -595154 -481163 -370780 -287976 -163988 -115079 -188338 -109149 242617
36044 242617 440818 138424 -269925 -227515 86173 131709 -29386 56928 291738 152713
36034 152713 -310986 -478966 -206896 -52962 -295753 -480786 -218501 196964 290994 48038
36024 48038 -244696 -412470 -415844 -274578 -141083 -177497 -278084 -208794 -42084 -85830 -345019
36013 -345019 -466623 -312470 -184247 -334715 -606559 -717270 -614723 -414216 -227363 -148405
36003 -148405 -193637 -217537 -101767 10909 -67334 -205645 -147475 18850 -479 -146975
35993 -146975 -71085 239101 404030 303240 247985 359428 321250 -5674 -242248 -99286
$$ packed form
36064C0712M43010j32886m72395j44497J82801K3703j82690m5155R1044p8867
36054b85220k30619p9315J13991J10383Q2804J23988M8909p3259P9189L51766
36044B42617J98201l02394m08349M2410L13688M5536j61095Q6314K34810j39025
36034A52713m63699j67980K72070J53934k42791j85033K62285M15465R4030k42956
36024D8038k92734j67774l374J41266J33495l6414j00587O9290J66710m3746k59189
36013c45019j21604J54153J28223j50468k71844j10711J02547K00507J86853P8958
36003a48405m5232k3900J15770J12676p8243j38311N8170J66325j9329j46496
35993a46975P5890L10186J64929j00790n5255J11443l8178l26924k36574J42962
$$ plain form
35983 -99286 123759 37459 -217292 -269606 -132340 -72212 -103236 -65837 -46043 -253311 -563759
35972 -563759 -629458 -430983 -307534 -394152 -425973 -223492 -15876 -68327 -246372 -212427
35962 -212427 79774 331258 297868 57500 -126888 -76715 182216 453677 497357 225305
35952 225305 -172926 -374942 -252157 8783 166065 224749 371307 646943 824234 652694
35942 652694 155484 -360005 -566243 -402004 -126652 -50349 -175247 -197321 51186 298696
35932 298696 168516 -273917 -577155 -505910 -303492 -275943 -385439 -409718 -288101 -119451
35922 -119451 29825 128367 99270 -90554 -325071 -449660 -431477 -334511 -226125 -174820
35912 -174820 -223658 -292779 -232837 -38121 139242 237736 353029 483472 453470 228209
$$ packed form
35983i9286K23045q6300k54751n2314J37266O0128l1024L7399J9794k07268l10448
35972e63759o5699J98475J23449q6618l1821K02481K07616n2451j78045L3945
35962b12427K92201K51484l3390k40368j84388N0173K58931K71461M3680k72052
35952B25305l98231k02016J22785K60940J57282N8684J46558K75636J77291j71540
35942F52694m97210n15489k06238J64239K75352P6303j24898k2074K48507K47510
35932B98696j30180m42433l03238P1245K02418K7549j09496k4279J21617J68650
35922a19451J49276R8542k9097j89824k34517j24589J8183R6966J08386N1305
35912a74820m8838o9121N9942J94716J77363R8494J15293J30443l0002k25261
$$ plain form
35902 228209 56734 107095 188648 73161 -119197 -139133 -42875 -81553 -255225 -308982 -150010
35891 -150010 28884 63730 4173 -56639 -113967 -147245 -65850 149573 358762 380798 151120
35880 151120 -241501 -613222 -792741 -730750 -501945 -200711 98163 284184 255355 63109
35870 63109 -118449 -208708 -255163 -229489 -13558 332778 537662 480497 347687 282771 160582
35859 160582 -86945 -217101 -45073 177587 95198 -222108 -422466 -390411 -266982 -90362
35849 -90362 194616 454566 488645 390604 415074 517030 420483 139215 -858 81834 80875
35838 80875 -150453 -323136 -201592 -9529 -60007 -248381 -234275 33001 276891 309923
35828 309923 227211 187031 193595 140091 -40163 -296893 -490342 -503184 -354866 -177492 -64337
$$ packed form
35902B28209j71475N0361Q1553j15487j92358j9936R6258l8678j73672n3757J58972
35891a50010J78894L4846n9557o0812n7328l3278Q1395K15423K09189K2036k29678
35880A51120l92621l71721j79519O1991K28805L01234K98874J86021k8829j92246
35870F3109j81558r0259m6455K5674K15931L46336K04884n7165j32810o4916j22189
35859A60582k47527j30156J72028K22660q2389l17306k00358L2055J23429J76620
35849i0362K84978K59950L4079r8041K4470J01956r6547k81268j40073Q2692r59
35838H0875k31328j72683J21544J92063n0478j88374J4106K67276K43890L3032
35828C09923q2712m0180O564n3504j80254k56730j93449j2842J48318J77374J13155
$$ plain form
35817 -64337 2194 53760 50129 -49345 -183531 -236057 -176354 -99011 -102375 -157338 -141669 -10958
35805 -10958 129850 181594 204402 294124 359179 218003 -62819 -158895 73361 351373 324596
35794 324596 18302 -264758 -350694 -295898 -190120 -88728 -82520 -210049 -321289 -233866
35784 -233866 -23902 30736 -180605 -457051 -548673 -427420 -254532 -181444 -221531 -258605
35774 -258605 -174268 4228 131732 153314 177900 268909 299295 153142 -53222 -131132 -100140
35763 -100140 -100102 -95175 90037 442975 702693 681597 474038 287908 217211 243327 325931
35752 325931 398996 359137 154916 -126641 -313868 -307255 -182161 -119707 -214090 -376670 -473195
35741 -473195 -494749 -496047 -441794 -287790 -159848 -214561 -336883 -266139 -55976 -63159 -365269
$$ packed form
35817f4337O6531N1566l631r9474j34186n2526N9703P7343l364n4963J5669J30711
35805a0958J40808N1744K2808Q9722O5055j41176k80822r6076K32256K78012k6777
35794C24596l06294k83060q5936N4796J05778J01392O208j27529j11240Q7423
35784b33866K09964N4638k11341k76446r1622J21253J72888P3088m0087l7074
35774b58605Q4337J78496J27504K1582K4586R1009L0386j46153k06364p7910L0992
35763a00140L8M927J85212L52938K59718k1096k07559j86130p0697K6116Q2604
35752C25931P3065l9859k04221k81557j87227O613J25094O2454r4383j62580r6525
35741d73195k1554j298N4253J54004J27942n4713j22322P0744K10163p183l02110
$$ plain form
35730 -365269 -563466 -373624 -50419 64290 67880 197217 305777 103235 -286300 -490031
35720 -490031 -479789 -511008 -557573 -340286 74747 244060 25520 -196577 -136007 -5128
35710 -5128 -55573 -120798 64143 373962 456948 214772 -154270 -456702 -608294 -551001 -302855
35699 -302855 -35056 88384 112891 198195 374298 525970 576847 558765 511454 414449 228285
35688 228285 -42858 -321549 -482435 -459605 -342829 -295605 -353265 -382867 -280084 -120398
35678 -120398 -51943 -99978 -150489 -103345 14010 88221 52383 -33105 -38464 102221 334062
35667 334062 534540 570645 342828 -99618 -481935 -513386 -240857 -19152 -28290 -28287 225316
35656 225316 531458 501751 145706 -144488 -172318 -157941 -317834 -545378 -656783 -681954
$$ packed form
35730c65269j98197J89842L23205J14709L590J29337J08560k02542l89535k03731
35720d90031J0242l1219m6565K17287M15033J69313k18540k22097O0570J30879
35710e128n0445o5225J84941L09819Q2986k42176l69042l02432j51592N7293K48146
35699c02855K67799J23440K4507Q5304J76103J51672N0877j8082m7311r7005j86164
35688B28285k71143k78691j60886K2830J16776M7224n7660k9602J02783J59686
35678a20398O8455m8035n0511M7144J17355P4211l5838q5488n359J40685K31841
35667C34062K00478L6105k27817m42446l82317l1451K72529K21705r138LK53603
35656B25316L06142k9707l56045k90194k7830J4377j59893k27544j11405k5171
$$ plain form
35646 -681954 -696450 -570556 -161522 341664 553160 389333 190879 250473 421626 385104
35636 385104 176082 165044 486573 767388 600112 94791 -283695 -306714 -129463 83752
35626 83752 340285 582477 605417 362101 105311 67342 187672 274201 229236 14869
35616 14869 -355128 -660183 -594477 -224435 -33435 -279772 -601083 -542967 -197948 36397
35606 36397 87903 171756 287065 211366 -53187 -239462 -225929 -142025 -64543 61811 193574
35595 193574 194259 90230 31862 -1132 -153156 -347591 -316905 -30535 213778 207492 71158
35584 71158 -3155 -1263 2259 -40254 -189005 -459365 -677183 -614138 -321597 -111988 -154559
35573 -154559 -303800 -375815 -366150 -327288 -253140 -172240 -163503 -203530 -175062 -81268 -63470 -151926
$$ packed form
35646f81954j4496J25894M09034N03186K11496j63827j98454N9594J71153l6522
35636C85104k09022j1038L21529K80815j67276n05321l78486k3019J77251K13215
35626H3752K56533K42192K2940k43316k56790l7969J20330Q6529m4965k14367
35616A4869l69997l05055O5706L70042J91000k46337l21311N8116L45019K34345
35606C6397N1506Q3853J15309p5699k64553j86275J3533Q3904P7482J26354J31763
35595A93574O85j04029n8368l2994j52024j94435L0686K86370K44313o286j36334
35584G1158p4313J892L522m2513j48751k70360k17818O3045K92541K09609m2571
35573a54559j49241p2015R665L8862P4148Q0900Q737m0027K8468R3794J7798q8456
$$ plain form
35561 -151926 -196740 -116355 -25401 -34298 -94237 -127032 -158303 -238204 -350063 -455032 -522102
35550 -522102 -494053 -343503 -166584 -88087 -76844 4833 180435 337575 410749 432058 422870
35539 422870 393992 418812 532213 596271 458186 206855 68916 76788 49165 -118210 -349374
35528 -349374 -552319 -677476 -641723 -413629 -150175 -34399 -19206 40828 75261 -94755
35518 -94755 -375708 -456729 -270518 -92365 -121749 -244382 -283042 -233949 -173786 -138199 -142381
35507 -142381 -146107 -20067 239562 330442 -25177 -603696 -871679 -667506 -353562 -255428
35497 -255428 -306444 -325932 -294924 -228474 -85562 61649 46432 -96016 -129999 -14800 -891
35486 -891 -217100 -462543 -542953 -521534 -493862 -408479 -275791 -270669 -436442 -536706 -390719
$$ packed form
35561a51926m4814Q0385R0954q897n9939l2795l1271p9901j11859j04969o7070
35550e22102K8049J50550J76919P8497J1243Q1677J75602J57140P3174K1309r188
35539D22870k8878K4820J13401O4058j38085k51331j37939P872k7623j67375k31164
35528c49374k02945j25157L5753K28094K63454J15776J5193O0034L4433j70016
35518i4755k80953q1021J86211J78153k9384j22633l8660M9093O0163L5587m182
35507a42381l726J26040K59629R0880l55619n78519k67983K04173L13944R8134
35497b55428n1016j9488L1008O6450J42912J47211j5217j42448l3983J15199J3909
35486h91k16209k45443q0410K1419K7672Q5383J32688N122j65773j00264J45987
$$ plain form
35475 -390719 -131956 38934 131074 213087 205416 27753 -211185 -347558 -352545 -268949 -115850
35464 -115850 36895 72383 12761 31151 181257 291075 219905 50044 -60050 -51149 56599
35453 56599 177653 131356 -185527 -570644 -692790 -515672 -296557 -171098 -51593 53327
35443 53327 -5534 -167927 -157544 43106 85845 -202151 -523245 -562829 -422673 -377305 -466701
35432 -466701 -546678 -521607 -359209 -88038 111248 64811 -71029 37169 348692 439589
35422 439589 165922 -98828 -75968 20784 -47922 -136253 -95115 -135475 -410401 -602443 -373372
35411 -373372 61086 246857 147355 54641 47161 -24619 -148906 -161644 -64317 8540 51057
35400 51057 113023 83721 -138355 -370046 -353344 -153931 -53528 -121074 -173732 -103460 18013
$$ packed form
35475c90719K58763J70890R2140Q2013p671j77663k38938j36373m987Q3596J53099
35464a15850J52745L5488n9622J8390J50106J09818p1170j69861j10094Q901J07748
35453E6599J21054m6297l16883l85117j22146J77118K19115J25459J19505J04920
35443E3327n8861j62393J0383K00650M2739k87996l21094l9584J40156M5368q9396
35432d66701p9977K5071J62398K71171J99286m6437j35840J08198L11523R0897
35422D39589k73667k64750K2860R6752o8706q8331M1138m0360k74926j92042K29071
35411c73372M34458J85771r9502r2714p480p1780j24287j2738R7327P2857M2517
35400E1057O1966k9302k22076k31691J6702J99413J00403o7546n2658P0272J21473
$$ plain form
35389 18013 112251 150589 93696 -36801 -100825 -16719 103921 140428 145440 200453 250906
35378 250906 231493 181811 111642 -31086 -140404 9007 343660 452792 192799 -33082
35368 -33082 106824 343152 267524 -16634 -145426 -104899 -103875 -78329 141914 337242 137071
35357 137071 -304316 -420086 -61655 266746 117784 -343989 -635152 -510044 -105579 251533
35347 251533 293196 16107 -320643 -482656 -473816 -386108 -219711 -9034 83102 6271 -54056
35336 -54056 -7189 -47332 -252724 -312535 -17427 285457 182459 -122647 -128214 173829 387582
35325 387582 428545 527419 610076 352267 -116479 -244835 56528 206983 -124217 -491588
35315 -491588 -417817 -138424 -139212 -337233 -259151 154795 436403 269813 -109941 -293857
$$ packed form
35389A8013R4238L8338n6893j30497o4024Q4106J20640L6507N012N5013N0453
35378B50906j9413m9682p0169j42728j09318J49411L34653J09132k59993k25881
35368c3082J39906K36328p5628k84158j28792M0527J024K5546K20243J95328k00171
35357A37071m41387j15770L58431L28401j48962m61773k91163J25108M04465L57112
35347B51533M1663k77089l36750j62013Q840Q7708J66397K10677R2136p6831o0327
35336e4056M6867m0143k05392n9811K95108L02884j02998l05106n567L02043K13753
35325C87582M0963R8874Q2657k57809m68746j28356L01363J50455l31200l67371
35315d91588P3771K79393p88j98021P8082M13946K81608j66590l79754j83916
$$ plain form
35305 -293857 -207196 -97490 -163611 -359171 -530941 -601337 -546074 -311301 81599 398401
35295 398401 381424 108043 -66477 11973 128334 103222 56106 86319 12426 -302196 -641120
35284 -641120 -750778 -708634 -665849 -504347 -130777 154277 34704 -280125 -367294 -264137
35274 -264137 -316104 -494815 -442616 -146095 17254 -59072 -56055 161204 288956 99226
35264 99226 -220640 -404211 -421265 -339454 -212535 -187544 -379605 -592694 -530731 -299512
35254 -299512 -269898 -426518 -366735 -30748 133713 -77372 -268271 -118693 106038 76502
35244 76502 -34643 69113 247817 203065 22387 -17939 26858 -92571 -316536 -368009
35234 -368009 -269507 -326624 -585431 -704560 -465849 -98226 58199 -6539 -40563 76916
$$ packed form
35305b93857Q6661J09706o6121j95560j71770p0396N5263K34773L92900L16802
35295C98401j6977k73381j74520P8450J16361k5112m7116L0213p3893l14622l38924
35284f41120j09658M2144M2785J61502L73570K85054j19573l14829q7169J03157
35274b64137n1967j78711N2199K96521J63349p6326L017K17259J27752j89730
35264I9226l19866j83571j7054Q1811J26919K4991j92061k13089O1963K31219
35254b99512K9614j56620N9783L35987J64461k11085j90899J49578K24731k9536
35244G6502j11145J03756J78704m4752j80678m0326M4797j19429k23965n1473
35234c68009R8502n7117k58807j19129K38711L67623J56425o4738l4024J17479
$$ plain form
35224 76916 183926 76668 -208513 -428977 -431014 -319947 -286561 -348207 -367326 -277729 -166898
35213 -166898 -140953 -202869 -256104 -174600 67798 282060 206173 -134188 -366609 -225221
35203 -225221 112262 329577 402369 458750 431568 218315 21733 102538 293165 209438
35193 209438 -115485 -298769 -291821 -446991 -814184 -934220 -553294 -55240 103516 -12438
35183 -12438 -82935 -36871 18774 75960 123264 16235 -263312 -445142 -337561 -135999 -99572
35172 -99572 -149791 -93839 -37326 -215298 -536898 -660643 -492914 -301120 -303522 -397698 -366938
35161 -366938 -176592 31581 149509 221936 361911 579670 733368 676704 422197 122317
35151 122317 -63537 -59300 64339 75311 -198783 -552838 -553665 -167319 73017 -194215 -590829
$$ packed form
35224G6916J07010j07258k85181k20464k037J11067L3386o1646j9119Q9597J10831
35213a66898K5945o1916n3235Q1504K42398K14262p5887l40361k32421J41388
35203b25221L37483K17315P2792N6381k7182k13253j96582Q0805J90627q3727
35193B09438l24923j83284O948j55170l67193j20036L80926M98054J58756j15954
35183a2438p0497M6064N5645N7186M7304j07029k79547j81830J07581K01562L6427
35172i9572n0219N5952N6513j77972l21600j23745J67729J91794k402r4176L0760
35161c66938J90346K08173J17928P2427J39975K17759J53698n6664k54507k99880
35151A22317j85854M237J23639J0972k74094l54055q27L86346K40336k67232l96614
$$ plain form
35140 -590829 -593107 -368575 -422830 -641974 -438781 187952 541030 317788 48351 155202
35130 155202 293015 50563 -308174 -327889 -110751 -42725 -131466 -130432 -41481 -18808 -4276
35119 -4276 113915 200778 133106 126739 393928 690580 632121 283747 23149 -29156 -42585
35108 -42585 -83543 -84799 -91147 -171878 -205912 -89193 903 -96375 -147794 137581 553712
35097 553712 640463 377339 159809 137316 61806 -188208 -400508 -428181 -387122 -351778 -222728
35086 -222728 -20299 22750 -187398 -426435 -460472 -322264 -182113 -135507 -187070 -264552
35076 -264552 -215192 20317 223958 119543 -205097 -349186 -129073 193194 303983 226994
35066 226994 180807 230576 252161 159229 33921 31180 178315 276328 84254 -333335 -571589
$$ packed form
35140e90829k278K24532n4255k19144K03193O26733L53078k23242k69437J06851
35130A55202J37813k42452l58737j9715K17138O8026q8741J034Q8951K2673J4532
35119d276J18191Q6863o7672o367K67189K96652n8459l48374k60598n2305j3429
35108d2585m0958j256o348q0731l4034J16719R0096r7278n1419K85375M16131
35097E53712Q6751k63124k17530k2493p5510k50014k12300k7673M1059L5344J29050
35086b22728K02429M3049k10148k39037l4037J38208J40151M6606n1563p7482
35076b64552M9360K35509K03641j04415l24640j44089K20113L22267J10789p6989
35066B26994m6187M9769K1585r2932j25308k741J47135R8013j92074m17589k38254
$$ plain form
35055 -571589 -347397 120947 397839 386839 332878 329237 166393 -253564 -656953 -726764
35045 -726764 -500415 -272799 -228371 -312252 -370134 -279208 -2009 363311 610631 606320 443840
35034 443840 342167 379099 400960 245094 -10643 -124164 -4824 183023 282591 351493
35024 351493 476056 535359 373032 105054 -11911 25806 -7532 -166579 -274035 -278628
35014 -278628 -326134 -410273 -327706 -95223 -15867 -159103 -189510 46738 186945 -68627
35004 -68627 -432751 -486625 -320548 -273135 -325210 -252053 -149642 -274682 -508816 -510724 -307803
34993 -307803 -220903 -267538 -172884 42849 33296 -264543 -507898 -537013 -595580 -819754 -969508
34982 -969508 -859092 -648054 -505850 -359232 -170377 -103689 -196121 -199795 8309 169700
$$ packed form
35055e71589K24192M68344K76892j1000n3961l641j62844m19957m03389o9811
35045g26764K26349K27616M4428q3881n7882R0926K77199L65320K47320m311j62480
35034D43840j01673L6932K1861j55866k55737j13521J19340J87847R9568O8902
35024C51493J24563N9303j62327k67978j16965L7717l3338j59047j07456m593
35014b78628m7506q4139Q2567K32483P9356j43236l0407K36248J40207k55572
35004f8627l64124n3874J66077M7413n2075P3157J02411j25040k34134j908K02921
34993c07803Q6900m6635R4654K15733r553k97839k43355k9115n8567k24174j49754
34982i69508J10416K11038J42204J46618J88855O6688r2432l674K08104J61391
$$ plain form
34972 169700 52037 -161969 -160803 48862 238061 304403 286794 202508 86727 39165 48214
34961 48214 -54121 -284056 -366615 -129253 168327 167550 -87384 -271372 -283072 -316312 -474864
34950 -474864 -613836 -594809 -466697 -334697 -218894 -103687 -12740 13025 -48678 -186721
34940 -186721 -330923 -388182 -369517 -415358 -606019 -810119 -822827 -605782 -299449 -57642
34930 -57642 33736 -52827 -248531 -388655 -378086 -319953 -357409 -435470 -376492 -171396 -15583
34919 -15583 -24749 -87768 -76234 -43263 -91357 -163131 -129305 -26478 -24041 -142912 -181848 -4253
34907 -4253 238093 297906 167291 62629 93173 107237 -72954 -376988 -541681 -398564
34897 -398564 -37952 300921 462907 493802 522357 534188 341717 -138012 -639312 -743375
$$ packed form
34972A69700j17663k14006J166K09665J89199O6342j7609q4286j15781m7562R049
34961D8214j02335k29935q2559K37362K97580p77k54934j83988j1700l3240j58552
34950d74864j38972J9027J28112J32000J15803J15207R0947K5765o1703j38043
34940a86721j44202n7259J8665m5841j90661k04100j2708K17045L06333K41807
34930e7642R1378q6563j95704j40124J0569N8133l7456p8061N8978K05096J55813
34919a5583r166o3019J1534L2971m8094p1774L3826J02827K437j18871l8936J77595
34907d253K42346N9813j30615j04662L0544J4064j80191l04034j64693J43117
34897c98564L60612L38873J61986L0895K8555J1831j92471m79729n01300j04063
$$ plain form
34887 -743375 -352439 157674 325147 60490 -332322 -514247 -428616 -299004 -345703 -511783
34877 -511783 -538595 -354382 -238425 -433309 -731885 -721582 -368451 -32943 83952 139627
34867 139627 236286 212201 3582 -167085 -185182 -270590 -547242 -729965 -559923 -243210
34857 -243210 -106762 -110959 -86696 -156462 -449851 -649817 -366067 188493 438742 273131
34847 273131 85116 49612 -56072 -286351 -376763 -274804 -266242 -402426 -331474 73082
34837 73082 411375 365851 166612 133215 154226 -11973 -247009 -273108 -112254 7507
34827 7507 31082 63374 132468 216924 344739 444977 305071 -81203 -337054 -151253 282821
34816 282821 553385 571164 530317 507564 433972 337863 283181 158296 -157349 -495722 -578463
$$ packed form
34887g43375L90936N10113J67473k64657l92812j81925Q5631J29612m6699j66080
34877e11783k6812J84213J15957j94884k98576J0303L53131L35508J16895N5675
34867A39627R6659k4085k08619j70667j8097q5408k76652j82723J70042L16713
34857b43210J36448m197K4263o9766k93389j99966K83750N54560K50249j65611
34847B73131j88015l5504j05684k30279r0412J01959Q562j36184P0952M04556
34837G3082L38293m5524j99239l3397K1011j66199k35036k6099J60854J19761
34827G507K3575L2292O9094Q4456J27815J00238j39906l86274k55851J85801M34074
34816B82821K70564J7779m0847k2753p3592r6109n4682j24885l15645l38373q2741
$$ plain form
34805 -578463 -416358 -219888 -4238 343671 654253 567227 107154 -231167 -125861 175279
34795 175279 283055 190035 124802 125179 59581 -49182 -17888 189514 372401 352952 175942
34784 175942 4300 -75703 -95124 -125419 -214796 -358165 -486561 -510399 -407203 -251107
34774 -251107 -127979 -40651 58491 148309 117085 -100553 -398727 -560726 -448859 -132710
34764 -132710 146582 154442 -114933 -375950 -319476 -2116 162305 -80885 -448468 -451857
34754 -451857 -31067 382744 430972 204786 -3620 -95059 -172929 -316111 -490747 -609399
34744 -609399 -584270 -391882 -143732 -12184 -43422 -126887 -161157 -136254 -57677 48057 45418
34733 45418 -185585 -492974 -549558 -291299 -29093 -14725 -141164 -216371 -261662 -322642 -247127
$$ packed form
34805e78463J62105J96470K15650L47909L10582q7026m60073l38321J05306L01140
34795A75279J07776r3020o5233L77o5598j08763L1294K07402J82887j9449j77010
34784A75942j71642q0003j9421l0295q9377j43369j28396k3838J03196J56096
34774b51107J23128Q7328R9142Q9818l1224k17638k98174j61999J11867L16149
34764a32710K79292P860k69375k61017N6474L17360J64421k43190l67583l389
34754d51857M20790M13811M8228k26186k08406r1439p7870j43182j74636j18652
34744f09399K5129J92388K48150J31548l1238q3465l4270K4903P8577J05734k639
34733D5418k31003l07389n6584K58259K62206J4368j26439p5207m5291o0980P5515
$$ plain form
34722 -247127 52307 319143 272821 62405 42572 192391 150338 -181553 -461926 -424860
34712 -424860 -232234 -164401 -224754 -226746 -85245 141134 362679 484088 433508 276213
34702 276213 198251 284485 406283 406133 297369 204741 194785 236365 256658 187695 31059
34691 31059 -101211 -105459 -54288 -114961 -283793 -368034 -280423 -166455 -150374 -145080 -49146
34680 -49146 43241 5911 -85841 -77904 18836 105341 207884 381873 481220 296177 -91427
34669 -91427 -358573 -377655 -340860 -382712 -358619 -152305 38514 -42065 -306607 -418279 -235540
34658 -235540 33271 113454 -44895 -267339 -344612 -219382 -44463 -25531 -170453 -283148
34648 -283148 -257405 -225987 -299860 -337814 -191086 -29855 -124602 -371281 -383109 -83364 149732
$$ packed form
34722b47127K99434K66836m6322k10416j9833J49819m2053l31891k80373L7066
34712d24860J92626O7833o0353j992J41501K26379K21545J21409n0580j57295
34702B76213p7962Q6234J21798j50j08764r2628r956M1580K0293o8963j56636
34691C1059j32270m248N1171o0673j68832q4241Q7611J13968J6081N294R5934
34680d9146R2387l7330r1752P937R6740Q6505J02543J73989R9347j85043l87604
34669i1427k67146j9082L6795m1852K4093K06314J90819q0579k64542j11672J82739
34658b35540K68811Q0183j58349k22444p7273J25230J74919J8932j44922j12695
34648b83148K5743L1418p3873l7954J46728J61231r4747k46679j1828K99745K33096
$$ plain form
34637 149732 53782 -135639 -90398 98039 111412 -59944 -106663 114852 374099 392801
34627 392801 178691 -48261 -143638 -170924 -283276 -509498 -678378 -605166 -343114 -143161
34617 -143161 -141792 -225929 -255782 -247880 -236867 -144237 50385 172742 96646 -8597 92857
34606 92857 327501 422880 333332 280672 372876 445128 332160 83710 -155642 -307357 -349563
34595 -349563 -304965 -277219 -350317 -427041 -322679 -40590 208901 289903 274641 265983 257418
34584 257418 214984 142476 26413 -133569 -221416 -107334 122011 229620 161914 107795
34574 107795 170588 213066 127486 29787 37523 53042 -53169 -194890 -192791 -46227 76004
34563 76004 46267 -132391 -354613 -427206 -179143 294207 592680 394694 -144739 -517296
$$ packed form
34637A49732r5950j89421M5241J88437J3373j71356m6719K21515K59247J8702
34627C92801k14110k26952r5377k7286j12352k26222j68880P3212K62052J99953
34617a43161J369q4137k9853P902J1013R2630J94622J22357p6096j05243J01454
34606I2857K34644R5379q9548n2660R2204P2252j12968k48450k39352j51715m2206
34595c49563M4598K7746p3098p6724J04362K82089K49491Q1002j5262q658q565
34584B57418m2434p2508j16063j59982q7847J14082K29345J07609o7706n4119
34574A07795O2793M2478q5580r7699P736J5519j06211j41721K099J46564J22231
34563G6004k9737j78658k22222p2593K48063M73350K98473j97986n39433l72557
$$ plain form
34553 -517296 -396407 29789 276240 80251 -313861 -427403 -119312 233366 239094 21299
34543 21299 -7243 204404 290576 88716 -96461 -8640 159366 142582 63490 179377 404059
34532 404059 449936 298867 171896 128578 54912 -5993 117306 349845 372584 80970
34522 80970 -248164 -349683 -280165 -220677 -195732 -138731 -71806 -64815 -108654 -137057 -107139
34511 -107139 -3298 153766 263215 207743 -2921 -248173 -465528 -671145 -798143 -698277
34501 -698277 -385140 -104689 -35542 -54806 45960 218944 223405 -5468 -232289 -202822
34491 -202822 68077 339265 403844 267531 108608 87949 188936 261020 235737 232274 367886
34480 367886 519526 421634 20538 -414157 -603655 -558225 -459592 -376434 -268657 -183276
$$ packed form
34553e17296J20889M26196K46451j95989l94112j13542L08091L52678N728k17795
34543B1299k8542K11647Q6172k01860j85177Q7821J68006j6784p9092J15887K24682
34532D04059M5877j51069j26971m3318p3666o0905J23299K32539K2739k91614
34522H0970l29134j01519O9518N9488K4945N7001O6925O991m3839k8403K9918
34511a07139J03841J57064J09449n5472k10664k45252k17355k05617j26998R9866
34501f98277L13137K80451O9147j9264J00766J72984M461k28873k26821K9467
34491b02822K70899K71188O4579j36313j58923k0659J00987P2084k5283l463J35612
34480C67886J51640r7892m01096m34695j89498M5430R8633Q3158J07777Q5381
$$ plain form
34470 -183276 -210216 -252384 -94636 225191 360233 121239 -205800 -215965 91223 378840
34460 378840 453509 412230 356997 246231 67565 -77509 -131534 -140204 -104160 39810 226368
34449 226368 239352 -19021 -376900 -588437 -559259 -341436 -63404 91175 17043 -133619
34439 -133619 -86913 171049 347001 250847 27155 -121829 -183272 -155800 83158 486930
34429 486930 676244 394509 -51393 -156175 98951 297188 251361 204091 326885 424487
34419 424487 295907 70842 -27533 -27081 -87347 -191027 -181738 -28834 141909 246069 306237
34408 306237 333301 287927 181640 105643 121306 192872 249781 244903 133051 -109605 -377491
34397 -377491 -439250 -183723 167682 255029 24272 -181077 -69814 204413 267328 36241
$$ packed form
34470a83276k6940m2168J57748L19827J35042k38994l27039j0165L07188K87617
34460C78840P4669m1279n5233j10766j78666j45074n4025q670L6044J43970J86558
34449B26368J2984k58373l57879k11537K9178K17823K78032J54579p4132j50662
34439a33619M6706K57962J75952r6154k23692j48984o1443K7472K38958M03772
34429D86930J89314k81735m45902j04782K55126J98237m5827m7270J22794R7602
34419D24487j28580k25065r8375M52o0266j03680R289J52904J70743J04160O0168
34408C06237K7064m5374j06287p5997J5663P1566N6909m878j11852k42656k67886
34397c77491o1759K55527L51405Q7347k30757k05349J11263K74227O2915k31087
$$ plain form
34387 36241 -211326 -248169 -144055 -66617 -51978 -64040 -106514 -160713 -144392 -42666 30492
34376 30492 -390 -54209 -46591 -51809 -182692 -386430 -495943 -452607 -365128 -344213 -355190
34365 -355190 -273992 -87287 8770 -183679 -531730 -629984 -336314 -47258 -164413 -461950
34355 -461950 -395760 46244 324948 233769 218379 575461 890690 692212 222302 44973
34345 44973 198235 285932 205061 208015 329694 306009 82335 -77141 -50870 -11407 -42436
34334 -42436 3459 164961 242792 123429 -70421 -237402 -406152 -516763 -416632 -173762
34324 -173762 -79114 -214412 -313665 -185147 16247 81305 36663 -14589 -91076 -209144 -279454
34313 -279454 -265229 -234376 -157523 91710 433349 574849 447913 341544 429995 500574
$$ packed form
34387C6241k47567l6843J04114P7438J4639j2062m2474n4199J6321J01726P3158
34376C0492l0882n3819P618n218j30883k03738j09513M3336Q7479K0915j0977
34365c55190Q1198J86705R6057j92449l48051r8254K93670K89056j17155k97537
34355d61950O6190M42004K78704r1179j5390L57082L15229j98478m69910j77329
34345D4973J53262Q7697q0871K954J21679k3685k23674j59476K6271L9463l1029
34334d2436M5895J61502P7831j19363j93850j66981j68750j10611J00131K42870
34324a73762R4648j35298r9253J28518K01394O5058m4642n1252p6487j18068p0310
34313b79454J4225L0853P6853K49233L41639J41500j26936j06369Q8451P0579
$$ plain form
34303 500574 371469 234893 288216 342346 157464 -99779 -133175 -30119 -69715 -195175
34293 -195175 -144075 13802 -28953 -227512 -212326 47072 133681 -112956 -292728 -105715
34283 -105715 133588 6094 -344059 -488525 -416358 -465071 -657527 -618591 -215906 163351
34273 163351 167272 -25485 -20616 214302 379650 324260 198803 155824 161869 149848 131825
34262 131825 75700 -129399 -450842 -617397 -424833 -39796 182538 124701 -35374 -155614
34252 -155614 -291459 -478209 -562981 -392699 -55398 200346 234325 110090 -29787 -97709
34242 -97709 -103185 -129540 -239390 -358702 -317027 -74938 152943 112666 -175158 -428149 -437143
34231 -437143 -282574 -173407 -159646 -97464 119298 380088 457560 261376 -57794 -267977
$$ packed form
34303E00574j29105j36576N3323N4130j84882k57243l3396J03056l9596j25460
34293a95175N1100J57877m2755j98559J5186K59398Q6609k46637j79772J87013
34283a05715K39303j27494l50153j44466P2167m8713j92456L8936M02685L79257
34273A63351L921j92757M869K34918J65348n5390j25457m2979O045j2021j8023
34262A31825n6125k05099l21443j66555J92564L85037K22334n7837j60075j20240
34252a55614j35845j86750q4772J70282L37301K55744L3979j24235j39877o7922
34242i7709n476k6355j09850j19312M1675K42089K27881m0277k87824k52991q994
34231d37143J54569J09167J3761O2182K16762K60790P7472j96184l19170k10183
$$ plain form
34221 -267977 -277546 -169852 -62867 1685 49605 129244 273613 433809 454884 220002 -159616
34210 -159616 -412054 -408595 -279508 -164219 -11470 226079 358963 176942 -169392 -294973
34200 -294973 -114997 36046 -81647 -270606 -258217 -143150 -192319 -365410 -384586 -210239
34190 -210239 -105290 -212662 -384576 -489009 -579184 -654105 -546888 -215470 103089 205361
34180 205361 169741 126850 26040 -162734 -261439 -157237 -41123 -90693 -137376 20191
34170 20191 191653 87503 -146498 -153983 5250 -19267 -183621 -84758 278436 405622
34160 405622 121067 -116901 -8111 81810 -191825 -485634 -309759 159112 373626 249327
34150 249327 129344 98232 -80960 -398037 -505799 -258481 80316 237189 199028 50938
$$ packed form
34221b67977r569J07694J06985O4552M7920P9639J44369J60196K1075k34882l79618
34210a59616k52438L459J29087J15289J52749K37549J32884j82021l46334j25581
34200b94973J79976J51043j17693j88959J2389J15067m9169j73091j9176J74347
34190b10239J04949j07372j71914j04433r0175p4921J07217L31418L18559J02272
34180B05361l5620m2891j00810j88774r8705J04202J16114m9570m6683J57567
34170B0191J71462j04150k34001p485J59233k4517j64354R8863L63194J27186
34160D05622k84555k37968J08790Q9921k73635k93809J75875M68871K14514j24299
34150B49327j19983l1112j79192l17077j07762K47318L38797J56873l8161j48090
$$ plain form
34140 50938 -134161 -214325 -89051 83515 59719 -100939 -115875 59495 178652 135413
34130 135413 108562 207391 299365 297232 318673 425758 469760 350595 214207 234390 361466
34119 361466 417648 311754 68394 -232136 -475502 -585689 -606225 -602842 -515740 -269071
34109 -269071 13761 113989 18146 -104745 -198596 -329823 -414382 -256024 82911 270508
34099 270508 184124 98551 228693 361536 176172 -267400 -605619 -622158 -408573 -146365
34089 -146365 73990 219786 245740 120570 -94874 -230387 -137479 119846 291152 233510
34079 233510 71547 -36869 -132617 -277484 -325707 -141823 97581 138942 73105 158908
34069 158908 319628 247799 -15117 -79578 150953 312168 182629 3378 13057 96443
$$ packed form
34140E0938j85099q0164J25274J72566k3796j60658j4936J75370J19157m3239
34130A35413k6851R8829R1974k133K1441J07085M4002j19165j36388K0183J27076
34119C61466N6182j05894k43360l00530k43366j10187k0536L383Q7102K46669
34109b69071K82832J00228r5843j22891r3851j31227q4559J58358L38935J87597
34099B70508q6384q5573J30142J32843j85364m43572l38219j6539K13585K62208
34089a46365K20355J45796K5954j25170k15444j35513R2908K57325J71306n7642
34079B33510j61963j08416r5748j44867m8223J83884K39404M1361o5837Q5803
34069A58908J60720p1829k62916o4461K30531J61215j29539j79251R679Q3386
$$ plain form
34059 96443 128660 266677 614633 937971 994857 858381 663938 361879 -6916 -133250
34049 -133250 124312 423302 413438 256999 294849 446674 379733 97196 -94754 -121927
34039 -121927 -228035 -537507 -867978 -990537 -836693 -488607 -168587 -130391 -341896 -431461
34029 -431461 -200897 18332 -135146 -406405 -248930 303366 614911 350288 -88481 -189305
34019 -189305 9968 128307 17272 -136995 -130773 48022 249603 281427 72648 -213856
34009 -213856 -327707 -233669 -151132 -240428 -381321 -353982 -141073 62942 102570 21921 -34712
33998 -34712 -9747 40109 73923 117393 144421 42031 -181902 -287440 -107892 137877 119664
33987 119664 -87296 -118998 58886 94987 -95683 -123925 197965 462660 312423 46918
$$ packed form
34059I6443L2217J38017L47956L23338N6886j36476j94443l02059l68795j26334
34049a33250K57562K98990r864j56439L7850J51825o6941k82537j91950k7173
34039a21927j06108l09472l30471j22559J53844L48086L20020L8196k11505q9565
34029d31461K30564K19229j53478k71259J57475N52296L11545k64623m38769j00824
34019a89305J99273J18339j11035j54267O222J78795K01581L1824k08779k86504
34009b13856j13851R4038Q2537q9296j40893K7339K12909K04015L9628q0649n6633
33998c4712K4965M9856L3814M3470K7028j02390k23933j05538J79548K45769j8213
33987A19664k06960l1702J77884L6101j90670k8242L21890K64695j50237k65505
$$ plain form
33977 46918 128382 431139 509033 344241 260112 266620 90784 -219516 -313678 -165935 -121926
33966 -121926 -253939 -221862 75883 229260 -63625 -514405 -652646 -415033 -91959 71320
33956 71320 20299 -161042 -287987 -221029 -55738 10663 13940 163669 425944 486058 213949
33945 213949 -141684 -326582 -345652 -262232 -78149 52513 -137572 -568946 -745226 -408290
33935 -408290 44196 98706 -180376 -336387 -201680 -32176 -62513 -247633 -414758 -429912
33925 -429912 -239451 66913 275428 278012 209569 226705 271872 221188 133558 142988 201176
33914 201176 149629 -9224 -120239 -121835 -98745 -109092 -125803 -141358 -186384 -244908 -261118
33903 -261118 -215143 -111506 51046 210024 229870 87585 -18671 101762 361184 509703
$$ packed form
33977D6918Q1464L02757P7894j64792q4129O508j75836l10300r4162J47743M4009
33966a21926j32013L2077K97745J53377k92885m50780j38241K37613L23074J63279
33956G1320n1021j81341j26945O6958J65291O6401L277J49729K62275O0114k72109
33945B13949l55633j84898j9070Q3420J84083J30662j90085m31374j76280L36936
33935d08290M52486N4510k79082j56011J34707J69504l0337j85120j67125j5154
33925d29912J90461L06364K08515K584o8443J7136M5167n0684q7630R430N8188
33914B01176n1547j58853j11015j596K3090j0347j6711j5555m5026n8524j6210
33903b61118M5975J03637J62552J58978J9846j42285j06256J20433K59422J48519
$$ plain form
33893 509703 467577 373614 340763 340501 316725 242224 61830 -245552 -530448 -579562 -406749
33882 -406749 -261067 -272586 -279178 -138399 -30958 -220729 -597732 -738206 -461060 -76666
33872 -76666 44666 -58750 -106332 -47234 -70936 -200038 -208182 -19045 122628 46053 -44321
33861 -44321 98284 332771 326156 61428 -150256 -121370 15388 55863 -55461 -247249
$$ packed form
33893E09703m2126r3963l2851k62k3776p4501j80394l07382k84896m9114J72813
33882d06749J45682j1519o592J40779J07441j89771l77003j40474K77146L84394
33872g6666J21332j03416m7582N9098k3702j29102q144J89137J41673p6575r0374
33861d4321J42605K34487o615k64728k11684K8886J36758M0475j11324j91788
$$ [...]
##END NTUPLES=NMR SPECTRUM
##END=
