##TITLE=31Pdec_E3d0307-2
 CDCl3, 24 sc
 4.7.2023
##JCAMPDX= 6.0         $$ Bruker NMR JCAMP-DX V2.0
##DATA TYPE= NMR SPECTRUM
##DATA CLASS= NTUPLES
##ORIGIN= UXNMR, Bruker Analytische Messtechnik GmbH
##OWNER= root
$$ XWIN-NMR		Version 3.5
$$ Tue Jul  4 14:25:17 2023 Russian Standard Time (UT+4h)  she@DPX200
##.OBSERVE FREQUENCY= 81.013821
##.OBSERVE NUCLEUS= ^31P
##.ACQUISITION MODE= SIMULTANEOUS
##.ACQUISITION SCHEME= undefined
##.AVERAGES= 24
##.DIGITISER RES= 16
##SPECTROMETER/DATA SYSTEM= spect
##.PULSE SEQUENCE= zgpg30
##.SOLVENT NAME= CDCl3
##.SHIFT REFERENCE= (INTERNAL, CDCl3, 0, 248.564)
##AUDIT TRAIL= $$ (NUMBER, WHEN, WHO, WHERE, WHAT)
$$ ##TITLE= Audit trail, XWIN-NMR		Version 3.5
$$ ##JCAMPDX= 5.01
$$ ##ORIGIN= Bruker BioSpin GmbH
$$ ##OWNER= she
$$ F:/spectra/data/she/nmr/P31/1/pdata/1/auditp.txt
$$ ##AUDIT TRAIL=  $$ (NUMBER, WHEN, WHO, WHERE, WHAT)
(   1,<2023-07-04 14:24:15.31 +0400>,<she>,<DPX200>,
      <created by zg, POWCHK disabled, PULCHK disabled
       configuration hash MD5:
       00 E9 B6 7A A2 85 ED C7 34 08 36 98 17 FE 4E 26
       data hash MD5: 32K
       46 4F A3 B7 CC 81 E4 0E 9C 61 80 D4 FC A9 B5 71>)
(   2,<2023-07-04 14:24:17.81 +0400>,<she>,<DPX200>,
      <Start of raw data processing
       efp BC_mod = 2 LB = 1 FT_mod = 6 PKNL = 1 PHC0 = -10676.96 PHC1 = 42.48483 SI = 64K 
       data hash MD5: 64K
       35 8A 4F EA F5 F7 0D 67 6C A2 CF D4 AA 09 B9 CF>)
(   3,<2023-07-04 14:24:40.81 +0400>,<she>,<DPX200>,
      <pk PHC0 = -174.2985 PHC1 = 397 
       data hash MD5: 64K
       3F 4D FE 0E 54 0E 6D 41 D8 84 00 5C C7 D3 C4 7D>)
$$ ##END=
$$ 
$$ hash MD5
$$ 3C FB CC E9 36 EA C8 EA 7B 58 7C B6 D4 6E 7F 32
##$RELAX= 
##$RELAX= 
##$RELAX= 
##$RELAX= 
##$RELAX= 
##$RELAX= 
##$RELAX= 
##$RELAX= 
##$RELAX= 
$$ Bruker specific parameters
$$ --------------------------
##$DU= <F:/spectra>
##$EXPNO= 1
##$NAME= <P31>
##$PROCNO= 1
##$TYPE= <nmr>
##$USER= <she>
##$AMP= (0..31)
100 100 100 100 100 100 100 100 100 100 100 100 100 100 100 100 100 100 
100 100 100 100 100 100 100 100 100 100 100 100 100 100 
##$AQSEQ= 0
##$AQ_mod= 1
##$AUNM= <au_zg>
##$AUTOPOS= <>
##$BF1= 81.014009
##$BF2= 200.13
##$BF3= 200.13
##$BF4= 200.13
##$BF5= 200.13
##$BF6= 200.13
##$BF7= 200.13
##$BF8= 200.13
##$BYTORDA= 1
##$CFDGTYP= 0
##$CFRGTYP= 5
##$CHEMSTR= <none>
##$CNST= (0..31)
1 1 145 1 1 1 1 1 1 1 1 1 1 1 1 1 1 1 1 1 1 1 1 1 1 1 1 1 1 1 1 1 
##$CPDPRG= <waltz16>
##$CPDPRG1= <>
##$CPDPRG2= <waltz16>
##$CPDPRG3= <>
##$CPDPRG4= <mlev>
##$CPDPRG5= <mlev>
##$CPDPRG6= <mlev>
##$CPDPRG7= <mlev>
##$CPDPRG8= <mlev>
##$CPDPRGB= <>
##$CPDPRGT= <>
##$D= (0..31)
0 1 0 0 0 0 0 0 0 0 0 0.03 2e-05 3e-06 0 0 0 0 0 0 0 0 0 0 0 0 0 0 0 0 
0 0 
##$DATE= 1688466254
##$DBL= (0..7)
120 120 120 11 120 120 24 19 
##$DBP= (0..7)
150 150 150 150 150 150 150 150 
##$DBP07= 0
##$DBPNAM0= <>
##$DBPNAM1= <>
##$DBPNAM2= <>
##$DBPNAM3= <>
##$DBPNAM4= <>
##$DBPNAM5= <>
##$DBPNAM6= <>
##$DBPNAM7= <>
##$DBPOAL= (0..7)
0.5 0.5 0.5 0.5 0.5 0.5 0.5 0.5 
##$DBPOFFS= (0..7)
$$ [...]
##$SUBNAM2= <"">
##$SUBNAM3= <"">
##$SUBNAM4= <"">
##$SUBNAM5= <"">
##$SUBNAM6= <"">
##$SUBNAM7= <"">
##$SUBNAM8= <"">
##$SUBNAM9= <"">
##$SW= 501.771253377433
##$SWIBOX= (0..15)
0 1 3 0 0 0 0 0 0 0 0 0 0 0 0 0 
##$SW_h= 40650.406504065
##$TD= 32768
##$TD0= 1
##$TE= 0
##$TE2= 300
##$TE3= 300
##$TEG= 300
##$TL= (0..7)
0 120 53 12 22 120 120 120 
##$TP= (0..7)
150 150 150 150 150 150 150 150 
##$TP07= 0
##$TPNAME0= <>
##$TPNAME1= <>
##$TPNAME2= <>
##$TPNAME3= <>
##$TPNAME4= <>
##$TPNAME5= <>
##$TPNAME6= <>
##$TPNAME7= <>
##$TPOAL= (0..7)
0.5 0.5 0.5 0.5 0.5 0.5 0.5 0.5 
##$TPOFFS= (0..7)
0 0 0 0 0 0 0 0 
##$TUNHIN= 0
##$TUNHOUT= 0
##$TUNXOUT= 0
##$USERA1= <user>
##$USERA2= <user>
##$USERA3= <user>
##$USERA4= <user>
##$USERA5= <user>
##$V9= 5
##$VALIST= <valist>
##$VCLIST= <CCCCCCCCCCCCCCC>
##$VD= 0
##$VDLIST= <DDDDDDDDDDDDDDD>
##$VPLIST= <PPPPPPPPPPPPPPP>
##$VTLIST= <TTTTTTTTTTTTTTT>
##$WBST= 1024
##$WBSW= 4
##$XGAIN= (0..3)
0 0 0 0 
##$XL= 0
##$YL= 0
##$YMAX_a= 5475
##$YMIN_a= -5447
##$ZGOPTNS= <>
##$ZL1= 120
##$ZL2= 120
##$ZL3= 120
##$ZL4= 120
##$ABSF1= 0
##$ABSF2= 0
##$ABSG= 0
##$ABSL= 0
##$ALPHA= 0
##$AQORDER= 0
##$ASSFAC= 0
##$ASSFACI= 0
##$ASSFACX= 0
##$ASSWID= 0
##$AUNMP= <proc_1d>
##$AZFE= 0.1
##$AZFW= 0.5
##$BCFW= 0
##$BC_mod= 2
##$BYTORDP= 0
##$COROFFS= 0
##$CY= -3
##$DATMOD= 1
##$DC= 0
##$DFILT= <>
##$DTYPP= 0
##$F1P= 0
##$F2P= 0
##$FCOR= 1
##$FTSIZE= 65536
##$FT_mod= 6
##$GAMMA= 0
##$GB= 0
##$INTBC= 1
##$INTSCL= 6.047779e-11
##$ISEN= 30
##$LB= 1
##$LEV0= 0
##$LPBIN= 0
##$MAXI= 10000
##$MC2= 0
##$MEAN= 0
##$ME_mod= 0
##$MI= 50
##$NCOEF= 0
##$NC_proc= -5
##$NLEV= 6
##$NOISF1= 182.463
##$NOISF2= 159.3651
##$NSP= 0
##$NTH_PI= 0
##$NZP= 0
##$OFFSET= 248.5645
##$PC= 4
##$PHC0= -10851.26
##$PHC1= 439.4848
##$PH_mod= 1
##$PKNL= yes
##$PPARMOD= 0
##$PSCAL= 0
##$PSIGN= 0
##$REVERSE= no
##$SF= 81.0140089999694
##$SI= 65536
##$SIGF1= 159.3651
##$SIGF2= -187.1042
##$SINO= 113.3802
##$SIOLD= 16384
##$SREGLST= <1H.CDCl3>
##$SSB= 0
##$STSI= 65536
##$STSR= 0
##$SW_p= 40650.406504065
##$SYMM= 0
##$S_DEV= 0
##$TDeff= 32768
##$TDoff= 0
##$TI= <>
##$TILT= no
##$TM1= 0
##$TM2= 0
##$TOPLEV= 0
##$USERP1= <user>
##$USERP2= <user>
##$USERP3= <user>
##$USERP4= <user>
##$USERP5= <user>
##$WDW= 1
##$XDIM= 65536
##$YMAX_p= 318272687
##$YMIN_p= -89002357
$$ End of Bruker specific parameters
$$ ---------------------------------
##NTUPLES= NMR SPECTRUM
##VAR_NAME=  FREQUENCY,     SPECTRUM/REAL,   SPECTRUM/IMAG
##SYMBOL=    X,             R,               I
##VAR_TYPE=  INDEPENDENT,   DEPENDENT,       DEPENDENT
##VAR_FORM=  AFFN,          ASDF,            ASDF
##VAR_DIM=   65536,         65536,           65536
##UNITS=     HZ,            ARBITRARY UNITS, ARBITRARY UNITS
##FACTOR=    0.620285442955139, 1,           1
##FIRST=     20137.2065510682, 0,            0
##LAST=      -20513.1999529968, 0,           0
##MIN=       -20513.1999529968, -89002357,   0
##MAX=       20137.2065510682, 318272687,    0
$$ Real data points
##PAGE= N=1
##DATA TABLE= (X++(R..R)), XYDATA
$$ [...]
39898e12503j89193l10135j23955L62643O06551K07776m25957n21216M5243N76371
39888b84375M37510k03671o34133m13222J88347N31644L35998k2963k6982L02013
39878B10166M83134K66194j17082l96469n36856m83824j05571M17171N95076K86592
39868F18531n6313n8414R2413J15196J18190K40181K71463P0247p5102K4312Q54
39857A361558m39489q28319n33462K29755O53641M35372k338k63924l48348l14028
39847d9582j27263J26881K79435K98072K00167o0740l34109k40578K06110L70758
39837F69151q4472n21166k56670K78194J97454l67375m92920n32L51835K47023
39827B0522K27715M98252M45807j62282n36192j07096M40602K17113m33249m84205
$$ y = [-512503, -701696, -1011831, -1135786, -773143, -166592, 41184, -384773, -905989, -860746, -284375, 153135, -50536, -684669, -1097891, -909544, -377900, -41902, -64865, -91847, 210166, 693300, 959494, 842412, 445943, -90913, -574737, -680308, -263137, 331939, 618531, 562218, 503804, 596217, 711413, 829603, 1069784, 1341247, 1411494, 1336392, 1360704, 1361558, 922069, 93750, -439712, -209957, 443684, 879056, 876718, 612794, 264446, -49582, -176845, -49964, 229471, 527543, 727710, 666970, 332861, 92283, 298393, 669151, 584679, 63513, -193157, 85037, 282491, -84884, -577804, -578336, -226501, 20522, 248237, 746489, 1192296, 1030014, 493822, 386726, 827328, 1044441, 611192, 126987]
39817A26987J57323N67287K63704j53276m2557L07631K05993l59316p21305n20626
39807a68155j53892n7548j0759L83617Q10852N45167l35821q21654l89374J82429
39797a5138p81n92595o39337j04030K05690R610j34235J20340M60601O14390O58371
39786E82886N08213n3330o66363n86175J42425N62059K02219k55824j53004J71802
39776D54908J64062R035Q3148J28124k22129o18412n11813p5361J62820K12642
39766b12976L50590L42678j49259o64032m42928K73570M60595j30245o12494l64711
39756a149212J54610L34860K84382K91766J81813j84512l80078n1278L74439L02141
39746A58931o4418p7803K74338L87104N3765k47669j58038P8033R0943j25031
$$ y = [126987, 284310, 851597, 1115301, 962025, 919468, 1227099, 1433092, 1073776, 352471, -168155, -322047, -379595, -390354, -6737, 804115, 1349282, 1013461, 191807, -197567, -15138, -15919, -608514, -1247851, -1351881, -1146191, -1136581, -1270816, -1150476, -689875, -75485, 582886, 1091099, 1037769, 371406, -214769, -72344, 489715, 691934, 436110, 283106, 454908, 618970, 628005, 711153, 839277, 617148, -1264, -513077, -588438, -425618, -212976, 137614, 480292, 331033, -332999, -775927, -502357, -41762, -172007, -784501, -1149212, -994602, -659742, -375360, -83594, 98219, -86293, -466371, -517649, -143210, 158931, 94513, 16710, 291048, 678152, 731917, 484248, 326210, 404243, 495186, 370155]
39736C70155l54877m06739j32795L88421O59378K53164m38489n41853N5468M72298
39726C24131J47289l39303k63374J12347J22229j46354j44820Q0261O1968r7256
39716a42882J01090M91249L82362k01267m59964j68952k6589l37675m33009Q2738
39706g12899N39221L52491K8362J67121L05948k17506q95406p01375K53847Q38203
39696d1993N23533r5390l57674k25167Q9259L88597L67249p8006m51281k54234
39686a35107J51469O3605l28150j95006M53904O33168l1998o27463l45679L24225
39676c7032M38768l0865l63474k01112J37020K52691J16980p767J15581L60819
39666G81609K49906l93986r27954n82681L59960Q06923L86778q0059N6422L14912
$$ y = [370155, 15278, -391461, -524256, -135835, 523543, 776707, 338218, -203635, -148167, 324131, 471420, 132117, -131257, -18910, 103319, -43035, -187855, -107594, -45626, -142882, -41792, 449457, 831819, 630552, 170588, 1636, -24953, -362628, -795637, -712899, -173678, 178813, 207175, 374296, 680244, 462738, -432668, -1134043, -880196, -41993, 481540, 386150, 28476, -196691, -107432, 281165, 648414, 570408, 119127, -135107, 16362, 79967, -248183, -443189, 10715, 643883, 611885, -15578, -361257, -37032, 401736, 370871, 7397, -193715, -56695, 195996, 312976, 305209, 420790, 781609, 1031515, 637529, -290425, -873106, -513146, 293777, 680555, 600496, 656918, 971830]
39656I71830M0438m50186m55165p7030K1734k57736l82012j13345K07786L07120
39646a86566L16419L99562M79176M08295J22310l50194p82864q03100l48874J08565
39636f37271J51587J7592J72984M82724L88694j29661m11219r1796L31282K35314
39626E10230k32383m06341l6131M39090N04519J26871l55484o31661n70055j77063
39616h28408L55392O42777M32283j5757j36989K15348N24447L08671j97249m10487
39606H90028k45005j12228j56009m8385L32705N51801K37887l25344n78560l97272
39596A49618q7119J32602K69634K69198l2219n56196q31129m27334M53548J015185
39586C55788O91954j22729m87223j22087K21894j08918o61387n81895K7048K90047
$$ y = [971830, 1012268, 562082, 106917, 29887, 51621, -206115, -588127, -701472, -493686, -186566, 129853, 529415, 1008591, 1416886, 1539196, 1189002, 406138, -396962, -745836, -637271, -485684, -468092, -295108, 187616, 576310, 446649, 35430, -56366, 274916, 510230, 277847, -128494, -164625, 274465, 778984, 905855, 550371, -81290, -651345, -828408, -473016, 169761, 602044, 586287, 449298, 664646, 1189093, 1497764, 1300515, 890028, 645023, 532795, 376786, 328401, 661106, 1212907, 1450794, 1125450, 546890, 149618, 62499, 195101, 464735, 733933, 701714, 145518, -685611, -1112945, -659397, 355788, 1047742, 925013, 437790, 315703, 537597, 428679, -232708, -814603, -787555, -497508]
39576d97508n045j02400L90807P89041M29295k59229m36308p3674J96878J11841
39566E43698l5857n8331r5155k07594k39008j01540J27702L47684M07998J05270
39556G94867m64241p33490k84389M43516N34621k35156r96109p58728L95267J317232
39546A3390J024416j73410r74017n92100L20673N95460R6952k75829k9791L21710
39536C27454K87805J53622K38215J92256k87044o84184m05915J88647L32005N0658
39526C93519l7746J50926J45398j34942k87878k08718j43691m6105K81047M95970
39516F07780J10541m71006l50723L66948O23884J48501j18469K39754L08961m57423
39506A008748j030209m38128M56959K49543o82193p56483K42108Q47530K58591
$$ y = [-497508, -502553, -604953, -214146, 574895, 1004190, 744961, 308653, 234979, 431857, 543698, 507841, 449510, 354355, 146761, -92247, -193787, -66085, 281599, 689597, 794867, 330626, -402864, -687253, -243737, 290884, 55728, -940381, -1699109, -1303842, 13390, 1037806, 864396, -109621, -701721, -381048, 214412, 311364, 35535, 5744, 327454, 615259, 768881, 1007096, 1199352, 912308, 228124, -177791, 10856, 342861, 393519, 355773, 506699, 652097, 517155, 229277, 20559, -123132, -169237, 111810, 607780, 718321, 247315, -103408, 263540, 887424, 1035925, 917456, 1157210, 1466171, 1008748, -21461, -459589, -2630, 246913, -435280, -1191763, -949655, -102125, 156466]
39497A56466n63153n81815j12673J27319K55492O23194Q41502L99948k99540m75651
39487C71089j61839J0686q1922p8705m5204l60940p33854l85000N82814J034103
39477A51228M43210k74050k02540J86503j2236n19602l85569K57045K87820m97187
39467e65378q78659q0787R51151R13647l953n60812k82051J48640J52852k1511
39457b26861J5836J38118N4945j53935k04314m3820J31602J44347k4099k31174
39447c99355k54651k2079K37732K56076J04853O5756J49061Q0878j83551l20193
39437b85473j73558o5448k81761n36859l33232K77692O92010N41395J59644J06175
39427A00585M24458O13079L16594j82254l32847p7143O0453k52465o05689l99720
$$ y = [156466, -406687, -988502, -1101175, -973856, -718364, -95170, 746332, 1146280, 846740, 371089, 209250, 219936, 138014, 59309, 14105, -346835, -1080689, -1465689, -882875, 151228, 594438, 320388, 117848, 304351, 292115, -227487, -613056, -356011, -68191, -565378, -1444037, -1524824, -573673, 339974, 336021, -224791, -506842, -358202, -205350, -226861, -211025, -72907, -17962, -171897, -376211, -420031, -288429, -144082, -168181, -399355, -654006, -676085, -438353, -182277, -77424, -11668, 137393, 218271, 34720, -285473, -459031, -524479, -806240, -1343099, -1676331, -1398639, -706629, -165234, -5590, 100585, 525043, 1138122, 1454716, 1272462, 939615, 862472, 922925, 670460, 64771, -334949]
39417c34949K32458N22844J14422m48435m66977M6884N29396O03467L33656n6797
39407A075969l66891m01813r7264L27281N35062L76219p6790o45336j027526q83280
39397a184369k32687L91211N15665L03634J88019J28468k07603o03096l64133
39388a064891N45379J128420N95741m96629r32630l80894L41112M39258R557l36049
39378a51626k60865O2570K57532J35337j13326j15656K02922M61367L28500J6764
39368H23519k5619K10617K99267K0447l68315n27776l79803l5325K96840L19374
39358F33226p7561n14334m69508J8338L90875L64141K10684J37900m7429l73588
39348B72744l68205K25642Q08264N91715k80104q31420m50611M39131R45108O37411
$$ y = [-334949, -102491, 420353, 534775, 86340, -380637, -333753, 195643, 799110, 1132766, 1075969, 709078, 307265, 210001, 537282, 1072344, 1448563, 1371773, 726437, -301089, -1184369, -1417056, -1025845, -510180, -206546, -18527, 109941, -97662, -700758, -1064891, -519512, 608908, 1204649, 708020, -224610, -605504, -264392, 174866, 184423, -151626, -412491, -349921, -92389, 42948, -70378, -186034, 16888, 478255, 806755, 823519, 797900, 1008517, 1307784, 1328231, 959916, 432140, 52337, 17012, 313852, 633226, 555665, 41331, -428177, -409839, -18964, 345177, 555861, 693761, 646332, 272744, -95461, 130181, 938445, 1530160, 1250056, 418636, -31975, 407156, 1352264, 1989675]
39338A989675j32153o46884n31969j11124K9297j77173k25800J36505M60971K62928
39328A054273k41683m80496l20655p0448Q9731J94207J63957j09272m08402l62503
39318d91291L5498M25362N37634L60005m298l11541k21419K34773M73400J16814
39308A154937l53990k99999K5001q3830m98967m09433K30961M93957J3614l41311
39298f9060Q7559N93200K48268n19250n47991K34563O98940K03993n64129p00077
39288c33984k67636O7113Q3932J20519L23909L50284l9445m60555l48445J88355
39278c15953M08721j3960m27919j06713O05436O97597l7427o68129m44329K34377
39268f8299N55877M10137K19215J07057q6130k23414k9535K44603L6610n54565
$$ y = [1989675, 1857522, 1210638, 678669, 567545, 596842, 419669, 193869, 330374, 791345, 1054273, 812590, 332094, 11439, -59009, 30722, 224929, 388886, 279614, -128788, -491291, -455793, -30431, 507203, 867208, 862910, 551369, 329950, 564723, 1038123, 1154937, 800947, 500948, 525949, 442119, -56848, -466281, -235320, 258637, 272251, -69060, 18499, 611699, 859967, 340717, -207274, 27289, 726229, 930222, 366093, -333984, -601620, -534507, -450575, -330056, -6147, 344137, 304692, -155863, -504308, -315953, 92768, 78808, -349111, -455824, 149612, 847209, 809782, 141653, -302676, -68299, 487578, 897715, 1116930, 1223987, 1137857, 914443, 884908, 1129511, 1166121, 611556]
39258F11556p19902j52435L56182N9939n27455l48430N09025P98184l1407r06326
39248c51069o55499K76530N68586L9275k29552K52643O34434K15493m09973m00340
39238e9472K8852K02399J68365L08131L39778j80536p42341m49932M59079Q36707
39228I11030L53233j51461j57459j43542m82987p46111n53723k10690k9486J65426
39218a045770M40566M49724J22453j17910j55428l42837n56411j35703P80578
39209e60738J023850J83570n41937j74904M96274L19560l13982l20991J63287
39200B73989K43536J5034K35454O33081K39033p07591q90659j00147L72436r0352
39190B23814m66199K3159N43915J58503n07497l37386L72789M17120l38337p72893
$$ y = [611556, -108346, -260781, 95401, 155340, -372115, -720545, -211520, 586664, 555257, -351069, -1006568, -730038, -161452, -122177, -351729, -99086, 535348, 750841, 340868, -59472, -30620, 171779, 340144, 648275, 988053, 807517, 65176, -384756, 74323, 911030, 1264263, 1112802, 955343, 811801, 328814, -417297, -971020, -1181710, -1211196, -1045770, -605204, -155480, -33027, -150937, -306365, -649202, -1205613, -1341316, -560738, 463112, 646682, 104745, -70159, 426115, 745675, 431693, 110702, 273989, 517525, 532559, 768013, 1401094, 1640127, 932536, 41877, -58270, 314166, 223814, -242385, -219226, 324689, 483192, -24305, -361691, 11098, 428218, 89881, -683012]
39180f83012k76225M21174M52769L768j68717J29154M04043K74969n7984j66989
39170C32950P0226M00053N01716K62634j45998l76969k20242P8524Q635m91589
39160D19940p74871l30059L59348M12744j11208k75844K35976N99380K16929k76251
39150D76084n1222N85280P25683K19400l38437n90464n80075k78957K20493L63337
39140G51122j45599n85270j42450O81420O87734j45684o31693k62986J46501n587
39130C47508j98207N2287K57261p4991m73340l49569m8071j43758l03471J44850
39120g89501Q86527R11296N1553p04105n90886j3062K01869m9719j86722J24784
39110a57966N27931N21740J60519n4142Q8295K25457L0541k52554k38584p5074
$$ y = [-683012, -959237, -538063, -85294, -81526, -250243, -121089, 282954, 557923, 499939, 332950, 403176, 803229, 1304945, 1567579, 1421581, 1044612, 824370, 902894, 911529, 419940, -354931, -684990, -325642, 87102, -24106, -299950, -63974, 535406, 752335, 476084, 424862, 1010142, 1735825, 1955225, 1616788, 1026324, 446249, 167292, 387785, 751122, 605523, 20253, -122197, 559223, 1246957, 1101273, 469580, 206594, 353095, 347508, 149301, 201588, 458849, 383858, -89482, -439051, -487122, -630880, -934351, -789501, 97026, 1008322, 1059875, 355770, -235116, -248178, -46309, -96028, -282750, -157966, 369965, 891705, 1052224, 998082, 1086377, 1311834, 1342375, 1089821, 851237, 776163]
39100G76163j68422m15768l42934L6219J95429J3328k8399K17506K18432k33497
39090B68057m48633Q0090O75018L98574m55921p62805k66153J34850j03460l71659
39080h52042l6895M71760M08468j6267J8478N35697O28657q6834p20784l45104
39070E134N81795P79245q0605r50388q61199j03141L84282K74235J0263j5135
39060B4486P5652j2907k76738l80970l9619N61548Q17703L92431k64710m67086
39050D29790k47644j91557l53049j50622M70237P07809K03021k68512r7345Q6021
39040E88149m09742r21054m34240N94123Q29997J48375l27560j56015m2404k63269
39030c93640j51258M41496N91882j33161p95461n46170P7278J66794j28932j10380
$$ y = [776163, 607741, 191973, -150961, -114742, 80687, 94015, 65616, 283122, 501554, 268057, -180576, -100486, 574532, 973106, 517185, -245620, -511773, -376923, -480383, -852042, -888937, -417177, -8709, -24976, -6498, 529199, 1157856, 1071022, 350238, 5134, 586929, 1366174, 1285569, 335181, -526018, -629159, -244877, 29358, 39621, 24486, 100138, 87231, -189507, -570477, -610096, -48548, 769155, 1161586, 896876, 429790, 182146, -9411, -362460, -513082, -42845, 664964, 867985, 599473, 502128, 588149, 178407, -742647, -1176887, -582764, 247233, 395608, 68048, -87967, -130371, -393640, -544898, -103402, 488480, 355319, -440142, -986312, -909034, -742240, -871172, -981552]
39020i81552K28088L77560K54318J45390Q0241n6555j12320N2860K02598J28328
39010C18956K9116N2712n2806l59047l99612L9885L64108P6487l25368j54166
39000d09735K83982K37569j47319p0306N07590P38322K40036l59454m49205k11482
38990C59998o4429L668J42970J82687q3260m30030m29067n2785K41133P6583l36262
38979c88794m02102J11446O79948O15591j6120m55310k89298K9078m7725l24775
38969d88061k40090K15684M73983K07109k55718l91518j02792K18527J67685j69502
38959c64693k83628O9740M47606L26527o4420q5663K32976K16333k56692m57926
38949b19840n5222K40731j38447o00207l55358K54765L42623n5800j06993M22980
$$ y = [-981552, -753464, -375904, -121586, 23804, 104045, 47490, -64830, -11970, 190628, 318956, 348072, 400784, 347978, -11069, -410681, -370796, -6688, 69799, -255569, -409735, -125753, 111816, -35503, -105809, 401781, 1140103, 1380139, 1020685, 571480, 359998, 295569, 299237, 442207, 624894, 541634, 111604, -317463, -370248, -129115, -52532, -388794, -790896, -679450, 498, 616089, 599969, 144659, -144639, -115561, -163286, -488061, -728151, -512467, -38484, 168625, -87093, -478611, -581403, -362876, -195191, -364693, -648321, -578581, -130975, 195552, 131132, 45469, 278445, 494778, 238086, -219840, -275062, -34331, -172778, -772985, -1128343, -873578, -530955, -586755, -693748, -270768]
38939b70768Q55288O85518J79700k03996l33970k51436m0970P6576l5509j38781
38929E21652K8461K25565L2070m20252n86441l13934K8658J78625K03178J35462
38919C3044q1437k97341k93750j88454k34217l08610j22457J80325K18157O8290
38909a026450J27474L47547L10548M7069K2983K52094K18725j60031l10399o999
38899a77439K02206l5674k41936N2714M91404N07653K13390M3254k9662k46654
38889G79256l91549j00454L57861L40150j76018n20207l21817K7820Q5480l689
38879G6833J06028L12992K21939k03775n16107l50041J10968L51291J18931k96191
38869f7132l93725l3416L89187L97955L7222j38029K16473O77483N16901k77485
$$ y = [-270768, 584520, 1270038, 1449738, 1245742, 911772, 660336, 619366, 695942, 660433, 521652, 550113, 775678, 807748, 387496, -198945, -512879, -484221, -305596, -102418, 33044, -48393, -345734, -639484, -827938, -1062155, -1370765, -1493222, -1312897, -1094740, -1026450, -898976, -551429, -240881, -193812, -170829, 81265, 299990, 139959, -170440, -177439, 24767, -10907, -252843, -200129, 291275, 798928, 1012318, 1055572, 1025910, 779256, 387707, 287253, 645114, 985264, 809246, 289039, -32778, -4958, 80522, 76833, 182861, 495853, 717792, 514017, -2090, -352131, -241163, 110128, 229059, -67132, -460857, -494273, -105086, 292869, 330091, 192062, 408535, 1086018, 1602919, 1325434]
38859A325434q44248n49679J21998K44088k18256l94092J54840P73285O86533
38850A299903O8588l28793k38149n4215j37996l93731m92763k39834K23245M53729
38840A59984J56405l12782k79795K40361M17815j45445o57607k57844O22696Q61874
38830H05662K90082k06965j26237P2272n3878k51295j81225K013N0391M1536N6179
38819D98535p5985l72149m72667j65498K27529L11339J56248Q2293J74608K83503
38809F47756K85552J27524j84416m71885m70134j62499J67068K87273K08954K2941
38799D58134j58963j28186J83377M18342J95910k21809k18966J92217L47131K2584
38789A089771k00634L0690K30210k2983l05960j34006J22395r9574m83859l31860
$$ y = [1325434, 481186, -68493, 53505, 297593, 79337, -314755, -159915, 613370, 1299903, 1368491, 1039698, 801549, 747334, 609338, 215607, -277156, -516990, -293745, 159984, 316389, 3607, -276188, -35827, 381988, 236543, -421064, -678908, -56212, 805662, 1095744, 888779, 762542, 834814, 780936, 529641, 348416, 350429, 400820, 442356, 498535, 422550, 50401, -422266, -587764, -360235, -48896, 107352, 189645, 364253, 647756, 933308, 1060832, 876416, 404531, -65603, -228102, -61034, 226239, 435193, 458134, 299171, 170985, 354362, 772704, 968614, 746805, 527839, 720056, 1067187, 1089771, 889137, 919827, 1150037, 1127054, 821094, 687088, 809483, 709909, 226050, -105810]
38779a05810K10829L79353O4436j05176P6737J25680j16492j54939J76285L06755
38769H57658n6885l37239q1267K03470n4500l95810n9809O14360N85260k10202
38759A065036o63360j79944M35010K58427l84372n22533J1814M98246M47310R4682
38749A060316j82404l28515l80222k50083N5451K90534K17675j36385n12997n97383
38739g64013k48967K64727M14443N2076k78333m3374M56636M89492J0024k71552
38729H1159J642L44848K84001M1145r153J0306j37996k47757n7862J48080p2071
38718C86342n45809o69362k61904K61347N15890N02979L57084J42691n6302j47038
38708D85918j62896j85420j70466l2922J72443L06206K72283J3714l93390n81087
$$ y = [-105810, 105019, 484372, 548808, 443632, 520369, 646049, 529557, 374618, 550903, 857658, 800773, 463534, 382267, 585737, 531237, 135427, 75618, 689978, 1275238, 1065036, 401676, 221732, 656742, 915169, 530797, 8264, 20078, 518324, 965634, 1060316, 877912, 549397, 169175, -80908, -25457, 265077, 482752, 346367, -166630, -764013, -1012980, -748253, -333810, -281734, -560067, -603441, -146805, 342687, 352711, 81159, 82801, 427649, 711650, 752795, 743642, 753948, 615952, 368195, 310333, 458413, 386342, -159467, -828829, -1090733, -829386, -313496, 189483, 546567, 689258, 632956, 485918, 323022, 137602, -32864, -65786, 106657, 412863, 685146, 698860, 305470, -275617]
38698b75617k13396L80785M05291k72179p45810l05069M94291O38703R7509l08249
38688a03741j78009J36809L06229L27767J32469l42092o94747m23887K16934M49537
38678a72731J12146j62403J533K53127K65610K04215J94326L0635k78094l34904
38668A13460o1908M7437k44460m48060j39609L30281M24802K52721K62136M41112
38658I77912L79296m5330m95699o23437l91344j4240K39776K64775J96199J60573
38648F48481L8545k52945m02656r8540L29080K68111j91753l44797j3226J96807
38638A77107j0368j36436J22068K71239m4978l26427j25496Q0624k34601n57216
38628g84484j20211O87347P91906Q5053m68602l27139L2785J13818N7337P3339
$$ y = [-275617, -489013, -108228, 297063, 24884, -720926, -1025995, -531704, 106999, 204508, -103741, -281750, -144941, 161288, 489055, 621524, 279432, -415315, -839202, -622268, -172731, -60585, -222988, -221455, 31672, 297282, 501497, 695823, 726458, 448364, 113460, 51552, 98989, -145471, -593531, -733140, -402859, 21943, 274664, 536800, 977912, 1357208, 1311878, 816179, 192742, -198602, -212842, 26934, 291709, 487908, 648481, 687026, 434081, 31425, -67115, 261965, 530076, 338323, -6474, -19700, 177107, 166739, 30303, 152371, 423610, 378632, 52205, -73291, 7333, -227268, -784484, -904695, -217348, 574558, 659611, 191009, -136130, -103345, 10473, 67810, 141149]
38618A41149K6539j04644n6875J22870j9079m93911n99950J4124O23485M03718
38608E7426l19171n43137o0191L65019K78738J70858N19056Q93083O00330j73099
38598A788912n63192k66007J02568M264k94027l14583j57163j88244l12864j64598
38588c64934J67670K29245l2799j93103p6325L0139L222J21039M47445N45492
38578H77091J45202l56465m30534r9832K31213L05001R0117l18734o02651l98454
38568e58046J27189K99403j25573n02088k25047L33916M04799k1253k84061j02697
38558f53458J45457J36984p769p8846l4967J26364L61449M63889L17008J68097
38548I44208K60913L50178O5035l93030m96310k47944j42031k68971j77349K33521
$$ y = [141149, 167688, 63044, 6169, 129039, 109960, -383951, -983901, -969777, -346292, 57426, -261745, -804882, -865073, -500054, -221316, -50458, 468598, 1361681, 1962011, 1788912, 1225720, 959713, 1062281, 1066545, 772518, 457935, 300772, 112528, -200336, -364934, -197264, 31981, -818, -193921, -270246, -240107, -236885, -115846, 331599, 877091, 1022293, 665828, 235294, 135462, 366675, 671676, 761793, 443059, -159592, -558046, -430857, -131454, -257027, -759115, -984162, -650246, -245447, -266700, -550761, -653458, -508001, -371017, -378786, -457632, -492599, -366235, -4786, 459103, 776111, 944208, 1205121, 1555299, 1620334, 1227304, 730994, 483050, 341019, 72048, -105301, 128220]
38538A28220M14189O3065l32000k69393J0151L9764p9954J0108J87198P9244j67098
38527H3494n2313L67096M31783q0127m89362j76138M54674N06195j34952o49049
38517B61301m42409R5584K60993L0080p6709J01658J77505l6665j55766J26275
38507C41847M56902L27873j26156l40603j99112j39796l43591l82409O6490O04336
38497B65781O10054Q9887l94210n02091l85239k15083Q7354N01838O87231M07977
38487A153499n4864k42739j38870j21863l54513n58126m42557o5415L30727N80406
38477H5685N90485L38598J7318p7646L7738J0634k73054m31008j99995N3804j02160
38466E0399l87618j97854L73679N86851J74457k64322j99331J14616J96353Q5630
$$ y = [128220, 542409, 605474, 273474, 4081, 14232, 53996, -25958, -15850, 171348, 250592, 83494, 31181, 398277, 830060, 749933, 260571, 84433, 539107, 1045302, 910350, 261301, -181108, -85524, 175469, 205549, 128840, 230498, 408003, 371338, 215572, 341847, 798749, 1126622, 1000466, 659863, 460751, 320955, -22636, -405045, -338555, 265781, 875835, 965722, 571512, 69421, -315818, -530901, -443547, 58291, 745522, 1153499, 1098635, 855896, 717026, 595163, 240650, -317476, -760033, -825448, -494721, 85685, 676170, 1014768, 1032086, 954440, 992178, 1002812, 729758, 298750, 98755, 152559, 50399, -337219, -535073, -161394, 425457, 599914, 335592, 136261, 250877, 447230, 532860]
38456E32860P8583J13962n1425k90103k51222K9895J42419n8718k23278l3536
38446a0563L31442M35654J43771k15257k20739J64799N18520L93794j63896o26441
38436G51084n65192j39774R9868j25763m78495l93242K15602P79589P22851J62737
38426A029265k87330l56189l50116m57365l44596J90118O40547M56384m1726j16256
38416C62736K02940J93235l09101n95346k45118K08067J81835p4185l7332J98059
38406H5790K07449L0767M2576K41785K60675q18k52997l16714l16565l28784k06934
38395e53770J05209L44956K26306j12876j71422K81601P58774N49160k90842q64442
38385B72654o04818l6158J13145M4746L44749O97883K54014p86250j163399l99629
$$ y = [532860, 611443, 725405, 673980, 383877, 132655, 162550, 304969, 246251, 22973, -10563, 320879, 756533, 900304, 685047, 464308, 629107, 1147627, 1541421, 1377525, 751084, 185892, 46118, 145986, 20223, -458272, -851514, -635912, 143677, 866528, 1029265, 741935, 385746, 35630, -421735, -766331, -576213, 64334, 520718, 478992, 362736, 565676, 758911, 449810, -145536, -390654, -182587, -752, -74937, -112269, 85790, 293239, 324006, 366582, 608367, 869042, 868224, 615227, 298513, -18052, -346836, -553770, -448561, -103605, 122701, 9825, -161597, 120004, 878778, 1427938, 1137096, 272654, -332164, -368322, -255177, -210431, 134318, 832201, 1086215, 299965, -863434, -1263063]
38375a263063M94929O03937K84857J48800l4194n24290o73977Q1258R94536R51351
38365A064144J63230k52992n0887K09l89812n82481j75583L78293N43800L28036
38355A025957k4578l02709k32367K32588N24008P1901p01766p82013j2677O65690
38345D64034N77155R3613j91585k89540m41928n68010m87961k19622K09202P49957
38335a04685R77877M06403n83920q66069o0795P67802N07725m65877q71795k80438
38325e73772M79609N63583O7516l64873l85801j60344J89n832m9679j0284O1756
38314c77932R0101J64482L66915M81542K09998l02157n29384k72046P4197J36491
38304D2207O9293J52667K31314k1225m63256n63669j20476M51044O30351L44198
$$ y = [-1263063, -768134, -164197, 120660, 269460, 235266, -289024, -963001, -881743, 112793, 1064144, 1227374, 974382, 923495, 923704, 533892, -48589, -224172, 154121, 697921, 1025957, 1001379, 698670, 466303, 698891, 1222899, 1294800, 593034, -188979, -201656, 464034, 1041189, 1134802, 943217, 653677, 211749, -356261, -844222, -1063844, -854642, -104685, 873192, 1279595, 695675, -170394, -231189, 536613, 1044338, 578461, -293334, -573772, -94163, 469420, 536936, 172063, -213738, -374082, -373893, -379725, -429404, -439688, -377932, -287831, -123349, 243566, 725108, 935106, 632949, 103565, -168481, -94284, 42207, 111500, 264167, 495481, 474256, 11000, -552669, -673145, -222101, 408250, 752448]
38294G52448q8062l55285l49760r9653K70851N04411L43699j46549n08391l57995
38284c4286J13741L58778K00762K2533J12508K06434k5222l60024l41414l4511
38274B19299M6336k47101m50343k01046K07513K56518o6546k77012n8104L47754
38264b22732M78879K18641j41947l50098m54409n19400l61657J16023N34095M44651
38254b57954M5329o0578J78312J97198j52653k64684J65644N00591J71645l23748
38244A99102k06633L01171L63579j09520m13861k52333r1314k37919l37501j4804
38234h00033N37830Q25177N61970j10440o35238m35267L31826P00506Q8755p75312
38224B89774p91914m0784M40601K20347j29648j44883j5805O1955J85222K53017
$$ y = [752448, 664386, 309101, -40659, -140312, 130539, 634950, 978649, 832100, 323709, -34286, 79455, 438233, 638995, 661528, 774036, 980470, 955248, 595224, 253810, 219299, 265635, 18534, -431809, -632855, -425342, -168824, -235370, -512382, -570486, -222732, 256147, 474788, 332841, -17257, -471666, -991066, -1352723, -1236700, -702605, -257954, -212625, -273203, -94891, 102307, -50346, -315030, -149386, 351205, 522850, 199102, -7531, 293640, 657219, 547699, 133838, -118495, -209809, -447728, -785229, -800033, -262203, 562974, 1124944, 1014504, 379266, -56001, 275825, 976331, 1065086, 289774, -502140, -542924, -102323, 118024, -11624, -156507, -172312, -110357, 74865, 327882]
38214C27882K1751k39829k1031M25056L31316k02749k19313M22573O28680j28488
38204A345848q24892n10752J92770K42801j18222l617M55966L92484k22942n23705
38194D25739j66893K61284K93143J26932K9695m2718j05951n4846L041j41413
38184F28013l42776k81125n6855l8107j53088L5725N10127O89452K97036k33241
38174A055161m23190l36706k74078l01150l28360l22707k21617P8683M61374N82728
38164b9862L11229n5560j75075n4918P4468P8107l6883k12013l30843k67389n9985
38153g58724R1131Q3051K4164K2986M4339P0061J96799M13750M69495J90414j85460
38142F62006k57686j2128J49374k5296l02686l31756j35029j5961j04411k36613
$$ y = [327882, 349633, 109804, 88773, 513829, 845145, 642396, 423083, 845656, 1474336, 1345848, 520956, 10204, 202974, 445775, 327553, 323936, 779902, 1172386, 949444, 425739, 258846, 520130, 813273, 940205, 969900, 927182, 821231, 766385, 769426, 628013, 285237, 4112, -52743, -90850, -243938, -208213, 301914, 991366, 1288402, 1055161, 631971, 295265, 21187, -279963, -608323, -931030, -1152647, -1073964, -612590, -29862, 281367, 225807, 50732, -4186, 70282, 148389, 111506, -100507, -431350, -698739, -758724, -667593, -584542, -560378, -537392, -493053, -422992, -226193, 187557, 657052, 847466, 662006, 404320, 392192, 541566, 516270, 213584, -118172, -253201, -269162, -373573, -610186]
38132f10186k31315n2675K64774N97434O58399K58334l08111m78065j43371J92864
38122A48082J54919o015O2552J88715J9926l01762l38848p9166P2857k6711j00008
38111b05459N214P0698p7990k76825k73359k4990L10441M93528L56614K6981j43843
38100B61010q4831j62063n03226n61652O8718P55787N61720k89628o13370L030
38090e64505O24533M18253k15222m53043k46554p8616o9406L141J19809O9789
38080c91821q3067p2910J12251K13982J03509m6887K0602L51262O41846M74276
38070A323043j28177n42231k98555J91161J94214k07432k67611J52089L27221
38061G43722r9854n06246l23409Q7917J40218n2385m7504J46079K53736K71630
$$ y = [-610186, -841501, -894176, -629402, -31968, 626431, 884765, 576654, 98589, -44782, 148082, 303001, 296986, 359538, 548253, 568179, 266417, -72431, -151597, -78740, -105451, -205459, -200245, -129547, -207537, -484362, -757721, -782711, -472270, 21258, 377872, 404853, 261010, 176179, 14116, -489110, -1050762, -982044, -226257, 335463, 45835, -567535, -564505, 60028, 478281, 263059, -189984, -436538, -515154, -584560, -581419, -461610, -391821, -474888, -547798, -435547, -221565, -118056, -164943, -144341, 206921, 848767, 1323043, 1194866, 652635, 354080, 545241, 739455, 532023, 264412, 416501, 743722, 643868, 137622, -185787, -97870, 42348, -10037, -57541, 88538, 342274, 613904]
38051F13904K76211R1023l44019o37489m57155k8294K79022M46053N05925K64300
38041A009481k16509l95196m7046K60121O3591k03349k356L14451J32177l04232
38031F11133l27682k3457J8998j55936j6285L41546L00995p6505n8652M08903
38021A023058M45355l11453r62543o20372L11167P62904M09478j56180l52000
38012E49414j61583J16318K48758J85896L4740m2157J8459J20856J00746j27782
38002A043665m28563m52736j2744N08949M79350j00957m83867k48556L1355k76209
37992E9687p44794m86548M09179R19620N50371q0737k68572q3354O0885P0876
37982D06613N1586j9433j56620k27182j80346j26919n4369J90379N07526N33757
$$ y = [613904, 890115, 981138, 637119, -370, -457525, -485819, -206797, 239256, 745181, 1009481, 792972, 397776, 350730, 610851, 674442, 471093, 468737, 783188, 915365, 611133, 283451, 259994, 278992, 123056, 106771, 448317, 749312, 672807, 614155, 1023058, 1468413, 1156960, 194417, -425955, -114788, 648116, 1057594, 901414, 549414, 387831, 504149, 752907, 938803, 973543, 931386, 949845, 1070701, 1171447, 1043665, 615102, 162366, 149622, 658571, 1137921, 1036964, 553097, 304541, 335896, 59687, -685107, -1171655, -762476, 157144, 707515, 626778, 358206, 274852, 335737, 406613, 458199, 438766, 282146, 54964, -125382, -252301, -306670, -116291, 391235, 924992]
37972I24992K00605r6548j01292o8267k64075m81419m01226j25564M4071J14908
37962b53815K58084L34861O9301l50854l82404L6285K71109p7473m86315k64842
37952h46063L29088M50122L5948p3369M11259O37691N9555m79951j03848M51498
37942H71930n8916j111392r75206M34937J162774K45775o99475o1480J188610
37933I97557J107571j74010q81378m44906r337k42911m34538m5598L55042K17849
37923D45341r7901j06870M0603N7544K3809M161j48392l04301p1949M12592M35829
37912F90466k06026p54622n23919K03573O99245O78156L10223j61998m61977l59923
37902A13198j4780J36290J1707l0559J18444R3307k62243n39729l91272k7159
$$ y = [924992, 1125597, 1029049, 927757, 859490, 595415, 113996, -287230, -412794, -368723, -253815, 4269, 339130, 408431, 57577, -324827, -288542, -17433, -94906, -581221, -846063, -516975, -66853, -30905, -104274, 306985, 944676, 1004231, 524280, 420432, 871930, 813014, -298378, -1273584, -838647, 324127, 569902, -129573, -191053, 997557, 2105128, 1931118, 1049740, 604834, 595497, 352586, -81952, -127550, 227492, 445341, 347440, 240570, 281173, 338717, 362526, 366687, 218295, -86006, -157955, 254637, 690466, 484440, -270182, -794101, -590528, 108717, 786873, 1097096, 935098, 473121, 113198, 98418, 234708, 246415, 215856, 334300, 427607, 165364, -374365, -765637, -792796]
37892g92796K07097L06958L75014L21761Q4980j86149l65747m51366l43033P3565
37882g69716N53291O53313L37427k7256k52147l71290k11544L54752P90307M12362
37872A469499m25680o62151j68255O6283l33098m88741P5763M67303r458n31366
37862e39901j50441N24726L85388k58698l09201J49389J03924m59533n07961J62682
37852h99626N60276K32076q8911K7124l6309n80268p66064p965Q65106Q37004
37842A42443K68137J49996M19754K22097m66530p14804j83116L09169R5034l45218
37832a03038k31455K95433M54214J9591m02628k83151J46412K96064O533l23859
37822a25884l05090j996K51320L07734K84028K34092J7837l69908n79196l17758
$$ y = [-792796, -585699, -278741, 96273, 418034, 503014, 316865, -48882, -500248, -843281, -769716, -216425, 436888, 774315, 747059, 494912, 123622, -87922, 266830, 1057137, 1469499, 1043819, 381668, 213413, 279696, -53402, -542143, -466380, 923, -8535, -539901, -690342, -165616, 219772, -38926, -348127, -198738, -94814, -554347, -1062308, -899626, -339350, -107274, -196185, -169061, -205370, -785638, -1551702, -1559667, -694561, 142443, 410580, 560576, 980330, 1202427, 735897, 21093, -162023, 147146, 242180, -103038, -334493, -39060, 415154, 434745, 32117, -251034, -104622, 191442, 197975, -125884, -430974, -432970, -181650, 126084, 410112, 644204, 662041, 292133, -287063, -604821]
37812f04821J21663J41750k90257m75522O1381Q11263R00871K63032l31135l59424
37802B38801j06886q655J4728K30200N13383N42005L36674J81850J33719q96k54580
37791A820343m23489l93550k51102q0932Q0015J15758n9984k68556k10329J25252
37781D53426M18865M12820J51263j64351l73719m27944m15284m57002m60516j62346
37771a024788L87783O59683L12090k17743k64684J09695K81166Q0189k1797J99252
37761E00846L36179R5107j86339j22540J11912J61006P5425R2358J37803o477
37751A195280k43854k82250q9473J10584J94006J95839J16336n5464k10756k52349
37741F77899k53817k68694j42299J97107M16407J37992m26850o24036k13319L03159
$$ y = [-604821, -483158, -341408, -631665, -1107187, -1045806, -234543, 666328, 929360, 598225, 238801, 131915, 123260, 137988, 368188, 881571, 1423576, 1760250, 1942100, 2075819, 2074923, 1820343, 1396854, 1003304, 752202, 671270, 751285, 867043, 807059, 538503, 328174, 453426, 872291, 1285111, 1436374, 1272023, 898304, 470360, 55076, -401926, -862442, -1024788, -637005, 22678, 334768, 117025, -147659, -37964, 243202, 323391, 301594, 500846, 837025, 932132, 745793, 623253, 735165, 896171, 971596, 1063954, 1201757, 1195280, 951426, 669176, 579703, 690287, 884293, 1080132, 1196468, 1141004, 930248, 677899, 424082, 155388, 13089, 210196, 626603, 764595, 337745, -286291, -499610, -196451]
37731a96451L79555J14330l8002J7910j0165k02876k35537R8646N11073N89857
37721A028340L19873k2301l06648n67433o99204n07037p1337K54797K64103O3059
37711b43788j64137k74923j10846L00704N37861K53026j75199o5559M37427M24638
37701I19204l35773q63583l99551M00631M55656j62866n17139k58518J14959K30350
37691d16630K08322J59764O7131R2029L36445M42676J05405k42479m2157L29625
37681A040131O5723o32445p11984N0395O35663L57727j78349j78883J63406K15107
37671H26491m8376j90875q3689K2093o4707l14430n43276m85910p6856L18227
37661f41308L29817J73366K95343N42230L73958j46099l85354j99002p6265j46083
$$ y = [-196451, 183104, 297434, 259432, 277342, 267177, 64301, -171236, -72590, 438483, 1028340, 1348213, 1325912, 1019264, 451831, -247373, -754410, -825747, -570950, -306847, -243788, -407925, -682848, -793694, -492990, 44871, 297897, 122698, 57139, 494566, 919204, 583431, -280152, -679703, -279072, 176584, 13718, -503421, -761939, -646980, -416630, -208308, -48544, 18587, 110616, 447061, 889737, 995142, 752663, 710506, 1040131, 1105854, 473409, -238575, -188180, 447483, 805210, 626861, 447978, 611384, 826491, 778115, 587240, 503551, 525644, 460937, 146507, -396769, -882679, -959535, -641308, -311491, -138125, 157218, 699448, 1073406, 927307, 541953, 342951, 266686, 120603]
37651A20603j5844K24031o2308p57414p78569K56833J228939J099631L13611j83502
37641A446011l62224n89866n79111M633N52336L12320k96220l19723J67678L13138
37631F48972J7783j2695L28023L05072l40276q86642p32843j49339L46600O09398
37621A34053N87302J48608m68346o43505j83833L46065M16809J83958K1063j09434
37611D32740l69692n15582k17997K59724K88790j72550l87226J21883P55435N80581
37601G76106k73213o45440L4730Q42046O25357l32136p54273k35259L10425J41098
37591D89441l34861m40148k47834j57167j00779J62706M05907K44589j62057k96852
37581d37055l5547K38591J96634p2717j98626J20607P45806J038968M96313n07349
$$ y = [120603, 104759, 328790, 266482, -490932, -1269501, -1012668, 216271, 1315902, 1629513, 1446011, 1083787, 493921, -85190, -80557, 471779, 784099, 487879, 168156, 335834, 648972, 666755, 654060, 982083, 1287155, 946879, 60237, -672606, -821945, -475345, 134053, 721355, 869963, 401617, -241888, -425721, -79656, 337153, 521111, 542174, 432740, 63048, -452534, -670531, -410807, -122017, -294567, -681793, -559910, 195525, 776106, 502893, -142547, -107817, 734229, 1359586, 1027450, 273177, 37918, 348343, 489441, 154580, -285568, -533402, -690569, -791348, -628642, -222735, 21854, -140203, -437055, -472602, -234011, -37377, -110094, -308720, -188113, 557693, 1596661, 2092974, 1585625]
37571A585625j027924p02687j24548M4052j95157m67948m93611j15867N39765
37562i58300Q40408K80710n68590o09196J49049N42281J03417k68096J7949K35237
37552b35131j82415m69405O0165O01237J86017n55880m32439K98588M99847J32007
37542i7409N5805K79136M0422n69672o55976j29818K10190J90353L88943P20892
37532D32866M06844m67769q37453l94625m3009k63343m02221l5271K87414J86298
37522a130269R7704K25705P0416m09520l97605L33578P89122L55899j35086J39692
37512f0364O01170L85419j35801j35027J86977J38281r2736J23131N24216L47865
37502A883131k46271l84072L6978K48850k4429k38123j66641k85971p36664q72211
$$ y = [1585625, 557701, -144986, -269534, -225482, -420639, -888587, -1382198, -1498065, -958300, -117892, 162818, -405772, -1014968, -865919, -323638, -220221, -488317, -470368, -235131, -417546, -886951, -826786, -225549, -39532, -595412, -1027851, -729263, -229416, -97409, -41604, 237532, 277954, -291718, -947694, -1077512, -867322, -676969, -288026, 432866, 839710, 371941, -465512, -860137, -903146, -1166489, -1568710, -1603981, -1316567, -1130269, -1032565, -806860, -736444, -1145964, -1543569, -1209991, -420869, -64970, -200056, -60364, 540806, 926225, 790424, 655397, 842374, 980655, 887919, 1011050, 1535266, 1883131, 1636860, 1252788, 1289766, 1538616, 1514187, 1276064, 1109423, 823452, 86788, -785423]
37492g85423k87131M57109O21502K44586j40103k79493k39836k5672L62449O74206
37482F02194O22218K89756L3985L506j4106k31788n26955n79318k94437M5169
37472d9776J41822R8915K50828N65453N46843m6162o79936o52764p7852K39631
37462C37002o2757m31319k93349P6725O2231k63236k58210K03513M67736J28822
37452c2842k89444j22076M12452N57573J51427k12699j18818J67863K39333Q7853
37442H40622q0154j75546j63985Q807K44844L17658K00102R8063Q1718J1267j02382
37431A281014n6061J21685J19127j62628m82294p10934r03677q42643j81530P43156
37421a074785J003977L69176k52972j55322J59961j2090l29685q6098M47209M48653
$$ y = [-785423, -1072554, -615445, 6057, 250643, 110540, -168953, -408789, -434461, -72012, 602194, 1224412, 1514168, 1548153, 1551659, 1537553, 1305765, 778810, 199492, -94945, -49776, 92046, 190961, 441789, 1007242, 1554085, 1507923, 827987, 175223, 97371, 337002, 274245, -157074, -450423, -373698, -311467, -574703, -832913, -629400, -161664, -32842, -322286, -444362, -31910, 525663, 677090, 464391, 345573, 513436, 752769, 840622, 760468, 584922, 420937, 429744, 674588, 992246, 1192348, 1290411, 1372129, 1383396, 1281014, 1224953, 1346638, 1465765, 1303137, 820843, 109909, -793768, -1636411, -1817941, -1074785, -70808, 298368, 45396, -109926, 50035, 37945, -291740, -377838, 69371, 518024]
37411E18024j3061r5425L42314M73507j08601o78747m41826L51257P79253L71971
37401A498666m51238q73476m85403K81143N81360J50357l54774k39008L09806
37392D17433N55272K00435l83774p10724n61039j7302N16146N45869O3898l71997
37382B54217l83214j94585n9488J60035M57639M02419p4803l11813L9007L37898
37372F27312O8810j98420J15766M14501j3212n32604j77284N22216L40715m55709
37362G12091n12651K04461L05070n65595j047425l49577N15422N25276J45704
37353f7224J28482J48474k95484o83186l03903M64388P27352L79724j9749j98277
37343B80597k23390l9831L19353M15141k6684n06525l40465L26513O60247K28706
$$ y = [518024, 504963, 409538, 751852, 1225359, 1116758, 438011, -3815, 347442, 1126695, 1498666, 1047428, 173952, -311451, -30308, 551052, 701409, 346635, 107627, 417433, 972705, 1173140, 789366, 78642, -482397, -499699, 16447, 562316, 626214, 254217, -128997, -323582, -383070, -223035, 234604, 637023, 562220, 250407, 289414, 627312, 696122, 497702, 613468, 1027969, 1014757, 482153, 304869, 827085, 1167800, 712091, 199440, 403901, 708971, 143376, -904049, -1253626, -738204, -212928, -67224, 61258, 209732, -85752, -768938, -1072841, -608453, 118899, 498623, 478874, 280597, 57207, 17376, 336729, 751870, 725186, 218661, -121804, 204709, 864956, 1093662]
37333A093662m84411p02986k38822L57729M85524K08854O4820J96197J69207j65576
37323I84198k90205N8028K87086n6744m07627j56022K08393Q60l07220N0121N38182
37312I09050J42544o67767n52347L52576N77245j72776n86749r0101L11957J7503
37302B41135k05319J08268K41692j43124k46104K43291L92498k14033n77928j04183
37292b63807L03261j71j91216L02842N37995j40076o40917k7826O53103J70658
37282G03846o66051m88264J64948m5137o81682l17714P61349R25286k1773n94246
37272b59438j44792L55528K45147Q4619K86666L85286J12220p8440M4866J06646
37262A138308l5410n9334L3711j26705m24540l43629L787k5192l57026j62254
$$ y = [1093662, 609251, -93735, -332557, 25172, 510696, 719550, 784370, 980567, 1149774, 984198, 693993, 752021, 1039107, 982363, 574736, 418714, 627107, 627967, 320747, 370868, 909050, 1051594, 383827, -168520, 184056, 761301, 588525, 1776, -88325, 223632, 241135, 35816, 144084, 385776, 242652, -3452, 239839, 632337, 418304, -159624, -263807, 39454, 39283, -151933, 150909, 688904, 548828, -92089, -119915, 533188, 703846, 37795, -450469, -285521, -330658, -1012340, -1330054, -568705, 356581, 334808, -259438, -404230, -48702, 196445, 281064, 567730, 953016, 1065236, 986796, 1031662, 1138308, 1102898, 1043564, 1077275, 950570, 526030, 182401, 186188, 160996, -196030, -358284]
37252c58284O68407J102908M98557l77307m77322O2829K77257j99256o98764m76675
37242B2350L22147Q52666O24700P8841j08394j255j50273n43539o12646l00785
37232A83812j70891k59726Q0453Q04382Q56509r3114q15182l64554L80563J82614
37222G84866n62675o48430o4155K68126J79920K29439L93678J84313j92285r0264
37212D82533L45775L91014p87k51686k49598l06700k92305R8773M82963K93092
37202I93074j39138j11788J71159L0042l26853j53340L89375M71516R7405L0239
37192A451691L35281L41366k998p2694J43882J9586m19470m91741k06425k82396
37182H16082p15128o76148m5054K89909l3090k73479O9096M85962M54412J88069
$$ y = [-358284, 310123, 1413031, 1911588, 1534281, 1056959, 1119788, 1397045, 1197789, 499025, 22350, 344497, 1197163, 1821863, 1900704, 1792310, 1791055, 1640782, 1097243, 484597, 183812, 12921, -246805, -166352, 638030, 1494539, 1401425, 586243, 221689, 602252, 784866, 222191, -426239, -490394, -222268, -42348, 187091, 580769, 765082, 572797, 482533, 828308, 1219322, 1218535, 966849, 717251, 410551, 118246, 217019, 699982, 993074, 853936, 742148, 913307, 943349, 616496, 463156, 852531, 1324047, 1421452, 1451691, 1786972, 2128338, 2125340, 2052646, 2196528, 2216114, 1796644, 1304903, 1098478, 816082, 100954, -575194, -620248, -330339, -363429, -636908, -567812, -81850, 372562, 560631]
37172E60631M075j58114k77362j42288R3724M7751j33931O295L11794K57321N553
37161E75449J18909L37654p5034p96445o86741K63862P08548N2770o23417l25522
37151d49967M36527O78779L35703p3025l08476l42818j46438J3752k44684o58411
37141g59058n08144K14796O87405N11123J76099N1219j07420l46918k12801L48550
37131E4851O76183L91766o8044k40510k19545k04307j78864j97427l04141j86271
37121d76309L27360O11221O1229o76880n07392K84491M27999j79320l29353L31473
37111a25481O96871J78555l59084k49644o1385k54150k56591K72751N91653J89518
37101F23013k30433N068L92927K49813j33306k07341j33416k10706j82196J14430
$$ y = [560631, 564706, 406592, 129230, -13058, 80666, 128417, -5514, 781, 312575, 569896, 575449, 694358, 1032012, 956978, 160533, -526208, -262346, 446202, 498972, -124445, -449967, -13440, 665339, 1001042, 928017, 619541, 276723, 130285, 144037, -100647, -759058, -1267202, -1052406, -365001, 146122, 322221, 373440, 266020, -80898, -293699, 54851, 731034, 1122800, 1054756, 814246, 594701, 390394, 211530, 14103, -290038, -476309, -148949, 462272, 523501, -153379, -660771, -376280, 51719, -127601, -456954, -125481, 571390, 749945, 390861, 141217, 79832, -174318, -430909, -158158, 433495, 623013, 392580, 397648, 790575, 1040388, 907082, 699741, 566325, 355619, 173423, 287853]
37091B87853K06875j77540n00343k81017J70306M34279N91263O57234L04557l35948
37081A357519n18611o4957K33029p8219l80712j31414K44312K24472K0341o1095
37071H44665j72468l10816j04000K93340J40329n34039o61513J59484Q70542O07115
37061A132639p681p1326J77240Q7138j92792j93047m9807r3262j71586q7199m7602
37050D82715j18507M3394M33677M98084J29089m2068K15640K89832j15292m09138
37040A407426k07494L6004j6561m6434N1690j40706n50896m41530K73102P00487
37030A065088M09429N376j20412l22535o07145m13681J04278P4355m03228j89573
37020c98048P85335J123564L10034l69191o8049K85661j35031n98780l28615J14318
$$ y = [287853, 494728, 317188, -183155, -464172, -293866, 140413, 731676, 1388910, 1693467, 1357519, 838908, 773951, 1006980, 928761, 548049, 416635, 660947, 885419, 905760, 844665, 672197, 361381, 257381, 550721, 691050, 157011, -504502, -345018, 525524, 1132639, 1124958, 1053632, 1230872, 1318010, 1125218, 932171, 882364, 789102, 617516, 530317, 482715, 364208, 407602, 841279, 1339363, 1468452, 1426384, 1642024, 1931856, 1816564, 1407426, 1199932, 1235936, 1219375, 1172941, 1224631, 1083925, 533029, 91499, 364601, 1065088, 1474517, 1479893, 1359481, 1036946, 429801, 16120, 120398, 194753, -208475, -398048, 387287, 1510851, 1820885, 1451694, 1383645, 1669306, 1534275, 935495, 606880, 721198]
37010G21198N8768r4250Q8942J92736n4341k07486j28238k00128j98834M12597
37000E90964R23553J37562j195309j119082J76300N41252k79693k25889R98275
36991E47933J040957p17412j636634l40334R12845L94125k10571N67386J060799
36982A619094r3512j004241j562J114560M04140o71270k22074N23277o3112o71715
36972I33585J48453P68036l74185j296731N8521J698681R23453q60177q07975
36963A191661L76163L41949l82184n651O35490j5828p02819J79641J013778k8329
36953B603871j081722J0405J304311L26170j053011j83605J152763K94047r19057
36944B454172J40481J329824j35731j701238o8734K061071Q04667j328403j83101
$$ y = [721198, 779966, 685716, 774658, 967394, 913053, 705567, 577329, 377201, 178367, 590964, 1514517, 1652079, 456770, -662312, -486012, 55240, -224453, -450342, 547933, 1588890, 871478, -765156, -1105490, -192645, 201480, -9091, 558295, 1619094, 1525582, 521341, 519779, 1634339, 2038479, 1367209, 1145135, 1668412, 1605300, 933585, 1082038, 1850074, 1475889, 179158, 237679, 1936360, 2859813, 1999636, 1191661, 1567824, 1909773, 1527589, 1521938, 2157428, 2141600, 1438781, 1618422, 2632200, 2603871, 1522149, 1532554, 2836865, 3163035, 2110024, 1926419, 3079182, 3373229, 2454172, 2594653, 3924477, 3788746, 2087508, 2018774, 4079845, 4884512, 3556109, 3373008]
36935C373008J899598Q27740q04707J069705L138631R37266j308896J784675N147067
36926A6064087K090466j475221K981565Q933595N725164Q42386Q145081J9126212
36918F2433335J5595389R754304L3409547P6989930Q1049252J5428099o6781807
36911B27878049r0956544n3898837j5140916j0225983j7873258j1781584o2630
36904B7938297M63859n077617m423785q65413k650755n730145l076549J033942
36896G611834j76790l039625j337773J724040M32322k400865j481249Q62980N1704
36887B246578j613587p3614K049563O22567j721518o22521J609339N58371j836596
36878A218582j170255J083353P18355j190490p87988J038457P21298r29807m93644
$$ y = [3373008, 5272606, 6100346, 5295639, 6365344, 9503975, 10441241, 9132345, 10917020, 16064087, 18154553, 16679332, 19660897, 28594492, 34319656, 35162042, 43307123, 62433335, 78028724, 87783028, 121192575, 198182505, 279231757, 294659856, 227878049, 136921505, 83022668, 67881752, 57655769, 39782511, 28000927, 27938297, 28402156, 23324539, 18900754, 18035341, 15384586, 9654441, 6577892, 7611834, 7435044, 4395419, 3057646, 4781686, 5214008, 2813143, 1331894, 2194874, 2246578, 632991, 559377, 2608940, 3231507, 1509989, 887468, 2496807, 3055178, 1218582, 48327, 1131680, 1850035, 659545, -128443, 910014, 1631312, 701505, 207861]
36869B07861J342055J197541o09114j000822O8756K30574l66166J41817J040997
36860B253499L90800q00531l48226P25475Q7846j257265p59650Q06009Q09576
36851A907533l31895k34968P72881N23398n93728m69042N10794L24459n71346
36842A838086j63753R85435O91618n49453l46096J110525J417483L91507J92433
36833E567785J248246J791368J368320J332639J890672J871629J308143J213089
36825A7591891J077281l93424k391290k863938j922354j470490j832831j683368
36817F111477r36661p61463j032801o14089J52364k0500p56664o35971R7100J31371
36807A734163k51424J10827O25217m9418j095499p15836M56631L37113q02128
$$ y = [207861, 1549916, 2747457, 2138343, 1137521, 1206277, 1436851, 1070685, 1212502, 2253499, 2644299, 1843768, 1495542, 2221017, 2308863, 1051598, 291948, 1097957, 1907533, 1575638, 1340670, 2113551, 2636949, 2043221, 1574179, 2084973, 2409432, 1838086, 1674333, 2659768, 3351386, 2801933, 2455837, 3566362, 4983845, 5375352, 5567785, 6816031, 8607399, 9975719, 11308358, 13199030, 15070659, 16378802, 17591891, 18669172, 18275748, 15884458, 13020520, 11098166, 9627676, 7794845, 6111477, 5174816, 4413353, 3380552, 2766463, 2918827, 2898327, 2141663, 1505692, 1602792, 1734163, 1482739, 1593566, 2218783, 2169365, 1073866, 358030, 814661, 1151774, 349646]
36798C49646q26491L77642Q80811L06344J07985M32991M8923p04474k63844Q76706
36788A586239O39972p96909j094114J07385O47676j33852l81816N77218R57929
36779B109728p8669r04080m16393K88531K91857K66690N98110O09227M10586R62316
36769D137903J675914P22790j548721k416684r61917M42861j595r56523o78246
36760D15782K28863M19307N4316j06705j36515k18135m4045J85312k36549r25067
36750c63436o03929O11643J107438M22445r1485K63658O27920O36161J001782
36741C612197J463935O47070j260984k166433j271988k00126p1964K877N61735
36732A316319N43789l86526p83486n147N22224o8561n60028j01936J93835m20404
$$ y = [349646, -476845, -99203, 781608, 1087952, 1195937, 1628928, 1677851, 973377, 709533, 1586239, 2226211, 1429302, 335188, 442573, 1090249, 956397, 574581, 1151799, 2109728, 2031059, 1126979, 710586, 999117, 1290974, 1557664, 2155774, 2765001, 3175587, 4137903, 5813817, 6536607, 4987886, 2571202, 1609285, 2052146, 2050551, 1094028, 415782, 644645, 1063952, 1118268, 1011563, 875048, 656913, 612868, 798180, 561631, -363436, -967365, -355722, 751716, 1174161, 1082676, 1346334, 1974254, 2610415, 3612197, 5076132, 5723202, 4462218, 2295785, 1023797, 823671, 751707, 754584, 1316319, 1860108, 1473582, 690096, 684949, 1207173, 1138612, 578584, 476648, 670483, 250079]
36722B50079p44267L5926O63223J35136m06549J57327Q56377M97824k21572j93110
36712A030394J88255J77088J28744L56926K00666m42274m40517M15424N47870
36703B162576p10264j621294q35930L79389M48930N803K13118M89971m4275n77672
36693h9648j25625M90722J64701m50542l05093R6392m0690p8061O23120J047321
36683A332597K69466n95769k17572N61820K52338o51783p09883q4510O9298j91324
36673C4678k7579L73199K84388l1617O0104K44920M1812o3236L18914M23011k44545
36662A414049p10238k33888K21007k15613o01343N887O11338P6619p06619m69253
36652f08054J33054o339k06044M91722J080448L23047o79626k66442P18349L91479
$$ y = [250079, -494188, -458262, 204961, 340097, -66452, 90875, 947252, 1445076, 1223504, 1030394, 1218649, 1395737, 1524481, 1881407, 2082073, 1639799, 1199282, 1614706, 2162576, 1452312, -168982, -1004912, -625523, -176593, -170790, 42328, 532299, 488024, -89648, -215273, 275449, 440150, -10392, -315485, -219093, -259783, -337844, 285276, 1332597, 1602063, 1006294, 788722, 1350542, 1602880, 951097, 241214, 156704, 226002, 34678, 7099, 380298, 664686, 633069, 693173, 938093, 979905, 916669, 1235583, 1658594, 1414049, 703811, 469923, 690930, 475317, -126026, -120139, 491199, 567818, -138801, -608054, -475000, -481339, -687383, -195661, 884787, 1207834, 528208, 261766, 980115, 1371594]
36642A371594p57521q10887J11004K87231l30416k37095N95964O75818j55942
36633G49750n01907m4941R5635l01274k39198L69471M87852J208j07172K70964
36623G80388K23224k76109k67096K85752L59480k23079n12163j77045Q5422l8300
36613B40474j33437r1717j49143r2695L09210N10870Q6237k48962J36562M51062
36603A018461q2264n37896J13331Q59474K71291p90016n39573N33859M93301o36596
36593G03372j016721k08490M23589L47690L41705M49408l9107o46807k10770P66212
36583I10081P25060j29717j92289M98780L58257n72296n02284P25355J133438
36574B954385J82831q6784J401641K707110J798243n32174k098647k081974j183028
$$ y = [1371594, 614073, -196814, -85810, 201421, -128995, -366090, 229874, 905692, 749750, 247843, 202902, 298537, -2737, -241935, 127536, 615388, 616596, 509424, 780388, 1003612, 727503, 460407, 746159, 1105639, 882560, 370397, 193352, 278774, 240474, 107037, 15320, -133823, -226518, 82692, 593562, 679799, 430837, 567399, 1018461, 936197, 398301, 511632, 1371106, 1642397, 852381, 312808, 846667, 1339968, 703372, -313349, -521839, -98250, 249440, 591145, 1040553, 1001446, 354639, 143869, 910081, 1635141, 1505424, 1313135, 1811915, 2170172, 1597876, 1095592, 1820947, 2954385, 3137216, 3050432, 4452073, 7159183, 8957426, 8425252, 6326605, 4244631, 3061603]
36565C061603l16848p1353m41853o20815j9242N43307l6258j099092j011122J77869
36555A66196P86843K11836m01085l21140j06116q3558J58100N01864K89348k43430
36545I58858k08370K26998J06380m26254l39336K97893M22483p6381m02051n48450
36535A1770r69297r96987J85896J460516J094867k73618n84194J46994J49782
36526B25729n92727l39622Q93558J094146j23736q34415k63431J53825k11324
36517B003j65975N72153O24096k46686m76922L23006N95793j48168m19666L07812
36507I67446O39673J04285L2267P18136P08721j24662J07524J836252K925318
36498G914960K213062J126383N94549m61662k208351k706460j269211K6531j69815
$$ y = [3061603, 2744755, 2673402, 2231549, 1610734, 1591492, 2134799, 2098541, 999449, -11673, 166196, 953039, 1164875, 763790, 442650, 336534, 252976, 411076, 912940, 1202288, 958858, 750488, 977486, 1083866, 657612, 318276, 616169, 1038652, 962271, 560220, 11770, -957527, -1954514, -1768618, -308102, 786765, 513147, -71047, 75947, 225729, -366998, -706620, 186938, 1281084, 1157348, 322933, 59502, 213327, 2003, -163972, 408181, 1032277, 785591, 308669, 631675, 1227468, 1079300, 659634, 967446, 1607119, 1711404, 1743671, 2461807, 3170528, 3045866, 3153390, 4989642, 7914960, 10128022, 11254405, 11848954, 11387292, 9178941, 6472481, 5203270, 5229801, 5059986]
36489E059986m59504K02600M57300n59386j258823n53733N0952o30882j187554
36480A120956l51264N81282K27337m15672j07289L30244j00622n62686k01815
36471E20471J35007k29410l54755K61887M27345l90676q00642r5845L61984j30794
36461b95428j82047Q12168J166518O2042o61837J91310R41788J93508o01781r021
36451A617220O84306P7985n20266N38806K143203K125304M17327j436310k362884
36442C284691j969096m22435Q73438M67496p10714n14792O78676N54169p11930
36433A529503n47231J059216J176158o32879j291363J28398P46399n50067j085075
36424E33059J74065N44670q51986j049908Q56367J508737l11128j051743Q02820
$$ y = [5059986, 4600482, 4803082, 5260382, 4700996, 3442173, 2888440, 2939392, 2308510, 1120956, 769692, 1350974, 1578311, 1162639, 1055350, 1385594, 1284972, 722286, 520471, 655478, 426068, 71313, 333200, 760545, 369869, -430773, -526618, -164634, -295428, -477475, 334693, 1501211, 1563253, 901416, 1092726, 2034514, 2228022, 1626241, 1617220, 2301526, 2379511, 1859245, 2398051, 4541254, 6666558, 7083885, 5647575, 3284691, 1315595, 893160, 1766598, 2234094, 1523380, 1008588, 1687264, 2241433, 1529503, 982272, 2041488, 3217646, 2584767, 1293404, 1421802, 2168201, 1618134, 533059, 707124, 1251794, 399808, -650100, 206267, 1715004, 1403876, 352133, 1154953]
36415A154953J536509o97874j994459O5023J719621P7610j522656j03165J301785
36406A537347j64085j525955j5606J354610r6233j215815N64799J701562m98649
36397A641975k020958K98923K241920J29803j864538K14100K114284l96169k827647
36388d68307l64492K554175N84405k120084m7422K692623M20424k648284n43166
36379E9872K492029L70347k397920L70705L483708K90610l167332O78663M989467
36370G170149Q90601m146374L51990O546190K430346l520167K481054J0737763
36362B2941552M842858l496488O740954K1647290J3422387J744923L5002140R8027875
36354B00873491J03864902J3534294r1901707j10798723n1270800k769091o374432
$$ y = [1154953, 2691462, 1993588, -871, 64152, 1783773, 1861383, 338727, 235562, 1537347, 1373262, -152693, -168299, 1186311, 1090078, -125737, 439062, 2140624, 1641975, -378983, -80060, 2161860, 2291663, 427125, 641225, 2755509, 2359340, -468307, -832799, 1721376, 2305781, 185697, 138275, 2830898, 3251322, 603038, 59872, 2551901, 2922248, 524328, 895033, 4378741, 4669351, 1502019, 2180682, 7170149, 8060750, 3914376, 4266366, 10812556, 13242902, 9722735, 12203789, 22941552, 27784410, 24287922, 31028876, 52676166, 66098553, 67843476, 102845616, 200873491, 304738393, 318272687, 226370980, 115572257, 64301457, 61532366, 55157934]
36347E5157934k1527623j2267328K836509l79157r188001n000847K929490J28465
36339A2689442n652451k435250K977961L09387m213482j374864L083221N92637
36331E976601l646971j490954K559682Q33320k872782j461620J876162P32494
36323B505932k065719p67816J910400O71180j797242m58872K030701P05119j987492
36314G46191j147364J175537M35075j497804m41267J666772P11911j453693p53746
36305e58388J175193M49463j371947n22375J485861Q69459j073876o41299J135871
36296I47962Q04273p40864l51203J006509L34692j266720p22881R35191N95954
36287A542913q84543n12078R15028M81738j020915o50158Q89458N91191j069783
$$ y = [55157934, 33630311, 21362983, 24199492, 23820335, 14632334, 9631487, 12560977, 12689442, 7036991, 4601741, 7579702, 7889089, 3675607, 2300743, 5383964, 5976601, 2329630, 838676, 3398358, 4231678, 1358896, -102724, 1773438, 2505932, 440213, -327603, 1582797, 2253977, 456735, -2137, 2028564, 2733683, 746191, -401173, 774364, 1209439, -288365, -729632, 937140, 1649051, 195358, -558388, 616805, 1066268, -305679, -828054, 657807, 1527266, 453390, -187909, 947962, 1752235, 1011371, 660168, 1666677, 2001369, 734649, 11768, 946959, 1542913, 658370, 146292, 1061320, 1543058, 522143, -128015, 761443, 1352634, 282851]
36278B82851j124800K89656N58827k39130J15429J189575O42853r71424r51618
36269b07781N86600J051059J47149p9083N23088K07756q28104p12101L24838L40199
36259A353620n18730m01334M69430J93864r78276r61937K65152P04452P8770R07
36249B05918N71501K93107o99813p13580K23060M13442k08530p4677P25879M30782
36239A167089r34002j271033R083J076494Q26656K18008l840l58800q94684p32649
36229h97678J31582O00397L78090K47452L56537Q8372l75920k05251M37996O30646
36219A392223L48608K41211J80454k73491n68731q5739M14428J22593m1512R00148
36209B630192J667789N82885j267188j504344l00159J92803l67769l94340K97571
$$ y = [282851, -841949, -552293, 6534, -232596, -117167, 1072408, 1715261, 743837, -207781, 378819, 1429878, 1577027, 1497944, 2021032, 2228788, 1400684, 688583, 1013421, 1353620, 834890, 433556, 902986, 1096850, 118574, -843363, -578211, 126241, 205011, 205918, 777419, 1070526, 370713, -342867, -119807, 293635, 85105, 10428, 736307, 1167089, 233087, -1037946, -1028863, 47631, 874287, 1092295, 1088455, 729655, -165029, -897678, -766096, -165699, 212391, 459843, 816380, 904752, 528832, 323581, 761577, 1392223, 1740831, 1982042, 2162496, 1889005, 1320274, 1234535, 1648963, 1771556, 1730044, 2630192, 4297981, 4880866, 3613678, 2109334, 1809175, 2001978, 1634209, 1239869, 1537440]
36200A537440K20193p10182q92945p7978K11627l79520m67197K96210N90163N6973
36190C84784p7777M39921L22647o35010r13005R975P36295N30382M01287P69616
36180A969115N19285n63455q06864N44367J677018Q77281r07309j669387j065867
36171E74184j72842K81868K40623j41190l66875N7208N98567J86377q57584q85299
36161d84963M59813J352892M72012r76752j135140j09544O30007N08011J56300
36152H72636O5695J00614P7256J727r3660j04591O9996J98195p0816n37896n99667
36141b0511j64502K45064L59205L75908K84883j55119o84413o96595k48577j2234
36131g16891j07631M4701N35786O44890K1651o94407p91405l09661K91247O42082
$$ y = [1537440, 1757633, 1047451, 154506, 76528, 288155, -91365, -558562, -262352, 327811, 384784, 307007, 746928, 1069575, 434565, -478440, -468465, 267830, 798212, 1199499, 1969115, 2488400, 1924945, 1118081, 1662448, 3339466, 4216747, 3309438, 1640051, 574184, 401342, 683210, 923833, 782643, 415768, 472976, 1071543, 1257920, 400336, -484963, -25150, 1327742, 1799754, 823002, -312138, -421682, 208325, 716336, 872636, 938331, 1038945, 1116201, 1117928, 1024268, 919677, 989673, 1187868, 1117052, 579156, -20511, -185013, 60051, 419256, 795164, 1080047, 924928, 240515, -456080, -704657, -716891, -824522, -779821, -244035, 400855, 422506, -271901, -1063306, -1372967, -1081720, -439638]
36121d39638N20555K9316k73319l1839K90857J47548j08734J10767M20477J05521
36111G71511l98201j08827O16513M25974p27000j306980n74770L64636M60629
36102d76515J61256J96305K66094j00083m50645j88158L39128M34021J47217o814
36092C21806N7523Q3624O9274J78532L24823K86858M0387k81222n27876n20329
36082C3400k04223J30323J34097q4946j02515J93303M90676N05327J99139k94910
36072I99671o32922m27082J75896M74156J78639j32366k2869M4741l28226n42080
36062b12442M535O94236O04541L3675j13603Q7634n2157l61194j46525L32212
36052H70912K21243l23676l86325K2725N1743l16099k42445K94311L78669j54707
$$ y = [-439638, 80917, 110233, -163086, -194925, 95932, 243480, 134746, 245513, 665990, 771511, 373310, 264483, 880996, 1306970, 579970, -727010, -1301780, -937144, -476515, -315259, -118954, 147140, 47057, -403588, -591746, -252618, 181403, 328620, 321806, 379329, 462953, 532227, 710759, 1035582, 1322440, 1362827, 1081605, 553729, 33400, -170823, -40500, 93597, 8651, -93864, 99439, 590115, 1095442, 1294581, 999671, 366749, -60333, 115563, 589719, 768358, 635992, 613123, 657864, 329638, -212442, -207907, 486329, 1090870, 1124545, 1010942, 1098576, 1046419, 685225, 538700, 870912, 1092155, 768479, 382154, 404879, 456622, 140523, -101922, 192389, 571058, 416351]
36042D16351m23033q3579K13337J54631J49633K17542r9145n57626l99596J49092
36032b62393Q5713n15233m98182K90663O64462K16729k7074L71122M24362l26861
36022D23308p89589k25980M13468J65251l54620j93281L34527M49805K71058K72647
36012G66594K82277M854k61716k62549l21883n57053m73840J6619K09166j16128
36002g13659j69884L68585N96177q634m92993j5227O60930M76493j64316k52438
35992B85034J00408J43628l8430J06319L25401j4625o32681o99172k25501L0738
35982f18881j40109k11236P6281L83585M15721K44805N7332K2422K21667M09472
35972H61059K11307k08493k49503J10500J75507k51342m38405k7033K43522j72095
$$ y = [416351, -6682, -90261, 123076, 277707, 427340, 644882, 545737, -11889, -411485, -262393, -176680, -691913, -1190095, -899432, -234970, -18241, -45315, 325807, 750169, 423308, -366281, -592261, -178793, -13542, -368162, -561443, -226916, 222889, 493947, 766594, 1048871, 1053725, 792009, 529460, 207577, -349476, -823316, -806697, -597531, -713659, -883543, -514958, 81219, 72585, -420408, -435635, 225295, 701788, 537472, 285034, 385442, 529070, 490640, 596959, 922360, 907735, 275054, -424118, -649619, -618881, -758990, -970226, -893945, -510360, -94639, 150166, 207498, 229920, 451587, 861059, 1072366, 863873, 614370, 724870, 900377, 649035, 210630, 183597, 427119, 255024]
35962B55024n97949k96169K49683K35087o9886N6677M15817L06317j58055k90347
35952A06199n6548M920j54580j04760J55844K00860k4543j77612j71484j78651
35942d00355j44028P6668K73322J52333j43986k79045k18335n6715K64996O22706
35932A47561N63612R065m00117k03044J74821J81420j548o220l9042l18873l76576
35921b68941J81297P29910M27410m14503p30132k24131L96212N32235K30559k28495
35911F31421n42905l58202K97942P44002M37141k07257m01357p9157K42523L42675
35901A106826L12186L2102n63279r62951o39470L9077K40995j10729l16127l1983
35891h93353L09189K69452q383j09730J36291N05733N68277J59294k75419j85015
$$ y = [255024, -342925, -639094, -389411, -154324, -224210, -167533, 248284, 554601, 396546, 106199, 49651, 54571, -100009, -204769, -48925, 151935, 127392, -50220, -221704, -400355, -544383, -467715, -194393, -42060, -186046, -465091, -683426, -740141, -475145, 147561, 711173, 720238, 320121, 117077, 291898, 473318, 471770, 465550, 426508, 107635, -268941, -87644, 642266, 1069676, 655173, -74959, -299090, 97122, 629357, 859916, 631421, 88516, -269686, 28256, 772258, 1209399, 1002142, 600785, 521628, 764151, 1106826, 1419012, 1451114, 887835, -75116, -714586, -675509, -434514, -545243, -861370, -893353, -584164, -314712, -323095, -432825, -296534, 209199, 777476, 936770, 661351, 476336]
35881D76336J91843R0481m68700n33358K17510P79794L74500l03698k93051J00121
35871F31778O1167k41940j57350J10980l8618l23324q3187L44756J32487m70273
35861c3524m86831O0007K12827j90592l02183J32788L72301J09286l2808K23030
35851F4301K84873j26297m14054j96917Q1570J04249K35578O14091O63304J11373
35841A422071l73432k21541J21499p27l76738l63443O9030L91233L12288M372
35831I84612k51934k83513r0874Q3372k231j83875q7912K24273K83982k9926l02620
35820C43354k75772j54291n6601K18638O18231O39700P4169n64867p21633m65244
35810c44316j46692J55549M58603N37355K03754l10275n90639m94371j57064K30577
$$ y = [476336, 668179, 758660, 289960, -243398, -25888, 753906, 1128406, 824708, 531657, 631778, 692945, 451005, 293655, 404635, 366017, 42693, -40494, 304262, 436749, -33524, -520355, -460348, -247521, -438113, -740296, -607508, -235207, -125921, -158729, 64301, 349174, 222877, -191177, -388094, -306524, -202275, 33303, 647394, 1310698, 1422071, 1048639, 827098, 948597, 947870, 571132, 207689, 276719, 667952, 980240, 984612, 732678, 449165, 358291, 441663, 439432, 255557, 167645, 391918, 675900, 645974, 343354, 67582, -86709, -143310, 75328, 693559, 1333259, 1407428, 842561, 120928, -344316, -491008, -335459, 123144, 660499, 864253, 553978, -36661, -531032, -688096, -457519]
35800d57519M64102L72113J7066l04774l61763j48487K09099M80826L70531j32041
35790E09153n33957l75694J06526K98073P0252j89261k79894l01679j76742K10454
35780f62769M59881R7940m16673j36835P55545R30442m6330q49472l68664N43900
35770C06965M33057m74517p26233L7327O64573L88126j86523k94022r0547j3470
35760D4736L6603K34069K38883k09027n84943k36931N12315O87373M3437n75003
35750A91512m15808K20128N05457J63885l55474n49073l39182K7973K71595K68295
35740a0692J32756Q9023J74112J90771N4907k9378O5818J08358j10560l48300
35730C16815k62508P106P5455l1253N263J43941P8868q3740L2318K45637j8801
$$ y = [-457519, 6583, 378696, 395762, 90988, -270775, -419262, -210163, 270663, 641194, 509153, -24804, -400498, -293972, 4101, 74353, -114908, -394802, -696481, -873223, -662769, -202888, -104948, -521621, -658456, 97089, 1027531, 981201, 131729, -236935, 306965, 740022, 265505, -460728, -423401, 241172, 629298, 442775, 148753, 58206, 44736, 81339, 315408, 554291, 345264, -239679, -476610, 35705, 723078, 766515, 191512, -224296, -4168, 501289, 665174, 309700, -239373, -578555, -550582, -278987, -10692, 122064, 211087, 385199, 575970, 630877, 601499, 667317, 775675, 665115, 316815, 54307, 61413, 136868, 105615, 110878, 254819, 333687, 249947, 282265, 527902, 509101]
35719E09101n80371m75544N09352J214011O71966m80966r53457n21668M4469K63160
35709B00053K37411L8398k97130l99120m3812K27375j69810p42048m86053N15681
35699i19055J075796N65359l41669p74984o49358k73465K12686O34092O70848
35690B00250L32776L8619l4934j62362m23854m47845p6210K86558L08238J84324
35680B05560J46514O0840j22161o3408L62565O44058L36576j98237l23763r9202
35670I49342r7419m11118n03836j22649K27896K6492m26028l58592L52194Q70573
35660E06855M50621n00903q72812l01144L92307M01961o792r9184J63430K40094
35650C74433J8911n8561J57261K71219N3443k04588k24114j24593r1794r2227
$$ y = [509101, -71270, -546814, -37462, 1176549, 1848515, 1367549, 414092, -107576, -63107, 200053, 437464, 475862, 178732, -220388, -264200, -36825, -206635, -948683, -1434736, -919055, 156741, 722100, 380431, -394553, -1043911, -1317376, -1104690, -470598, 200250, 533026, 571645, 536711, 374349, -49505, -497350, -573560, -287002, 21236, 205560, 352074, 412914, 290753, 227345, 589910, 1233968, 1570544, 1372307, 1048544, 949342, 851923, 440805, -63031, -185680, 42216, 68708, -357320, -715912, -363718, 506855, 957476, 456573, -416239, -717383, -325076, 76885, 70093, -29091, 134339, 374433, 393344, 334783, 492044, 763263, 816706, 612118, 388004, 263411, 171617, 79390]
35640G9390p4665p0826K825K49750M53853K86795j06304k43786q7922r6126l69915
35629B3069m17594k3290L07285J59040j21551l9576K63702L56004K26239J13918
35619H47246j5646k57311l27406L8998M56031L16261k21797l53841J74972O39719
35609A297226L73811k87213n22991j53219K48817K31543m5846k50448l41560l78722
35599A71398k44184Q0634K35885n0505l86709j78180L85066M84792n6646m26208
35589A5343r4619L31381J47667k43903m4811N06662M59868k71304p17585l26467
35579b37768L26903N39858L55570J05929j71405m34830l80085M3109L27118O9201
35569E43600m27278o03290l75438o3766J26920K15629K49466K71472L18496K97848
$$ y = [79390, 4725, -66101, -63276, 186474, 640327, 927122, 820818, 577032, 489110, 392984, 23069, -394525, -417815, -110530, 48510, -73041, -112617, 151085, 507089, 733328, 847246, 831600, 574289, 246883, 285881, 741912, 1058173, 836376, 482535, 657507, 1297226, 1671037, 1383824, 860833, 707614, 956431, 1187974, 1142128, 891680, 550120, 171398, -72786, 7848, 243733, 193228, -193481, -371661, 13405, 498197, 441551, 15343, -79276, 252105, 399772, 155869, 111058, 617720, 1077588, 806284, 88699, -237768, 89135, 628993, 984563, 1090492, 919087, 484257, 104172, 147281, 474399, 543600, 116322, -486968, -862406, -926172, -799252, -583623, -334157, -62685, 255811, 553659]
35559E53659Q2623j76890j38432K15715M64275K84362j87939o16008p57614m71064
35549g47313J55608O28073M80090k7485j75418J37058K30380k08130n32051j43053
35539b02241N32898O78969K50240j29640j38867j5325o254q7294j57092j19922
35529F05472J22771M35761L78351k54372r59965r97520k77569N41786Q18302N19295
35519I32312P8019j12677l2140M5409m8635j32806p080R7321j98062o94860p09449
35508g82648o0688N63909N36686J09184q5980O2072J95659J31637j2622j25246
35498E31963j44944L248K04569J49279j56368k16383K15995N83503K38635n50817
35488H58680r00076m87314J17941K84049Q934k50277j00864M34840Q71490O88911
$$ y = [553659, 636282, 459392, 320960, 536675, 1000950, 1285312, 1097373, 481365, -276249, -747313, -591705, 36368, 516458, 488973, 313555, 450613, 680993, 472863, -59188, -202241, 330657, 1009626, 1259866, 1130226, 991359, 976034, 969780, 882486, 725394, 605472, 728243, 1164004, 1542355, 1287983, 328018, -669502, -947071, -405285, 413017, 932312, 1010331, 897654, 865514, 910923, 862288, 729482, 722402, 819723, 621661, -73199, -782648, -843336, -279427, 257259, 366443, 280463, 342535, 538194, 669831, 657209, 531963, 387019, 390267, 594836, 744115, 587747, 371364, 587359, 1170862, 1409497, 858680, -41396, -528710, -410769, -126720, -117786, -368063, -468927, -34087, 837403, 1526314]
35478A526314R981m16106j80192K11631J37370j89676j66934J57109K35476k325
35468A322648j33009r5604k25799m35571k43165K46014K92182k61999o04544k07516
35458c46363L59101M14253J90329J78499J48249l09593p84944n78811P0590K89360
35448c69330l8289j77163J44013L43630J16578l7069J94676L28007K0589k13789
35438C11853O6646L26702m3393n21176k09031N83873P10877L2636l60334L2202
35428I30855L14726k52489r83300q77828j93770Q6100j53055j51837L33494O41832
35418c05272L17070j96109k48032J64100N31133M86862J13615k14732k07231O631
35408D48035m562l56801n78236k69226K17827K43090j38423k50966J51378N13282
$$ y = [1526314, 1536295, 1120189, 939997, 1151628, 1288998, 1099322, 932388, 1089497, 1324973, 1322648, 1189639, 1094035, 868236, 432665, 189500, 435514, 727696, 465697, -138847, -346363, 12738, 426991, 617320, 795819, 944068, 634475, -150469, -729280, -658690, -369330, -407619, -584782, -440769, -97139, 19439, -17630, 177046, 505053, 525642, 311853, 378499, 705201, 661808, 140632, -68399, 515474, 1226351, 1258987, 898653, 930855, 1245581, 993092, 9792, -868036, -1061806, -975706, -1128761, -1280598, -947104, -305272, 11798, -184311, -432343, -268243, 262890, 749752, 863367, 648635, 441404, 448035, 443473, 86672, -491564, -760790, -542963, -299873, -438296, -689262, -537884, -24602]
35398b4602L19471k03450m87069l50137n0028J48587K06800K30829L04482L62221
35388D57104K45384l7545k32701j79793n5609o3206r9490j8316M1130l1322L1950
35377E7586M08575O52362K73926l46071l85991J44355L81330o6931o00821o46971
35367a28651l99126k13314p891K91399L57183K4076k82036j84041M8169M4476
35357d49756J3776K85538N64112L33834k09582l48100N3299K87560j52352p72465
35347c94136o96970J26176P57527M14956m89293q07626j16152P34151P47115K9810
35337C05558n29881m98969k09082j543J69184L59426M45575L95667K80229L0534
35327G46698l51283m75715o1717L99904K26989l17419l62206J19547K46426k25990
$$ y = [-24602, 294869, 91419, -395650, -745787, -795815, -647228, -440428, -209599, 94883, 457104, 702488, 664943, 432242, 252449, 196840, 133634, 34144, 15828, 56958, 25636, 57586, 466161, 1118523, 1392449, 1046378, 660387, 804742, 1186072, 1119141, 518320, -128651, -527777, -741091, -748982, -457583, -100400, -76324, -358360, -542401, -494232, -449756, -435980, -150442, 413670, 747504, 537922, 189822, 243121, 530681, 378329, -394136, -1091106, -964930, -207403, 207553, -281740, -1089366, -1205518, -471367, 275748, 305558, -224323, -723292, -932374, -933917, -764733, -405307, 40268, 435935, 716164, 746698, 395415, -80300, -142017, 257887, 484876, 167457, -194749, -75202, 171224, -54766]
35317e4766m46750M0927M91569K70556p9874Q7010L11247j05038p30010o16206
35307h31335J52503N99998L29066j02269j99476r2214l7930l4799k7620l1815
35297b75891k686J10139K42788L62406N12803N28062R5669o12190q60032l24985
35287b23917L21408L14957j50099l34234m2273K91356L24581Q2874k47645l84643
35277d7635j08290L13420L03093j06131j77352K73183L67395l81336r92860m32276
35267i88789O46246Q38254J48629k10129R1883J45106l92287o26581o297O89593
35257C35628N90867J0306k17245K9524K51967J75711p7954l44254m94336l89448
35247a29234n9709K51697L71766L13927Q9140k77218n32520l97181k0009J66090
$$ y = [-54766, -501516, -460589, 30980, 301536, 221662, 308672, 619919, 514881, -215129, -831335, -678832, -78834, 250232, 147963, -51513, -143727, -181657, -216456, -244076, -275891, -278577, -168438, 74350, 436756, 949559, 1477621, 1573290, 961100, 101068, -223917, 97491, 412448, 262349, -71885, -114158, 177198, 501779, 584653, 337008, -47635, -155925, 157495, 460588, 354457, 177105, 450288, 817683, 436347, -556513, -988789, -342543, 495711, 644340, 434211, 526094, 671200, 278913, -347668, -353965, 335628, 926495, 936801, 719556, 749080, 1001047, 1176758, 1098804, 754550, 260214, -129234, -188943, 62754, 434520, 748447, 837587, 560369, 27849, -369332, -389341, -223251]
35237b23251P3272J1733R2142Q6167j9213J18186N44701P14237K09315n69240
35227A038049q25886l38235L15791M72562R5157l05702l40673j42689l5618l4594
35217a01838L1191O0645j79446m85346l64132J46586M37545L02048K41271M81385
35207E69909M87266k6774m04604q3419L96518K63389k30651l60103j78107j86419
35197B47005k23016J79714O50651L94725l96391p14580k86215J53190J62687R1961
35187B59731J76312J79241R9932K59240N05546K79141l50649o41427l56346o3211
35177C47510p0370k3180J99412J61789k26843m06070j28446J15270j1273j81106
35167b23307j13030R958J16929M04596O43483K44553o42983j041334n50768R2915
$$ y = [-223251, -149979, -138246, -46104, 40063, 20850, 139036, 683737, 1397974, 1607289, 1038049, 212163, -126072, 189719, 662281, 757438, 451736, 111063, -31626, -67244, -101838, -70647, -10002, -189448, -674794, -1038926, -892340, -454795, -152747, 88524, 569909, 1057175, 1030401, 625797, 542378, 938896, 1202285, 971634, 611531, 433424, 247005, 23989, 203703, 854354, 1249079, 852688, 138108, -148107, 5083, 167770, 259731, 436043, 615284, 715216, 974456, 1480002, 1759143, 1408494, 767067, 410721, 347510, 277140, 253960, 453372, 615161, 388318, -17752, -146198, -30928, -42201, -223307, -336337, -326379, -209450, 195146, 838629, 1083182, 440199, -601135, -1151903, -1058988]
35157a058988K89299L92650P20118P74778K01337l69708k61448J70623J87892
35148A046553j95424m45406l55559m2217L82722O06650J89328o38122r24639l05740
35138f81854L71736L35385p584J8191J70098o1564l33458l9319M97468M81719
35128G50818n8257m16693l69691k60554j63973J31791M69912M80529K59858J61007
35118I84747J00200j88452m36332j90959K89412L27061q8231l24474j74444p9782
35108B18746k51654l50884j76270J9389P3840J77370M03980M93723K95387J5093
35098I18720j30758j72286j93322j73107r0788K8469J61965K15753L1280l30265
35088B65661n00094k45687J94030M46927M36717K60329k8262k54914j41723K04640
$$ y = [-1058988, -769689, -377039, 343079, 1117857, 1319194, 949486, 688038, 858661, 1046553, 851129, 405723, 50164, 7947, 390669, 997319, 1186647, 548525, -376114, -681854, -310118, 25267, 17683, 35874, 205972, 144408, -189050, -228369, 269099, 750818, 692561, 275868, -93823, -354377, -518350, -386559, 83353, 563882, 823740, 984747, 1084947, 896495, 460163, 269204, 558616, 885677, 797446, 472972, 298528, 218746, -32908, -383792, -560062, -540673, -466833, -289463, 114517, 608240, 903627, 918720, 787962, 615676, 422354, 249247, 158459, 186928, 348893, 564646, 595926, 265661, -234433, -480120, -286090, 160837, 597554, 857883, 829621, 574707, 432984, 637624]
35078F37624K56302j39414m24606j98232J46728J61807J04193L06529L95815l9666
35068A207080n21482l45044K21137L55983n607k60274k69932l75382m55664n9171
35058e08356N71823O67259J59936k52288l06996l89908m80993n5622P11633Q20445
35048I36933k0334p89228o46190o9345J47179J35015L84599O49357L43830l54183
35038G17633o36208j68603N22673P25752K56927m12457n93280j36917K61696o6732
35028D70484o70930m71720N66316J175101N72329m15899o52244k67115r4313k10473
35018A536o5825L37907M57198K32710J40496K40972P1604m17974o53561l73819
35008b8756n3527q6021j63434J35251O09693P27755L63426j31130m26285m92139
$$ y = [637624, 893926, 754512, 329906, 131674, 278402, 440209, 544402, 850931, 1246746, 1207080, 685598, 340554, 561691, 917674, 912067, 651793, 381861, 6479, -449185, -508356, 63467, 730726, 890662, 638374, 331378, -58530, -539523, -595145, 116488, 936933, 916599, 127371, -518819, -588164, -440985, -305970, 78629, 727986, 1071816, 717633, 81425, -87178, 435495, 1161247, 1418174, 1005717, 412437, 275520, 537216, 470484, -200446, -672166, -105850, 1069251, 1641580, 1225681, 573437, 306322, 212009, 1536, -64289, 273618, 730816, 963526, 1104022, 1344994, 1416598, 998624, 345063, -28756, -82283, -168304, -331738, -196487, 413206, 1140961, 1504387, 1373257, 946972, 454833]
34998D54833m60957m20598l26974o7193L19034N24996K89394j82570l83852j56540
34988d10427J10352O2060j37553j21947J22977L12958L24445K87223K76404K05144
34978A031636L8506j31037k60390l92970m79477l85572j42508M1163J03024J98624
34968c79001L23677J94650k32581m56661p9354M66579M04256k33032n62513r9800
34958f53780N64718O49975K17480j29875j75847j67637k05938j32802L7082O8639
34948G2015q1336j88587j26997J0529J49333K75609K70731M3866j89172j19996
34938A15995J67534L13925K83484L77410N64872L48212m13528j017647p31830
34929H427J51969N89116Q5227p04985q28405j84479M49240M41788K8927j42961
$$ y = [454833, -6124, -426722, -753696, -820889, -501855, 23141, 312535, 129965, -253887, -410427, -300075, -238015, -375568, -497515, -374538, -61580, 262865, 550088, 826492, 1031636, 1070142, 939105, 678715, 285745, -193732, -579304, -721812, -680649, -577625, -379001, -55324, 139326, -93255, -549916, -629270, -162691, 241565, 8533, -553980, -653780, -89062, 560913, 778393, 648518, 472671, 305034, 99096, -33706, 3376, 72015, -9321, -197908, -324905, -314376, -165043, 110566, 381297, 425163, 235991, 115995, 283529, 597454, 880938, 1258348, 1823220, 2171432, 1757904, 740257, 8427, 160396, 749512, 834739, 129754, -698651, -883130, -433890, 7898, 36825, -106136]
34919a06136O1357J83900k4046k03462j9880K36914J10372k59378l48121o3974
34909d32454J95703K40974K75048L51995K22393j43608m02660l80846k73914j40648
34899d88017K34572P20717P11696N1438m86082k22062L85071M07209j80159n68257
34889E66126l96674j41378j62017j44726K08700N43782L42813k96407p65279o54266
34879h99326q9624N01022P45364N48165J24939k16505l55250l33876j43237K07279
34869H8951M34202J77927m17566o89797k59171M46023P31623M49792k0466l55127
34859E86391m79694l65575n4899J82200J03185j21898j36821L6880P3350l7472
34849b14353N8452M02988N24622J68896k37904k21907L1642N8616j01080n1430
$$ y = [-106136, -44779, 139121, 115075, -88387, -108267, 128647, 239019, -20359, -368480, -432454, -236751, 4223, 279271, 631266, 853659, 710051, 307391, -73455, -347369, -488017, -253445, 467272, 1178968, 1230406, 744324, 522262, 907333, 1314542, 1134383, 566126, 169452, 28074, -133943, -278669, -69969, 473813, 816626, 520219, -245060, -899326, -988950, -487928, 257436, 805601, 930540, 714035, 358785, 24909, -118328, 88951, 523153, 701080, 283514, -406283, -665454, -219431, 512192, 961984, 941518, 586391, 106697, -258878, -313777, -131577, -28392, -150290, -287111, -250231, -176881, -214353, -155901, 247087, 771709, 940605, 702701, 480794, 512436, 571052, 469972, 418542]
34839D18542J85747J47726k73259n57255k96591J95506L21891P245k57923j06697
34829b15068K43356K99763o3216m22607l23010J22292L39537L9513l74899l21384
34819f75723K03789O19590M53185j60287o54379n81446l0053M33194L45571r2523
34809a39082k64524L320K16024M0093j21243J91297O60530O34474J10834l62460
34799I69263n50545o03108m49730P0703N55686L98259j45684j67879M43524P30180
34789A250669J71676m95799m80687o7262R6632M5355Q5996L7709l03527n17428
34779a76666k08839J98727J47495q0011L3371J66197k50415p73396m97553L36208
34769a104882N76002K3270k57991K36959O17639J46900n07588l79558K87634N49027
$$ y = [418542, 604289, 752015, 478756, -78499, -375090, -179584, 142307, 149552, -108371, -215068, 28288, 328051, 264835, -157772, -480782, -358490, -18953, 20560, -354339, -675723, -471934, 147656, 600841, 440554, -213825, -795271, -825324, -392130, -46559, -139082, -403606, -400286, -184262, -144169, -265412, -74115, 586415, 1220889, 1331723, 969263, 418718, -184390, -634120, -563417, -7731, 390528, 244844, 76965, 520489, 1250669, 1422345, 926546, 445859, 378597, 475229, 520584, 606580, 644289, 340762, -176666, -385505, -186778, -39283, -119294, -85923, 80274, -170141, -943537, -1441090, -1104882, -528880, -505610, -763601, -526642, 90997, 237897, -269691, -649249, -361615, 187412]
34759A87412K10066j32682j76387j83146k63787j29817L25704P12577O09106Q2442
34749A241488l96447m51691j62541O8145L1404q230K51454N59779L67306l04773
34739A195894p38999m68023J02528L26179J70184L3915L7890j0162j26088j34976
34729C88342p8815j57323k53381o829N08849O53740O4266p10694q23006k14624
34719f29475L31885K31822k16006l35547N5554N41279O71781L50657k09910o26653
34709A65387n28960P3678O46002O62128K44027p8079j58849k95283m96431l44310
34699a10690K00740N05717J84722k47667j64138K11237K42848q9746k95379k49410
34689A88234k44993k87701n5120M20657O61438M30439J0475k63965l09945j44892
$$ y = [187412, 397478, 264796, 88409, -94737, -358524, -488341, -162637, 549940, 1159046, 1241488, 845041, 393350, 230809, 298954, 330358, 322128, 573582, 1133361, 1500667, 1195894, 456895, -11128, 91400, 417579, 587763, 621678, 659568, 649406, 523318, 388342, 309527, 152204, -101177, -108006, 400843, 1054583, 1118849, 408155, -414851, -629475, -297590, -65768, -281774, -617321, -561767, -20488, 651293, 1001950, 792040, 165387, -363573, -289895, 356107, 1018235, 1262262, 1184183, 1025334, 730051, 233620, -110690, 90050, 595767, 780489, 532822, 368684, 579921, 822769, 733023, 437644, 188234, -56759, -344460, -399580, 21077, 682515, 1112954, 1123429, 859464, 549519, 404627]
34679D04627J00916P2090l85852p41857l34336N72322R52226L72052m58190o98732
34669a44734l46479Q5230L06455L26443K14702J11283J63293K50376J02385k02820
34659H66134k87410j17625o8844j98738q7641L17562L83283k09190p46620m18109
34649e67198M48881P94790K60816m50621o04361k48564R0173J07010o0009j02822
34639c31905R2612L34726M02152L68815M42018N09201K22898l61138o69409l87252
34629F22718N3722J16164p1134l4714K04389J50153l58639q26383p08489p3255
34619i25468M74707M41997k9100l07254j7931M61287N14939K08819K02206O45805
34609A670007P89103R0315q11844q75796j16754M20457J00525n54278p08314k64500
$$ y = [404627, 505543, 577633, 191781, -550076, -884412, -312090, 640136, 1012188, 553998, -144734, -491213, -405983, -99528, 226915, 441617, 552900, 716193, 966569, 1068954, 866134, 578724, 461099, 392255, 193517, 105876, 423438, 806721, 597531, -149089, -567198, -118317, 676473, 937289, 486668, -117693, -366257, -276084, -169074, -229083, -331905, -239293, 95433, 497585, 866400, 1308418, 1817619, 2040517, 1679379, 1009970, 622718, 676440, 792604, 721470, 686756, 891145, 1041298, 682659, -143724, -852213, -925468, -450761, -8764, -37864, -345118, -363049, 98238, 613177, 821996, 1024202, 1670007, 2459110, 2549425, 1737581, 861785, 745031, 1165488, 1266013, 711735, 3421, -261079]
34599b61079K24565L40167J42986r9373k14836j64872J964J53829J38000n9075
34589B02276k41616j93617M7180K09538J23457r4696k57107l25629k97737j03507
34579i31458J67593J92353j03466k33742K16414Q30891Q10693J16226m69869m68238
34569A27397k26673j55351j20123Q2142K51104J98114J27153J82489R4567k71984
34559B88835m85605j88548K43547K62149Q910j7422J34781J6154l30217l71389
34549d38805M317K75414J36570m9827R1228L40746K82331m0319k43831j99860
34539A57964j47491k41680k90194n8759L28130M84467K45270j33015l28705l24109
34529c08122k60351j20467J61399M08033L63542R0215j37576k60240l70605l38721
$$ y = [-261079, -36514, 303653, 446639, 347266, 132430, -32442, -30478, 123351, 261351, 202276, -39340, -232957, -185777, 23761, 147218, 52522, -204585, -530214, -827951, -931458, -763865, -571512, -674978, -908720, -692306, 138585, 949278, 1065504, 595635, 127397, -99276, -254627, -374750, -292608, -41504, 156610, 283763, 466252, 560819, 288835, -196770, -385318, -141771, 120378, 129288, 111866, 246647, 262801, -67416, -438805, -434488, -159074, -22504, -72331, 18897, 359643, 641974, 601655, 357824, 157964, 10473, -231207, -521401, -580160, -252030, 232437, 477707, 344692, 15987, -308122, -568473, -688940, -527541, -119508, 244034, 334249, 196673, -63567, -434172, -772893]
34519g72893q791L09329J83005j15707J04230P21067P61944n4627o91160l29632
34509A06765L41611K49234l73827m87390L3131L38299Q5158j60610n6767J6638
34499I2242j79512k77634m4952J52395K0565j42050j1411J89768J27678m0075
34489a12986M2149L05811L68907J26162j47097k41858k67783l96961n35661l96004
34479a255321R3421N59718N38373O0276l36429k69986O2004K68023K65211J54892
34469A40182p6976l70098l84875M8800M68923K74217m03007p95735m64351K44892
34459a318028O93199N52605k3674m96515l28367L64359P47954L05204l41029k61565
34449a05857L72262N57324N0092l05612k5402K62304j6881l77984j57131L06229
$$ y = [-772893, -781684, -472355, -289350, -405057, -300827, 420240, 1182184, 1127557, 436397, 106765, 448376, 697610, 323783, -163607, -130476, 207823, 292981, 132371, 75604, 92242, -87270, -364904, -409856, -257461, -236896, -378946, -390357, -200589, -72911, -112986, -70837, 234974, 603881, 730043, 582946, 341088, 73305, -323656, -859317, -1255321, -1161900, -602182, -63809, -3533, -339962, -609948, -547944, -279921, -14710, 140182, 63206, -306892, -691767, -642967, -174044, 100173, -302834, -1098569, -1562920, -1318028, -624829, -72224, -95898, -592413, -920780, -556421, 191533, 496737, 155708, -105857, 266405, 823729, 873821, 568209, 542807, 805111, 788230, 410246, 253115, 559344]
34439E59344K35700k74231m19137L0505M33359K76078k11867n30997m50862L72
34429c51736N75548P63506K33077n53554p16550j41620K91022k2640n19069l83292
34419h25308J69895L02669o8965k28986M0653J01686l20110m96228J29761Q91669
34409c03264Q38579J94929m8944K96449M63365P6700l35446l52758k79541m11839
34399A38230m64779j73474J66807K23105J58334K05141K01205n949j55850l2678
34389B60092J12796N5830O4921L68992N82764K45686l90111o83395m73818j25832
34379A7925O2288L3182j98289m52032l76513P0040M28746L82237J95848J61509
34369C24941J19733k9360L3058L24747J91484n86579j043369l66217O57252P08292
$$ y = [559344, 795044, 520813, 101676, 132181, 565540, 841618, 629751, 98754, -352108, -351736, 223812, 987318, 1220395, 666841, -49709, -191329, 99693, 77053, -442016, -825308, -655413, -352744, -421709, -650695, -610042, -508356, -828466, -1324694, -1194933, -303264, 535315, 730244, 681300, 977749, 1441114, 1517814, 1182368, 829610, 550069, 138230, -326549, -500023, -333216, -110111, 48223, 253364, 454569, 448620, 292770, 260092, 372888, 428718, 493639, 862631, 1445395, 1691081, 1300970, 617575, 143757, 17925, 80213, 113395, -84894, -536926, -913439, -843399, -414653, -32416, 163432, 324941, 444674, 415314, 448372, 773119, 964603, 378024, -665345, -1031562, -374310, 333982]
34359C33982n8956m18479j24504n8719m15552l32255M08108P99910K78072l30397
34349H1210k01312K23914J39867l20417m65560j10545L77954O10553L25599m35919
34339B25344j002111o16544L77140P31512P0129m92273q3193N86500M73683j00071
34329A70116j07388M52892O79632K98298q0627j30103j86641l89954l66859K039
34319C41405K49829N6246k63977l13594j91334j82874k23127n6647K36921K67395
34309g9757q1364l91964k38590J95669L43665P3429j32320K8931J81601n4657
34299a55357l46876j90446J81580J67770j42823j21432K62037L47160q0317m35892
34289e14596l25077o3123M5868J52198K96908J91301j22734j59026J57612L07049
$$ y = [333982, 275026, -143453, -267957, -326676, -742228, -1074483, -666375, 133535, 411607, 81210, -120102, 103812, 243679, -76738, -542298, -652843, -274889, 335664, 661263, 225344, -776767, -1393311, -1016171, -284659, -214530, -706803, -789996, -203496, 270187, 170116, 62728, 515620, 1195252, 1493550, 1412923, 1282820, 1096179, 706225, 339366, 341405, 591234, 647480, 383503, 69909, -121425, -304299, -527426, -584073, -347152, -79757, -161121, -553085, -791675, -596006, -252341, -178912, -311232, -282301, -100700, -155357, -502233, -692679, -511099, -343329, -486152, -607584, -345547, 1613, -78704, -514596, -839673, -902796, -856928, -704730, -407822, -216521, -339255, -498281, -340669, -33620]
34279c3620J23669N5245J82101k731m43067l08899M82543P69027j4015p23739
34269H6514l08937M44459K88626l77027l34392K62039K33779m82710p36122j03434
34259a027205N90885P46463O08421L35309k42752p89643o35849K4082K85748M6370
34249e8171J26974O70379P49520n893o81429n73110k31630k90731l31410J90960
34239d34541P55989N24472k72638o25442j45377N49183O94507J39269o14965q45871
34229b75414l01293M13280M89783j5333l19120j36592Q818j38673r7828L49697
34219b2675N92883J99570l14711l78074k67513l91773l95162J46508P33373O12591
34209E15017K0351k04413N3841J88246k31r6549O9615J88278J00127l4407j64541
$$ y = [-33620, 90049, 145294, 327395, 324664, -118403, -427302, 55241, 824268, 810253, 86514, -222423, 222036, 510662, 133635, -200757, 61282, 295061, -187649, -923771, -1027205, -436320, 310143, 918564, 1253873, 1011121, 221478, -414371, -390289, -104541, -58171, 68803, 739182, 1488702, 1482809, 801380, 228270, -3360, -294091, -625501, -434541, 321448, 845920, 573282, -52160, -197537, 351646, 1046153, 1185422, 570457, -275414, -576707, -163427, 326356, 311023, -8097, -144689, -135871, -274544, -372372, -22675, 570208, 769778, 455067, 76993, -190520, -582293, -977455, -830947, -97574, 515017, 535368, 330955, 384796, 573042, 572811, 476262, 545877, 734155, 834282, 799875, 635334]
34198F35334l09693k08547L03359P12027M04348k74405m08977O0777K46710k34355
34188I26578o86230n16327q8324N0097l1N5042R7429k188K2342K89699L80030
34177E28117M8008k35362p9320N7420l43363q09544n45348K02902M82545J79201
34167e14744J21973N69481P17684R1589n82270n10921m3489P933l26248l78716
34157h47728j1251K51076J28210r3463j44313o8294Q9536L34315M20130O4109
34147A22327m46580m51482R0687L99294j2352n61406m18057K95523P07462M00752
34137A26168j47847l10598j9222L53317M77271L07557M5433p0940m8048j39512
34127E73579m14941n06052r7963M69117N38636O5303k91289j18465K06850J83396
$$ y = [635334, 325641, 117094, 420453, 1132480, 1536828, 1262423, 853446, 914223, 1160933, 926578, 240348, -275979, -364303, -314206, -314237, -259195, -161766, -163954, -141612, 148087, 528117, 576125, 340763, 261443, 318863, -24500, -834044, -1379392, -1176490, -693945, -514744, -392771, 176710, 894394, 985983, 403713, -107208, -150697, -142764, -469012, -847728, -858979, -607903, -479693, -573156, -717469, -785763, -696227, -361912, 58218, 122327, -324253, -775735, -685048, -285754, -298106, -859512, -1277569, -982046, -274584, 126168, -21679, -332277, -351499, 1818, 479089, 786646, 832079, 761139, 713091, 573579, 158638, -347414, -445377, 23740, 562376, 627679, 336390, 217925, 424775, 608171]
34117F08171p6795j76613j23346j80928k79830j39771J38219J87398N9846J74558
34107A90909M95225M37777j34523n01654j49589L50294J86162m22133o00502j91029
34097c39063J60263J91532L11500N62374L24580n16364j038951n76471K18942
34088g01658L71874O838j12300N1120n1565l41834j73004M25977O48198K21141
34078C44787j71687p8726M7007j94177l75174l8257M12833L17556j96307m31805
34068c63950j06358M19528O82920M82707n3651m44302k18735L82913N04080j64210
34058A120942q23417o75022o0134J78352N965L0425L31347L93804J29059N4361
34048F85682L61100O07091N02738K75660P0540k82054o60470n78714p6691P4931
$$ y = [608171, 531376, 354763, 231417, 50489, -229341, -369112, -230893, -43495, 16351, 190909, 686134, 1123911, 989388, 487734, 338145, 688439, 874601, 452468, -148034, -339063, -178800, 12732, 324232, 886606, 1211186, 694822, -344129, -920600, -701658, -329784, -322946, -435246, -384126, -435691, -777525, -950529, -524552, 123646, 344787, 173100, 94374, 141381, -52796, -427970, -466227, -53394, 264162, 67855, -363950, -470308, -50780, 632140, 1114847, 1061196, 616894, 398159, 781072, 1285152, 1120942, 297525, -377497, -437631, -259279, -253314, -222889, 108458, 502262, 631321, 685682, 1046782, 1653873, 2156611, 2432271, 2502811, 2220757, 1560287, 981573, 904882, 979813]
34038I79813m30190p58622j67483O97896O62722j88222o44889k37148J49019j74086
34028a11190n65597j72876N97724O89173O3876k97163l499K11024j58070m99944
34018b46542j70458L39567J82188m18088n02480P4853M44027J16868l36360k69729
34008g86154J49905M05995L68052J73931j20180l94290l87695r6697J26520J25174
33998d35439J73359M30948O27226N32436K64485q4907n60681q68863n07054L00643
33988a27847N97103P8855l72976j48514O9223l79106p48213q1545R22568P55184
33978E64732n00666j161771m03221O95160Q85500L03011k19239l74344l15010
33969e25848j05639J79731L08649K44228K40574L60581L54600J73779J00767K27495
$$ y = [979813, 549623, -208999, -376482, 321414, 984136, 795914, 151025, -86123, 62896, -111190, -676787, -849663, -251939, 437234, 501110, 203947, 200448, 411472, 253402, -246542, -417000, -77433, 104755, -313333, -815813, -740960, -296933, -180065, -516425, -786154, -636249, -230254, 137798, 311729, 191549, -202741, -590436, -687133, -560613, -435439, -262080, 168868, 796094, 1328530, 1593015, 1508108, 947427, 78564, -428490, -127847, 469256, 548111, 175135, 26621, 95844, -283262, -1031475, -1113020, -190452, 564732, 64066, -1097705, -1500926, -805766, 79734, 382745, 163506, -210838, -525848, -631487, -451756, -143107, 101121, 341695, 702276, 1056876, 1230655, 1331422, 1558917]
$$ [...]
##END NTUPLES=NMR SPECTRUM
##END=
