##TITLE=31Pdec_E3d-4
 CDCl3, 24 sc
 15.6.2023
##JCAMPDX= 6.0         $$ Bruker NMR JCAMP-DX V2.0
##DATA TYPE= NMR SPECTRUM
##DATA CLASS= NTUPLES
##ORIGIN= UXNMR, Bruker Analytische Messtechnik GmbH
##OWNER= root
$$ XWIN-NMR		Version 3.5
$$ Thu Jun 15 09:42:27 2023 Russian Standard Time (UT+4h)  she@DPX200
##.OBSERVE FREQUENCY= 81.013821
##.OBSERVE NUCLEUS= ^31P
##.ACQUISITION MODE= SIMULTANEOUS
##.ACQUISITION SCHEME= undefined
##.AVERAGES= 24
##.DIGITISER RES= 16
##SPECTROMETER/DATA SYSTEM= spect
##.PULSE SEQUENCE= zgpg30
##.SOLVENT NAME= CDCl3
##.SHIFT REFERENCE= (INTERNAL, CDCl3, 0, 248.564)
##AUDIT TRAIL= $$ (NUMBER, WHEN, WHO, WHERE, WHAT)
$$ ##TITLE= Audit trail, XWIN-NMR		Version 3.5
$$ ##JCAMPDX= 5.01
$$ ##ORIGIN= Bruker BioSpin GmbH
$$ ##OWNER= she
$$ F:/spectra/data/she/nmr/P31/1/pdata/1/auditp.txt
$$ ##AUDIT TRAIL=  $$ (NUMBER, WHEN, WHO, WHERE, WHAT)
(   1,<2023-06-15 09:41:13.62 +0400>,<she>,<DPX200>,
      <created by zg, POWCHK disabled, PULCHK disabled
       configuration hash MD5:
       00 E9 B6 7A A2 85 ED C7 34 08 36 98 17 FE 4E 26
       data hash MD5: 32K
       3D 03 0E 6A B9 AA 44 48 28 DC 9E 94 EB 65 2A 08>)
(   2,<2023-06-15 09:41:16.75 +0400>,<she>,<DPX200>,
      <Start of raw data processing
       efp BC_mod = 2 LB = 1 FT_mod = 6 PKNL = 1 PHC0 = -10706.7 PHC1 = 136.2848 SI = 64K 
       data hash MD5: 64K
       DA B7 18 47 92 39 43 B6 CB AE 08 6B 12 F8 9B FD>)
(   3,<2023-06-15 09:41:36.65 +0400>,<she>,<DPX200>,
      <pk PHC0 = 0.5822775 PHC1 = 0 
       data hash MD5: 64K
       4F 67 4C E9 71 7D AE 17 57 88 8B 0A DB 9B 4A BF>)
(   4,<2023-06-15 09:41:40.71 +0400>,<she>,<DPX200>,
      <abs ABSG = 5 
       data hash MD5: 64K
       0A D5 71 63 1A A2 F9 79 0A 5A EB F3 85 3D C2 97>)
$$ ##END=
$$ 
$$ hash MD5
$$ 7F C3 F0 50 B4 23 B5 54 93 1B CF 9E 0A C9 F1 F2
##$RELAX= 
##$RELAX= 
##$RELAX= 
##$RELAX= 
##$RELAX= 
##$RELAX= 
##$RELAX= 
##$RELAX= 
##$RELAX= 
$$ Bruker specific parameters
$$ --------------------------
##$DU= <F:/spectra>
##$EXPNO= 1
##$NAME= <P31>
##$PROCNO= 1
##$TYPE= <nmr>
##$USER= <she>
##$AMP= (0..31)
100 100 100 100 100 100 100 100 100 100 100 100 100 100 100 100 100 100 
100 100 100 100 100 100 100 100 100 100 100 100 100 100 
##$AQSEQ= 0
##$AQ_mod= 1
##$AUNM= <au_zg>
##$AUTOPOS= <>
##$BF1= 81.014009
##$BF2= 200.13
##$BF3= 200.13
##$BF4= 200.13
##$BF5= 200.13
##$BF6= 200.13
##$BF7= 200.13
##$BF8= 200.13
##$BYTORDA= 1
##$CFDGTYP= 0
##$CFRGTYP= 5
##$CHEMSTR= <none>
##$CNST= (0..31)
1 1 145 1 1 1 1 1 1 1 1 1 1 1 1 1 1 1 1 1 1 1 1 1 1 1 1 1 1 1 1 1 
##$CPDPRG= <waltz16>
##$CPDPRG1= <>
##$CPDPRG2= <waltz16>
##$CPDPRG3= <>
##$CPDPRG4= <mlev>
##$CPDPRG5= <mlev>
##$CPDPRG6= <mlev>
##$CPDPRG7= <mlev>
##$CPDPRG8= <mlev>
##$CPDPRGB= <>
##$CPDPRGT= <>
##$D= (0..31)
0 1 0 0 0 0 0 0 0 0 0 0.03 2e-05 3e-06 0 0 0 0 0 0 0 0 0 0 0 0 0 0 0 0 
0 0 
##$DATE= 1686807673
##$DBL= (0..7)
120 120 120 11 120 120 24 19 
##$DBP= (0..7)
150 150 150 150 150 150 150 150 
##$DBP07= 0
##$DBPNAM0= <>
##$DBPNAM1= <>
##$DBPNAM2= <>
$$ [...]
##$SUBNAM3= <"">
##$SUBNAM4= <"">
##$SUBNAM5= <"">
##$SUBNAM6= <"">
##$SUBNAM7= <"">
##$SUBNAM8= <"">
##$SUBNAM9= <"">
##$SW= 501.771253377433
##$SWIBOX= (0..15)
0 1 3 0 0 0 0 0 0 0 0 0 0 0 0 0 
##$SW_h= 40650.406504065
##$TD= 32768
##$TD0= 1
##$TE= 0
##$TE2= 300
##$TE3= 300
##$TEG= 300
##$TL= (0..7)
0 120 53 12 22 120 120 120 
##$TP= (0..7)
150 150 150 150 150 150 150 150 
##$TP07= 0
##$TPNAME0= <>
##$TPNAME1= <>
##$TPNAME2= <>
##$TPNAME3= <>
##$TPNAME4= <>
##$TPNAME5= <>
##$TPNAME6= <>
##$TPNAME7= <>
##$TPOAL= (0..7)
0.5 0.5 0.5 0.5 0.5 0.5 0.5 0.5 
##$TPOFFS= (0..7)
0 0 0 0 0 0 0 0 
##$TUNHIN= 0
##$TUNHOUT= 0
##$TUNXOUT= 0
##$USERA1= <user>
##$USERA2= <user>
##$USERA3= <user>
##$USERA4= <user>
##$USERA5= <user>
##$V9= 5
##$VALIST= <valist>
##$VCLIST= <CCCCCCCCCCCCCCC>
##$VD= 0
##$VDLIST= <DDDDDDDDDDDDDDD>
##$VPLIST= <PPPPPPPPPPPPPPP>
##$VTLIST= <TTTTTTTTTTTTTTT>
##$WBST= 1024
##$WBSW= 4
##$XGAIN= (0..3)
0 0 0 0 
##$XL= 0
##$YL= 0
##$YMAX_a= 9580
##$YMIN_a= -7850
##$ZGOPTNS= <>
##$ZL1= 120
##$ZL2= 120
##$ZL3= 120
##$ZL4= 120
##$ABSF1= 248.5645
##$ABSF2= -253.2056
##$ABSG= 5
##$ABSL= 3
##$ALPHA= 0
##$AQORDER= 0
##$ASSFAC= 0
##$ASSFACI= 0
##$ASSFACX= 0
##$ASSWID= 0
##$AUNMP= <proc_1d>
##$AZFE= 0.1
##$AZFW= 0.5
##$BCFW= 0
##$BC_mod= 2
##$BYTORDP= 0
##$COROFFS= 0
##$CY= -3
##$DATMOD= 1
##$DC= 0
##$DFILT= <>
##$DTYPP= 0
##$F1P= 0
##$F2P= 0
##$FCOR= 1
##$FTSIZE= 65536
##$FT_mod= 6
##$GAMMA= 0
##$GB= 0
##$INTBC= 1
##$INTSCL= 6.047779e-11
##$ISEN= 30
##$LB= 1
##$LEV0= 0
##$LPBIN= 0
##$MAXI= 10000
##$MC2= 0
##$MEAN= 0
##$ME_mod= 0
##$MI= 50
##$NCOEF= 0
##$NC_proc= -4
##$NLEV= 6
##$NOISF1= 182.463
##$NOISF2= 159.3651
##$NSP= 0
##$NTH_PI= 0
##$NZP= 0
##$OFFSET= 248.5645
##$PC= 4
##$PHC0= -10706.12
##$PHC1= 136.2848
##$PH_mod= 1
##$PKNL= yes
##$PPARMOD= 0
##$PSCAL= 0
##$PSIGN= 0
##$REVERSE= no
##$SF= 81.0140089999694
##$SI= 65536
##$SIGF1= 159.3651
##$SIGF2= -187.1042
##$SINO= 113.3802
##$SIOLD= 16384
##$SREGLST= <1H.CDCl3>
##$SSB= 0
##$STSI= 65536
##$STSR= 0
##$SW_p= 40650.406504065
##$SYMM= 0
##$S_DEV= 0
##$TDeff= 32768
##$TDoff= 0
##$TI= <>
##$TILT= no
##$TM1= 0
##$TM2= 0
##$TOPLEV= 0
##$USERP1= <user>
##$USERP2= <user>
##$USERP3= <user>
##$USERP4= <user>
##$USERP5= <user>
##$WDW= 1
##$XDIM= 65536
##$YMAX_p= 291227960
##$YMIN_p= -110497970
$$ End of Bruker specific parameters
$$ ---------------------------------
##NTUPLES= NMR SPECTRUM
##VAR_NAME=  FREQUENCY,     SPECTRUM/REAL,   SPECTRUM/IMAG
##SYMBOL=    X,             R,               I
##VAR_TYPE=  INDEPENDENT,   DEPENDENT,       DEPENDENT
##VAR_FORM=  AFFN,          ASDF,            ASDF
##VAR_DIM=   65536,         65536,           65536
##UNITS=     HZ,            ARBITRARY UNITS, ARBITRARY UNITS
##FACTOR=    0.620285442955139, 1,           1
##FIRST=     20137.2065510682, 0,            0
##LAST=      -20513.1999529968, 0,           0
##MIN=       -20513.1999529968, -110497970,  0
##MAX=       20137.2065510682, 291227960,    0
$$ Real data points
##PAGE= N=1
##DATA TABLE= (X++(R..R)), XYDATA
$$ [...]
$$ plain form
39977 -290992 -254227 -366425 -469505 -432326 -314327 -270790 -337201 -400099 -373751 -294361 -210447
39966 -210447 -102486 15385 32780 -98229 -234125 -214345 -95878 -53431 -105511 -134927
39956 -134927 -146328 -265059 -456195 -498147 -332865 -217698 -381116 -697616 -858128 -729721
39946 -729721 -409420 -55718 186152 216896 102413 65655 224289 439516 541650 553439
39936 553439 533547 377608 11355 -353047 -428300 -246391 -82045 -45327 -29632 -24509 -162856
39925 -162856 -425163 -594931 -583687 -533089 -510532 -382053 -117784 49315 -32422 -149669
39915 -149669 -21162 269684 380723 164295 -208096 -526367 -728342 -798917 -682327 -381890
39905 -381890 -45713 134038 95566 -36488 -68764 62735 208793 177088 -2591 -80170
$$ packed form
39977b90992L6765j12198j03080L7179J17999M3537o6411o2898K6348P9390Q3914
39966b10447J07961J17871J7395j31009j35896J9780J18467M2447n2080k9416
39956a34927j1401j18731j91136m1952J65282J15167j63418l16500j60512J28407
39946g29721L20301L53702K41870L0744j14483l6758J58634K15227J02134J1789
39936E53439j9892j55939l66253l64402p5253J81909J64346L6718J5695N123j38347
39925a62856k62307j69768J1244N0598K2557J28479K64269J67099q1737j17247
39915a49669J28507K90846J11039k16428l72391l18271k01975p0575J16590L00437
39905c81890L36177J79751l8472j32054l2276J31499J46058l1705j79679p7579
$$ plain form
39895 -80170 91035 337753 385687 220425 81044 113897 190460 118325 -84232 -211122
39885 -211122 -113508 145530 357184 345273 107487 -173748 -277706 -148430 50913 116560
39875 116560 22256 -81234 -67129 31297 91710 41015 -102192 -254393 -295190 -139912 149475
39864 149475 379409 416761 312983 176933 15260 -191197 -344090 -327886 -204380 -127254
39854 -127254 -94483 9019 135891 98554 -77962 -87731 237768 655600 813931 656306
39844 656306 369574 96123 -122172 -246736 -270836 -257737 -230611 -145983 -66220 -157807 -385316
39833 -385316 -458539 -289207 -225217 -530470 -890655 -838437 -478992 -316804 -454786 -481403
39823 -481403 -180147 148963 206738 98347 36601 14993 -16331 23625 121838 63740 -212663
$$ packed form
39895h0170J71205K46718M7934j65262j39381L2853P6563p2135k02557j26890
39885b11122R7614K59038K11654j1911k37786k81235j03958J29276J99343O5647
39875A16560r4304j03490J4105R8426O0413n0695j43207j52201m0797J55278K89387
39864A49475K29934L7352j03778j36050j61673k06457j52893J6204J23506P7126
39854a27254L2771J03502J26872l7337j76516r769L25499M17832J58331j57625
39844F56306k86732k73451k18295j24564k4100J3099K7126Q4628P9763r1587k27509
39833c85316p3223J69332O3990l05253l60185N2218L59445J62188j37982k6617
39823d81403L01256L29110N7775j08391o1746k1608l1324L9956R8213n8098k76403
$$ plain form
39812 -212663 -414389 -297015 -46162 8511 -129183 -210513 -165962 -149473 -225342 -269985 -184750
39801 -184750 -22657 109116 156767 135211 103393 93831 50795 -69528 -138411 35506 392096
39790 392096 613160 511975 229098 -47561 -309279 -528089 -508059 -188772 109562 45535
39780 45535 -257852 -374982 -162039 88860 74424 -158563 -309006 -146502 269977 635816
39770 635816 710762 600689 587396 668663 542829 152955 -109900 6063 175164 19946
39760 19946 -233565 -131496 184251 132685 -370021 -745548 -627952 -336101 -267314 -335712
39750 -335712 -315618 -300252 -432534 -512807 -297349 30368 92099 -121923 -297923 -308348
39740 -308348 -301938 -325124 -226924 13953 189583 184059 130641 142053 125147 5833 -73128
$$ packed form
39812b12663k01726J17374K50853N4673j37694q1330M4551J6489p5869m4643Q5235
39801a84750J62093J31773M7651k1556l1818r562m3036j20323o8883J73917L56590
39790C92096K21064j01185k82877k76659k61718k18810K0030L19287K98334o4027
39780D5535l03387j17130K12943K50899j4436k32987j50443J62504M16479L65839
39770F35816P4946j10073j3293Q1267j25834l89874k62855J15963J69101j55218
39760A9946k53511J02069L15747n1566n02706l75527J17596K91851O8787o8398
39750c35712K0094J5366j32282q0273K15458L27717O1731k14022j76000j0425
39740c08348O410k3186R8200K40877J75630n524n3418J1412j6906j19314p8961
$$ plain form
39729 -73128 30292 191882 188931 49191 5361 120885 201851 154029 198430 534554 926000
39718 926000 904822 406995 -65899 -61144 260901 406122 249028 137530 300158 487755
39708 487755 368438 33731 -142570 -39875 65829 -109090 -513068 -848136 -878310 -611842
39698 -611842 -266543 -81630 -98084 -127623 -12296 121596 8050 -353316 -612280 -483031
39688 -483031 -108976 121703 30364 -238650 -487485 -636433 -618291 -335931 142400 503246
39678 503246 490226 220417 23983 68 -65923 -304740 -497880 -369085 -16626 164702
39668 164702 -2719 -237713 -175532 141068 319819 153724 -85460 3035 421059 770926
39658 770926 755481 472987 153672 -174401 -569332 -884751 -877644 -578145 -279381 -116710
$$ packed form
39729g3128J03420J61590k951j39740m3830J15524Q0966m7822M4401L36124L91446
39718I26000k1178m97827m72894M755L22045J45221j57094j11498J62628J87597
39708D87755j19317l34707j76301J02695J05704j74919m03978l35068l0174K66468
39698f11842L45299J84913j6454k9539J15327J33892j13546l61366k58964J29249
39688d83031L74055K30679r1339k69014k48835j48948J8142K82360M78331L60846
39678E03246j3020k69809j96434k3915o5991k38817j93140J28795L52459J81328
39668A64702j67421k34994O2181L16600J78751j66095k39184Q8495M18024L49867
39658G70926j5445k82494l19315l28073l94931l15419P107K99499K98764J62671
$$ plain form
39648 -116710 73573 367693 503109 242795 -196168 -366430 -172428 42506 -3873 -187037
39638 -187037 -199568 59417 411846 601000 495200 188374 -50690 -22874 167688 228967
39628 228967 65568 -93465 -32677 134314 142396 -30400 -143571 -52007 105689 124351
39618 124351 -15494 -197002 -348732 -459556 -483834 -363549 -135158 78954 183651 150492
39608 150492 -19105 -267589 -443139 -421913 -280865 -217873 -282229 -338980 -330634 -365306 -450266
39597 -450266 -377527 -69843 172537 51297 -254381 -321271 -99623 74525 57189 68327
39587 68327 213149 259431 80838 -57281 80299 306295 339279 248554 231532 189355 -69767
39576 -69767 -369044 -351008 -63077 80490 -65882 -201233 -119475 -30643 -165559 -383100
$$ packed form
39648a16710J90283K94120J35416k60314m38963j70262J94002K14934m6379j83164
39638a87037j2531K58985L52429J89154j05800l06826k39064K7816J90562O1279
39628B28967j63399j59033O0788J66991Q082j72796j13171R1564J57696J8662
39618A24351j39845j81508j51730j10824k4278J20285K28391K14112J04697l3159
39608A50492j69597k48484j75550K1226J41048O2992o4356n6751Q346l4672q4960
39597d50266P2739L07684K42380j21240l05678o6890K21648J74148j7336J1138
39587F8327J44822M6282j78593j38119J37580K25996L2984r0725j7022m2177k59122
39576f9767k99277J8036K87931J43567j46372j35351Q1758Q8832j34916k17541
$$ plain form
39566 -383100 -404352 -219486 -38656 10372 -64956 -256069 -536328 -753840 -712093 -389677
39556 -389677 -5912 165135 48653 -160417 -217617 -129656 -129431 -292640 -359030 -119909 183950
39545 183950 155903 -148530 -277801 -74372 80706 -136597 -493835 -545469 -242308 68453
39535 68453 112991 -76007 -312898 -444374 -414861 -284463 -167630 -104151 -52624 -9648 7405
39524 7405 95308 363973 659778 656985 325287 20972 -34255 -53068 -246243 -410607 -269240
39513 -269240 45444 218504 248023 315070 342082 138880 -125504 -95465 153113 172945
39503 172945 -121853 -290292 -85966 130706 -39794 -437431 -618964 -459867 -191262 -44900
39493 -44900 -114028 -376159 -613363 -495902 2229 436804 400345 45349 -169844 -114636
$$ packed form
39566c83100k1252J84866J80830M9028p5328j91113k80259k17512M1747L22416
39556c89677L83765J71047j16482k09070n7200Q7961K25j63209o6390K39121L03859
39545A83950k8047l04433j29271K03429J55078k17303l57238n1634L03161L10761
39535F8453M4538j88998k36891j31476K9513J30398J16833O3479N1527M2976J7053
39524G405Q7903K68665K95805k793l31698l04315n5227j8813j93175j64364J41367
39513b69240L14684J73060K9519O7047K7012k03202k64384L0039K48578J9832
39503A72945k94798j68439K04326K16672j70500l97637j81533J59097K68605J46362
39493d4900o9128k62131k37204J17461M98131M34575l6459l54996k15193N5208
$$ plain form
39483 -114636 -41830 -90220 -89257 100614 349049 461585 419026 309770 178550 42380 -55263
39472 -55263 -102156 -162931 -289649 -416126 -401652 -201124 22911 21182 -243424 -479086 -388366
39461 -388366 -72204 102004 42752 47048 263146 391910 189641 -44695 111456 501984
39451 501984 583388 235763 -110903 -181633 -189774 -336137 -446621 -349224 -219463 -250285 -287368
39440 -287368 -112609 155367 267590 249096 269495 279048 117916 -134273 -259773 -260315 -273886
39429 -273886 -225301 46430 346734 255433 -218680 -528836 -309518 151916 386822 368252
39419 368252 362581 405292 300415 40331 -134248 -112599 -67492 -154371 -273300 -240965 -52571
39408 -52571 146375 262657 321075 363806 364476 243511 -52788 -458530 -756796 -711633 -312770
$$ packed form
39483a14636P2806m8390R63J89871K48435J12536m2559j09256j31220j36170r7643
39472e5263m6893o0775j26718j26477J4474K00528K24035j729k64606k35662R0720
39461c88366L16162J74208n9252M296K16098J28764k02269k34336J56151L90528
39451E01984Q1404l47625l46666p0730q141j46363j10484R7397J29761l0822l7083
39440b87368J74759K67976J12223j8494K0399R553j61132k52189j25500n42j3571
39429b73886M8585K71731L00304r1301m74113l10156K19318M61434K34906j8570
39419C68252n671M2711j04877k60084j74579K1649M5107q6879j18929L2335J88394
39408e2571J98946J16282N8418M2731O70j20965k96299m05742k98266M5163L98863
$$ plain form
39397 -312770 135661 271451 53344 -192603 -162351 65372 163572 4005 -198066 -226029
39387 -226029 -175568 -283157 -540668 -670383 -489014 -148349 40068 -66680 -330657 -482595
39377 -482595 -352468 -12629 269306 257646 -39053 -386562 -536507 -395876 -42321 337149
39367 337149 532762 440678 155802 -99729 -165162 -54428 85894 97807 -61696 -256126
39357 -256126 -275996 -78926 126266 117505 -74272 -239112 -272065 -250395 -256179 -260343 -187134
39346 -187134 4736 282404 494023 442510 135990 -136302 -162289 -126893 -314467 -594435
39336 -594435 -569419 -224793 -8522 -154842 -344515 -248805 -27488 15592 -53193 -2457
39326 -2457 83068 -59721 -384518 -572845 -490963 -268669 10253 346037 598086 590372 440669
$$ packed form
39397c12770M48431J35790k18107k45947L0252K27723R8200j59567k02071k7963
39387b26029N0461j07589k57511j29715J81369L40665J88417j06748k63977j51938
39377d82595J30127L39839K81935j1660k96699l47509j49945J40631L53555L79470
39367C37149J95613r2084k84876k55531o5433J10734J40322J1913j59503j94430
39357b56126j9870J97070K05192q761j91777j64840l2953K1670n784m164P3209
39346a87134J91870K77668K11619n1513l06520k72292k5987L5396j87574k79968
39336e94435K5016L44626K16271j46320j89673R5710K21317M3080o8785N0736
39326b457Q5525j42789l24797j88327Q1882K22294K78922L35784K52049p714j49703
$$ plain form
39315 440669 427744 519478 418057 122560 15814 246698 450103 325202 113030 169036
39305 169036 369932 347797 105805 -35715 55 -11488 -98251 15967 395486 660434
39295 660434 508364 187732 158616 446623 638470 461490 87340 -166945 -204545 -126766
39285 -126766 -24191 70463 107435 29629 -147140 -323531 -389435 -308350 -169902 -145221 -307725
39274 -307725 -499701 -493339 -304132 -189522 -269644 -332185 -159362 114546 184126 1954
39264 1954 -209213 -303444 -315871 -257493 -88286 88136 84746 -59904 -107579 -20514 -27926
39253 -27926 -182261 -194094 84497 342137 269225 54515 49679 153735 -19804 -459575
39243 -459575 -715571 -581039 -378854 -415981 -518283 -357554 3894 188571 27205 -242142
$$ packed form
39315D40669j2925R1734j01421k95497j06746K30884K03405j24901k12172N6006
39305A69036K00896k2135k41992j41520L5770j1543q6763J14218L79519K64948
39295F60434j52070l20632k9116K88007J91847j76980l74150k54285l7600P7779
39285a26766J02575R4654L6972p7806j76769j76391o5904Q1085J38448K4681j62504
39274c07725j91976O362J89207J14610q0122o2541J72823K73908O9580j82172
39264A954k11167r4231j2427N8378J69207J76422l390j44650m7675Q7065p412
39253b7926j54335j1833K78591K57640p2912k14710m836J04056j73539m39771
39243d59575k55996J34532K02185l7127j02302J60729L61448J84677j61366k69347
$$ plain form
39233 -242142 -307168 -146252 2974 -42649 -214946 -314400 -252468 -98272 74084 248041
39223 248041 362159 318294 170825 131287 255339 302811 92805 -171079 -177872 18771
39213 18771 104074 8146 -20605 142718 307303 299067 201016 132153 29934 -174374 -345948
39202 -345948 -309214 -121695 -11940 -79445 -185416 -150751 12272 108309 4614 -170635
39192 -170635 -169714 18569 102857 -121714 -466019 -584872 -395208 -76339 212994 390270
39182 390270 346683 68086 -224378 -337111 -416656 -678244 -929662 -797565 -397030 -266376
39172 -266376 -535104 -671732 -290847 248068 371838 55440 -305064 -482655 -499781 -351541
39162 -351541 -54500 165916 108222 -66353 -45578 164613 295001 268950 272435 375593
$$ packed form
39233b42142o5026J60916J49226m5623j72297r9454O1932J54196J72356J73957
39223B48041J14118m3865j47469l9538J24052M7472k10006k63884o793J96643
39213A8771Q5303r5928k8751J63323J64585q236r8051o8863j02219k04308j71574
39202c45948L6734J87519J09755o7505j05971L4665J63023R6037j03695j75249
39192a70635R21J88283Q4288k24571l44305j18853J89664L18869K89333J77276
39182C90270m3587k78597k92464j12733p9545k61588k51418J32097M00535J30654
39172b66376k68728j36628L80885N38915J23770l16398l60504j77591j7126J48240
39162c51541K97041K20416n7694j74575K0775K10191J30388k6051L485J03158
$$ plain form
39152 375593 393650 186028 -132441 -339847 -312284 -76010 193188 243504 -14058 -353313
39142 -353313 -470570 -346192 -212522 -199002 -193776 -61877 160291 318054 285624 64906
39132 64906 -189860 -293679 -239982 -190595 -190923 -72481 221751 425495 300960 28385 -50531
39121 -50531 56165 75933 -23695 -10090 141413 159327 -46004 -185726 -31064 261821
39111 261821 442034 495742 482348 305378 -76593 -393611 -326395 40721 282841 149386
39101 149386 -166858 -296578 -112335 138882 75988 -403822 -925605 -957701 -406379 229058
39091 229058 402552 101678 -258857 -395847 -383888 -371200 -332566 -192720 -14688 77423
39081 77423 83352 108173 179574 186966 35388 -197188 -315958 -222770 -27883 77794 26098
$$ packed form
39152C75593J8057k07622l18469k07406K7563K36274K69198N0316k57562l39255
39142c53313j17257J24378J33670J3520N226J31899K22168J57763l2430k20718
39132F4906k54766j03819N3697M9387l28J18442K94232K03744j24535k72575p8916
39121e0531J06696J9768r9628J3605J51503J7914k05331j39722J54662K92885
39111B61821J80213N3708j3394j76970l81971l17018O7216L67116K42120j33455
39101A49386l16244j29720J84243K51217o2894m79810n21783l2096N51322O35437
39091B29058J73494l00874l60535j36990J1959J2688L8634J39846J78032R2111
39081G7423N929K4821P1401P392j51578k32576j18770R3188J94887J05677n1696
$$ plain form
39070 26098 -95399 -176242 -172912 -84603 54155 132561 25700 -232237 -419480 -362218 -151054
39059 -151054 -39089 -157033 -402031 -571115 -522702 -244147 129930 367024 309357 30044
39049 30044 -246935 -390123 -448450 -493864 -490062 -379279 -216186 -126284 -162619 -269563 -369490
39038 -369490 -429605 -446845 -404660 -259119 15595 342403 543289 518343 408651 441789
39028 441789 585937 539445 175050 -191454 -184245 109923 270603 140303 -11395 46354
39018 46354 185695 201769 155591 226915 392068 462172 347922 114015 -147833 -345118
39008 -345118 -366676 -199080 -896 74253 55208 26489 -63688 -285500 -505282 -500839 -272948
38997 -272948 -48137 19976 -25262 -109663 -228739 -347810 -361957 -227482 -52490 -13884
$$ packed form
39070B6098j21497q0843L330Q8309J38758P8406j06861k57937j87243N7262K11164
39059a51054J11965j17944k44998j69084M8413K78555L74077K37094n7667k79313
39049C0044k76979j43188n8327m5414L802J10783J63093Q9902l6335j06944r9927
39038c69490o0115j7240M2185J45541K74714L26808K00886k4946j09692L3138
39028D41789J44148m6492l64395l66504P209K94168J60680j30300j51698N7749
39018D6354J39341J6074m6178P1324J65153P0104j14250k33907k61848j97285
39008c45118k1558J67596J98184P5149j9045k8719r0177k21812k19782M443K27891
38997b72948K24811O8113m5238q4401j19076j19071j4147J34475J74992L8606
$$ plain form
38987 -13884 -200151 -497460 -623769 -398043 -18315 111341 -77255 -187922 54609 365932
38977 365932 334603 44393 -118796 -96746 -148811 -315193 -361468 -235970 -130032 -71308
38967 -71308 98538 319517 348945 233117 242152 283030 -40818 -646303 -883869 -509983
38957 -509983 -130327 -277432 -611118 -540605 -163262 6893 -103599 -154673 -50970 9504
38947 9504 13957 138019 340247 397342 285698 159832 57563 -24748 68958 386007 573520
38936 573520 299317 -183139 -344349 -114252 158341 325767 487698 540034 275482 -100014
38926 -100014 -145836 103323 191384 32326 13602 215299 205301 -165415 -412048 -190465
38916 -190465 146465 153698 -43876 -125649 -181455 -460884 -834442 -980064 -888067 -762297
$$ packed form
38987a3884j86267k97309j26309K25726L79728J29656j88596j10667K42531L11323
38977C65932l1329k90210j63189K2050n2065j66382m6275J25498J05938N8724
38967g1308J69846K20979K9428j15828R035M0878l23848o05485k37566L73886
38957e09983L79656j47105l33686P0513L77343J70155j10492n1074J03703O0474
38947I504M453J24062K02228N7095j11644j25866j02269q2311R3706L17049J87513
38936E73520k74203m82456j61210K30097K72593J67426J61931N2336k64552l75496
38926a00014m5822K49159Q8061j59058j8724K01697r998l70716k46633K21583
38916a90465L36930P233j97574q1773n5806k79429l73558j45622R1997J25770
$$ plain form
38906 -762297 -607808 -317357 -15992 69579 -10356 -19753 72084 98570 30741 15875 113154
38895 113154 230168 297223 313818 266171 163671 97095 120326 157832 146219 137221 136459 17611
38883 17611 -234323 -380998 -240603 32081 198021 285121 423039 503495 341673 70702
38873 70702 11622 169317 203555 -44993 -305261 -269461 -7198 163665 88618 -69901
38863 -69901 -41236 254079 595826 658724 347050 -90876 -307069 -163044 207050 528844
38853 528844 554040 245951 -128716 -239850 -94572 -20962 -177538 -323065 -222368 -16048
38843 -16048 50187 31560 124752 284052 318416 240226 195206 152196 -7314 -178373 -154037
38832 -154037 5746 69185 34111 67433 105340 -55648 -281006 -197125 155619 271596
$$ packed form
38906g62297J54489K90451L01365Q5571p9935r397R1837K6486o7829j4866R7279
38895A13154J17014O7055J6595m7647j02500o6576K3231L7506j1613q998p62j18848
38883A7611k51934j46675J40395K72684J65940Q7100J37918Q0456j61822k70971
38873G0702n9080J57695L4238k48548k60268L5800K62263J70863p5047j58519
38863f9901K8665K95315L41747O2898l11674m37926k16193J44025L70094L21794
38853E28844K5196l08089l74667j11134J45278P3610j56576j45527J00697K06320
38843a6048O6235j8627R3192J59300L4364p8190m5020m3010j59510j71059K4336
38832a54037J59783O3439l5074L3322L7907j60988k25358Q3881L52744J15977
$$ plain form
38822 271596 -42992 -329314 -184022 137435 187846 21864 -19032 60790 -9670 -196781
38812 -196781 -166845 135736 337886 162900 -201237 -369619 -175623 262218 694101 879355
38802 879355 735861 434389 240890 235650 293603 322677 351754 369165 276979 94222 37636
38791 37636 261073 608880 764274 606539 313221 114660 43493 -25053 -135320 -153167
38781 -153167 40923 333018 482194 437586 377065 374173 239781 -134155 -458499 -354922
38771 -354922 94877 405502 301141 -12174 -243267 -384952 -535889 -612116 -478477 -227201
38761 -227201 -90584 -134281 -223926 -260572 -277268 -301602 -269250 -119703 99220 262837 289231
38750 289231 225864 201138 252580 250066 92658 -69361 4304 263586 392540 282930 207062
$$ packed form
38822B71596l14588k86322J45292L21457N0411j65982m0896P9822p0460j87111
38812a96781K9936L02581K02150j74986l64137j68382J93996M37841M31883J85254
38802H79355j43494l01472j93499n240N7953K9074K9077J7411r2186j82757n6586
38791C7636K23437L47807J55394j57735k93318j98561p1167o8546j10267j7847
38781a53167J94090K92095J49176m4608o0521k892j34392l73936l24344J03577
38771c54922M49799L10625j04361l13315k31093j41685j50937p6227J33639K51276
38761b27201J36617m3697q9645l6646j6696k4334L2352J49547K18923J63617K6394
38750B89231o3367k4726N1442k514j57408j62019P3665K59282J28954j09610p5868
$$ plain form
38739 207062 358506 496967 316904 -44702 -202158 -95788 -22421 -140768 -290434 -326071
38729 -326071 -321697 -368991 -423225 -430394 -405881 -334855 -185731 -48933 -55688 -137815 -89988 107479
38717 107479 267064 319105 391965 519959 554057 441376 312495 205621 10051 -204041
38707 -204041 -139882 259193 617020 625503 446793 366190 333077 155390 -93731 -209104
38697 -209104 -212337 -240576 -228784 -47880 159645 139227 -49187 -105590 42870 175199 173555
38686 173555 172054 264189 335032 269532 135461 91881 236297 533538 775255 681075 215616
38675 215616 -254900 -312868 41223 428860 534892 344377 33228 -182278 -165518 -9132
38665 -9132 26698 -127918 -230488 -144288 -116511 -333714 -474144 -154617 368236 484870
$$ packed form
38739B07062J51444J38461j80063l61606j57456J06370P3367j18347j49666l5637
38729c26071M374m7294n4234p169K4513P1026J49124J36798o755q2127M7827J97467
38717A07479J59585N2041P2860J27994L4098j12681j28881j06874j95570k14092
38707b04041O4159L99075L57827Q483j78710q0603l3113j77687k49121j15373
38697b09104l233k8239J1792J80904K07525k0418j88414n6403J48460J32329j644
38686A73555j501R2135P0843o5500j34071m3580J44416K97241K41717r4180m65459
38675B15616m70516n7968L54091L87637J06032j90515l11149k15506J6760J56386
38665i132L5830j54616j02570Q6200K7777k17203j40430L19527N22853J16634
$$ plain form
38655 484870 147867 -66469 150899 446878 444597 268382 207430 277725 366815 466379 525266
38644 525266 376756 28456 -252402 -319419 -318893 -327569 -174857 161667 354643 208348 7722
38633 7722 57122 176173 43223 -205667 -165701 180781 423909 306439 -15692 -293175
38623 -293175 -442264 -442570 -254317 64157 332402 423270 366191 256879 151278 48198
38613 48198 -87228 -260368 -377759 -323676 -148381 -56903 -134468 -215950 -127689 75010 229716
38602 229716 297288 338688 376466 414001 492822 610052 682157 696535 765882 908512 931280
38591 931280 703742 411649 328397 427609 442618 262224 48172 -47780 -90102 -215929
38581 -215929 -407212 -499642 -394602 -200770 -112869 -147744 -103540 130692 346333 289281
$$ packed form
38655D84870l37003k14336K17368K95979k281j76215o0952P0295Q9090R9564N8887
38644E25266j48510l48300k80858o7017N26q676J52712L36524J92976j46295k00626
38633G722M9400J19051j32950k48890L9966L46482K43128j17470l22131k77483
38623b93175j49089l06J88253L18474K68245R0868n7079j09312j05601j03080
38613D8198j35426j73140j17391N4083J75295R1478p7565q1482Q8261K02699J54706
38602B29716O7572M1400L7778L7535P8821J17230P2105J4378O9347J42630K2768
38591I31280k27538k92093q3252R9212J5009j80394k14052r5952m2322j25827
38581b15929j91283r2430J05040J93832Q7901l4875M4204K34232K15641n7052
$$ plain form
38571 289281 81613 96231 413956 710297 750587 679533 675243 626135 382632 84980 -30186
38560 -30186 16015 37599 2280 15295 81083 109984 101080 119683 138427 74784 -41733 -81175
38548 -81175 19017 177554 230712 47600 -330071 -657335 -718288 -569642 -384885 -132514
38538 -132514 285173 614834 424594 -198514 -605910 -480384 -299232 -550497 -933634 -844345
38528 -844345 -330208 17066 -50620 -224968 -252578 -231489 -270720 -306479 -324305 -389071 -404073
38517 -404073 -190429 154114 325195 285722 311292 489225 543619 306555 35681 51465
38507 51465 288085 418205 289140 65925 4643 173152 361825 276696 -108817 -451615
38497 -451615 -405464 -20913 359897 510516 439291 213286 -80865 -254319 -156322 108950
$$ packed form
38571B89281k07668J4618L17725K96341M0290p1054m290m9108k43503k97652j15166
38560c0186M6201K1584l5319J3015O5788K8901q904J8603J8744o3643j16517l9442
38548h1175J00192J58537N3158j83112l77671l27264o0953J48646J84757K52371
38538a32514M17687L29661j90240o23108m07396J25526J81152k51265l83137Q9289
38528h44345N14137L47274o7686j74348k7610K1089l9231l5759j7826o4766j5002
38517d04073K13644L44543J71081l9473K5570J77933N4394k37064k70874J5784
38507E1465K36620J30120j29065k23215o1282J68509J88673q5129l85513l42798
38497d51615M6151L84551L80810J50619p1225k26005k94151j73454R7997K65272
$$ plain form
38487 108950 315650 417426 489511 458555 198062 -144953 -254164 -92759 69293 101436
38477 101436 145385 245520 218070 24945 -72416 64830 178691 8356 -287827 -385163
38467 -385163 -288158 -267892 -396169 -447934 -283015 -69446 -20494 -71672 23789 326608 593454
38456 593454 577915 333330 102705 -3641 -40456 5721 215122 468457 491449 289456
38446 289456 214501 395561 449231 80546 -354128 -335980 6981 122936 -60111 -57368
38436 -57368 326587 671980 624349 373785 211567 70815 -172834 -323060 -167811 94281
38426 94281 117613 -48654 -43602 229788 430852 250276 -151048 -308632 -23236 346580
38416 346580 273639 -263238 -696926 -592236 -211802 -81677 -196238 -89912 375214 796346
$$ packed form
38487A08950K06700J01776P2085l0956k60493l43015j09211J61405J62052L2143
38477A01436M3949J00135k7450j93125r7361J37246J13861j70335k96183r7336
38467c85163R7005K0266j28277n1765J64919K13569M8952n1178R5461L02819K66846
38456E93454j5539k44585k30625j06346l6815M6177K09401K53335K2992k01993
38446B89456p4955J81060N3670l68685m34674J8148L42961J15955j83047K743
38436e7368L83955L45393m7631k50564j62218j40752k43649j50226J55249K62092
38426I4281K3332j66267N052K73390K01064j80576m01324j57584K85396L69816
38416C46580p2941n36877m33688J04690L80434J30125j14561J06326M65126M21132
$$ plain form
38406 796346 877064 806675 816273 788480 563251 278399 132141 96030 106267 241350 454248
38395 454248 445425 114177 -159649 -40108 231359 236031 74587 173212 527505 670761
38385 670761 403856 65883 -33771 -26603 -139502 -284507 -248233 -66013 45718 2649
38375 2649 -114118 -251743 -405602 -470943 -275476 164522 540790 532402 176042 -146789
38365 -146789 -135624 100483 224488 106304 -70134 -108316 -23655 75549 152345 191875 142207
38354 142207 28415 -806 124381 256432 238538 146435 152741 235019 217312 61821 -83462
38343 -83462 -130088 -152309 -211710 -252849 -238445 -241350 -315673 -387313 -357204 -224718 -37285
38332 -37285 185630 393803 475494 407268 351087 448943 573726 468249 127762 -154182
$$ packed form
38406G96346Q0718p0389R598k7793k25229k84852j46258l6111J0237J35083K12898
38395D54248q823l31248k73826J19541K71467M672j61444R8625L54293J43256
38385F70761k66905l37973r9654P168j12899j45005L6274J82220J11731m3069
38375B649j16767j37625j53859o5341J95467M39998L76268q388l56360l22831
38365a46789J1165K36107J24005j18184j76438l8182Q4661R9204P6796L9530m9668
38354A42207j13792k9221J25187J32051j7894r2103O306Q2278j7707j55491j45283
38343h3462m6626k2221n9401m1139J4404k905p4323p1640L0109J32486J87433
38332c7285K22915K08173Q1691o8226n6181R7856J24783j05477l40487k81944
$$ plain form
38322 -154182 -169519 -27649 87965 184525 309519 322641 80757 -244433 -318469 -97453
38312 -97453 138108 220288 285592 454814 593639 541309 368572 241200 178993 97501 -34845
38301 -34845 -198905 -365301 -449927 -370780 -213333 -160467 -196392 -107564 136393 271853 140193
38290 140193 -88394 -250761 -431898 -652692 -659328 -336655 -29742 -85850 -326051 -358310
38280 -358310 -190381 -115562 -182180 -216290 -217585 -289258 -310073 -132123 20367 -164858 -506573
38269 -506573 -548402 -294884 -185180 -339659 -387342 -103624 304647 635552 904867 1024010
38259 1024010 781794 295520 -161 28628 64441 -58279 -89733 117798 309808 256727
38249 256727 44597 -228276 -568954 -743272 -370280 388897 802358 542405 131192 54235
$$ packed form
38322a54182j5337J41870J15614R6560J24994J3122k41884l25190p4036K21016
38312i7453K35561Q2180O5304J69222J38825n2330j72737j27372o2207q1492j32346
38301c4845j64060j66396q4626P9147J57447N2866l5925Q8828K43957J35460j31660
38290A40193k28587j62367j81137k20794o636L22673L06913n6108k40201l2259
38280c58310J67929P4819o6618l4110j295p1673k0815J77950J52490j85225l41715
38269e06573m1829K53518J09704j54479m7683K83718M08271L30905K69315J19143
38259A024010k42216m86274k95681K8789L5813j22720l1454K07531J92010n3081
38249B56727k12130k72873l40678j74318L72992P59177M13461k59953m11213p6957
$$ plain form
38239 54235 31732 -327782 -709715 -582796 -107464 130305 35506 -9368 85482 11897 -302553
38228 -302553 -526100 -447717 -233214 -102752 -101121 -202871 -334336 -309624 -44039 209391
38218 209391 139053 -158037 -301856 -182548 -55788 -84822 -121076 -14770 130096 127902
38208 127902 -41177 -254812 -402896 -438301 -331543 -47104 383282 749744 758255 396775
38198 396775 88123 206358 530159 548296 256305 150224 372736 460292 163223 -86716
38188 -86716 90361 367709 284210 7324 -44194 40686 -91828 -340850 -320248 -60741
38178 -60741 88306 132905 383093 784221 905705 615631 231830 -21720 -207679 -316540
38168 -316540 -229389 -78864 -151166 -376133 -397507 -191590 -96572 -154664 7456 469533
$$ packed form
38239E4235k2503l59514l81933J26919M75332K37769r4799m4874R4850p3585l14450
38228c02553k23547P8383K14503J30462J631j01750j31465K4712K65585K53430
38218B09391p0338k97090j43819J19308J26760k9034l6254J06306J44866k194
38208A27902j69079k13635j48084l5405J06758K84439M30386L66462Q511l61480
38198C96775l08652J18235L23801J8137k91991j06081K22512Q7556k97069k49939
38188h6716J77077K77348q3499k76886n1518Q4880j32514k49022K0602K59507
38178f0741J49047M4599K50188M01128J21484k90074l83801k53550j85959j08861
38168c16540Q7151J50525p2302k24967k1374K05917R5018n8092J62120M62077
$$ plain form
38158 469533 732904 418934 -186614 -575785 -641529 -582472 -505350 -409039 -324794 -234885 -52629
38147 -52629 150861 137118 -119504 -293428 -135128 187487 350562 267377 62759 -128856
38137 -128856 -180397 -2254 279698 379624 239214 145200 298931 503080 482404 294569
38127 294569 164656 83958 -127681 -441244 -590070 -442792 -194157 -114012 -224471 -301109
38117 -301109 -159417 110888 235354 86943 -147319 -211350 -117022 -98135 -271605 -512159
38107 -512159 -658387 -673617 -581810 -404006 -197176 -23205 145967 370495 593297 691029
38097 691029 665546 621944 561443 384150 115160 -74751 -130855 -209403 -422133 -636700
38087 -636700 -638391 -399883 -109153 24832 -36663 -139225 -128854 -78563 -200066 -473995
$$ packed form
38158D69533K63371l13970o05548l89171o5744N9057P7122R6311Q4245Q9909J82256
38147e2629K03490j3743k56622j73924J58300L22615J63075q3185k04618j91615
38137a28856n1541J78143K81952R9926j40410r4014J53731K04149k0676j87835
38127B94569j29913q0698k11639l13563j48826J47278K48635Q0145j10459p6638
38117c01109J41692K70305J24466j48411k34262o4031R4328J8887j73470k40554
38107e12159j46228j5230R1807J77804K06830J73971J69172K24528K22802R7732
38097F91029k5483m3602o0501j77293k68990j89911n6104p8548k12730k14567
38087f36700j691K38508K90730J33985o1495j02562J0371N0291j21503k73929
$$ plain form
38077 -473995 -580893 -374208 -188515 -370083 -685042 -615056 -168426 83310 -150494 -461100
38067 -461100 -373538 -26893 75726 -228921 -604373 -664401 -372087 -19347 81327 -98303
38057 -98303 -297355 -316309 -274523 -348779 -388961 -128311 268449 302419 -109214 -419349 -227043
38046 -227043 122479 67895 -333868 -543275 -357075 -133053 -189118 -374548 -369529 -135228
38036 -135228 108097 191243 126459 13258 -57690 -44671 1992 -49019 -268888 -527257 -577322
38025 -577322 -335586 -8101 154064 175114 289024 562646 774505 744707 597547 545204
38015 545204 560333 462343 234374 42691 -15845 6277 55023 125708 178304 158350 90187
38004 90187 19823 -88753 -263430 -407420 -439166 -455832 -551906 -575094 -332809 18114 100309
$$ packed form
38077d73995j06898K06685J85693j81568l14959O9986M46630K51736k33804l10606
38067d61100Q7562L46645J02619l04647l75452o0028K92314L52740J00674j79630
38057i8303j99052j8954M1786p4256m0182K60650L96760L3970m11633l10135J92306
38046b27043L49522n4584m01763k09407J86200K24022n6065j85430N019K34301
38036a35228K43325Q3146o4784j13201p0948J3019M6663n1011k19869k58369n0065
38025e77322K41736L27485J62165K1050J13910K73622K11859k9798j47160n2343
38015E45204J5129r7990k27969j91683n8536K2122M8746P0685N2596j9954o8163
38004I0187p0364j08576j74677j43990l1746j6666r6074k3188K42285L50923Q2195
$$ plain form
37993 100309 -155405 -411448 -405231 -242927 -132024 -103701 -128173 -246528 -409085 -383735
37983 -383735 -30925 447423 709885 660884 500555 432937 441745 370168 167174 -2425
37973 -2425 50752 259870 346775 193826 -3504 -62369 -80103 -186913 -252264 -126172 10829
37962 10829 -93290 -272195 -131582 303284 565884 424565 164933 90312 139175 169154
37952 169154 255833 468603 626587 532158 267357 63240 24406 120548 282134 378192
37942 378192 274104 34034 -102123 -43072 42019 33464 60290 243819 444557 449233 273336
37931 273336 114915 100080 189397 258435 205692 61141 -7893 81085 139607 -58770 -392642
37920 -392642 -500307 -284838 -30651 29188 -28768 -59854 -44967 54643 320517 619216
$$ packed form
37993A00309k55714k56043O217J62304J10903K8323k4472j18355j62557K5350
37983c83735L52810M78348K62462m9001j60329o7618Q808p1577k02994j69599
37973b425N3177K09118Q6905j52949j97330n8865j7734j06810o5351J26092J37001
37962A0829j04119j78905J40613M34866K62600j41319k59632p4621M8863K9979
37952A69154Q6679K12770J57984r4429k64801k04117l8834R6142J61586R6058
37942C78192j04088k40070j36157N9051Q5091q555K6826J83529K00738M676j75897
37931B73336j58421j4835Q9317O9038n2743j44551o9034Q8978N8522j98377l33872
37920c92642j07665K15469K54187N9839n7956l1086J4887R9610K65874K98699
$$ plain form
37910 619216 633346 323625 67311 138413 327993 306099 100318 -50064 -102132 -181837
37900 -181837 -283761 -261402 -57076 229667 440850 437786 207317 -35840 -31465 159702
37890 159702 192047 -57911 -280929 -193559 54283 154519 104730 138169 341642 589002
37880 589002 757613 806470 714074 508288 310502 243384 336123 532594 685653 588637
37870 588637 221604 -76503 26507 339370 365584 53866 -127654 34633 177404 34636
37860 34636 -103428 41537 203758 62964 -162520 -138358 -66654 -313076 -646203 -511166
37850 -511166 57480 442891 363252 186471 245776 385271 361483 244609 184648 108810
37840 108810 -107702 -380498 -515522 -445420 -264500 -125830 -133103 -234726 -245764 -76307
$$ packed form
37910F19216J4130l09721k56314P1102J89580k1894k05781j50382n2068p9705
37900a81837j01924K2359K04326K86743K11183l064k30469k43157M375J91167
37890A59702L2345k49958k23018Q7370K47842J00236m9789L3439K03473K47360
37880E89002J68611M8857r2396k05786j97786o7118R2739J96471J53059r7016
37870E88637l67033k98107J03010L12863K6214l11718j81520J62287J42771j42768
37860C4636j38064J44965J62221j40794k25484K4162P1704k46422l33127J35037
37850e11166N68646L85411p9639j76781N9305J39495k3788j16874n9961p5838
37840A08810k16512k72796j35024P0102J80920J38670p273j01623j1038J69457
$$ plain form
37830 -76307 139775 264075 362610 518930 608386 511911 404560 528905 792892 904905
37820 904905 809418 668413 524805 353834 341065 665706 1050195 1002795 538986 185707
37810 185707 194783 254155 129934 76746 336443 677857 780340 714711 680254 575183 229765
37799 229765 -172566 -323233 -272515 -287255 -356228 -254478 -27152 28732 -114567 -124583
37789 -124583 159324 457901 470764 274842 129935 125222 203609 332238 447239 399355
37779 399355 170829 13547 149515 437394 562698 471268 361908 308752 185513 -20939
37769 -20939 -117263 -13776 121370 136925 112706 171353 275957 353226 424564 468172 356713
37758 356713 106122 -32627 49930 76098 -203803 -553771 -572085 -329485 -266062 -489084
$$ packed form
37830g6307K16082J24300R8535J56320Q9456r6475j07351J24345K63987J12013
37820I04905r5487j41005j43608j70971j2769L24641L84489m7400m63809l53279
37810A85707R076N9372j24221n3188K59697L41414J02483o5629l4457j05071l45418
37799B29765m02331j50667N0718j4740o8973J01750K27326N5884j43299j0016
37789a24583K83907K98577J2863j95922j44907m713P8387J28629J15001m7884
37779C99355k28526j57282J35968K87879J25304r1430j09360n3156j23239k06452
37769b0939r6324J03487J35146J5555k4219N8647J04604P7269P1338M3608j11459
37758C56713k50591j38749Q2557K6168k79901l49968j8314K42600O3423k23022
$$ plain form
37748 -489084 -607812 -343130 82231 311308 306121 258478 272938 303638 258130 67784 -206501
37737 -206501 -311304 -41370 421475 641588 471944 239462 299835 613366 858734 791005
37727 791005 415732 -23192 -191150 21023 325307 388451 310123 451291 812632 973829
37717 973829 718466 320815 77977 -58668 -210830 -304831 -290489 -290249 -313773 -162882 151132
37706 151132 258700 -16103 -302329 -210115 104915 264805 262434 323446 412975 319062 77936
37695 77936 -91486 -173278 -305921 -437226 -379027 -149405 45216 113084 102957 25510 -87974
37684 -87974 -70097 155119 348406 249998 -22739 -168440 -154942 -151789 -148527 -19822 125314
37673 125314 66383 -97569 -45990 223533 342637 115690 -235456 -446034 -502172 -467350
$$ packed form
37748d89084j18728K64682M25361K29077n187m7643J4460L0700m5508j90346k74285
37737b06501j04803K69934M62845K20113j69644k32482O0373L13531K45368o7729
37727G91005l75273m38924j67958K12173L04284O3144p8328J41168L61341J61197
37717I73829k55363l97651k42838j36645j52162r4001J4342K40k3524J50891L14014
37706A51132J07568k74803k86226R2214L15030J59890k371O1012Q9529r3913k41126
37695G7936j69422q1792j32643j31305N8199K29622J94621O7868j0127p7447j13484
37684h7974J7877K25216J93287r8408k72737j45701J3498L153L262J28705J45136
37673A25314n8931j63952N1579K69523J19104k26947l51146k10578n6138L4822
$$ plain form
37663 -467350 -322291 -107969 24136 36787 78834 225629 337558 284533 145978 77703
37653 77703 102442 119014 31333 -173466 -391295 -443130 -257531 -7641 49506 -129828 -348613
37642 -348613 -431800 -404236 -396393 -456229 -470307 -257338 203249 635872 706538 445324 241366
37631 241366 314034 418271 265016 4313 -11327 199506 264760 28799 -219298 -162389
37621 -162389 140021 377697 369187 201305 58638 5177 -44705 -152977 -225003 -141663 20977
37610 20977 61918 -56327 -166801 -157937 -74378 52264 223321 293776 80073 -267824 -334488
37599 -334488 -19627 283126 261802 90913 41855 54928 -3383 8079 236993 482305
37589 482305 462795 229326 -3813 -209810 -416744 -467678 -253391 35123 202484 348880
$$ packed form
37663d67350J45059K14322J32105J2651M2047J46795J11929n3025j38555o8275
37653G7703K4739J6572q7681k04799k17829n1835J85599K49890N7147j79334k18785
37642c48613q3187K7564P843n9836j4078K12969M60587M32623P0666k61214k03958
37631B41366P2668J04237j53255k60703j5640K10833O5254k35961k48097N6909
37621a62389L02410K37676q510j67882j42667n3461m9882j08272p2026Q3340J62640
37610B0977M0941j18245j10474Q864Q3559J26642J71057P0455k13703l47897o6664
37599c34488L14861L02753k1324j70889m9058J3073n8311J1462K28914K45312
37589D82305j9510k33469k33139k05997k06934n0934K14287K88514J67361J46396
$$ plain form
37579 348880 564615 642112 471397 378269 597694 741443 359622 -236456 -357095 28196
37569 28196 301379 169704 -32016 -26195 54281 95601 218861 420738 483036 384976 379115
37558 379115 537736 627291 535477 428408 392047 311398 194084 213794 333221 284671 42149
37547 42149 -81896 52724 186925 103611 -59977 -117449 -125556 -173988 -155149 51768 356549
37536 356549 568827 595331 460087 268003 151706 104238 -66373 -421922 -667134 -522239
37526 -522239 -183188 -47254 -98025 1599 274883 387973 263157 236414 491984 784252
37516 784252 866246 796363 669645 423947 90182 -98482 -31811 112978 171134 202095
37506 202095 294390 404980 476247 481948 326383 -39516 -393368 -434568 -223135 -116198
$$ packed form
37579C48880K15735P7497j70715r3128K19425J43749l81821n96078j20639L85291
37569B8196K73183j31675k01720N821Q0476M1320J23260K01877O2298r8060n861
37558C79115J58621Q9555r1814j07069l6361q0649j17314J9710J19427m8550k42522
37547D2149j24045J34620J34201q3314j63588n7472q107m8432J8839K06917L04781
37536C56549K12278K6504j35244j92084j16297m7468j70611l55549k45212J44895
37526e22239L39051J35934n0771R9624K73284J13090j24816k6743K55570K92268
37516G84252Q1994o9883j26718k45698l33765j88664O6671J44789N8156L0961
37506B02095R2295J10590P1267N701j55565l65899l53852m1200K11433J06937
$$ plain form
37496 -116198 -244969 -371476 -289302 -51864 213192 408649 405916 204615 99044 318326
37486 318326 582982 454926 47472 -124232 49396 192272 168483 242561 424177 335582
37476 335582 -55226 -226431 66756 359377 250847 60461 256884 685102 855954 686303
37466 686303 494924 487250 626493 836183 1020485 1042329 907805 793038 739717 582246
37456 582246 312403 180209 256633 268780 92319 17349 246945 515769 535678 454662
37446 454662 492993 460749 91037 -390816 -507220 -207507 117164 226688 252924 336628
37436 336628 381886 248261 -23446 -252503 -288608 -131002 67967 142506 70342 -59855
37426 -59855 -189468 -281915 -250771 -82269 43200 -22424 -130939 -67686 65243 40560 -30693
$$ packed form
37496a16198j28771j26507Q2174K37438K65056J95457k733k01301j05571K19282
37486C18326K64656j28056m07454j71704J73628J42876k3789P4078J81616q8595
37476C35582l90808j71205K93187K92621j08530j90386J96423M28218J70852j69651
37466F86303j91379p674J39243K09690J84302K1844j34524j14767n3321j57471
37456E82246k69843j32194P6424J2147j76461p4970K29596K68824J9909q1016
37446D54662L8331l2244l69712m81853j16404K99713L24671J09524K6236Q3704
37436C36628M5258j33625k71707k29057l6105J57606J98969P4539p2164j30197
37426e9855j29613r2447L1144J68502J25469o5624j08515O3253J32929k4683p1253
$$ plain form
37415 -30693 131744 408354 396843 109928 -4022 172204 225668 -37542 -232233 -63726
37405 -63726 182345 164929 27398 44007 153171 220633 367104 633567 693369 334444
37395 334444 -84398 -98192 203223 398586 379657 340531 320167 204457 75201 147332
37385 147332 391348 538794 451736 253192 121445 127898 220267 242679 67626 -208188
37375 -208188 -342475 -279075 -201575 -202882 -159056 -13182 97088 95919 68942 25772 -114975
37364 -114975 -236000 -115101 89056 -81049 -617908 -865003 -411044 272478 468232 125610
37354 125610 -258615 -367016 -259687 -74990 78979 80763 -55032 -116000 13497 184094
37344 184094 273846 382265 541467 547963 334675 210047 435601 818233 999679 922005
$$ packed form
37415c0693J62437K76610j1511k86915j13950J76226N3464k63210j94691J68507
37405f3726K46071j7416j37531J6609J09164O7462J46471K66463N9802l58925
37395C34444m18842j3794L01415J95363j8929l9126k0364j15710j29256P2131
37385A47332K44016J47446q7058j98544j31747O453R2369K2412j75053k75814
37375b08188j34287O3400P7500j307M3826J45874J10270j169k6977m3170j40747
37364a14975j21025J20899K04157j70105n36859k47095M53959O83522J95754l42622
37354A25610l84225j08401J07329J84697J53969J784j35795o0968J29497J70597
37344A84094Q9752J08419J59202O496k13288j24628K25554L82632J81446p7674
$$ plain form
37334 922005 756219 601097 492106 486348 526057 439306 241949 179018 324430 451801
37324 451801 448547 498669 681657 773822 648039 487060 407634 284142 130851 189261 420677
37313 420677 432736 171322 116376 457888 683043 418952 87447 178316 422081 325818
37303 325818 69667 159238 511154 587316 239022 -198351 -483205 -583186 -384863 164433
37293 164433 749667 1003630 997707 1002301 971234 728676 451717 452404 636870 669630 533267
37282 533267 458546 451083 367836 328931 560202 910014 981960 698642 343908 124317 53349
37271 53349 159365 430195 644804 606304 443084 381793 384671 322776 301342 452156 597494
37260 597494 499049 268207 164817 167938 108127 33424 67695 94987 -30125 -140873 -18391
$$ packed form
37334I22005j65786j55122j08991n758L9709q6751j97357o2931J45412J27371
37324D51801l254N0122J82988R2165j25783j60979p9426j23492j53291N8410K31416
37313D20677J2059k61414n4946L41512K25155k64091l31505R0869K43765r6263
37303C25818k56151Q9571L51916P6162l48294m37373k84854r9981J98323N49296
37293A64433N85234K53963n923M594l1067k42558k76959O87J84466L2760j36363
37282E33267p4721p463q3247l8905K31271L49812P1946k83318l54734k19591p0968
37271E3349J06016K70830K14609l8500j63220o1291K878o1895k1434J50814J45338
37260E97494r8445k30842j03390L121n9811p4703L4271K7292j25112j10748J22482
$$ plain form
37249 -18391 175926 123365 -132699 -254863 -82527 268926 628669 817947 677617 321911
37239 321911 136506 261118 353646 145101 -109969 -73018 136048 217315 179402 148344
37229 148344 14687 -301188 -530438 -426930 -181770 -83439 -68347 23603 100127 102996 240597
37218 240597 521684 505730 -894 -455017 -321503 131115 344630 325949 364802 352957
37208 352957 93757 -109061 76476 297457 50227 -380612 -328386 156355 439385 356559
37198 356559 309951 423991 413297 253599 236526 359229 337182 207675 276744 497478
37188 497478 529397 377780 361029 493500 511730 455976 605162 877162 907707 698171
37178 698171 594312 653799 619474 495529 573608 883261 1136076 1201567 1175511 1056760
$$ packed form
37249a8391J94317n2561k56064j22164J72336L51453L59743J89278j40330l55706
37239C21911j85405J24612R2528k08545k55070L6951K09066Q1267l7913l1058
37229A48344j33657l15875k29250J03508K45160R8331J5092R1950P6524K869J37601
37218B40597K81087j5954n06624m54123J33514M52618K13515j8681L8853j1845
37208C52957k59200k02818J85537K20981k47230m30839N2226M84741K83030q2826
37198C56559m6608J14040j0694j59698j7073J22703k2047j29507O9069K20734
37188D97478L1919j51617j6751J32471J8230n5754J49186K72000L0545k09536
37178F98171j03859N9487l4325j23945P8079L09653K52815O5491k6056j18751
$$ plain form
37168 1056760 815252 645920 688388 690684 449824 317389 665523 1118422 1020725 476232
37158 476232 175061 310832 436479 361115 432106 838802 1276068 1423372 1269121 920813
37148 920813 527611 353788 514210 726874 699837 566840 553333 519321 304071 167634
37138 167634 336510 479761 256551 13830 252082 739060 880517 664799 510175 479645
37128 479645 388956 379236 614378 726898 355596 -89755 -14435 351589 378486 113276
37118 113276 26759 43679 -194636 -419296 -116273 443521 591709 432834 572931 925803
37108 925803 908997 633880 736525 1142137 1159833 744473 523474 608525 517985 262120
37098 262120 360862 762312 868222 667366 731335 1059502 1069011 786407 887215 1433149
$$ packed form
37168A056760k41508j69332M2468K296k40860j32435L48134M52899r7697n44493
37158D76232l01171J35771J25647p5364P0991M06696M37266J47304j54251l48308
37148I20813l93202j73823J60422K12664k7037j32997j3507l4012k15250j36437
37138A67634J68876J43251k23210k42721K38252M86978J41457k15718j54624l0530
37128D79645r0689r720K35142J12520l71302m45351P5320L66024K6897k65210
37118A13276q6517J6920k38315k24660L03023N59794J48188j58875J40097L52872
37108I25803j6806k75117J02645M05612J7696m15360k20999Q5051r0540k55865
37098B62120R8742M01450J05910k00856O3969L28167R509k82604J00808N45934
$$ plain form
37088 1433149 1699563 1419619 1139845 1189847 1299291 1332855 1432339 1414420 1014909 652402
37078 652402 890196 1296926 1035912 410457 458970 1113137 1259486 681692 385526 786620
37068 786620 1119678 985046 982836 1362572 1461312 1011487 707097 932002 1127304 936561
37058 936561 855501 1269117 1874164 2403702 2898210 3063171 2507787 1770806 1841033 2517217
37048 2517217 2638865 2109906 2116451 2998432 3557980 3056775 2354642 2369424 2801005 3076442
37038 3076442 3251062 3300508 2777103 1824246 1345432 1593074 1762117 1446903 1234315 1407742
37028 1407742 1423714 1163602 1301618 1900315 2067224 1567531 1326400 1732076 1919126 1400082
37018 1400082 945208 1126707 1397652 1321782 1337232 1624176 1592474 1131356 976679 1264192
$$ packed form
37088A433149K66414k79944k79774N0002J09444L3564R9484j7919l99511l62507
37078F52402K37794M06730k61014o25455M8513O54167J46349n77794k96166M01094
37068G86620L33058j34632k210L79736R8740m49825l04390K24905J95302j90743
37058I36561q1060M13616O05047N29538M94508J64961n55384p36981P0227O76184
37048B517217J21648n28959O545Q81981N59548n01205p02133J4782M31581K75437
37038C076442J74620M9446n23405r52857m78814K47642J69043l15214k12588J73427
37028A407742J5972k60112J38016N98697J66909m99693k41131M05676J87050n19044
37018A400082m54874J81499K70945p5870J5450K86944l1702m61118j54677K87513
$$ plain form
37008 1264192 1187899 639778 599023 1293915 1639308 1167401 820676 1114127 1255318 871546
36998 871546 834230 1495877 1857500 1400553 1030582 1300915 1432661 1000036 820309 1250166
36988 1250166 1390841 907288 799513 1438397 1737359 1230501 1001584 1543220 1729688
36979 1729688 1003033 527510 1027701 1517044 1310155 1226710 1674075 1678736 956303 733302
36969 733302 1390813 1607983 956310 856450 1785340 2184869 1428324 1094520 1905333 2295143
36959 2295143 1523126 1185250 2012891 2315911 1359454 1016300 2171034 2875979 2104050
36950 2104050 1785191 2930787 3461335 2287203 1682725 2983093 3907884 2977292 2447462
36941 2447462 3833148 4834203 3956232 3648395 5363711 6311433 4898482 4271952 6326979
$$ packed form
37008A264192p6293n48121m0755O94892L45393m71907l46725K93451J41191l83772
36998H71546l7316O61647L61623m56947l69971K70333J31746m32625j79727M29857
36988A250166J40675m83553j07775O38884K98962n06858k28917N41636J86468
36979A729688p26655m75523N00191M89343k06889q3445M47365M661p22433k23001
36969G33302O57511K17170o51673r9860R28890L99529p56545l33804Q10813L89810
36959B295143p72017l37876Q27641L03020r56457l43154J154734P04945p71929
36950B104050l18859J145596N30548j174132o04478J300368R24791r30592n29830
36941B447462J385686J001055q77971l07837J715316R47722j412951o26530K055027
$$ plain form
36932 6326979 7701642 6286627 5757507 8522618 10633866 9528812 9804060 14594063
36924 14594063 18860348 18997475 20641758 27809570 33952588 35190718 41413725 59325363
36916 59325363 77021015 87022448 112872309 180238493 262413693 291227960 236284862
36909 236284862 144607667 82767820 64080427 56394918 40378431 27130473 26162654
36902 26162654 28283796 24574563 19377874 17533356 15209457 9858906 6341209 7339359
36894 7339359 8137484 5708529 3811165 4899923 5427782 3192191 1647107 3003978
36886 3003978 4018682 2399738 1029852 2159232 3239168 2106649 999692 1947432
36878 1947432 2976663 2198374 1282396 1788792 2120327 1025986 313092 1314058 2235108
$$ packed form
36932F326979J374663j415015n29120K765111K111248j105054K75248M790003
36924A4594063M266285J37127J644283P167812O143018J238130O223007J7911638
36916E9325363J7695652J0001433K5849861O7366184Q2175200K8814267n4943098
36909B36284862r1677195o1839847j8687393p685509j6016487j3247958r67819
36902B6162654K121142l709233n196689j844518k323899n350551l517697R98150
36894G339359P98125k428955j897364J088758N27859k235591j545084J356871
36886C003978J014704j618944j369886J129380J079936j132519j106957R47740
36878A947432J029231p78289r15978N06396L31535j094341p12894J000966R21050
$$ plain form
36869 2235108 1614395 1001381 1722202 2278602 1404598 583383 1124609 1670793 936155
36860 936155 168747 644714 1304352 1025952 799407 1584152 2322541 2045113 1781902 2559035
36850 2559035 3545350 3812286 3896641 4165240 3759705 2578071 2127460 3001587 3694343
36841 3694343 3286717 3048127 3934774 4802426 4689031 4664486 5741684 7016345 7570349
36832 7570349 8291477 10136415 12384388 14182000 16037656 18214531 19366550 18387131
36824 18387131 16121310 13857017 11627229 9249187 7405171 6380353 5287127 3750131
36816 3750131 2775593 2839543 2837118 2086074 1583934 2046511 2503643 2139913 1738398 1952874
36806 1952874 1930215 1056930 333897 569520 893021 504655 216937 772139 1290962 937887
$$ packed form
36869B235108o20713o13014P20821N56400q74004q21215N41226N46184p34638
36860I36155p67408M75967O59638k78400k26545P84745P38389k77428k63211P77133
36850B559035R86315K66936Q4355K68599m05535j181634m50611Q74127O92756
36841C694343m07626k38590Q86647Q67652j13395k4545J077198J274661N54004
36832G570349P21128J844938K247973J797612J855656K176875J152019r79419
36824A8387131k265821k264293k229788k378042j844016j024818j093226j536996
36816C750131r74538O3950k425p51044n02140M62577M57132l63730m01515K14476
36806A952874k2659q73285p23033K35623L23501l88366k87718N55202N18823l53075
$$ plain form
36796 937887 544653 1029017 1707665 1681509 1413498 1491476 1359294 720596 618816 1622105
36786 1622105 2498597 2185401 1488641 1372271 1276850 687410 561698 1490743 2235121 1874322
36776 1874322 1577561 2385389 3212762 3121247 3455302 5304927 7066175 7520515 9220414
36767 9220414 14917665 21840829 23768526 18816726 11555759 6952952 5444613 4801130
36759 4801130 3881252 2995915 2468723 2315535 2440730 2470824 2102763 1703668 1763638 2011852
36749 2011852 1996844 2038547 2549269 3107467 3379955 4036779 5411142 6530458 7277625
36740 7277625 9953406 15923541 21758113 22113938 16446972 9732022 6131028 4990792
36732 4990792 3892867 2553923 1995582 2136601 2182964 2071524 2033541 1759534 1114239
$$ packed form
36796I37887l93234M84364O78648k6156k68011P7978j32182o38698j01780J003289
36786A622105Q76492l13196o96760j16370r5421n89440j25712R29045P44378l60799
36776A874322k96761Q07828Q27373r1515L34055J849625J761248M54340J699899
36767I220414N697251O923164J927697m951800p260967m602807j508339o43483
36759D801130r19878q85337n27192j53188J25195L0094l68061l99095N9970K48214
36749B011852j5008M1703N10722N58198K72488O56824J374363J119316P47167
36740G277625K675781N970135N834572L55825n666966o714950l600994j140236
36732D990792j097925j338944n58341J41019M6363j11440l7983k74007o45295
$$ plain form
36723 1114239 707262 862481 986912 683192 448996 603750 616711 192432 -62998 234188
36713 234188 505290 292047 64017 258000 507785 509230 654418 1105385 1234914 744124
36703 744124 376723 714053 1156897 957340 452198 393310 753291 1053149 1262770 1553099
36693 1553099 1690269 1452948 1187852 1254186 1362546 1110935 737565 719337 1031542 1378895
36683 1378895 1750668 2191958 2420351 2209625 1804257 1495430 1172961 724736 437092
36674 437092 527897 702814 643383 526185 601054 679474 529231 374293 491958 665931
36664 665931 543415 236773 109202 234044 468684 774941 1092852 1212845 1138978 1240550
36654 1240550 1676257 2035603 1945095 1643990 1516052 1433304 1082692 628718 490968 666042
$$ packed form
36723A114239m06977J55219J24431l03720k34196J54754J2961m24279k55430K97186
36713B34188K71102k13243k28030J93983K49785J445J45188M50967J29529m90790
36703G44124l67401L37330M42844j99557n05142n8888L59981K99858K09621K90329
36693A553099J37170k37321k65096O6334J08360k51611l73370j8228L12205L47353
36683A378895L71773M41290K28393k10726m05368l08827l22469m48225k87644
36674D37092R0805J74917n9431j17198P4869P8420j50243j54938J17665J73973
36664F65931j22516l06642j27571J24842K34640L06257L17911J19993p3867J01572
36654A240550M35707L59346r0508l01105j27938q2748l50612m53974j37750J75074
$$ plain form
36644 666042 788482 729258 676012 724900 801634 908914 1104229 1301536 1374075 1366786 1394150
36633 1394150 1466462 1587062 1803707 1992995 1897619 1612986 1701142 2504764 3641880 4500933
36623 4500933 4929983 5086188 4946262 4445779 3878591 3670173 3863451 4199048 4530194
36614 4530194 4760880 4572313 3712274 2489687 1537209 1101067 931530 801040 710753
36605 710753 614778 384848 114436 82844 323615 535199 495038 285807 61727 -119512
36595 -119512 -168137 38606 420409 708200 806359 916784 1192801 1486881 1574136 1440169
36585 1440169 1212788 976061 793845 764833 892641 1019103 1040766 1073115 1221496 1317851
36575 1317851 1162535 982509 1293897 2197441 3175431 3886310 4839443 6705394 8983864
$$ packed form
36644F66042J22440n9224n3246M8888P6734J07280J95315J97307P2539p289K7364
36633A394150P2312J20600K16645J89288r5376k84633Q8156Q03622J137116Q59053
36623D500933M29050J56205j39926n00483n67188k08418J93278L35597L31146
36614D530194K30686j88567q60039j222587r52478m36142j69537j30490r0287
36605G10753r5975k29930k70412l1592K40771K11584m0161k09231k24080j81239
36595a19512m8625K06743L81803K87791R8159J10425K76017K94080Q7255j33967
36585A440169k27381k36727j82216k9012J27808J26462K1663L2349J48381R6355
36575A317851j55316j80026L11388R03544R77990P10879R53133J865951K278470
$$ plain form
36566 8983864 10028129 8770844 6013548 3552945 2319459 1887648 1570742 1253890 1070160
36557 1070160 952083 843618 887175 1055409 981647 513366 90563 170162 553897 718555
36547 718555 582912 472454 483413 399116 190545 101460 191655 239257 179879 224134 409715
36536 409715 433037 122036 -250945 -344962 -178556 10317 85845 5896 -255928 -553175
36526 -553175 -558505 -173837 228528 240469 -48048 -217238 -101874 86311 163627 202654
36516 202654 318077 456044 492922 429311 414884 596427 921473 1114833 982939 752502
36506 752502 885368 1464399 2017891 2126145 1948507 1916853 2159407 2528872 2976812 3553871
36496 3553871 4233690 5094074 6427641 8177663 9444908 9186901 7453728 5413848 4082334
$$ packed form
36566H983864J044265j257285k757296k460603j233486m31811l16906l16852j83730
36557A070160j18077j08465M3557J68234p3762m68281m22803P9599L83735J64658
36547G18555j35643j10458J0959q4297k08571q9085R0195M7602n9378M4255J85581
36536D09715K3322l11001l72981r4017J66406J88873P5528p9949k61824k97247
36526e53175n330L84668M02365J1941k88517j69190J15364J88185P7316L9027
36516B02654J15423J37967L6878o3611j4427J81543L25046J93360j31894k30437
36506G52502J32866N79031N53492J08254j77638l1654K42554L69465M47940N77059
36496C553871O79819Q60384J333567J750022J267245k58007j733173k039880j331514
$$ plain form
36487 4082334 3487856 3130004 2703555 2196781 1743125 1583935 1823548 2118950 1992414
36478 1992414 1492388 1099955 978028 866577 740190 886657 1208720 1187205 773348 575156
36468 575156 848712 1056544 809188 492575 511532 648083 656118 747807 972720 890429
36458 890429 427369 264828 782711 1446432 1810266 2154769 2544314 2487246 2263959 3051596
36448 3051596 4737508 5614814 5912653 9205044 17188542 24780080 24658931 16549409 7906290
36439 7906290 4630890 5058821 4689864 2897844 1958342 2267688 2222881 1538228 1400225
36430 1400225 1823770 1589467 674879 415605 1160501 1748633 1507140 1060111 924374
36421 924374 811872 585115 578629 719935 495649 -22147 -187393 78005 202598 81549
$$ packed form
36487D082334n94478l57852m26449n06774m53656j59190K39613K95402j26536
36478A992414n00026l92433j21927j11451j26387J46467L22063k1515m13857j98192
36468E75156K73556K07832k47356l16613J8957J36551Q035R1689K24913q2291
36458H90429m63060j62541N17883O63721L63834L44503L89545n7068k23287P87637
36448C051596J685912Q77306K97839L292391P983498P591538j21149q109522q643119
36439G906290l275400M27931l68957j792020r39502L09346m4807o84653j38003
36430A400225M23545k34303r14588k59274P44896N88132k41493m47029j35737
36421I24374j12502k26757o486J41306k24286n17796j65246K65398J24593j21049
$$ plain form
36411 81549 201015 579163 669393 428299 407223 646905 556564 66524 -173833 34212
36401 34212 143789 -3312 152658 720088 944549 466748 -5330 130383 422855 250675
36391 250675 -134793 -169387 50559 78444 -68418 -66503 88994 179616 209526 304704 419930
36380 419930 496622 635874 831952 855532 650674 478135 431732 251243 -114751 -251760
36370 -251760 57758 384475 284780 -39644 -162297 -109716 -113889 -46024 313496 682639
36360 682639 578478 112758 -96850 188594 593814 898467 1499222 2744969 4125055
36351 4125055 4595874 3745190 2308604 1357514 1178008 1225041 1066374 914425 1060818
36342 1060818 1230995 946149 307697 -78711 79045 465614 711100 805526 848262 777691
$$ packed form
36411H1549J19466L78148R0230k41094k1076K39682r0341m90040k40357K08045
36401C4212J09577j47101J55970N67430K24461m77801m72078J35713K92472j72180
36391B50675l85468l4594K19946K7885j46862J915J55497R0622K9910R5178J15226
36380D19930P6692J39252J96078K3580k04858j72539m6403j80489l65994j37009
36370b51760L09518L26717r9695l24424j22653N2581m173O7865L59520L69143
36360F82639j04161m65720k09608K85444M05220L04653O00755J245747J380086
36351D125055M70819q50684j436586r51090j79506M7033j58667j51949J46393
36342A060818J70177k84846o38452l86408J57756L86569K45486R4426M2736p0571
$$ plain form
36332 777691 556251 347345 301331 344139 320543 192494 -3632 -240547 -453696 -549865
36322 -549865 -528195 -476568 -425327 -334141 -227572 -196986 -250931 -284825 -206257 -10246 225078
36311 225078 348809 248980 44909 27114 295642 622625 784723 822386 846413 849984 862440
36300 862440 980505 1085874 938585 776337 1285765 2546970 3523779 3225618 2005346
36291 2005346 1038657 812611 855819 760956 675644 778890 952258 1068122 1134209 1183532
36281 1183532 1421529 2238967 3521661 4252593 3566817 2018585 975494 864778 901939
36272 901939 510986 19903 -202210 -335648 -527861 -549302 -379141 -405148 -700877 -782228
36262 -782228 -409384 21254 191134 301050 481229 442197 92093 -140281 -3505 150711
$$ packed form
36332G77691k21440k08906m6014M2808k3596j28049j96126k36915k13149r6169
36322e49865K1670N1627N1241R1186J06569L0586n3945l3894P8568J96011K35324
36311B25078J23731r9829k04071j7795K68528L26983J62098L7663K4027L571J2456
36300H62440J18065J05369j47289j62248N09428J261205R76809k98161j220272
36291B005346r66689k26046M3208r4863q5312J03246J73368J15864O6087M9323
36281A183532K37997Q17438J282694P30932o85776j548232j043091j10716L7161
36272I01939l90953m91083k22113j33438j92213k1441J70161k6007k95729q1351
36262g82228L72844M30638J69880J09916J80179l9032l50104k32374J36776J54216
$$ plain form
36252 150711 31918 -88231 51133 196135 76402 -119025 -172391 -226276 -352282 -272443
36242 -272443 74876 237545 -31376 -281978 -68717 351535 506608 429689 410733 462439
36232 462439 492112 573308 618304 265446 -442730 -786925 -320950 384189 528278 170108
36222 170108 -87235 -83944 -92436 -130707 17253 271348 346311 246852 182454 146228 18456
36211 18456 -102895 -90218 -80708 -186353 -179523 119629 438988 474515 402145 503901 605609
36200 605609 404702 64336 -66313 -68846 -236019 -456377 -386128 -79734 80972 -24083
36190 -24083 -185974 -256072 -207268 9646 297569 344111 91644 -40545 192787 389851
36180 389851 179026 -73864 120581 453528 281922 -264359 -466265 -162219 102822 34990
$$ packed form
36252A50711j18793j20149J39364J45002j19733j95427n3366n3885j26006P9839
36242b72443L47319J62669k68921k50602K13261M20252J55073p6919j8956N1706
36232D62439K9673Q1196M4996l52858p08176l44195M65975P05139J44089l58170
36222A70108k57343L291q492l8271J47960K54095P4963r9459o4398l6226j27772
36211A8456j21351J2677R510j05645O830K99152L19359L5527p2370J01756J01708
36200F05609k00907l40366j30649k533j67173k20358P0249L06394J60706j05055
36190b4083j61891p0098M8804K16914K87923M6542k52467j32189K33332J97064
36180C89851k10825k52890J94445L32947j71606n46281k01906L04046K65041o7832
$$ plain form
36170 34990 -76717 -31679 -10422 -92340 -103288 -53600 -166291 -371092 -299810 108069 465800
36159 465800 484647 245527 -71966 -296912 -155153 452441 1085746 1180085 802807 505150
36149 505150 488536 476037 357458 334237 402756 319223 138690 173256 345426 227657 -170702
36138 -170702 -334802 -129624 -58163 -379336 -650995 -504782 -238768 -195668 -118280 340035
36128 340035 899087 1015911 680550 329777 167982 57765 -42460 558 151792 170755
36118 170755 -13990 -160052 -39470 243054 356908 119587 -299125 -572081 -582520 -492329
36108 -492329 -426703 -291113 -38078 112181 -15678 -197946 -114154 112940 75217 -259576
36098 -259576 -456889 -244077 133146 289715 144934 -111388 -252053 -141937 146828 318601
$$ packed form
36170C4990j11707M5038K1257q1918j0948M9688j12691k04801P1282M07879L57731
36159D65800J8847k39120l17493k24946J41759O07594O33305R4339l77278k97657
36149E05150j6614j2499j18579k3221O8519q3533j80533L4566J72170j17769l98359
36138a70702j64100K05178P1461l21173k71659J46213K66014M3100P7388M58315
36128C40035N59052J16824l35361l50773j61795j10217j00225M3018J51234J8963
36118A70755j84745j46062J20582K82524J13854k37321m18712k72956j0439R0191
36108d92329O5626J35590K53035J50259j27859j82268Q3792K27094l7723l34793
36098b59576j97313K12812L77223J56569j44781k56322j40665J10116K88765J71773
$$ plain form
36088 318601 166461 -115684 -172809 11060 150670 155383 231292 464494 649255 603309
36078 603309 361368 6509 -396893 -654705 -529201 -59505 434556 702570 711186 499832
36068 499832 176005 6828 186513 519641 636927 491225 329635 249107 148079 51002
36058 51002 68771 79314 -124044 -401420 -431180 -264636 -229272 -322541 -262971 -137310 -351894
36047 -351894 -848229 -1043555 -754382 -518317 -703383 -927244 -746989 -358440 -152371 -57880
36037 -57880 170323 393638 333994 106145 33171 118914 107677 -78378 -297664 -453602
36027 -453602 -533437 -518792 -452604 -419863 -331577 -3355 411637 444080 -5963 -397555 -276834
36016 -276834 89797 177091 -42781 -230974 -292252 -390322 -532801 -577182 -538941 -521201 -443931
$$ packed form
36088C18601j52140k82145n7125J83869J39610M713P5909K33202J84761m5946
36078F03309k41941l54859m03402k57812J25504M69696M94061K68014Q616k11354
36068D99832l23827j69177J79685L33128J17286j45702j61590q0528j01028r7077
36058E1002J7769J0543k03358k77376k9760J66544L5364r3269N9570J25661k14584
36047c51894m96335j95326K89173K36065j85066k23861J80255L88549K06069R4491
36037e7880K28203K23315n9644k27849p2974Q5743j1237j86055k19286j55938
36027d53602p9835J4645O6188L2741Q8286L28222M14992L2443m50043l91592J20721
36016b76834L66631Q7294k19872j88193o1278r8070j42479m4381L8241J7740P7270
$$ plain form
36005 -443931 -185352 114098 218587 167819 166330 199406 76983 -207042 -452900 -545575
35995 -545575 -520171 -402007 -216272 -87329 -101905 -133826 -7298 221704 314549 122277
35985 122277 -295216 -711058 -826162 -518868 -86171 15073 -228503 -356459 -146644 38893
35975 38893 -132446 -414828 -410867 -197419 -114297 -221298 -377810 -576175 -762120 -626162
35965 -626162 -75179 373179 239339 -120351 -8128 508610 712836 391147 100857 203333
35955 203333 374590 291614 135444 113365 67298 -99565 -126076 103262 225007 -22258
35945 -22258 -294967 -174700 140375 163266 -112563 -269599 -136693 71133 197842 281991
35935 281991 272704 40339 -277891 -324883 -29764 242598 185914 -59229 -169516 -84228
$$ packed form
36005d43931K58579K99450J04489n0768j489L3076j22423k84025k45858r2675
35995e45575K5404J18164J85735J28943j4576l1921J26528K29002R2845j92272
35985A22277m17493m15842j15104L07294M32697J01244k43576j27956K09815J85537
35975C8893j71339k82382L961K13448Q3122j07001j56512j98365j85945J35958
35965f26162N50983M48358j33840l59690J12223N16738K04226l21689k90290J02476
35955B03333J71257q2976j56170k2079m6067j66863k6511K29338J21745k47265
35945b2258k72709J20267L15075K2891k75829j57036J32906K07826J26709Q4149
35935B81991r287k32365l18230m6992K95119K72362n6684k45143j10287Q5288
$$ plain form
35925 -84228 2730 -32767 -117680 -138189 -87497 -46895 -78340 -144671 -143920 -59174 -34176 -187697
35913 -187697 -364063 -243680 218854 630063 581361 126903 -334926 -563622 -628124 -598798
35903 -598798 -394108 -37578 198095 110075 -137976 -253855 -227610 -266871 -406073 -455299
35893 -455299 -334778 -197291 -159023 -135310 -35092 75455 113706 120550 140156 102583 -38328
35882 -38328 -159592 -104385 97618 259171 250636 114367 -565 19535 125148 112337 -145685
35871 -145685 -469156 -513986 -192902 183866 264531 31390 -255286 -363474 -242465 18736
35861 18736 264422 360770 303800 217250 215118 302975 394083 354941 103381 -212822 -242647
35850 -242647 137111 508009 347958 -250396 -689812 -723798 -715474 -879362 -815841 -205507
$$ packed form
35925h4228Q6958l5497q4913k0509N0692M0602l1445o6331P51Q4746K4998j53521
35913a87697j76366J20383M62534M11209m8702m54458m61829k28696o4502K9326
35903e98798K04690L56530K35673q8020k48051j15879K6245l9261j39202m9226
35893d55299J20521J37487L8268K3713J00218J10547L8251O844J9606l7573j40911
35882c8328j21264N5207K02003J61553q535j36269j14932K0100J05613j2811k58022
35871a45685l23471m4830L21084L76768Q0665k33141k86676j08188J21009K61201
35861A8736K45686R6348n6970q6550k132Q7857R1108l9142k51560l16203k9825
35850b42647L79758L70898j60051n98354m39416l3986Q324j63888O3521O10334
$$ plain form
35840 -205507 469464 464933 -184359 -726727 -720181 -466419 -379192 -408469 -277885 45079 343761
35829 343761 441422 339189 160225 34933 -10546 -44663 -69122 20481 211079 277867 100221
35818 100221 -97473 -65807 76810 78573 21452 156029 366711 273376 -114162 -320432
35808 -320432 -109657 164006 105110 -201680 -450724 -558933 -577740 -451430 -179708 -11145
35798 -11145 -153432 -423486 -468022 -229916 57483 238673 335796 355853 270705 167368
35788 167368 173068 223573 123301 -142667 -356287 -363257 -242706 -135660 -77642 -68209 -139547
35777 -139547 -246958 -220506 36998 374436 540487 466929 287310 108788 -73494 -205395
35767 -205395 -106668 266795 607094 539211 127823 -149731 -43478 100492 -161145 -683214
$$ packed form
35840b05507O74971m531o49292n42368O546K53762Q7227k9277J30584L22964K98682
35829C43761R7661j02233j78964j25292m5479l4117k4459Q9603J90598O6788j77646
35818A00221j97694L1666J42617J763n7121J34577K10682r3335l87538k06270
35808c20432K10775K73663n8896l06790k49044j08209j8807J26310K71722J68563
35798a1145j42287k70054m4536K38106K87399J81190R7123K0057q5148j03337
35788A67368N700N0505j00272k65968k13620o970J20551J07046N8018R433p1338
35777a39547j07411K6452K57504L37438J66051p3558j79619j78522j82282j31901
35767b05395R8727L73463L40299o7883m11388k77554J06253J43970k61637n22069
$$ plain form
35757 -683214 -883496 -539599 -79159 15689 -217916 -421893 -436149 -370775 -318050 -262563
35747 -262563 -220502 -238039 -258679 -177228 -35491 -10803 -187649 -453142 -622744 -578153 -316691
35736 -316691 17066 189098 109884 -15435 77129 350907 521956 456069 297649 179709
35726 179709 50010 -121408 -194554 -75438 101485 176519 197358 272132 334909 263923 119427
35715 119427 49243 55491 78031 203782 516090 809155 779999 497967 338311 398370 349830
35704 349830 10001 -307290 -260934 -10411 33985 -213412 -502613 -665195 -718047 -643091
35694 -643091 -395668 -109973 4195 -18498 47600 229596 303341 188549 112299 249008
35684 249008 431170 392533 140488 -89284 -155934 -137686 -171864 -281802 -368138 -335728 -226968
$$ packed form
35757f83214k00282L43897M60440R4848k33605k03977j4256O5374N2725N5487
35747b62563M2061j7537k0640Q1451J41737K4688j76846k65493j69602M4591K61462
35736c16691L33757J72032p9214j25319R2564K73778J71049o5887j58420j17940
35726A79709j29699j71418p3146J19116J76923P5034K0839P4774O2777p0986j44496
35715A19427p0184O248K2540J25751L12308K93065k9156k82032j59656O0059m8540
35704C49830l39829l17291M6356K50523M4396k47397k89201j62582n2852P4956
35694f43091K47423K85695J14168k2693O6098J81996P3745j14792p6250J36709
35684B49008J82162l8637k52045k29772o6650J8248l4178j09938q6336L2410J08760
$$ plain form
35673 -226968 -194627 -298177 -399130 -363036 -285139 -344284 -484521 -467375 -255800 -115814
35663 -115814 -258452 -571546 -801385 -836877 -717343 -511007 -295914 -143189 -32551 101998
35653 101998 187941 40388 -327014 -582013 -428062 9044 298793 182275 -166907 -355199
35643 -355199 -202783 44893 -14722 -434631 -806588 -770159 -462750 -238087 -124453 59323
35633 59323 177260 -98268 -590689 -639716 -57209 476060 338615 -177101 -404759 -287681
35623 -287681 -232238 -271491 -74354 300319 357944 -18633 -308751 -122282 260168 385704
35613 385704 262786 169223 131674 -26092 -269300 -332438 -91934 277638 534199 599071
35603 599071 543394 461852 397163 333268 231269 77513 -100103 -253609 -349943 -406910 -478617
$$ packed form
35673b26968L2341j03550j00953L6094P7897n9145j40237J7146K11575J39986
35663a15814j42638l13094k29839l5492J19534K06336K15093J52725J10638J34549
35653A01998Q5943j47553l67402k54999J53951M37106K89749j16518l49182j88292
35643c55199J52416K47676n9615m19909l71957L6429L07409K24663J13634J83776
35633E9323J17937k75528m92421m9027N82507N33269j37445n15716k27658J17078
35623b87681N5443l9253J97137L74673N7625l76577k90118J86469L82450J25536
35613C85704j22918r3563l7549j57766k43208o3138K40504L69572K56561O4872
35603E99071n5677q1542o4689o3895j01999j53756j77616j53506r6334n6967p1707
$$ plain form
35592 -478617 -540802 -423085 -9368 478676 624653 355355 90554 149591 251940 -62651
35582 -62651 -684143 -1016011 -772786 -289692 14153 96145 85338 -31320 -293435 -566784
35572 -566784 -672497 -581597 -356700 -63902 145708 66787 -282352 -569684 -507035 -180036
35562 -180036 114376 219325 148143 -89951 -460252 -748326 -669034 -204725 281169 366787
35552 366787 11222 -373423 -351743 29987 286231 108918 -230280 -284582 -73394 7996
35542 7996 -154458 -242217 -75615 86971 16586 -94547 5292 178027 153275 8497 8691
35531 8691 105994 -1109 -343662 -580000 -464507 -137038 118922 180813 88407 -67160
35521 -67160 -184276 -210432 -196362 -204627 -209415 -200916 -286327 -500456 -624255 -453917 -178507
$$ packed form
35592d78617o2185J17717M13717M88044J45977k69298k64801N9037J02349l14591
35582f2651o21492l31868K43225M83094L03845Q1992j0807j16658k62115k73349
35572e66784j05713R0900K24897K92798K09610p8921l49139k87332O2649L26999
35562a80036K94412J04949p1182k38094l70301k88074P9292M64309M85894Q5618
35552C66787l55565l84645K1680L81730K56244j77313l39198n4302K11188Q1390
35542G996j62454q7759J66602J62586p0385j11133R9839J72735k4752j44778J94
35531H691R7303j07103l42553k36338J15493L27469K55960O1891r2406j55567
35521f7160j17116k6156J4070q265m788Q499q5411k14129j23799J70338K75410
$$ plain form
35510 -178507 -168383 -395755 -426569 -74577 291713 273854 -27114 -245349 -279028 -304701
35500 -304701 -411740 -502113 -493034 -397515 -241470 -77305 -28159 -147093 -284959 -268890 -153297
35489 -153297 -103865 -88023 82617 399030 588582 479229 235341 124136 193317 288772
35479 288772 274095 118872 -141281 -413773 -565287 -523116 -341536 -125266 65540 202941
35469 202941 265642 282988 321048 354650 252798 6176 -122754 136532 653670 943521
35459 943521 711906 227794 17711 247173 555025 518215 141919 -205217 -251512 -66934
35449 -66934 135371 263005 325528 296426 152555 -13216 -78282 -66441 -95692 -177530 -232709
35438 -232709 -281833 -403736 -490235 -312226 69360 240664 -13190 -331451 -237631 185533
$$ packed form
35510a78507J0124k27372l0814L51992L66290j7859l00968k18235l3679k5673
35500c04701j07039r0373R079R5519J56045J64165M9146j18934j37866J6069J15593
35489a53297M9432J5842J70640L16413J89552j09353k43888j11205O9181R5455
35479B88772j4677j55223k60153k72492j51514M2171J81580K16270J90806J37401
35469B02941O2701J7346L8060L3602j01852k46622j28930K59286N17138K89851
35459I43521k31615m84112k10083K29462L07852l6810l76296l47136m6295J84578
35449f6934K02305J27634O2523k9102j43871j65771o5066J1841k9251q1838n5179
35438b32709m9124j21903q6499J78009L81586J71304k53854l18261R3820M23164
$$ plain form
35428 185533 411236 188124 -187949 -326390 -151658 198593 582381 826852 742176 348978
35418 348978 -58642 -226832 -200168 -162623 -177692 -224388 -331020 -474211 -451449 -85907
35408 -85907 458908 766056 607306 170335 -189048 -313187 -315844 -374502 -521541 -628155
35398 -628155 -564736 -362137 -186916 -148565 -184550 -179690 -140407 -155976 -207805 -149076 62328
35387 62328 220319 106361 -162767 -218650 46224 246907 1803 -466387 -549725 -84175
35377 -84175 400912 412719 133379 51321 234754 361617 307013 256547 271349 172920 -75551
35366 -75551 -256293 -274803 -303995 -415949 -407904 -180034 25137 -4080 -95255 28681 320884
35355 320884 523796 549400 485991 348467 85652 -222831 -401952 -402400 -341581 -347406 -447268
$$ packed form
35428A85533K25703k23112l76073j38441J74732L50251L83788K44471q4676l93198
35418C48978m07620j68190K6664L7545j5069m6696j06632j43191K2762L65542
35408h5907N44815L07148j58750m36971l59383j24139k657n8658j47039j06614
35398f28155O3419K02599J75221L8351l5985M860L9283j5569n1829N8729K11404
35387F2328J57991j13958k69128n5883K64874K00683k45104m68190q3338M65550
35377h4175M85087J1807k79340q2058J83433J26863n4604n0466J4802r8429k48471
35366g5551j80742j8510k9192j11954Q045K27870K05171k9217r1175J23936K92203
35355C20884K02912K5604o3409j37524k62815l08483j79121m48O0819n825r9862
$$ plain form
35344 -447268 -551660 -500006 -234767 44183 82107 -36189 47984 414822 683780 553249
35334 553249 212961 -12109 -119821 -241677 -299730 -221028 -231385 -506879 -743780 -553897
35324 -553897 -138426 -44056 -312181 -417304 -92156 312080 421589 324734 262572 230675
35314 230675 126906 -5145 -93958 -156305 -138762 93269 448470 565381 269582 -161463
35304 -161463 -375135 -355223 -276855 -200680 -138358 -194892 -378467 -445536 -213357 103345 141320
35293 141320 -117657 -363166 -397860 -298746 -168985 -107 177612 233825 116819 -52536
35283 -52536 -136416 -116173 -22738 147279 362714 494633 430972 228072 60589 14860 2603
35272 2603 -91504 -242163 -332768 -333845 -328501 -353533 -331628 -213124 -74403 9357 87084 212528
$$ packed form
35344d47268j04392N1654K65239K78950L7924j18296Q4173L66838K68958j30531
35334E53249l40288k25070j07712j21856n8053P8702j0357k75494k36901J89883
35324e53897M15471R4370k68125j05123L25148M04236J09509r6855o2162l1897
35314B30675j03769j32051q8813o2347J7543K32031L55201J16911k95799m31045
35304a61463k13672J9912P8368P6175O2322n6534j83575o7069K32179L16702L7975
35293A41320k58977k45509l4694R9114J29761J68878J77719N6213j17006j69355
35283e2536q3880K0243R3435J70017K15435J31919o3661k02900j67483m5729j2257
35272B603r4107j50659r0605j077N344k5032K1905J18504J38721Q3760P7727J25444
$$ plain form
35260 212528 289532 183108 -63975 -271600 -354238 -378787 -411803 -444689 -464368 -474401 -449678
35249 -449678 -380589 -346478 -432343 -588309 -672707 -601893 -367638 9883 410500 593003
35239 593003 438473 155455 47561 132276 198762 180203 210902 336311 437209 458587
35229 458587 457140 400066 186533 -87956 -166109 -1164 164996 169608 107955 66016 -30630
35218 -30630 -179768 -209707 -85903 -35672 -184615 -336098 -320363 -293338 -424782 -529508
35208 -529508 -334001 50778 262631 216672 184589 351497 559218 539914 225059 -220161
35198 -220161 -545736 -582290 -359838 -85535 37228 -45255 -259499 -473513 -531935 -366465
35188 -366465 -117516 2972 11094 122936 367160 471044 270245 -6395 -57903 85313
$$ packed form
35260B12528P7004j06424k47083k07625q2638k4549l3016l2886j9679j0033K4723
35249d49678O9089L4111q5865j55966q4398P0814K34255L77521M00617J82503
35239E93003j54530k83018j07894Q4715O6486j8559L0699J25409J00898K1378
35229D58587j447n7074k13533k74489p8153J64945J66160M612o1653m1939r6646
35218c0630j49138k9939J23804N0231j48943j51483J5735K7025j31444j04726
35208e29508J95507L84779K11853m5959l2083J66908K07721j9304l14855m45220
35198b20161l25575l6554K22452K74303J22763q2483k14244k14014n8422J65470
35188c66465K48949J20488Q122J11842K44224J03884k00799k76640n1508J43216
$$ plain form
35178 85313 202692 257929 384424 610172 817782 888876 721699 253367 -338879 -635261
35168 -635261 -431727 -56255 47786 -92594 -139967 -67242 -194023 -588358 -841605 -593472
35158 -593472 -4352 459036 526604 291066 17933 -103959 -111000 -207796 -488111 -748843
35148 -748843 -713807 -394824 -58724 118786 161901 103170 -54572 -175237 -66486 209460
35138 209460 352390 240659 88040 78222 102425 27650 -17124 135344 347133 326140 49194
35127 49194 -204540 -226719 -88042 36172 72657 34448 -65144 -200559 -300513 -293328 -173400
35116 -173400 -661 157662 279150 381405 463300 476148 396733 309330 331214 438965
35106 438965 464243 320461 145494 116313 175358 81389 -246976 -565818 -575452 -290723 -23175
$$ packed form
35178H5313J17379N5237J26495K25748K07610P1094j67177m68332n92246k96382
35168f35261K03534L75472J04041j40380m7373P2725j26781l94335k53247K48133
35158e93472N89120M63388O7568k35538k73133j21892p041r6796k80315k60732
35148g48843L5036L18983L36100J77510M3115n8731j57742j20665J08751K75946
35138B09460J42930j11731j52619r818K4203p4775m4774J52468K11789k0993k76946
35127D9194k53734k2179J38677J24214L6485l8209r9592j35415r9954P185J19928
35116a73400J72739J58323J21488J02255Q1895J2848p9415q7403K1884J07751
35106D38965K5278j43782j74967k9181N9045r3969l28365l18842r634K84729K67548
$$ plain form
35095 -23175 4861 -98914 -110402 -28540 -41030 -185329 -251384 -105000 72041 39954 -111716
35084 -111716 -69455 220390 419499 256102 -75675 -166282 53323 233921 109745 -131254
35074 -131254 -122591 151843 317595 122142 -203431 -233203 107573 467494 518555 290099
35064 290099 5807 -222220 -399910 -489440 -439362 -335545 -338598 -454737 -519970 -446459 -339348
35053 -339348 -303094 -265959 -106951 130713 271093 202228 -51328 -387336 -637738 -590294
35043 -590294 -185533 303701 483412 293451 76891 106792 239786 198317 5305 -112074
35033 -112074 -117906 -156438 -206730 -96280 121720 170171 24174 15405 282028 474485 275907
35022 275907 -104802 -287836 -284443 -314327 -311501 -86676 184822 165633 -24468 57959 409937
$$ packed form
35095b3175K8036j03775j1488Q1862j2490j44299o6055J46384J77041l2087j51670
35084a11716M2261K89845J99109j63397l31777r0607K19605J80598j24176k40999
35074a31254Q663K74434J65752j95453l25573k9772L40776L59921N1061k28456
35064B90099k84292k28027j77690q9530N0078J03817l053j16139o5233P3511J07111
35053c39348L6254L7135J59008K37664J40380o8865k53556l36008k50402M7444
35043e90294M04761M89234J79711j89961k16560K9901J32994m1469j93012j17379
35033a12074n832l8532n0292J10450K18000M8451j45997q769K66623J92457j98578
35022B75907l80709j83034L393k9884K826K24825K71498j9189j90101Q2427L51978
$$ plain form
35011 409937 512553 157313 -207070 -183250 17324 33736 -63251 -26658 78127 53593
35001 53593 -13246 75739 212524 123232 -182676 -434373 -483681 -383572 -187372 45952
34991 45952 142785 -3810 -216070 -246491 -121104 -27468 10515 62900 33844 -185831 -395594
34980 -395594 -287416 55940 228983 84955 -101407 -99652 -8035 21049 23878 60537 73688
34969 73688 54816 122617 285707 317195 20665 -504109 -960816 -1108677 -874378 -378131
34959 -378131 86683 259840 175233 89944 134016 202527 208422 211091 227757 157780 7236
34948 7236 -41456 64990 87091 -173990 -549399 -722826 -654861 -564199 -557423 -504283 -288736
34937 -288736 -12865 104824 -36943 -306828 -436215 -270885 52974 261722 286376 312482
$$ packed form
35011D09937J02616l55240l64383K3820K00574J6412r6987L6593J04785k4534
35001E3593o6839Q8985J36785q9292l05908k51697m9308J00109J96200K33324
34991D5952R6833j46595k12260l0421J25387R3636L7983N2385k9056k19675k09763
34980c95594J08178L43356J73043j44028j86362J755R1617K9084K829L6659J3151
34969G3688j8872O7801J63090L1488k96530n24774m56707j47861K34299M96247
34959c78131M64814J73157q4607q5289M4072O8511N895K669J6666o9977j50544
34948G236m8692J06446K2101k61081l75409j73427O7965R0662O776N3140K15547
34937b88736K75871J17689j41767k69885j29387J65330L23859K08748K4654K6106
$$ plain form
34927 312482 439422 493357 337058 179823 316508 653797 800777 632703 457423 527683
34917 527683 674754 613375 381645 221849 178509 117486 70074 216582 494682 560895
34907 560895 277126 -54234 -129453 -51763 -56162 -83303 26117 108746 -107406 -446543 -425442
34896 -425442 2983 314489 163542 -169680 -294303 -250431 -237843 -181104 47739 258606
34886 258606 213160 57117 71299 169915 85793 -90066 -47919 131852 41255 -341037 -519713
34875 -519713 -224381 181187 271696 154509 178903 329037 261835 -164892 -687595 -946036
34865 -946036 -830019 -517702 -257505 -129369 -42909 13716 -123344 -475235 -675566 -373720
34855 -373720 190772 416770 163948 -89657 -18928 96326 -64541 -296256 -248131 -28183
$$ packed form
34927C12482J26940N3935j56299j57235J36685L37289J46980j68074j75280P0260
34917E27683J47071o1379k31730j59796m3340o1023m7412J46508K78100O6213
34907E60895k83769l31360p5219P7690m399k7141J09420Q2629k16152l39137K1101
34896d25442M28425L11506j50947l33222j24623M3872J2588N6739K28843K10867
34886B58606m5446j56043J4182R8616q4122j75859M2147J79771r0597l82292j78676
34875e19713K95332M05568R0509j17187K4394J50134o7202m26727n22703k58441
34865i46036J16017L12317K60197J28136Q6460N6625j37060l51891k00331L01846
34855c73720N64492K25998k52822k53605P0729J15254j60867k31715M8125K19948
$$ plain form
34845 -28183 25156 -57303 14916 210253 190016 -109349 -353834 -337284 -242577 -265863 -320063
34834 -320063 -270307 -184619 -168787 -170644 -125969 -111913 -171182 -145571 103424 413421 477590
34823 477590 244875 -20128 -79459 25594 95183 33651 -64546 -48688 99066 213186
34813 213186 117009 -149274 -353530 -368290 -338900 -457779 -667761 -741585 -597979 -362669
34803 -362669 -144613 43996 139939 45579 -129802 -96917 189527 362744 125727 -285615
34793 -285615 -405767 -176422 48940 73569 60399 132267 140104 -25575 -197204 -199039 -113303
34782 -113303 -72035 5873 232461 472182 510656 402908 391277 512231 526500 271263
34772 271263 -97320 -274995 -125876 206685 451808 463700 338417 254442 224411 110879
$$ packed form
34845b8183N3339q2459P2219J95337k0237k99365k44485J6550R4707k3286n4200
34834c20063M9756Q5688J5832j857M4675J4056n9269K5611K48995L09997O4169
34823D77590k32715k65003n9331J05053O9589o1532r8197J5858J47754J14120
34813B13186r6177k66283k04256j4760K9390j18879k09982p3824J43606K35310
34803c62669K18056J88609R5943r4360j75381L2885K86444J73217k37017m11342
34793b85615j20152K29345K25362K4629j3170P1868P837j65679j71629j835Q5736
34782a13303M1268P7908K26588K39721L8474j07748j1631J20954J4269k55237
34772B71263l68583j77675J49119L32561K45123J1892j25283q3975l0031j13532
$$ plain form
34762 110879 -117388 -304795 -328412 -238115 -122317 -7796 46020 -38343 -157719 -77898
34752 -77898 188860 303664 72766 -248512 -342703 -281044 -317763 -441464 -442993 -288317 -127245
34741 -127245 -37780 -21230 -130150 -344268 -450919 -310847 -104098 -51362 -61932 48344
34731 48344 177893 123737 -22778 -31586 68694 121362 194748 391820 494173 273264 -17103
34720 -17103 1720 144902 -37236 -385200 -296235 217833 432167 47750 -339518 -219306
34710 -219306 97656 150653 103185 311683 607085 576301 235648 -74830 -214143 -233715
34700 -233715 -102354 153604 265789 68246 -178937 -157851 37316 134725 140382 192644
34690 192644 203248 42828 -117439 -46086 143470 204733 188462 273004 359693 267833 162584
$$ packed form
34762A10879k28267j87407k3617R0297J15798J14521N3816q4363j19376P9821
34752g7898K66758J14804k30898l21278r4191O1659l6719j23701j529J54676J61072
34741a27245Q9465J6550j08920k14118j06651J40072K06749N2736j0570J10276
34731D8344J29549n4156j46515q808J00280N2668P3386J97072J02353k20909k90367
34720a7103J8823J43182j82138l47964Q8965N14068K14334l84417l87268J20212
34710b19306L16962N2997m7468K08498K95402l0784l40653l10478j39313j9572
34700b33715J31361K55958J12185j97543k47183K1086J95167R7409N657N2262
34690A92644J0604j60420j60267P1353J89556O1263j6271Q4542Q6689r1860j05249
$$ plain form
34679 162584 316705 564103 486028 93883 -161491 -78394 60283 13269 -83601 -45105
34669 -45105 50342 43519 -61759 -175453 -251769 -253847 -153921 -24124 19174 -18143 -29950
34658 -29950 24628 113761 223621 293499 157105 -242632 -669167 -851306 -838960 -855966 -901669
34647 -901669 -800093 -572793 -419374 -339236 -121224 243372 463907 359694 91510 -109910
34637 -109910 -192603 -164403 18592 302632 479024 426443 266042 162291 107930 14318
34627 14318 -111748 -198672 -232039 -251411 -281254 -322383 -360217 -348177 -237638 -50847 116942
34616 116942 180254 130494 46992 61274 259132 595238 962949 1328050 1661538 1767298
34606 1767298 1426354 787937 341584 333845 465814 378295 171055 146621 271546 271016 123103
$$ packed form
34679A62584J54121K47398p8075l92145k55374Q3097J38677m7014r6870L8496
34669d5105R5447o823j05278j13694p6316k078R9926J29797M3298l7317j1807
34658b9950N4578Q9133J09860O9878j36394l99737m26535j82139J2346j7006m5703
34647i01669J01576K27300J53419Q0138K18012L64596K20535j04213k68184k01420
34637a09910q2693K8200J82995K84040J76392n2581j60401j03751n4361r3612
34627A4318j26066q6924l3367j9372k9843m1129l7834J2040J10539J86791J67789
34616A16942O3312m9760q3502J4282J97858L36106L67711L65101L33488J05760
34606A767298l40944o38417m46353p739J31969q7519k07240k4434J24925n30j47913
$$ plain form
34595 123103 68193 175156 249822 171231 21111 -114404 -204367 -163817 46632 249963
34585 249963 248663 134738 123476 164592 60417 -99882 -31724 221830 284175 35637 -193194
34574 -193194 -144733 17879 52354 1888 21239 95189 121229 84894 18149 -50732 -38030
34563 -38030 109103 237620 146200 -56344 -49015 191635 315931 138987 -88087 -94385 52123
34552 52123 178067 272681 311649 129588 -265758 -519598 -364859 -31719 54460 -171685
34542 -171685 -408845 -403862 -162723 123007 190049 -95348 -492845 -549300 -179781 156069
34532 156069 77486 -190326 -209846 12593 158716 190898 344421 600350 639776 371065
34522 371065 83166 -40488 -179956 -463660 -625627 -366146 139048 402618 247629 -847
$$ packed form
34595A23103n4910J06963P4666p8591j50120j35515q9963M0550K10449K03331
34585B49963j300j13925j1262M1116j04175j60299O8158K53554O2345k48538k28831
34574a93194M8461J62612L4475n0466J9351P3950K6040l6335o6745o8881J2702
34563c8030J47133J28517r1420k02544P329K40650J24296j76944k27074o298J46508
34552E2123J25944R4614L8968j82061l95346k53840J54739L33140Q6179k26145
34542a71685k37160M983K41139K85730O7042k85397l97497n6455L69519L35850
34532A56069p8583k67812j9520K22439J46123L2182J53523K55929L9426k68711
34522C71065k87899j23654j39468k83704j61967K59481N05194K63570j54989k48476
$$ plain form
34512 -847 7377 195499 234544 50987 -70680 69649 264284 197925 -70476 -196216 -82236
34501 -82236 -13826 -183003 -376428 -316699 -80592 50141 -10609 -132948 -224276 -269344 -210488
34490 -210488 -22478 146008 114057 -85477 -271128 -351081 -316573 -108300 259986 525151
34480 525151 423930 106001 -5621 201115 391363 312004 137283 122195 194304 133896
34470 133896 -39445 -130627 -98467 -58217 -22283 100380 256624 252693 59255 -101203 -69006
34459 -69006 22395 -42254 -247073 -394678 -392361 -329333 -288106 -224595 -68769 154250 347312
34448 347312 427227 368941 225187 117290 137393 235002 266741 185002 102296 126769 211115
34437 211115 235735 193173 211130 394983 683194 861522 736778 336476 -88577 -323176
$$ packed form
34512h47Q224J88122L9045j83557j21667J40329J94635o6359k68401j25740J13980
34501h2236O8410j69177j93425N9729K36107J30733o0750j22339r1328m5068N8856
34490b10488J88010J68486l1951j99534j85651p9953L4508K08273L68286K65165
34480E25151j01221l17929j11622K06736J90248p9359j74721j5088P2109o0408
34470A33896j73341r1182L2160M0250L5934J22663J56244l931j93438j60458L2197
34459f9006R1401o4649k04819j47605K317O3028M1227O3511J55826K23019J93062
34448C47312P9915n8286j43754j07897K0103R7609L1739q1739q2706K4473Q4346
34437B11115K4620m2562J7957J83853K88211J78328j24744m00302m25053k34599
$$ plain form
34427 -323176 -398276 -430625 -333583 70209 638394 917040 705350 348480 256450 365427
34417 365427 345795 143291 -17636 -26626 73775 335070 789006 1151213 1112036 968220
34407 968220 1448123 2683510 3786885 3793746 2750629 1547919 896419 807139 913891
34398 913891 916749 720434 439777 319863 465731 656871 604237 352447 207172 266053
34388 266053 270405 8242 -345434 -450443 -247323 -7858 33121 -54778 -44064 140615
34378 140615 355361 442601 396746 310951 261060 290560 411892 541683 521361 304300 49512
34367 49512 -74350 -89928 -92026 -43160 119494 262813 191805 -18170 -70771 148396 438428
34356 438428 573111 504885 269851 -54763 -260422 -151271 140672 246825 57668 -144077
$$ packed form
34427c23176p5100l2349R7042M03792N68185K78646k11690l56870r2030J08977
34417C65427j9632k02504j60927q990J00401K61295M53936L62207l9177j43816
34407I68220M79903J235387J103375O861j043117j202710o51500q9280J06752
34398I13891K858j96315k80657j19914J45868J91140n2634k51790j45275N8881
34388B66053M352k62163l53676j05009K03120K39465M0979q7899J0714J84679
34378A40615K14746Q7240m5855q5795m9891K9500J21332J29791k0322k17061k54788
34367D9512j23862j5578k098M8866J62654J43319p1008k09975n2601K19167K90032
34356D38428J34683o8226k35034l24614k05659J09151K91943J06153j89157k01745
$$ plain form
34346 -144077 -144649 -88147 -152095 -239726 -203476 -104514 -28801 91787 237642 158711 -232973
34335 -232973 -580759 -527067 -221195 -29561 47828 252035 522900 567431 405993 359298
34325 359298 467160 398660 49997 -211426 -87073 238839 439876 479464 463064 349298
34315 349298 104179 -72564 -1698 119691 -59626 -501016 -748148 -498300 16743 316061
34305 316061 191319 -158414 -412264 -417352 -216959 78933 370180 560134 582662 480058
34295 480058 392608 410144 468319 447160 336440 232820 191567 155058 37982 -158675 -324379
34284 -324379 -321716 -127214 100562 163025 62052 8926 141807 346546 445850 439506 416862
34273 416862 353706 203131 109436 268129 563290 610334 255624 -191656 -371622 -326772
$$ packed form
34346a44077n72N6502o3948q7631L6250R8962P5713J20588J45855p8931l91684
34335b32973l47786N3692L05872J91634P7389K04207K70865M4531j61438m6695
34325C59298J07862o8500l48663k61423J24353L25912K01037L9588j6400j13766
34315C49298k45119j76743P0866J21389j79317m41390k47132K49848N15043K99318
34305C16061j24742l49733k53850n088K00393K95892K91247J89954K2528j02604
34295D80058q7450J7536N8175k1159j10720j03620m1253l6509j17076j96657j65704
34284c24379K663J94502K27776O2463j00973n3126J32881K04739R9304o344k2644
34273D16862o3156j50575r3695J58693K95161M7044l54710m47280j79966M4850
$$ plain form
34263 -326772 -340352 -457144 -433698 -151409 182295 340687 380548 469687 555554 450625
34253 450625 208269 127469 288437 348311 18512 -445306 -538860 -211931 72034 7892
34243 7892 -168095 -105216 158723 347486 370114 327644 249727 103633 -16831 22323 148126
34232 148126 155015 28547 -17360 138799 345710 382901 228670 66160 71434 205000 209445
34221 209445 -106683 -561627 -733387 -482987 -149648 -72728 -141344 -66725 106873 118426
34211 118426 -13870 -26918 92994 83473 -77174 -68981 204179 368387 155991 -117241
34201 -117241 15961 499612 863242 883649 827072 1075869 1741173 2591817 3172130 3074500
34191 3074500 2324932 1456588 997852 932011 854875 578028 295935 179281 127220 17862
$$ packed form
34263c26772j3580j16792K3446K82289L33704J58392L9861Q9139Q5867j04929
34253D50625k42356q0800J60968N9874l29799m63818r3554L26929K83965o4142
34243G892j75987O2879K63939J88763K2628m2470p7917j46094j20464L9154J25803
34232A48126O889j26468m5907J56159K06911L7191j54231j62510N274J33566M445
34221B09445l16128m54944j71760K50400L33339P6920o8616P4619J73598J1553
34211A18426j32296j3048J19912r521j60647Q193K73160J64208k12396k73232
34201a17241J33202M83651L63630K0407n6577K48797O65304Q50644N80313r7630
34191C074500p49568q68344m58736o5841p7136k76847k82093j16654n2061j09358
$$ plain form
34181 17862 -68427 -38257 -685 -108209 -303011 -389659 -291292 -108389 10525 -44453 -291590
34170 -291590 -563167 -562781 -190894 246840 349595 115956 -80218 -24555 64789 -95073
34160 -95073 -418146 -575012 -442334 -229435 -185917 -343386 -557507 -685567 -690465 -635684
34150 -635684 -594210 -543401 -395172 -155512 50106 183793 390553 735871 973475 808798
34140 808798 343367 -1117 -20152 63037 -7096 -157665 -165230 -13176 104092 44111 -143558
34129 -143558 -282723 -209247 76962 355491 381444 169560 -34983 -75228 -2155 130453
34119 130453 344385 536524 476542 163635 -63598 24304 217383 219183 105941 129286
34109 129286 235486 147065 -148384 -348175 -286841 -138298 -118057 -232099 -375992 -467626
$$ packed form
34181A7862q6289L0170L7572j07524j94802q6648R8367J82903J18914n4978k47137
34170b91590k71577L86L71887M37734J02755k33639j96174N5663Q9344j59862
34160i5073l23073j56866J32678K12899M3518j57469k14121j28060m898N4781
34150f35684M1474N0809J48229K39660K05618J33687K06760L45318K37604j64677
34140H08798m65431l44484j9035Q3189p0133j50569p565J52054J17268n9981j87669
34129a43558j39165P3476K86209K78529K5953k11884k04543m0245P3073J32608
34119A30453K13932J92139n9982l12907k27233Q7902J93079J800j13242K3345
34109A29286J06200q8421k95449j99791O1334J48543K0241j14042j43893r1634
$$ plain form
34099 -467626 -426392 -210976 70486 254312 355791 539040 823774 1003351 911504 617500
34089 617500 302035 74615 -42647 -85561 -156392 -348146 -609607 -772746 -745199 -604780
34079 -604780 -496744 -496076 -546004 -482083 -193991 166803 271725 33995 -211973 -145767 74959
34068 74959 54228 -248213 -486411 -452448 -295722 -196965 -147818 -122197 -163767 -207189 -94051
34057 -94051 126006 187910 29748 -63987 97054 297126 259223 69689 824 75967 81621
34046 81621 -75582 -260340 -315045 -190639 89217 426285 628354 536198 185608 -225094
34036 -225094 -500244 -537590 -351855 -109454 -54821 -257687 -461751 -326218 153526 574083
34026 574083 548272 150708 -167865 -130392 43137 2447 -169063 -64969 354095 579267
$$ packed form
34099d67626M1234K15416K81462J83826J01479J83249K84734J79577r1847k94004
34089F17500l15465k27420j17262m2914p0831j91754k61461j63139K7547J40419
34079f04780J08036O68m9928O3921K88092L60794J04922k37730k45968O6206K20726
34068G4959k0731l02441k38198L3963J56726R8757M9147K5621m1570m3422J13138
34057i4051K20057O1904j58162r3735J61041K00072l7903j89534o8865P5143N654
34046H1621j57203j84758n4705J24406K79856L37068K02069r2156l50590m10702
34036b25094k75150l7346J85735K42401N4633k02866k04064J35533M79744M20557
34026E74083k5811l97564l18573L7473J73529m0690j71510J04094M19064K25172
$$ plain form
34016 579267 275869 -186895 -295520 -163819 -236267 -442541 -296767 198934 443492 176020
34006 176020 -126120 -60441 100287 9316 -113145 38831 190278 -77054 -527842 -574720
33996 -574720 -208407 33109 -29064 -2028 301294 503306 323379 78396 170782 447054
33986 447054 465113 183984 -6112 129489 386031 458216 318863 158150 99392 118295
33976 118295 187507 342033 551433 656346 563172 424485 443756 533346 406543 52058
33966 52058 -158754 15370 314706 343973 116870 -27174 80444 292809 413710 353752
33956 353752 89447 -279051 -484112 -362717 -129910 -116176 -272863 -242512 77088 366703
33946 366703 352038 129554 -85860 -247593 -345286 -243853 110710 481531 563331 339012
$$ packed form
34016E79267l03398m62764j08625J31701p2448k06274J45774M95701K44558k67472
34006A76020l02140O5679J60728r0971j22461J51976J51447k67332m50788m6878
33996e74720L66313K41516o2173K7036L03322K02012j79927k44983R2386K76272
33986D47054J8059k81129j90096J35601K56542P2185j39353j60713n8758J8903
33976A18295O9212J54526K09400J04913r3174j38687J9271Q9590j26803l54485
33966E2058k10812J74124K99336K9267k27103j44044J07618K12365J20901n9958
33956C53752k64305l68498k05061J21395K32807J3734j56687L0351L19600K89615
33946C66703j4665k22484k15414j61733r7693J01433L54563L70821Q1800k24319
$$ plain form
33936 339012 47460 -133800 -212437 -232416 -169029 -8851 156705 180319 12502 -196962
33926 -196962 -200451 79844 418225 515830 353861 205817 285559 498875 587034 424331
33916 424331 121663 -104389 -132927 -54618 -86624 -317047 -559812 -552004 -278231 8874
33906 8874 97963 46507 70074 273435 520443 554788 278519 -84910 -203851 -44505 99002
33895 99002 60364 51130 257861 436573 248963 -163271 -358053 -270573 -251478 -420406 -482479
33884 -482479 -311684 -214490 -369758 -463233 -216633 108402 136136 -12924 10225 148609
33874 148609 71079 -204143 -325944 -205848 -113872 -155569 -117668 69203 147622 -19813
$$ packed form
33936C39012k91552j81260p8637j9979O3387J60178J65556K3614j67817k09464
33926a96962l489K80295L38381R7605j61969j48044P9742K13316Q8159j62703
33916D24331l02668k26052k8538P8309l2006k30423k42765P808K73773K87105
33906H874Q9089n1456K3567K03361K47008L4345k76269l63429j18941J59346J43507
33895I9002l8638r234K06731J78712j87610m12234j94782Q7480J9095j68928o2073
33884d82479J70795R7194j55268r3475K46600L25035K7734j49060K3149J38384
33874A48609p7530k75222j21801J20096R1976m1697L7901J86871P8419j67435
$$ [...]
##END NTUPLES=NMR SPECTRUM
##END=
