##TITLE=31Pdec_E3d-3c
 CDCl3
 24 sc
 2.4.2024
##JCAMPDX= 6.0         $$ Bruker NMR JCAMP-DX V2.0
##DATA TYPE= NMR SPECTRUM
##DATA CLASS= NTUPLES
##ORIGIN= UXNMR, Bruker Analytische Messtechnik GmbH
##OWNER= root
$$ XWIN-NMR		Version 3.5
$$ Tue Apr  2 14:15:05 2024 Russian Standard Time (UT+4h)  she@DPX200
##.OBSERVE FREQUENCY= 81.013821
##.OBSERVE NUCLEUS= ^31P
##.ACQUISITION MODE= SIMULTANEOUS
##.ACQUISITION SCHEME= undefined
##.AVERAGES= 24
##.DIGITISER RES= 16
##SPECTROMETER/DATA SYSTEM= spect
##.PULSE SEQUENCE= zgpg30
##.SOLVENT NAME= D2O
##.SHIFT REFERENCE= (INTERNAL, D2O, 0, 248.564)
##AUDIT TRAIL= $$ (NUMBER, WHEN, WHO, WHERE, WHAT)
$$ ##TITLE= Audit trail, XWIN-NMR		Version 3.5
$$ ##JCAMPDX= 5.01
$$ ##ORIGIN= Bruker BioSpin GmbH
$$ ##OWNER= she
$$ F:/spectra/data/she/nmr/P31/1/pdata/1/auditp.txt
$$ ##AUDIT TRAIL=  $$ (NUMBER, WHEN, WHO, WHERE, WHAT)
(   1,<2024-04-02 14:13:58.54 +0400>,<she>,<DPX200>,
      <created by zg, POWCHK disabled, PULCHK disabled
       configuration hash MD5:
       00 E9 B6 7A A2 85 ED C7 34 08 36 98 17 FE 4E 26
       data hash MD5: 32K
       8F 61 3F E8 ED DE 7D F1 91 68 3F 84 AB 4C 87 3F>)
(   2,<2024-04-02 14:14:01.92 +0400>,<she>,<DPX200>,
      <Start of raw data processing
       efp BC_mod = 2 LB = 10 FT_mod = 6 PKNL = 1 PHC0 = -13242.11 PHC1 = 86.28333 SI = 64K 
       data hash MD5: 64K
       5C BE FB E9 8D 25 46 EB 7C 43 8A 24 4A E2 BB FA>)
(   3,<2024-04-02 14:14:13.84 +0400>,<she>,<DPX200>,
      <pk PHC0 = 14.98547 PHC1 = 0 
       data hash MD5: 64K
       C7 BB DE 19 AF 1D 82 C6 7C A5 71 90 0C 59 B7 48>)
(   4,<2024-04-02 14:14:26.78 +0400>,<she>,<DPX200>,
      <pk PHC0 = 2.000004 PHC1 = 0 
       data hash MD5: 64K
       11 D5 4B 85 03 9D A1 68 1C AB E9 65 F6 D6 89 1E>)
$$ ##END=
$$ 
$$ hash MD5
$$ C9 1D 9C AF 87 BC 92 51 3D 73 EB 32 D7 5B 06 E4
##$RELAX= 
##$RELAX= 
##$RELAX= 
##$RELAX= 
##$RELAX= 
##$RELAX= 
##$RELAX= 
##$RELAX= 
##$RELAX= 
$$ Bruker specific parameters
$$ --------------------------
##$DU= <F:/spectra>
##$EXPNO= 1
##$NAME= <P31>
##$PROCNO= 1
##$TYPE= <nmr>
##$USER= <she>
##$AMP= (0..31)
100 100 100 100 100 100 100 100 100 100 100 100 100 100 100 100 100 100 
100 100 100 100 100 100 100 100 100 100 100 100 100 100 
##$AQSEQ= 0
##$AQ_mod= 1
##$AUNM= <au_zg>
##$AUTOPOS= <>
##$BF1= 81.014009
##$BF2= 200.13
##$BF3= 200.13
##$BF4= 200.13
##$BF5= 200.13
##$BF6= 200.13
##$BF7= 200.13
##$BF8= 200.13
##$BYTORDA= 1
##$CFDGTYP= 0
##$CFRGTYP= 5
##$CHEMSTR= <none>
##$CNST= (0..31)
1 1 145 1 1 1 1 1 1 1 1 1 1 1 1 1 1 1 1 1 1 1 1 1 1 1 1 1 1 1 1 1 
##$CPDPRG= <waltz16>
##$CPDPRG1= <>
##$CPDPRG2= <waltz16>
##$CPDPRG3= <>
##$CPDPRG4= <mlev>
##$CPDPRG5= <mlev>
##$CPDPRG6= <mlev>
##$CPDPRG7= <mlev>
##$CPDPRG8= <mlev>
##$CPDPRGB= <>
##$CPDPRGT= <>
##$D= (0..31)
0 1 0 0 0 0 0 0 0 0 0 0.03 2e-05 3e-06 0 0 0 0 0 0 0 0 0 0 0 0 0 0 0 0 
0 0 
##$DATE= 1712052837
##$DBL= (0..7)
120 120 120 11 120 120 24 19 
##$DBP= (0..7)
150 150 150 150 150 150 150 150 
##$DBP07= 0
##$DBPNAM0= <>
##$DBPNAM1= <>
$$ [...]
##$SUBNAM2= <"">
##$SUBNAM3= <"">
##$SUBNAM4= <"">
##$SUBNAM5= <"">
##$SUBNAM6= <"">
##$SUBNAM7= <"">
##$SUBNAM8= <"">
##$SUBNAM9= <"">
##$SW= 501.771253377433
##$SWIBOX= (0..15)
0 1 3 0 0 0 0 0 0 0 0 0 0 0 0 0 
##$SW_h= 40650.406504065
##$TD= 32768
##$TD0= 1
##$TE= 0
##$TE2= 300
##$TE3= 300
##$TEG= 300
##$TL= (0..7)
0 120 53 12 22 120 120 120 
##$TP= (0..7)
150 150 150 150 150 150 150 150 
##$TP07= 0
##$TPNAME0= <>
##$TPNAME1= <>
##$TPNAME2= <>
##$TPNAME3= <>
##$TPNAME4= <>
##$TPNAME5= <>
##$TPNAME6= <>
##$TPNAME7= <>
##$TPOAL= (0..7)
0.5 0.5 0.5 0.5 0.5 0.5 0.5 0.5 
##$TPOFFS= (0..7)
0 0 0 0 0 0 0 0 
##$TUNHIN= 0
##$TUNHOUT= 0
##$TUNXOUT= 0
##$USERA1= <user>
##$USERA2= <user>
##$USERA3= <user>
##$USERA4= <user>
##$USERA5= <user>
##$V9= 5
##$VALIST= <valist>
##$VCLIST= <CCCCCCCCCCCCCCC>
##$VD= 0
##$VDLIST= <DDDDDDDDDDDDDDD>
##$VPLIST= <PPPPPPPPPPPPPPP>
##$VTLIST= <TTTTTTTTTTTTTTT>
##$WBST= 1024
##$WBSW= 4
##$XGAIN= (0..3)
0 0 0 0 
##$XL= 0
##$YL= 0
##$YMAX_a= 8228
##$YMIN_a= -8258
##$ZGOPTNS= <>
##$ZL1= 120
##$ZL2= 120
##$ZL3= 120
##$ZL4= 120
##$ABSF1= 0
##$ABSF2= 0
##$ABSG= 0
##$ABSL= 0
##$ALPHA= 0
##$AQORDER= 0
##$ASSFAC= 0
##$ASSFACI= 0
##$ASSFACX= 0
##$ASSWID= 0
##$AUNMP= <proc_1d>
##$AZFE= 0.1
##$AZFW= 0.5
##$BCFW= 0
##$BC_mod= 2
##$BYTORDP= 0
##$COROFFS= 0
##$CY= -3
##$DATMOD= 1
##$DC= 0
##$DFILT= <>
##$DTYPP= 0
##$F1P= 0
##$F2P= 0
##$FCOR= 1
##$FTSIZE= 65536
##$FT_mod= 6
##$GAMMA= 0
##$GB= 0
##$INTBC= 1
##$INTSCL= 6.047779e-11
##$ISEN= 30
##$LB= 10
##$LEV0= 0
##$LPBIN= 0
##$MAXI= 10000
##$MC2= 0
##$MEAN= 0
##$ME_mod= 0
##$MI= 50
##$NCOEF= 0
##$NC_proc= -6
##$NLEV= 6
##$NOISF1= 182.463
##$NOISF2= 159.3651
##$NSP= 0
##$NTH_PI= 0
##$NZP= 0
##$OFFSET= 248.5645
##$PC= 4
##$PHC0= -13225.12
##$PHC1= 86.28333
##$PH_mod= 1
##$PKNL= yes
##$PPARMOD= 0
##$PSCAL= 0
##$PSIGN= 0
##$REVERSE= no
##$SF= 81.0140089999694
##$SI= 65536
##$SIGF1= 159.3651
##$SIGF2= -187.1042
##$SINO= 113.3802
##$SIOLD= 16384
##$SREGLST= <1H.CDCl3>
##$SSB= 0
##$STSI= 65536
##$STSR= 0
##$SW_p= 40650.406504065
##$SYMM= 0
##$S_DEV= 0
##$TDeff= 32768
##$TDoff= 0
##$TI= <>
##$TILT= no
##$TM1= 0
##$TM2= 0
##$TOPLEV= 0
##$USERP1= <user>
##$USERP2= <user>
##$USERP3= <user>
##$USERP4= <user>
##$USERP5= <user>
##$WDW= 1
##$XDIM= 65536
##$YMAX_p= 445824525
##$YMIN_p= -3948583
$$ End of Bruker specific parameters
$$ ---------------------------------
##NTUPLES= NMR SPECTRUM
##VAR_NAME=  FREQUENCY,     SPECTRUM/REAL,   SPECTRUM/IMAG
##SYMBOL=    X,             R,               I
##VAR_TYPE=  INDEPENDENT,   DEPENDENT,       DEPENDENT
##VAR_FORM=  AFFN,          ASDF,            ASDF
##VAR_DIM=   65536,         65536,           65536
##UNITS=     HZ,            ARBITRARY UNITS, ARBITRARY UNITS
##FACTOR=    0.620285442955139, 1,           1
##FIRST=     20137.2065510682, 0,            0
##LAST=      -20513.1999529968, 0,           0
##MIN=       -20513.1999529968, -3948583,    0
##MAX=       20137.2065510682, 445824525,    0
$$ Real data points
##PAGE= N=1
##DATA TABLE= (X++(R..R)), XYDATA
$$ [...]
41886 -416098 -474150 -530184 -579366 -617626 -642800 -655158 -657104 -652342 -644793 -637633 -632656 -630078 -628869
41873 -628869 -627519 -625108 -622174 -620971 -624804 -636668 -657769 -686671 -719511 -751102 -776365 -791515
41861 -791515 -794729 -786256 -767899 -742069 -710789 -675228 -635883 -593094 -547521 -500390 -453480 -408772
41849 -408772 -367934 -332043 -301867 -278519 -263866 -260299 -269952 -293785 -330945 -378720 -433179 -490225
41837 -490225 -546570 -600180 -650185 -696513 -739525 -779745 -817625 -853257 -886041 -914543 -936812
41826 -936812 -951269 -957782 -958223 -956041 -954994 -957732 -965049 -976046 -988847 -1001267 -1011134 -1016486 -1015898 -1008912
41812 -1008912 -996270 -979696 -961277 -942663 -924361 -905344 -883264 -855276 -819312 -775273 -725486
41801 -725486 -674032 -625154 -581645 -544149 -511620 -482397 -455221 -429854 -407292 -389540 -378790
41790 -378790 -376256 -381186 -390603 -399905 -404119 -399351 -383957 -358928 -327360 -293310 -260747 -233026 -212815
41777 -212815 -202006 -201293 -209613 -223995 -240208 -254110 -262977 -266135 -264597 -260041 -253772 -246259 -237310
41764 -237310 -226696 -214846 -203255 -194403 -191094 -195497 -208432 -229317 -256733 -289052 -324582 -361241
41752 -361241 -396207 -426096 -447735 -459137 -460108 -452119 -437471 -418136 -394756 -366284 -330505 -285340
41740 -285340 -230434 -168198 -103694 -43330 7044 43780 66316 77126 80839 82856 87929 99142
41728 99142 117553 142418 171726 202843 233194 260874 285052 306069 325220 344288 364904 387788
41716 387788 412119 435369 453782 463360 460855 444313 412963 366737 305905 231195 144373 48781
41704 48781 -50612 -147794 -236557 -311306 -367640 -402750 -415724 -407649 -381356 -340798 -290178 -233204
41692 -233204 -172804 -111414 -51544 3840 51355 87515 108958 112436 94852 53798 -11383 -98580
41680 -98580 -202696 -316499 -432147 -542656 -642863 -729760 -802340 -861147 -907777 -944460 -973697
41669 -973697 -997833 -1018550 -1036483 -1051118 -1060990 -1064037 -1058024 -1041059 -1012201 -972028 -922869 -868453
41657 -868453 -812920 -759652 -710562 -666253 -626782 -592318 -563196 -539467 -520488 -504940 -491183
41646 -491183 -477741 -463656 -448652 -433083 -417690 -403268 -390421 -379452 -370370 -362961 -356884 -351727
41634 -351727 -346982 -341969 -335817 -327575 -316405 -301774 -283679 -262915 -241231 -221129 -205248 -195563
41622 -195563 -192773 -196020 -202936 -209996 -213173 -208845 -194702 -170301 -137129 -98319 -58276 -22341 3669
41609 3669 14151 4623 -27403 -81827 -155735 -243676 -338484 -432587 -519405 -594247 -654486 -699224
41597 -699224 -728915 -745181 -750712 -748947 -743410 -736857 -730606 -724386 -716833 -706418 -692345 -674977 -655703
41584 -655703 -636333 -618376 -602491 -588359 -574974 -561167 -546087 -529529 -512114 -495308 -481115
41573 -481115 -471376 -466853 -466583 -467978 -467669 -462684 -451284 -433059 -408329 -377368 -340066 -296396 -247518
41560 -247518 -196766 -149619 -112363 -90141 -85526 -98286 -126126 -165764 -213805 -267333 -324244 -383371
41548 -383371 -444424 -507677 -573371 -641037 -709117 -775164 -836353 -889964 -933751 -966463 -988472
41537 -988472 -1002042 -1010826 -1018765 -1029010 -1043305 -1061899 -1083853 -1107500 -1130869 -1151912 -1168598 -1179109
41525 -1179109 -1182191 -1177457 -1165293 -1146321 -1120713 -1087800 -1046189 -994355 -931457 -858097 -776801 -692002
41513 -692002 -609358 -534517 -471694 -422631 -386362 -359795 -338793 -319364 -298584 -275142 -249445
41502 -249445 -223322 -199488 -181038 -171112 -172596 -187667 -217183 -260276 -314384 -375558 -438792 -498309
41490 -498309 -548091 -582838 -599233 -596983 -579168 -551495 -520622 -492243 -469845 -454639 -446441 -444899
41478 -444899 -450464 -464683 -489657 -526914 -576349 -635929 -702246 -771394 -839469 -902519 -956397 -997071
41466 -997071 -1021508 -1028672 -1019886 -998246 -967427 -930665 -890426 -848822 -808235 -771586 -741937 -721598
41454 -721598 -711257 -709546 -713162 -717316 -716377 -704747 -678005 -634117 -574120 -501941 -423361 -344662
41442 -344662 -271471 -208097 -157331 -120647 -98572 -90934 -96656 -113147 -135835 -158497 -174534 -178635
41430 -178635 -167942 -142251 -103391 -54417 905 58268 112959 160243 195926 216898 221507 209820
41418 209820 183741 146820 103706 59348 18170 -16585 -43264 -61869 -73833 -81686 -88704 -98561
41406 -98561 -114806 -140260 -176459 -223372 -279436 -341851 -407014 -471027 -530107 -580843 -620225 -645608
41394 -645608 -654840 -646861 -622585 -585443 -540961 -495377 -454149 -421128 -398563 -387498 -388091 -399732
41382 -399732 -421075 -450042 -483866 -519302 -553069 -582512 -606227 -624411 -638746 -651812 -666270
41371 -666270 -684116 -706224 -732318 -761280 -791660 -822092 -851351 -878012 -899989 -914406 -918030 -908161
41359 -908161 -883525 -844698 -793820 -733796 -667492 -597445 -526092 -456163 -390592 -331833 -280943
41348 -280943 -237141 -198269 -161960 -126827 -93002 -61875 -35347 -15065 -1898 4292 4566 547
41336 547 -6095 -14129 -23036 -33114 -45376 -61180 -81551 -106402 -134075 -161500 -184876 -200453 -205174
41323 -205174 -197116 -175895 -142958 -101469 -55629 -9636 33124 70306 100335 122168 135344 140277
41311 140277 138393 131830 122806 112965 103110 93461 84150 75667 68986 65398 66179 72168 83445 99313
41297 99313 118700 140750 165150 191911 220668 250029 277431 299757 314481 320825 320364 316826
41285 316826 315148 320068 334679 359412 391781 427019 459346 483539 496357 497383 488822 474204
41273 474204 456577 437151 415141 388653 355845 315657 267951 213400 153416 90127 26255
41262 26255 -35225 -91574 -140800 -181996 -215347 -241845 -262889 -279998 -294643 -308024 -320711 -332288
41250 -332288 -341276 -345402 -342180 -329705 -307560 -277608 -244276 -213959 -193569 -188686 -202031 -232918
41238 -232918 -277751 -331145 -387015 -439231 -481951 -509946 -519180 -507600 -475804 -427248 -367673 -303824
41226 -303824 -241838 -185822 -137088 -94177 -53656 -11442 35694 89084 148025 210478 274020
41215 274020 336374 395397 448895 494627 530640 555746 569957 574648 572318 565927 558016 549919
41203 549919 541397 530876 516278 496070 469995 439019 404654 368201 330477 292107 253983 217363
41191 217363 183431 152624 124222 96582 67922 37218 4753 -27937 -58647 -85328 -106807
41180 -106807 -123023 -134745 -142927 -148179 -150588 -149932 -145971 -138676 -128369 -115864 -102585 -90494 -81790
41167 -81790 -78494 -82071 -93139 -111317 -135292 -163224 -193402 -224905 -257981 -294021 -335055 -382949
41155 -382949 -438622 -501601 -570039 -640998 -710837 -775716 -832227 -877936 -911624 -933142 -943093 -942519
41143 -942519 -932625 -914611 -889662 -859045 -824080 -785790 -744534 -700008 -651758 -599796 -544855 -488187
41131 -488187 -431156 -374874 -320012 -266811 -215276 -165438 -117551 -72188 -30344 6544 36816
41120 36816 59091 72761 78078 75842 66996 52440 33101 10051 -15418 -41809 -67476 -90661
41108 -90661 -109474 -121789 -125338 -118315 -100468 -74079 -43942 -15994 4825 16290 19265 16679
41096 16679 11792 6754 2161 -2355 -7179 -12239 -17293 -22422 -28113 -34773 -42209 -49496 -55376 -58949
41082 -58949 -60389 -61328 -64642 -73609 -90847 -117467 -152676 -193841 -236965 -277515 -311398 -335719 -349128
41069 -349128 -351682 -344445 -328986 -307028 -280346 -250834 -220489 -191082 -163605 -137899 -112862 -87312
41057 -87312 -61033 -35366 -12913 3401 11351 10018 -113 -17351 -39174 -62797 -85892 -107208
41045 -107208 -126638 -144600 -161148 -175462 -186113 -191883 -192624 -189660 -185520 -183118 -184785 -191685 -203882
41032 -203882 -220826 -241732 -265512 -290430 -313869 -332602 -343581 -344914 -336517 -320118 -298670 -275511
41020 -275511 -253628 -235234 -221680 -213571 -210828 -212605 -217142 -221848 -223700 -219870 -208392 -188693 -161907
41007 -161907 -130721 -98792 -69939 -47421 -33502 -29321 -35027 -50131 -73968 -106150 -146797 -196305
40995 -196305 -254545 -319793 -388022 -453253 -509086 -550758 -576712 -588857 -591393 -588878 -584532 -579506
40983 -579506 -573264 -564732 -553546 -540817 -528983 -520820 -518274 -521824 -530562 -542623 -555507 -566309 -572113
40970 -572113 -570582 -560446 -541616 -514991 -482224 -445559 -407548 -370451 -335494 -302383 -269448 -234399
40958 -234399 -195375 -151831 -104958 -57553 -13385 23668 50426 64958 66784 56809 37047 10249
40946 10249 -20517 -52306 -82736 -110386 -135040 -157726 -180549 -206309 -237872 -277289 -324820 -378280
40934 -378280 -433146 -483620 -524224 -551241 -563317 -561172 -546777 -522543 -490897 -454232 -415055 -376018
40922 -376018 -339702 -308179 -282606 -263014 -248314 -236544 -225301 -212245 -195437 -173432 -145285
40911 -145285 -110745 -70615 -27038 16645 56548 89320 113353 129633 141688 154468 172579
40900 172579 198662 232520 271284 310460 345423 372711 390565 398679 397615 388344 372008 349737
40888 349737 322407 290477 254017 212852 166714 115448 59332 -593 -62493 -124087 -183098
40877 -183098 -237526 -285633 -325927 -357296 -379221 -391852 -395881 -392292 -382051 -365791 -343687 -315617
40865 -315617 -281600 -242147 -198373 -151929 -104966 -60241 -21096 8969 27273 33114 28527 18124
40853 18124 7991 4239 11874 34179 72378 125270 188996 257381 323135 379608 422338 449692
40841 449692 462429 462682 453119 436657 416550 396288 379064 367011 360684 359014 359675 359654 355899 345958
40827 345958 328477 303412 271904 235831 197234 157760 118309 79043 39876 1235 -35343
40816 -35343 -67376 -92454 -109612 -120163 -127478 -135902 -149529 -171361 -202967 -244520 -294994 -352395
40804 -352395 -413946 -476251 -535646 -588775 -633273 -668233 -694304 -713399 -728021 -740218 -750378
40793 -750378 -756366 -753720 -737115 -702610 -649486 -580697 -501873 -419644 -340252 -268814 -208997 -162857
40781 -162857 -130808 -111986 -105094 -109508 -126095 -157100 -205007 -270857 -352910 -446307 -543819 -637241
40769 -637241 -718979 -783324 -827185 -850169 -854236 -843058 -821253 -793569 -764201 -736332 -711806 -690807
40757 -690807 -671758 -651857 -628437 -600556 -569930 -540556 -517230 -503743 -501645 -510023 -526330 -547752
40745 -547752 -572337 -599225 -627851 -656817 -683384 -704024 -715516 -715748 -703755 -679374 -643096 -596295
40733 -596295 -541493 -482302 -422974 -367840 -320885 -285419 -263766 -256944 -264547 -284889 -315303 -352357
40721 -352357 -392048 -430200 -463173 -488664 -506091 -516404 -521447 -523292 -523802 -524576 -527151 -533158 -544058
40708 -544058 -560463 -581468 -604632 -626837 -645570 -660043 -671657 -683646 -699988 -723853 -756315
40697 -756315 -795927 -839357 -882652 -922445 -956617 -984326 -1005576 -1020750 -1030444 -1035533 -1037106 -1036078
40685 -1036078 -1032798 -1027104 -1018810 -1008099 -995357 -980573 -962821 -940242 -910564 -871912 -823634 -766832
40673 -766832 -704435 -640746 -580520 -527770 -484702 -451273 -425625 -405204 -387967 -373128 -361237
40662 -361237 -353773 -352529 -359071 -374373 -398697 -431679 -472456 -519637 -571020 -623281 -671961 -711998
40650 -711998 -738644 -748315 -738997 -710160 -662483 -597728 -518814 -429873 -336006 -242721 -155181 -77582
40638 -77582 -12796 37702 73666 95872 105973 106440 100403 91247 81929 74190 68078 62079 53893
40625 53893 41409 23366 -508 -29697 -63249 -100217 -140123 -183222 -230301 -282075 -338485 -398311
40613 -398311 -459216 -518135 -571723 -616636 -649623 -667767 -669223 -654317 -626295 -590959 -555179 -525032
40601 -525032 -504537 -495321 -496903 -507084 -522277 -537991 -549571 -553141 -546476 -529545 -504526 -475294
40589 -475294 -446473 -422469 -406765 -401489 -407117 -422263 -443667 -466600 -485713 -496230 -495216 -482442
40577 -482442 -460382 -433222 -405436 -380670 -361437 -349434 -345999 -352385 -369807 -399362 -441855 -497406
40565 -497406 -564889 -641404 -722082 -800426 -869218 -921872 -953758 -963020 -950584 -919568 -874662 -821718
40553 -821718 -767238 -717445 -677104 -648690 -632260 -625897 -626371 -629961 -633559 -635862 -638087 -643614 -656583
40540 -656583 -680053 -714584 -757890 -805645 -852956 -895794 -931841 -960720 -983795 -1003615 -1022977
40529 -1022977 -1043690 -1065598 -1086317 -1101884 -1107825 -1100101 -1075598 -1032329 -969636 -888492 -791723 -683890
40517 -683890 -570712 -458228 -351965 -256348 -174461 -108113 -57991 -23722 -3882 3743 1363
40506 1363 -9853 -30280 -61256 -103681 -156694 -217188 -280260 -340243 -391846 -431181 -456397 -467801
40494 -467801 -467365 -457766 -441340 -419422 -392393 -360413 -324446 -286960 -251964 -224404 -209223 -210333
40482 -210333 -229782 -267263 -320233 -384517 -455131 -526922 -595020 -655223 -704469 -741166 -765179
40471 -765179 -777417 -779273 -772218 -757716 -737417 -713469 -688688 -666340 -649443 -639920 -638121 -643052
40459 -643052 -653244 -667640 -685991 -708581 -735533 -766189 -798864 -831102 -860295 -884416 -902544
40448 -902544 -914988 -922987 -928156 -931865 -934688 -936067 -934246 -926634 -910606 -884536 -848618 -804961 -756859
40435 -756859 -707658 -659924 -615266 -574592 -538327 -506419 -478238 -452623 -428174 -403687 -378563
40424 -378563 -352912 -327272 -302135 -277735 -254338 -232782 -214724 -202253 -197081 -199767 -209375 -223811
40412 -223811 -240673 -258218 -275814 -293642 -311991 -330786 -349609 -368023 -385726 -402402 -417390
40401 -417390 -429363 -436333 -436108 -427155 -409425 -384667 -356068 -327396 -302005 -282042 -268134 -259708
40389 -259708 -255751 -255628 -259501 -268167 -282371 -301808 -324265 -345444 -359733 -361543 -346533 -312248 -258351
40376 -258351 -186774 -101793 -9596 82867 169422 245873 310330 362724 403945 435047 456794
40365 456794 469597 473747 469825 458963 442869 423511 402586 380936 358209 332969 303266 267441
40353 267441 224760 175689 121753 65203 8689 -45004 -93240 -133898 -165557 -187207 -197613
40342 -197613 -195013 -177790 -145881 -101920 -51222 -593 43355 75656 93828 97981 90222 73624
40330 73624 51267 25763 -761 -26528 -50162 -70955 -89064 -105399 -121163 -137243 -153727 -169790
40318 -169790 -184025 -195120 -202550 -206831 -209080 -210107 -209737 -206818 -199860 -187687 -169654 -145539 -115606
40305 -115606 -81141 -45106 -12107 12706 25529 25582 15784 2196 -7551 -6349 10278 42703 86874
40292 86874 135310 179064 210043 223038 216890 194514 161782 125672 92279 65185 44696 28196
40280 28196 11599 -8654 -33983 -63184 -93137 -120202 -141501 -155608 -162590 -163658 -160655 -155548
40268 -155548 -149896 -144487 -139386 -134637 -131348 -132501 -142735 -167053 -209026 -269411 -345844 -433741 -527954
40255 -527954 -624304 -720170 -813925 -903803 -987091 -1060133 -1118918 -1159837 -1180401 -1179908 -1159969 -1124659
40243 -1124659 -1080042 -1033062 -990072 -955511 -931259 -916902 -910599 -910032 -913047 -917962 -923620 -929253 -934254
40230 -934254 -938013 -939946 -939654 -937081 -932580 -926913 -921141 -916443 -913969 -914883 -920429 -931716 -949040 -971138
40216 -971138 -995015 -1016661 -1032219 -1038955 -1035659 -1022701 -1002127 -977699 -954405 -937200 -929317 -931095
40204 -931095 -939902 -951161 -959841 -961821 -954718 -938093 -912991 -881020 -843436 -800702 -752710 -699349
40192 -699349 -640950 -578380 -512881 -445837 -378498 -311693 -245607 -179829 -113757 -47241 18904
40181 18904 82796 141906 193734 236323 268393 289195 298416 296262 283643 262219 234227 202151
40169 202151 168357 134873 103352 75218 51869 34765 25279 24327 31862 46495 65450 84920
40157 84920 100671 108672 105591 89158 58441 13943 -42523 -108167 -179505 -252621 -323515 -388636
40145 -388636 -445402 -492263 -528153 -551735 -561119 -554426 -530940 -492257 -442769 -389211 -339318 -300070
40133 -300070 -276150 -269179 -277937 -299264 -329206 -363949 -400405 -436374 -470412 -501478 -528602 -550780
40121 -550780 -567114 -577084 -580738 -578693 -571889 -561182 -546988 -529319 -508254 -484465 -459268 -434063
40109 -434063 -409557 -385322 -360029 -332208 -301097 -267105 -231587 -196118 -161611 -127728 -92747
40098 -92747 -53974 -8721 44351 104171 167063 227655 280417 321196 348199 362265 366488 365350
40086 365350 363528 364613 370065 378861 388016 393670 392037 379902 354742 314816 259361 188792 104893
40073 104893 10843 -89018 -189873 -287282 -377760 -458729 -528047 -583658 -623828 -647912 -657039
40062 -657039 -654113 -643052 -627894 -612375 -599997 -594013 -596939 -609927 -632529 -663140 -699824 -741141
40050 -741141 -786710 -837362 -894749 -960405 -1034529 -1115114 -1197984 -1277906 -1350211 -1412029 -1462557
40039 -1462557 -1502419 -1532769 -1554555 -1568132 -1573100 -1568420 -1552860 -1525681 -1487240 -1439163 -1384032 -1324768
40027 -1324768 -1264012 -1203610 -1144303 -1085670 -1026522 -965709 -903065 -840060 -779921 -727170 -686624
40016 -686624 -662001 -654544 -662250 -680166 -701739 -720661 -732476 -735283 -729424 -716593 -699056 -679324
40004 -679324 -660060 -643781 -632260 -625920 -623628 -623022 -621263 -615977 -605968 -591439 -573651 -554328 -535136
39991 -535136 -517388 -501849 -488551 -476584 -464042 -448292 -426545 -396607 -357484 -309708 -255325
39980 -255325 -197552 -140136 -86619 -39769 -1393 27647 47456 59177 64857 66855 66972 65663
39968 65663 61717 52450 34349 4060 -40449 -98932 -168556 -244580 -321778 -395950 -464777 -527673
39956 -527673 -584901 -636532 -681805 -719081 -746316 -761735 -764491 -755104 -735532 -708749 -677837 -644836
39944 -644836 -609932 -571568 -527659 -477369 -422436 -367216 -317412 -278122 -252109 -238971 -235489 -236927
39932 -236927 -238753 -238015 -233877 -227277 -219975 -213521 -208554 -204803 -201665 -198969 -197344 -197977 -202045 -210356 -223484
39917 -223484 -242074 -266721 -297235 -331841 -367161 -399193 -424702 -442068 -451372 -454050 -452575 -450132
39905 -450132 -450065 -455112 -466742 -484893 -508134 -534004 -559432 -581201 -596408 -602748 -598480 -582245 -553079
39892 -553079 -510818 -456618 -393242 -324940 -257004 -195125 -144570 -109324 -91483 -91125 -106560 -134774
39880 -134774 -171967 -214240 -258346 -302229 -345172 -387581 -430525 -475093 -521612 -568939 -614233
39869 -614233 -653436 -682350 -697849 -698809 -686529 -664545 -637906 -612097 -591948 -580850 -580393 -590402
39857 -590402 -609221 -634168 -662123 -690153 -716215 -739717 -761660 -784029 -808587 -835670 -863652
39846 -863652 -889281 -908557 -917744 -914227 -897102 -867288 -827138 -779638 -727485 -672374 -614728 -554036
39834 -554036 -489639 -421609 -351301 -281388 -215550 -157964 -112627 -82610 -69388 -72537 -89859 -117780
39822 -117780 -151831 -187195 -219386 -245054 -262601 -272278 -275692 -275071 -272682 -270620 -270842 -275294 -285964
39809 -285964 -304790 -333330 -372266 -421023 -477743 -539710 -604055 -668461 -731547 -792735 -851627
39798 -851627 -907321 -958136 -1001968 -1036993 -1062320 -1078165 -1085575 -1085850 -1080047 -1068785 -1052359 -1031065
39786 -1031065 -1005662 -977828 -950297 -926349 -908758 -898791 -895898 -898132 -902909 -907646 -910209 -909223 -904255
39773 -904255 -895753 -884663 -871854 -857644 -841780 -823958 -804602 -785427 -769447 -760370 -761472 -774296
39761 -774296 -797737 -828101 -860301 -889651 -913391 -931306 -945335 -958425 -973082 -990160 -1008250
39750 -1008250 -1023957 -1032956 -1031461 -1017503 -991466 -955669 -913311 -867333 -819648 -770905 -720655 -667831
39738 -667831 -611314 -550496 -485685 -418339 -351068 -287260 -230345 -182865 -145793 -118469 -99240
39727 -99240 -86397 -78887 -76409 -78922 -85946 -96193 -107854 -119447 -130634 -142457 -156892 -176181
39715 -176181 -202407 -237357 -282354 -337889 -403125 -475584 -551172 -624592 -690076 -742208 -776687
39704 -776687 -790837 -783887 -757088 -713634 -658356 -597077 -535744 -479621 -432901 -398781 -379773 -377769
39692 -377769 -393589 -426126 -471570 -523382 -573304 -613221 -637109 -642323 -629930 -604135 -571037 -536992
39680 -536992 -507058 -484127 -469053 -461536 -461113 -467700 -481610 -503261 -532897 -570348 -614680 -663748
39668 -663748 -714046 -761269 -801501 -832363 -853478 -866210 -873043 -876950 -880807 -886896 -896584 -910275
39656 -910275 -927554 -947513 -969267 -992573 -1018051 -1046674 -1078692 -1112795 -1146212 -1175753 -1198953
39645 -1198953 -1214566 -1222244 -1221946 -1213740 -1198127 -1176469 -1150914 -1123751 -1096553 -1069670 -1042321 -1013164
39633 -1013164 -980999 -945281 -906196 -864319 -820126 -773739 -725096 -674390 -622395 -570453 -520158
39622 -520158 -473035 -430392 -393423 -363414 -341816 -330027 -328883 -338093 -355883 -379169 -404379 -428748
39610 -428748 -451457 -473927 -498957 -529167 -565632 -607446 -652370 -698072 -743196 -787636 -831856
39599 -831856 -875833 -918272 -956669 -988047 -1009960 -1021254 -1022330 -1014886 -1001296 -984000 -965184 -946761
39587 -946761 -930431 -917558 -908908 -904505 -903759 -905709 -909158 -912590 -914003 -910888 -900389 -879650 -846336
39574 -846336 -799270 -738993 -667853 -589557 -508286 -427860 -351330 -281105 -219336 -168031 -128617
39563 -128617 -101164 -83940 -73752 -66998 -60840 -53912 -46285 -38790 -32049 -25783 -18791 -9548 3014
39550 3014 18965 37171 55313 70039 77363 73345 55028 21365 -26221 -84055 -147161 -210510
39538 -210510 -269978 -322776 -367492 -403999 -433219 -456727 -476296 -493504 -509421 -524241 -536989
39527 -536989 -545548 -547182 -539500 -521521 -494515 -462306 -430804 -406702 -395638 -400479 -420460 -451590
39515 -451590 -488086 -524052 -554776 -577416 -591321 -598097 -601322 -605665 -615440 -633045 -657903 -686450
39503 -686450 -713236 -732582 -740048 -733244 -712088 -678805 -637668 -594226 -554014 -521222 -497978 -484421
39491 -484421 -479228 -480085 -484054 -488019 -489407 -486923 -480865 -472787 -464756 -458707 -456239 -458692 -467137 -482028
39477 -482028 -502685 -527003 -551606 -572404 -585354 -587213 -576064 -551477 -514243 -465925 -408541 -344598
39465 -344598 -277343 -210940 -150205 -99836 -63355 -42256 -35794 -41450 -55852 -75728 -98560 -122749
39453 -122749 -147374 -171740 -194961 -215794 -232778 -244693 -251112 -252626 -250470 -245733 -238778 -229274 -216758
39440 -216758 -201218 -183361 -164517 -146313 -130197 -116934 -106339 -97535 -89679 -82751 -77835 -76657
39428 -76657 -80679 -90351 -104931 -122836 -142298 -162003 -181560 -201642 -223672 -249085 -278361 -310240
39416 -310240 -341628 -368486 -387399 -397034 -398662 -395649 -392396 -393324 -402022 -420421 -448077 -481979 -517224
39403 -517224 -548381 -570907 -582007 -580721 -567481 -543553 -510758 -471576 -429382 -388330 -352665 -325665
39391 -325665 -308824 -301644 -302037 -306963 -313108 -317433 -317634 -312356 -301217 -284662 -263763 -240017 -215113
39378 -215113 -190623 -167642 -146457 -126379 -105811 -82589 -54543 -20204 20646 66773 115598
39367 115598 163402 205594 237391 255055 257221 245458 223616 196389 167829 140357 114460 89090
39355 89090 62641 34045 3444 -27743 -57122 -81628 -97862 -102570 -93400 -69627 -32557 14537
39343 14537 66887 118907 165056 200742 223090 231256 226165 209844 184799 153701 119354 84591
39331 84591 51892 22938 -1504 -21228 -36039 -45522 -49251 -47141 -39599 -27339 -11142 8142
39319 8142 29321 50535 69304 83099 90192 90319 84746 75788 65970 57246 50529 45691 41940 38327
39305 38327 34195 29506 24988 22038 22338 27258 37254 51520 68170 85073 101056 116767 134534
39292 134534 157172 186369 221498 259368 294984 322869 338346 338240 320950 286209 235004 169743
39280 169743 94401 14328 -64464 -136315 -196951 -244297 -278902 -303879 -324321 -346208 -375095
39269 -375095 -415006 -467853 -533433 -609806 -693803 -781445 -868206 -949188 -1019362 -1074081 -1109858
39258 -1109858 -1125183 -1120916 -1099918 -1066066 -1023232 -974754 -923400 -871493 -821025 -773867 -732184
39247 -732184 -698784 -676932 -669559 -678222 -702414 -739540 -785495 -835459 -884641 -928799 -964614 -989953
39235 -989953 -1003972 -1006983 -1000226 -985584 -965364 -942003 -917753 -894296 -872445 -852057 -832267 -812066
39223 -812066 -791024 -769834 -750426 -735615 -728501 -731825 -747292 -774795 -811814 -853499 -893767 -926985
39211 -926985 -949341 -959260 -957084 -944554 -924395 -899888 -874270 -850037 -828503 -809804 -793339 -778431
39199 -778431 -764804 -752646 -742375 -734432 -729226 -727130 -728314 -732416 -738323 -744176 -747587 -746084 -737688
39186 -737688 -721554 -698312 -669818 -638333 -605636 -572597 -539391 -506098 -473247 -442026 -414194
39175 -414194 -391842 -377160 -372246 -378777 -397392 -426941 -464084 -503773 -540565 -570226 -590933 -603716
39163 -603716 -612100 -620955 -634822 -656207 -684625 -716845 -748210 -774249 -791755 -798982 -795206 -780243
39151 -780243 -754273 -717979 -672757 -620830 -565029 -508176 -452309 -398262 -345977 -295327 -246868
39140 -246868 -202154 -163693 -134701 -118539 -117634 -132159 -159173 -192932 -226475 -253785 -271632 -280294
39128 -280294 -283035 -284669 -289887 -301924 -321927 -349008 -380661 -413293 -442749 -464849 -475968 -473593
39116 -473593 -456783 -426331 -384432 -333814 -276625 -213725 -144760 -69023 13361 100520 188696
39105 188696 273068 349165 414122 467156 509215 542246 568500 590062 608524 624827 639268
39094 639268 651680 661739 669253 674258 676845 676832 673572 666055 653190 634037 607825 573830 531271
39081 531271 479473 418359 349053 274154 197506 123493 56157 -1706 -49269 -87927 -120932
39070 -120932 -152398 -186153 -224798 -269248 -318833 -371883 -426515 -481261 -535277 -588152 -639527
39059 -639527 -688746 -734676 -775861 -810884 -838751 -858954 -871233 -875339 -871009 -858178 -837236 -809107
39047 -809107 -775139 -736803 -695310 -651228 -604191 -552931 -495731 -431296 -359584 -282202 -202123
39036 -202123 -123030 -48629 17842 73864 117647 147860 163279 162728 145628 112926 67868 16032
39024 16032 -35522 -79623 -110341 -123851 -118737 -95861 -57996 -9338 45094 100136 151117 194441
39012 194441 228011 251432 265859 273552 277306 279997 284231 291949 303894 319164 335203 348389
39000 348389 354974 351891 337141 309784 269883 218560 158158 92178 24782 -40154 -99921 -153230
38988 -153230 -199585 -238289 -267892 -286563 -293083 -287690 -272145 -249167 -221795 -193237 -167096 -147420
38976 -147420 -138063 -141497 -157763 -184342 -217167 -252283 -287219 -321340 -355070 -388585 -420886 -449879
38964 -449879 -473408 -490559 -502396 -511653 -521557 -534495 -551195 -570698 -590895 -609164 -622828 -629368
38952 -629368 -626564 -612863 -587989 -553513 -512944 -471068 -432830 -402394 -382785 -376067 -383631 -406178
38940 -406178 -443272 -492772 -550632 -611425 -669425 -719758 -759047 -785468 -798421 -798196 -785894 -763711
38928 -763711 -735364 -706174 -682313 -669228 -669928 -684113 -708604 -738833 -770618 -801387 -830467 -858515
38916 -858515 -886566 -915243 -944391 -973081 -999793 -1022665 -1039890 -1050203 -1053312 -1050027 -1041983 -1031125
38904 -1031125 -1019245 -1007801 -998022 -991053 -987878 -988891 -993315 -998858 -1002100 -999713 -990035 -974107 -955548
38891 -955548 -939415 -930713 -933146 -948339 -975530 -1011723 -1052222 -1091442 -1123878 -1145096 -1152383 -1144757
38879 -1144757 -1122327 -1085486 -1034420 -969127 -889749 -797071 -693046 -581097 -466028 -353557
38869 -353557 -249582 -159291 -86286 -32010 4216 24633 32313 30570 22537 10846 -2462 -15792
38857 -15792 -27833 -37674 -45216 -51505 -58640 -69223 -85612 -109353 -140919 -179742 -224392 -272805
38845 -272805 -322591 -371419 -417399 -459316 -496645 -529297 -557356 -580992 -600694 -617537 -633187
38834 -633187 -649511 -668071 -689799 -715022 -743707 -775759 -811169 -849826 -891048 -933128 -973219
38823 -973219 -1007604 -1032194 -1043112 -1037372 -1013663 -973030 -919037 -857131 -793244 -732149 -676256 -625465
38811 -625465 -578039 -531967 -486027 -440101 -394859 -351174 -309529 -269420 -228923 -184859 -133853
38800 -133853 -73975 -6013 66340 137393 200765 250460 281488 290192 274520 234330 171603 90351
38788 90351 -3910 -104958 -206687 -303859 -392671 -470893 -537446 -591557 -632071 -657424 -666282
38777 -666282 -658426 -635386 -600476 -558099 -512585 -467147 -423507 -382330 -344069 -309567 -279993 -256192
38765 -256192 -237867 -223179 -209094 -192249 -169834 -139984 -101750 -55002 -571 59476 121781
38754 121781 182016 235504 277879 305646 316648 310351 287866 251777 205872 154815 103597 56635
38742 56635 16723 -15600 -41793 -64162 -84501 -103434 -120848 -136886 -152505 -169075 -187519 -207905
38730 -207905 -229883 -253546 -279975 -311013 -348340 -392302 -441062 -490515 -535139 -569347 -588735
38719 -588735 -590711 -574456 -540517 -490402 -426260 -350644 -266258 -175784 -81855 12834 105417 192917
38707 192917 272421 341223 396866 437111 459981 463956 448309 413477 361353 295323 220035 140997
38695 140997 64119 -4888 -61434 -103090 -130282 -146031 -154850 -161371 -169288 -180762 -196112 -213717
38683 -213717 -230293 -241710 -244298 -236268 -218637 -195197 -171409 -152710 -142959 -143584 -153600 -170296
38671 -170296 -190332 -210844 -230152 -247722 -263423 -276618 -285845 -289355 -286118 -276509 -262130 -244965
38659 -244965 -226417 -206802 -185579 -162171 -136930 -111671 -89510 -74206 -69383 -77818 -100789 -137595
38647 -137595 -185481 -240126 -296473 -349619 -395604 -432014 -458239 -475265 -485018 -489487 -489986 -486846
38635 -486846 -479620 -467679 -450796 -429366 -404287 -376683 -347758 -318781 -291147 -266457 -246564 -233494
38623 -233494 -229196 -235099 -251633 -277838 -311260 -348217 -384424 -415710 -438596 -450582 -450241 -437383
38611 -437383 -413394 -381574 -347017 -315706 -293080 -282763 -286019 -301971 -328232 -361579 -398660 -436654
38599 -436654 -473688 -508755 -541238 -570425 -595417 -615431 -630285 -640746 -648617 -656467 -667068 -682707
38587 -682707 -704703 -733291 -767775 -806733 -848212 -890073 -930471 -968176 -1002498 -1032987 -1059205
38576 -1059205 -1080771 -1097486 -1109363 -1116570 -1119359 -1117990 -1112647 -1103501 -1091070 -1076770 -1063188 -1053709
38564 -1053709 -1051601 -1059066 -1076713 -1103549 -1137258 -1174476 -1211077 -1242613 -1265024 -1275429 -1272758 -1257946
38552 -1257946 -1233617 -1203328 -1170570 -1137817 -1105967 -1074443 -1041874 -1006956 -969023 -928083 -884592
38541 -884592 -839265 -792981 -746553 -700310 -653669 -605003 -551799 -491095 -420200 -337669 -244146
38530 -244146 -142544 -37353 66516 164696 253793 331399 396005 446986 484651 510158 525131
38519 525131 531018 528506 517313 496425 464527 420357 362935 291904 208119 114263 15003 -83602
38507 -83602 -175288 -254795 -318696 -365705 -396504 -413143 -418143 -413632 -400828 -380060 -351213 -314344
38495 -314344 -270236 -220690 -168477 -116992 -69663 -29207 3048 27485 45868 60530 73533
38484 73533 86331 100026 115784 134873 158118 185133 214010 241784 265436 282812 293025 296343
38472 296343 293793 286726 276440 263910 249702 234103 217475 200626 184960 172230 163954 160752
38460 160752 161852 164899 166188 161444 146996 120938 83666 37603 -13589 -65811 -115077 -157940
38448 -157940 -191967 -216171 -231118 -238548 -240649 -239368 -236043 -231369 -225595 -218801 -211123 -202895 -194714
38435 -194714 -187539 -182742 -181950 -186529 -196903 -212154 -230227 -248706 -265644 -280004 -291547 -300392 -306620
38422 -306620 -310123 -310623 -307769 -301183 -290460 -275149 -254799 -229186 -198714 -164880 -130585 -100071
38410 -100071 -78386 -70393 -79598 -107172 -151588 -209007 -274285 -342178 -408253 -469279 -523127 -568519
38398 -568519 -604851 -632139 -650936 -662151 -666745 -665296 -657626 -642690 -618955 -585138 -540932 -487335
38386 -487335 -426450 -361027 -294121 -229034 -169360 -118706 -79964 -54489 -41783 -39886 -46177 -58070
38374 -58070 -73373 -90291 -107233 -122493 -133995 -139389 -136622 -124774 -104657 -78674 -49991 -21542
38362 -21542 4484 26543 43469 54408 58981 57341 50026 37778 21425 1892 -19750 -42206
38350 -42206 -63936 -83349 -99194 -111016 -119389 -125871 -132731 -142523 -157575 -179454 -208521 -243771
38338 -243771 -283108 -324049 -364648 -404255 -443755 -485152 -530561 -580915 -634966 -689196 -738854
38327 -738854 -779645 -809208 -827673 -837297 -841444 -843377 -845233 -847538 -849416 -849279 -845587 -837318 -824203
38314 -824203 -806771 -786182 -763708 -740162 -715760 -690712 -666127 -644408 -628698 -621649 -624239 -635230
38302 -635230 -651455 -668815 -683555 -693335 -697719 -697984 -696437 -695492 -696848 -701145 -708193 -717506 -728666 -741385
38288 -741385 -755478 -770963 -788128 -807328 -828449 -850411 -871021 -887308 -896113 -894697 -881168 -854684
38276 -854684 -815547 -765275 -706588 -643197 -579297 -518917 -465368 -421018 -387396 -365339 -354942
38265 -354942 -355347 -364693 -380583 -400929 -424756 -452369 -484789 -522682 -565322 -610002 -652116 -685873
38253 -685873 -705440 -706260 -686247 -646496 -591215 -526711 -459678 -395423 -336764 -283918 -235102 -187331
38241 -187331 -137152 -81431 -18206 52786 130230 211848 294969 376590 453072 519895 571811
38230 571811 603423 609991 588219 536976 457882 355610 237561 112771 -9654 -121977 -218667
38219 -218667 -296627 -354987 -394599 -417391 -425901 -423171 -412890 -399385 -387168 -380225 -381344 -391664
38207 -391664 -410509 -435457 -462745 -487997 -507124 -517173 -516807 -506313 -487159 -461369 -431054 -398233
38195 -398233 -364861 -332914 -304459 -281760 -267240 -263048 -270214 -287840 -312945 -341165 -367855 -389008
38183 -389008 -401669 -403979 -395115 -375301 -345832 -309050 -268165 -226905 -188958 -157259 -133288 -116705
38171 -116705 -105569 -97023 -88024 -75759 -57729 -31833 3253 47410 98594 153079 206471 255011
38159 255011 296383 329745 355175 372933 382746 383346 372512 347876 308144 254050 188448 115596
38147 115596 40124 -33774 -102710 -164186 -216646 -259542 -293318 -319143 -338473 -352681 -362875
38136 -362875 -369857 -374073 -375541 -373846 -368351 -358674 -345235 -329466 -313482 -299440 -289074 -283658 -284067
38123 -284067 -290518 -301962 -315600 -327074 -331481 -324860 -305488 -274313 -234368 -189573 -143677 -99808
38111 -99808 -60477 -27646 -2526 14692 24934 29902 31390 30500 27120 19954 7209 -12352 -38442
38098 -38442 -68846 -99800 -126942 -146476 -156024 -154983 -144444 -126805 -105165 -82478 -60699 -40385
38086 -40385 -21027 -1847 17530 36915 55747 73370 89163 102608 113350 121239 126365 129048
38074 129048 129751 128836 126258 121349 112913 99656 80789 56494 28016 -2575 -32823 -60270 -82874
38061 -82874 -99542 -110756 -118914 -127998 -142394 -165387 -197911 -238082 -281655 -323299 -358317 -384148
38049 -384148 -401091 -411931 -420785 -431765 -447854 -470176 -497759 -527883 -556993 -581813 -600122 -610766
38037 -610766 -613078 -606259 -589275 -561320 -522412 -473669 -417133 -355350 -290965 -226488 -164293 -106731
38025 -106731 -56037 -13759 20030 47067 70323 92856 116812 143076 171460 201026 230287
38014 230287 257369 280230 296949 305971 306208 297061 278485 251094 216242 175981 132924 90079
38002 90079 50593 17270 -8045 -25018 -35012 -40801 -45829 -53260 -65148 -82069 -103345 -127649
37990 -127649 -153684 -180700 -208804 -239045 -273211 -313263 -360530 -414932 -474562 -535799 -593877
37979 -593877 -643737 -680882 -701944 -704911 -689163 -655586 -606607 -545844 -477250 -404285 -329799 -256577
37967 -256577 -187823 -126902 -76482 -37906 -11287 3802 7741 648 -17485 -46653 -86725 -137264
37955 -137264 -197181 -264261 -334828 -403802 -465299 -513658 -544520 -555516 -546475 -519269 -477374 -425199
37943 -425199 -367140 -306654 -245729 -184980 -124271 -63571 -3646 53745 106288 152007 190164
37932 190164 221665 248782 274418 301276 331324 365664 404624 447779 493849 540639 585323
37921 585323 625023 657437 681148 695507 700266 695216 679974 653901 616095 565442 500747 421024
37909 421024 326000 216737 96050 -31677 -161270 -287768 -407065 -516137 -612930 -696164
37899 -696164 -765120 -819474 -859316 -885331 -898950 -902283 -897854 -888249 -875729 -861849 -847190 -831410
37887 -831410 -813689 -793446 -770924 -747322 -724368 -703567 -685549 -669862 -655279 -640506 -624950
37876 -624950 -609232 -595138 -584994 -580643 -582423 -588613 -595773 -599971 -598414 -590610 -578529 -565757 -556100
37863 -556100 -552220 -554875 -563067 -575007 -589306 -605616 -624490 -646685 -672435 -700997 -730559 -758441
37851 -758441 -781594 -797360 -804375 -803336 -797073 -789793 -785719 -787920 -797793 -815257 -839190 -867700 -898128
37838 -898128 -927010 -950361 -964358 -966162 -954450 -929438 -892592 -846326 -793820 -738799 -685075 -635876
37826 -635876 -593186 -557479 -528050 -503739 -483506 -466367 -450802 -434202 -413041 -383886 -344711
37815 -344711 -295747 -239549 -180421 -123561 -74143 -36388 -12786 -3744 -7737 -21782 -42003 -64194
37803 -64194 -84447 -99826 -108893 -111851 -110136 -105626 -99958 -94366 -90019 -88377 -91099 -99476 -113811 -133113
37789 -133113 -155343 -178124 -199616 -219116 -237005 -254087 -270793 -286811 -301367 -313946 -324954
37778 -324954 -335888 -348973 -366517 -390313 -421199 -458732 -501037 -544925 -586331 -620878 -644460
37767 -644460 -653743 -646651 -622677 -582898 -529625 -465789 -394339 -317838 -238437 -158201 -79560 -5574
37755 -5574 60290 114905 156466 185211 203387 214376 221476 226985 232031 236905 241418 244942 246255
37742 246255 243583 235011 219082 195225 163873 126432 85179 42995 2798 -33192 -63959 -89730
37730 -89730 -111701 -131784 -152496 -176759 -207427 -246661 -295559 -354214 -421977 -497491 -578438 -661296
37718 -661296 -741516 -814218 -875159 -921559 -952441 -968403 -970932 -961621 -941566 -911092 -869881 -817476
37706 -817476 -754022 -680860 -600645 -517073 -434606 -358408 -294174 -247409 -222195 -220040 -239391 -275972
37694 -275972 -323632 -375425 -424745 -466319 -496814 -514909 -520931 -516289 -502925 -482886 -458125 -430499
37682 -430499 -401768 -373404 -346332 -320837 -296882 -274644 -254936 -239262 -229499 -227274 -233336 -247217
37670 -247217 -267435 -292090 -319435 -348044 -376594 -403506 -426835 -444517 -454971 -457789 -454227 -447286
37658 -447286 -441296 -441030 -450482 -471703 -504214 -545262 -590673 -635774 -675956 -706850 -724361 -724871 -705817
37645 -705817 -666596 -609378 -539290 -463640 -390334 -326069 -275023 -238539 -215721 -204342 -201579 -204431
37633 -204431 -210116 -216567 -222756 -228595 -234441 -240562 -246822 -252717 -257792 -262328 -267892 -277243 -293425 -318480
37619 -318480 -352538 -393704 -438680 -483625 -524856 -559289 -584767 -600409 -606823 -605816 -599509 -589326
37607 -589326 -575606 -558181 -537512 -515519 -495491 -481060 -474813 -477257 -486735 -500234 -514550 -527093
37595 -527093 -536043 -540107 -538281 -529799 -514200 -491452 -462123 -427551 -389851 -351604 -315263 -282462
37583 -282462 -253574 -227775 -203734 -180721 -159649 -143421 -136225 -142019 -162920 -198398 -245603 -300455
37571 -300455 -358776 -416968 -472177 -522152 -564965 -598763 -621667 -632024 -628924 -612699 -584996 -548273
37559 -548273 -504966 -456821 -404773 -349398 -291574 -232943 -175971 -123521 -78165 -41570 -14337
37548 -14337 3701 13109 14817 10471 2821 -4312 -6595 -110 17619 46890 85643 129884 174590
37535 174590 214782 246501 267494 277421 277539 269938 256657 239065 217830 193407 166623 138919
37523 138919 112043 87492 66074 47745 31717 16736 1481 -14863 -32153 -49190 -64278
37512 -64278 -76197 -85034 -92224 -99616 -108199 -117373 -125410 -130850 -133928 -137022 -143796 -157571 -179780 -209140
37498 -209140 -241764 -272130 -294797 -306284 -306299 -297600 -284648 -271953 -263034 -260334 -265559 -279853 -303524
37485 -303524 -335633 -373986 -415791 -458647 -501288 -543651 -586365 -630082 -675030 -720926 -767089
37474 -767089 -812497 -855569 -893870 -924121 -942782 -946964 -935189 -907620 -865819 -812334 -750367 -683559
37462 -683559 -615767 -550740 -491645 -440583 -398203 -363627 -334761 -308985 -284042 -258758 -233242
37451 -233242 -208449 -185343 -164066 -143599 -122107 -97791 -69691 -37979 -3633 32109 68079
37440 68079 103162 136202 166062 191904 213399 230587 243333 250728 250983 242073 222842 193893
37428 193893 157679 117753 77521 39130 2993 -31716 -65864 -99048 -128994 -151997 -164158
37417 -164158 -162710 -146835 -117757 -78379 -32766 14420 58593 96005 124364 143016 152514 153692
37405 153692 146733 130678 103727 64099 11016 -54699 -130593 -213114 -298480 -383523 -466132 -545095
37393 -545095 -619577 -688681 -751336 -806540 -853686 -892890 -925128 -951970 -974735 -993397 -1006038
37382 -1006038 -1009542 -1001373 -981386 -952488 -919887 -889386 -865589 -850620 -843731 -841941 -841443 -839147 -833765
37369 -833765 -826168 -819137 -816589 -822464 -839550 -868707 -908653 -956296 -1007420 -1057606 -1103121 -1141370
37357 -1141370 -1170714 -1189974 -1198153 -1194649 -1179687 -1154659 -1122201 -1085996 -1050208 -1018567 -993311 -974547
37345 -974547 -960490 -948432 -935885 -921272 -904032 -884401 -863078 -840867 -818254 -795136 -770878
37334 -770878 -744764 -716626 -687268 -658350 -631611 -607819 -586150 -564535 -540759 -513524 -482887
37323 -482887 -450044 -416840 -385283 -357151 -333753 -315982 -304548 -300164 -303420 -314402 -332443 -356246
37311 -356246 -384352 -415490 -448548 -482237 -514886 -544596 -569524 -587925 -597951 -597607 -585189 -560041
37299 -560041 -523124 -476983 -425138 -371231 -318349 -268789 -224253 -186254 -156356 -136068 -126448 -127707
37287 -127707 -138975 -158253 -182486 -207867 -230482 -247157 -256224 -257933 -254453 -249512 -247625 -253037 -268755
37274 -268755 -296074 -334728 -383288 -439431 -500029 -561247 -618910 -669118 -708833 -736095 -749819
37263 -749819 -749501 -735262 -708193 -670553 -625353 -575516 -523167 -469557 -415591 -362572 -312706 -269066
37251 -269066 -234998 -213248 -205176 -210327 -226398 -249541 -274885 -297155 -311324 -313284 -300465 -272195
37239 -272195 -229577 -174869 -110742 -39692 36147 114861 194392 272295 345854 412566 470616
37228 470616 518990 557208 584994 602147 608667 604982 592138 571832 546356 518516 491513 468620
37216 468620 452643 445345 447115 457009 472940 491906 510242 524035 529746 524882 508525 481538
37204 481538 446358 406430 365444 326623 292238 263459 240537 223153 210783 202929 199114 198650
37192 198650 200298 202160 202085 198522 191393 182410 174611 171280 174704 185228 200957 218143 232154 238752
37178 238752 235364 221883 200655 175638 151138 130642 116078 107589 103923 103365 104916 109108 117970
37165 117970 134061 158975 192052 229940 267357 298748 320088 329970 329496 321170 307448 289707
37153 289707 268078 242022 211192 176030 137825 98347 59427 22824 -9546 -35431 -52518
37142 -52518 -59203 -55363 -42623 -23995 -3210 15956 30314 37879 38322 33144 25463 19460 19503 28985
37128 28985 49202 78711 113454 147631 175016 190387 190759 176013 148621 112548 71865 29789
37116 29789 -11429 -49934 -83537 -109411 -124421 -125924 -112677 -85541 -47749 -4571 37667 73037
37104 73037 97389 109231 109873 102861 92876 84256 79552 78590 78561 75231 64806 45508 18045 -15184
37090 -15184 -51487 -88907 -126431 -163531 -199639 -233946 -265497 -293417 -317032 -335790 -348988 -355510
37078 -355510 -353820 -342377 -320345 -288163 -247616 -201451 -152878 -105216 -61632 -24774 3705 23489
37066 23489 35530 41668 44167 45387 47542 52436 61192 74038 90209 107935 124568 136931 141889
37053 141889 136899 120316 91453 50654 -488 -58969 -120576 -180556 -234484 -279016 -312316 -334111
37041 -334111 -345401 -347897 -343459 -333666 -319595 -301771 -280293 -255118 -226391 -194551 -160096 -123195
37029 -123195 -83489 -40393 6202 55128 103433 146419 178280 193226 186767 156808 104248 32957
37017 32957 -50853 -139757 -226486 -305081 -371535 -423853 -461783 -486466 -500099 -505546 -505908 -504091
37005 -504091 -502365 -502021 -503242 -505247 -506650 -505819 -501136 -491259 -475441 -453822 -427485 -398202 -368052
36992 -368052 -339101 -313295 -292455 -278190 -271678 -273367 -282782 -298518 -318446 -340046 -360871 -379097
36980 -379097 -393918 -405528 -414566 -421377 -425532 -425987 -421735 -412630 -399917 -386181 -374616 -367829 -366655
36967 -366655 -369627 -373446 -374287 -369230 -357104 -338566 -315702 -291554 -269560 -252776 -242992 -240213 -242906
36954 -242906 -248837 -255885 -262365 -266812 -267632 -263047 -251448 -231954 -204778 -171240 -133518 -94299 -56451
36941 -56451 -22672 4824 24573 36067 39878 37564 31352 23698 17030 13628 15470 23844 38896
36928 38896 59468 83383 108122 131659 153156 173249 193765 217041 245151 279277 319251 363307
36916 363307 408203 449843 484386 509461 525003 533234 537680 541610 546603 551946 555041 552496 541344
36903 541344 519939 488398 448616 403924 358481 316477 281381 255506 239953 234791 239256 251961
36891 251961 271235 295626 324276 356877 393177 432358 472734 511957 547579 577635 600982
36880 600982 617304 626926 630580 629258 624214 617025 609571 603716 600683 600397 601293 600890 596961 588747 577573
36865 577573 566645 560152 562032 574789 598744 632097 671815 714920 759496 805001 851895 900955
36853 900955 952579 1006326 1060729 1113260 1160352 1197557 1220197 1224487 1208721 1173963 1124067 1065167
36841 1065167 1004692 949780 905387 872823 849636 831000 811885 788930 761258 730099 697702
36830 697702 666157 636663 609442 584100 560152 537353 515775 495778 478101 464040 455500 454746
36818 454746 463830 483861 514326 552770 595112 636598 672975 701302 720084 728919 728049 718038
36806 718038 699527 672988 638589 596349 546540 490079 428695 364976 302350 244808 196028
36795 196028 158185 131177 112901 100431 91373 84726 80943 81235 86476 96261 108628 120625 129419
36782 129419 133435 132996 130101 127428 127060 129634 134307 139547 144338 149211 156530 169736 191910 224372
36768 224372 266119 314367 365832 417917 469133 518713 566073 610620 651841 689300 722500
36757 722500 750922 774380 793360 809036 822948 836572 851014 866969 884942 905450 928871
36746 928871 954915 982310 1009127 1033575 1054583 1071789 1085211 1094965 1101261 1104454 1104978 1103087 1098561
36733 1098561 1090671 1078671 1062654 1044349 1027275 1016089 1015447 1028949 1058626 1105012 1167549 1244947
36721 1244947 1335437 1436957 1547396 1664860 1787843 1915183 2045869 2178948 2313731 2450250
36711 2450250 2589530 2733421 2884003 3042916 3210865 3387318 3570375 3756907 3943149
36702 3943149 4125669 4302305 4472606 4637516 4798499 4956500 5111096 5260137 5399964
36693 5399964 5526143 5634297 5720622 5782068 5816554 5823553 5804727 5764142 5707750 5642380 5574676
36682 5574676 5510230 5453087 5405578 5368546 5341838 5324926 5317389 5318979 5329244 5346963 5369835 5394809
36670 5394809 5418887 5440029 5457633 5472339 5485324 5497534 5509336 5520736 5532011 5544359 5560130
36659 5560130 5582448 5614391 5658193 5714996 5785214 5869287 5968251 6083783 6217688 6371200 6544526
36648 6544526 6736771 6946124 7170109 7405781 7649869 7898917 8149556 8399026 8645842
36639 8645842 8890227 9134053 9380338 9632598 9894232 10168006 10455644 10757591 11072941
36630 11072941 11399588 11734752 12075937 12422091 12774458 13136684 13514171 13913024 14339178
36621 14339178 14798060 15294767 15834284 16421356 17059998 17752943 18501411 19305211 20163122
36612 20163122 21073362 22034164 23044467 24104679 25217369 26387652 27623138 28933533
36604 28933533 30330073 31825163 33432504 35167651 37048596 39096011 41333207 43786212
36596 43786212 46484046 49458905 52746059 56383739 60413345 64880038 69833561 75329187
36588 75329187 81428739 88201367 95723829 104079956 113359094 123653174 135052652 147642077
36580 147642077 161496056 176675713 193225313 211168595 230503970 251196739 273165170
36573 273165170 296256282 320207242 344591450 368756259 391771483 412419842 429265364
36566 429265364 440823902 445824525 443498789 433795447 417427258 395722675 370341771
36559 370341771 342966770 315064638 287763966 261834196 237729573 215660698 195668243
36552 195668243 177685426 161584823 147210363 134397423 122984359 112818600 103759761
36545 103759761 95680958 88468636 82021373 76248445 71068731 66409954 62208038 58406577
36537 58406577 54956540 51816189 48951044 46333502 43941808 41758365 39767806 37955416
36529 37955416 36306207 34804728 33435501 32183960 31037485 29986126 29022700 28142269
36521 28142269 27341176 26615953 25962542 25376214 24852285 24387298 23979958 23631329 23344152
36512 23344152 23121806 22967478 22883898 22873479 22938584 23081735 23305638 23613047 24006541 24488522
36502 24488522 25061546 25728832 26494617 27364082 28342764 29435552 30645515 31972852 33414235
36493 33414235 34962597 36607292 38334442 40126987 41963963 43818918 45657988 47438361
36485 47438361 49107614 50604139 51859111 52800516 53359548 53478804 53120829 52275133 50961777
36476 50961777 49230335 47154207 44821559 42325058 39752627 37180753 34670779 32267854
36468 32267854 30001815 27889340 25936727 24142765 22501329 21003541 19639333 18398358
36460 18398358 17270404 16245622 15314819 14469740 13703289 13009712 12384703 11825146 11328268
36451 11328268 10890473 10506568 10169865 9873165 9610030 9375594 9166293 8978548 8807125
36442 8807125 8644295 8480343 8305198 8110362 7890467 7644080 7373718 7085131 6786088
36433 6786088 6484940 6189337 5905449 5637853 5389916 5164298 4963208 4788266 4640109
36424 4640109 4517956 4419436 4340857 4277838 4226079 4182046 4143404 4109031 4078603 4051910 4028241
36413 4028241 4006098 3983224 3956883 3924325 3883390 3833070 3773989 3708627 3641207 3577107 3521914
36402 3521914 3480482 3456367 3451597 3466523 3499556 3547017 3603517 3662993 3720079 3771264 3815315
36391 3815315 3852853 3885269 3913444 3936873 3953700 3961754 3959887 3948664 3929836 3904954 3874069 3835334
36379 3835334 3785658 3722041 3643002 3549600 3445776 3337956 3233928 3141265 3065678 3009912 2973522
36368 2973522 2953410 2944684 2941500 2937899 2928759 2910643 2882079 2843013 2793717 2733952 2662941 2580168
36356 2580168 2486314 2383536 2274794 2162579 2047920 1930371 1808942 1683321 1554531 1424804
36346 1424804 1296977 1173973 1058666 954032 863271 789626 735710 702500 688395 688855 696968
36335 696968 704888 705614 694431 669518 631722 583773 529291 471883 414462 359036 306998 259737
36323 259737 219129 187583 167613 161315 169979 193845 231813 281147 337537 395748 450708 498630
36311 498630 537776 568782 594440 618926 646659 681173 724328 775963 833980 894822 954346
36300 954346 1008746 1055149 1091723 1117462 1131964 1135329 1128083 1110973 1084684 1049736 1006671 956321
36288 956321 899845 838494 773422 705790 637024 568834 502757 439464 378284 317318 254300
36277 254300 187913 118865 50078 -14252 -70149 -115047 -148136 -169943 -181718 -185027 -181670 -173744
36265 -173744 -163594 -153519 -145252 -139464 -135629 -132466 -128726 -123842 -118136 -112704 -109200 -109585 -115728 -128861
36251 -128861 -149075 -175047 -204061 -232415 -256170 -271971 -277579 -271936 -254931 -227160 -189830 -144722
36239 -144722 -94159 -40955 11702 60516 102498 135551 159058 174225 183878 191572 200234 211010
36227 211010 222911 233487 240112 241186 236651 227789 216685 205697 197089 192755 194058 201839 216500
36214 216500 237967 265383 296656 328202 355292 373034 377591 366965 341012 300987 249214 189047
36202 189047 124897 61933 5524 -39378 -68855 -80764 -75509 -56357 -28857 554 26183 44258
36190 44258 53433 54722 51035 46343 44518 48148 57855 72413 89528 106842 122638 136044 146818
36177 146818 155052 161044 165371 168907 172605 177211 183194 190986 201188 214429 230962 250372 271716
36164 271716 293912 315966 336789 354758 367521 372396 367447 352816 331720 310389 296694 297725
36152 297725 317330 354704 404617 459014 509239 547991 570667 575879 565184 542195 511331 476618
36140 476618 440883 405505 370754 336471 302800 270566 241073 215427 193790 175166 157949
36129 157949 140908 123861 107498 92407 78047 62459 43036 17936 -12824 -47273 -82422
36118 -82422 -115626 -145555 -172361 -197070 -220559 -242592 -261247 -273002 -273461 -258540 -225707 -174825
36106 -174825 -108289 -30460 53360 138043 219479 294968 363113 423359 475533 519615 555750
36095 555750 584137 604610 616086 616460 603408 575872 535495 487136 438178 396895 370526 363608
36083 363608 377039 408186 452066 503032 556152 607674 654681 694505 724509 742489 747467 740423
36071 740423 724509 704599 686356 675156 675084 688113 713570 748128 786478 822641 851531 870165
36059 870165 877944 876009 866207 850466 830790 809476 788975 771344 757656 747709 740136 732793 723315
36046 723315 709662 690395 664572 631466 590436 541150 484030 420506 352841 283665 215510
36035 215510 150544 90466 36451 -10807 -50879 -83229 -106888 -120405 -122114 -110689 -85809 -48639
36023 -48639 -1839 50973 105985 159726 209145 251371 283465 302410 305389 290273 256188 204059
36011 204059 137036 60671 -17326 -87936 -142314 -173731 -179415 -161550 -126815 -84415 -43366 -10202
35999 -10202 11940 22753 23432 15642 1334 -16788 -34921 -48509 -53275 -46332 -26819 4179 44299
35986 44299 90812 141522 195332 252231 312646 376437 442024 506173 564589 612929 647689 666627
35974 666627 668738 654015 623154 577349 518242 448060 369766 286938 203271 121817 44312 -29003
35962 -29003 -98929 -166469 -232192 -296200 -358656 -420251 -482184 -545541 -610503 -675873 -739146 -797072
35950 -797072 -846392 -884520 -910021 -922895 -924545 -917337 -903781 -885667 -863527 -836570 -803010 -760691
35938 -760691 -707889 -644238 -571511 -493919 -417616 -349354 -294689 -256540 -234842 -227360 -230983 -242656
35926 -242656 -259657 -279487 -299796 -318544 -334288 -346464 -355439 -362177 -367625 -372142 -375311 -376193 -373729
35913 -373729 -367102 -356001 -340879 -323147 -305095 -289422 -278533 -273854 -275475 -282251 -292320 -303855
35901 -303855 -315738 -327868 -340843 -355180 -370463 -384943 -395780 -399791 -394334 -378018 -351040 -315063
35889 -315063 -272635 -226408 -178564 -130754 -84420 -41013 -1777 32761 63098 90462 116046
35878 116046 140256 162537 181905 197841 210975 223066 236366 252763 273181 297396 324171
35867 324171 351592 377565 400410 419323 434411 446237 455202 461254 464163 464078 461877 459024 457118
35854 457118 457345 459971 463961 466994 466153 459103 445042 424800 400118 372657 343333 312204 278919
35841 278919 243531 207290 172800 143316 121552 108745 104494 107231 114804 124833 134840 142393
35829 142393 145423 142620 133688 119246 100383 78083 52863 24873 -5637 -37858 -70363 -101523
35817 -101523 -129966 -154709 -175040 -190627 -201942 -210677 -219613 -231960 -250585 -277439 -313196 -357053
35805 -357053 -406812 -459265 -510629 -556729 -593066 -615209 -619826 -605952 -575750 -534185 -487767 -443004
35793 -443004 -405215 -377916 -362583 -358625 -363541 -373363 -383464 -389596 -388895 -380481 -365305 -345273 -322179
35780 -322179 -297043 -270126 -241383 -210929 -179263 -147210 -115635 -85116 -55816 -27665 -669
35769 -669 24890 48485 69512 87409 101711 112027 117954 118816 113381 99760 75800 39878 -8292
35756 -8292 -67286 -134212 -205347 -276817 -345020 -406791 -459503 -501345 -531731 -551485 -562392 -566214
35744 -566214 -563838 -555156 -539757 -517898 -491159 -462476 -435598 -414246 -401262 -398004 -404138 -417938
35732 -417938 -437098 -459814 -485604 -515339 -550400 -591532 -638032 -687671 -737186 -782986 -821701
35721 -821701 -850462 -867053 -870126 -859488 -836173 -802087 -759378 -709967 -655526 -597708 -538296 -479080
35709 -479080 -421636 -367197 -316670 -270659 -229499 -193409 -162800 -138587 -122210 -115215 -118564 -132047
35697 -132047 -154165 -182462 -214058 -246043 -275685 -300619 -319164 -330634 -335409 -334656 -329902 -322720
35685 -322720 -314603 -306836 -300226 -294692 -288933 -280404 -265843 -242344 -208707 -166461 -120044 -75944 -41075
35672 -41075 -20916 -17993 -31121 -55696 -84942 -111792 -130737 -139007 -136659 -125669 -108551 -87286
35660 -87286 -62982 -36227 -7702 21362 49081 73026 90365 97945 92485 71072 32018 -24254
35648 -24254 -94743 -174211 -256375 -335542 -407995 -472542 -530095 -582651 -632223 -680047 -726299 -770266
35636 -770266 -810835 -846852 -877119 -900074 -913563 -914996 -901847 -872253 -825613 -763084 -687878 -605135
35624 -605135 -521293 -443052 -376243 -324943 -291041 -274275 -272652 -283105 -302242 -326890 -354179 -381237
35612 -381237 -404908 -421925 -429608 -426762 -414320 -395436 -374925 -358143 -349655 -352135 -365937 -389363
35600 -389363 -419338 -452118 -483823 -510866 -530407 -540743 -541328 -532361 -514142 -486666 -449764 -403701
35588 -403701 -349985 -291919 -234462 -183213 -142844 -115753 -101616 -97989 -101554 -109413 -119921 -132893
35576 -132893 -149155 -169635 -194360 -221746 -248526 -270341 -282776 -282430 -267730 -239351 -200225 -155151
35564 -155151 -110077 -71107 -43363 -29929 -31171 -44759 -66421 -91100 -114062 -131638 -141612 -143357
35552 -143357 -137853 -127591 -116350 -108790 -109757 -123268 -151416 -193641 -246776 -305861 -365397 -420574
35540 -420574 -468163 -506917 -537404 -561389 -581005 -597950 -612850 -624798 -631194 -627989 -610487 -574568
35528 -574568 -518045 -441632 -349074 -246335 -140276 -37554 55927 135151 196188 236633 256020
35517 256020 255905 239414 210415 172639 129110 82009 32845 -17305 -67631 -117465 -166239 -213509
35505 -213509 -259084 -303047 -345566 -386586 -425716 -462510 -496950 -529650 -561504 -592978 -623634
35494 -623634 -652248 -677413 -698188 -714498 -727241 -738151 -749373 -762754 -779012 -797215 -814899
35483 -814899 -828825 -835999 -834502 -823817 -804689 -778746 -748059 -714719 -680434 -646296 -612873 -580717
35471 -580717 -551030 -526096 -509115 -503488 -511827 -535132 -572479 -621215 -677526 -737081 -795578 -849145
35459 -849145 -894545 -929264 -951542 -960451 -956101 -939813 -914095 -882354 -848405 -815847 -787305 -763777
35447 -763777 -744461 -727298 -710009 -691027 -669863 -646812 -622315 -596433 -568793 -538964 -506883
35436 -506883 -472973 -437990 -403025 -369857 -341384 -321535 -314485 -323534 -350219 -393924 -451916 -519644
35424 -519644 -591426 -661561 -725654 -781564 -829495 -871179 -908592 -942704 -972670 -995606 -1007030
35413 -1007030 -1001922 -976106 -927583 -857257 -768821 -667841 -560453 -452160 -346989 -247082 -152695
35402 -152695 -62671 24628 110098 192779 269320 334412 382227 408423 411893 395542 365801 331153
35390 331153 300235 280096 274986 285877 310664 344953 383141 419472 448772 466893 471198 461278
35378 461278 439529 410984 382101 359074 346391 346151 358059 379871 408034 438284 466106 487142
35366 487142 497740 495562 479867 451281 411225 361488 304154 241642 176608 111675 49172 -8951
35354 -8951 -61049 -105614 -141186 -166524 -180990 -184958 -179858 -167757 -150781 -130683 -108600 -84795
35342 -84795 -58354 -27185 11336 59120 116134 179845 245672 308157 362196 403718 429682 437873
35330 437873 427027 397357 350973 291783 224764 155066 87317 25280 -28264 -71603 -104271
35319 -104271 -127136 -142193 -151994 -158971 -164996 -171185 -177828 -184360 -189559 -192030 -190754 -185399 -176236 -163804
35305 -163804 -148496 -130217 -108184 -80961 -46786 -4123 47763 108532 176883 250936 328543
35294 328543 407387 484902 558253 624461 680688 724624 754778 770509 771744 758674 731747 692044
35282 692044 641898 585357 528122 476687 436788 411812 401926 404360 414564 427685 439870 449008
35270 449008 454849 458471 461406 464813 468994 473366 476760 477889 475849 470550 462979 455073 449117 446809
35256 446809 448473 452781 457087 458232 453555 441855 423997 402912 382941 368681 363647 369121 383585
35243 383585 403005 421924 434983 438282 430053 410470 380837 342758 297754 247400 193620 138795
35231 138795 85610 36722 -5650 -40122 -66398 -85188 -97846 -105851 -110359 -111941 -110586 -105949
35219 -105949 -97678 -85630 -69882 -50774 -29151 -6712 13864 29307 36487 33106 18004 -8924
35207 -8924 -46901 -94257 -148368 -205893 -263546 -319059 -371667 -421648 -469187 -513316 -551676 -581266
35195 -581266 -599841 -607245 -605987 -600725 -596881 -599084 -610067 -630234 -657857 -689828 -722876 -754803
35183 -754803 -785103 -814520 -843861 -872950 -900415 -924386 -943585 -958109 -969487 -980007 -991666
35172 -991666 -1005305 -1020320 -1034984 -1047054 -1054314 -1054820 -1046857 -1028751 -998818 -955615 -898526 -828415
35160 -828415 -748007 -661710 -574838 -492467 -418319 -353989 -298790 -250216 -204860 -159370 -111150
35149 -111150 -58673 -1568 59387 122407 184967 244173 297098 341088 374155 395445 405535
35138 405535 406404 401159 393666 388129 388487 397604 416521 444032 476763 509743 537320 554270 556796
35125 556796 543121 513430 469249 412631 345610 270104 188122 101969 14228 -72422 -155449
35114 -155449 -232724 -302765 -364878 -419017 -465264 -503172 -531417 -548061 -551275 -539958 -514001 -474325
35102 -474325 -423015 -363477 -300227 -237992 -180366 -128630 -81460 -35873 10842 59078 105806
35091 105806 145150 170400 176577 162369 130604 87093 38427 -10206 -56303 -100075 -143540 -189123
35079 -189123 -238261 -290421 -342886 -391447 -431685 -460261 -475700 -478560 -471190 -457250 -440954 -426045
35067 -426045 -414790 -407486 -402750 -398326 -391865 -381322 -365080 -342077 -312176 -276608 -238061 -200081
35055 -200081 -165855 -136874 -112166 -88455 -61273 -26680 17026 68271 122341 172693 212913
35044 212913 238530 248042 242856 226394 202895 176581 151284 130307 116068 109556 109957 114896 121269
35031 121269 126233 127841 125179 118236 107783 95359 83215 74073 70637 74907 87526 107423 132003
35018 132003 157802 181304 199540 210464 213212 208333 197841 184857 172815 164539 161596 164209
35006 164209 171652 182841 196833 213045 231220 251215 272715 294957 316533 335339 348708 353643
34994 353643 347131 326476 289734 236189 166746 84020 -8046 -105106 -203553 -301356 -398083 -494091
34982 -494091 -589353 -682545 -770792 -850166 -916790 -968042 -1003204 -1023196 -1029673 -1024258 -1008433 -984013
34970 -984013 -953660 -920955 -889863 -863883 -845434 -835825 -835700 -845360 -864542 -891935 -925025 -960587
34958 -960587 -995515 -1027394 -1054596 -1076114 -1091433 -1100540 -1103954 -1102653 -1097915 -1091114 -1083492 -1075965 -1069024
34945 -1069024 -1062838 -1057592 -1053945 -1053229 -1057121 -1066778 -1081963 -1100805 -1120400 -1137840 -1150907 -1157992 -1157442
34932 -1157442 -1146959 -1123677 -1085065 -1030313 -961417 -883413 -803606 -730158 -670455 -629591 -609223
34921 -609223 -607158 -617886 -633993 -647933 -653613 -647333 -627959 -596434 -554916 -505940 -451934 -395133
34909 -395133 -337689 -281655 -228743 -180084 -136247 -97570 -64485 -37568 -17228 -3297 5184 9874
34897 9874 12814 16080 21432 29903 41330 54047 65052 70712 67761 54194 29741 -4148 -44801
34884 -44801 -89151 -134639 -179824 -224474 -269062 -313894 -358220 -399785 -435126 -460624 -473863 -474546
34872 -474546 -464496 -446687 -423974 -398156 -369779 -338580 -304253 -267224 -229189 -193218 -163340
34861 -163340 -143784 -138181 -149022 -177428 -223027 -283859 -356334 -435536 -515984 -592619 -661513 -720004
34849 -720004 -766398 -799602 -819005 -824600 -817138 -798120 -769567 -733801 -693402 -651415 -611521 -577880
34837 -577880 -554650 -545297 -551816 -573949 -608684 -650486 -692479 -728162 -752860 -764284 -762137 -747118
34825 -747118 -719903 -680557 -628708 -564403 -489196 -406759 -322598 -242941 -173465 -118592 -81575
34814 -81575 -65014 -71059 -100962 -154202 -227881 -316869 -414698 -514668 -610681 -697634 -771554 -829736
34802 -829736 -870950 -895617 -905820 -905026 -897460 -887207 -877356 -869571 -864260 -861125 -859648 -859266 -859314 -858966
34788 -858966 -857290 -853295 -845859 -833662 -815397 -790386 -759254 -724102 -687948 -653795 -623917 -599656
34776 -599656 -581513 -569240 -561887 -557952 -555725 -553757 -551228 -548011 -544389 -540679 -537159 -534466 -534154 -538842
34762 -538842 -551657 -575278 -611101 -658888 -716922 -782408 -851885 -921523 -987337 -1045406 -1092185
34751 -1092185 -1124969 -1142478 -1145315 -1135890 -1117539 -1093205 -1064407 -1031081 -992192 -946628 -893985 -835052
34739 -835052 -771958 -707934 -646778 -592242 -547443 -514378 -493565 -484070 -484037 -491560 -505410 -525245
34727 -525245 -551284 -583676 -621933 -664572 -708985 -751569 -788208 -815176 -830186 -833058 -825551 -810466
34715 -810466 -790539 -767754 -743278 -717818 -691969 -666289 -641155 -616764 -593561 -572945 -557707
34704 -557707 -551720 -558819 -581258 -618438 -666556 -719340 -769514 -810197 -835796 -842485 -828610 -795076
34692 -795076 -745332 -684699 -619210 -554509 -495132 -444145 -402968 -371272 -347147 -327633 -309500
34681 -309500 -289911 -266713 -238507 -204828 -166512 -125850 -86217 -51268 -24252 -7771 -3845 -13937
34669 -13937 -38733 -77764 -129094 -189325 -254022 -318428 -378216 -430128 -472406 -505021 -529489 -548297
34657 -548297 -564174 -579609 -596723 -617321 -642845 -674172 -711332 -753296 -797907 -842125 -882630
34646 -882630 -916741 -943311 -963179 -978827 -993297 -1008949 -1026799 -1046705 -1067969 -1089634 -1110255
34635 -1110255 -1127619 -1139038 -1142364 -1137131 -1125107 -1109915 -1095967 -1087239 -1086379 -1094367 -1110591 -1133144
34623 -1133144 -1159126 -1185048 -1207409 -1223504 -1232094 -1233678 -1230168 -1224132 -1217919 -1212936 -1209314 -1206070 -1201656
34610 -1201656 -1194643 -1184228 -1170493 -1154413 -1137733 -1122665 -1111308 -1104838 -1102812 -1103079 -1102648 -1099242 -1092714
34597 -1092714 -1085429 -1081251 -1083735 -1094501 -1112602 -1134944 -1157329 -1175584 -1186459 -1188114 -1180157 -1163338
34585 -1163338 -1139089 -1109103 -1075024 -1038246 -999861 -960755 -921736 -883607 -847141 -813040 -781954
34574 -781954 -754512 -731405 -713506 -701892 -697622 -701328 -712931 -731654 -756200 -784850 -815401 -845184
34562 -845184 -871237 -890613 -900781 -900065 -888010 -865417 -833970 -795766 -753031 -708003 -662598 -617766
34550 -617766 -572990 -526516 -476371 -421487 -362265 -300402 -238330 -178685 -123942 -76205 -37106
34539 -37106 -7856 10642 17654 12636 -4465 -32596 -68996 -109134 -147452 -178605 -198570 -205260
34527 -205260 -198752 -181368 -157550 -133206 -114459 -106108 -110453 -127052 -153524 -187010 -225586 -268996
34515 -268996 -318508 -376066 -443212 -520180 -605442 -695756 -786639 -873112 -950618 -1015948 -1067907
34504 -1067907 -1107364 -1136602 -1158255 -1174388 -1186154 -1193922 -1197566 -1196658 -1190584 -1178770 -1161015 -1137848
34492 -1137848 -1110736 -1081995 -1054328 -1029989 -1009894 -993117 -976945 -957429 -930120 -891001 -837610
34481 -837610 -770158 -691995 -608946 -527657 -453807 -391120 -341486 -305710 -284071 -276320 -281383 -297330
34469 -297330 -321760 -352368 -387291 -425185 -465112 -506288 -547639 -587340 -622751 -651050 -670269
34458 -670269 -680114 -682115 -679152 -674637 -671626 -672035 -676134 -682398 -687666 -687617 -677581 -653579 -613261 -556345
34444 -556345 -484507 -401062 -310679 -219062 -132288 -55824 6427 52598 82660 97836 99976 91179
34432 91179 73647 49617 21331 -8956 -38960 -66508 -89825 -107800 -120038 -126694 -128322 -125784
34420 -125784 -120192 -112874 -105371 -99373 -96397 -97265 -101722 -108576 -116329 -123899 -131010 -138122 -146029 -155416
34406 -155416 -166694 -180286 -197159 -219113 -248429 -286982 -335325 -392246 -454897 -519284 -580890
34395 -580890 -635368 -679236 -710434 -728516 -734429 -729971 -717168 -697795 -673250 -644757 -613701 -581706
34383 -581706 -550367 -520963 -494474 -471926 -454712 -444581 -443290 -452093 -471311 -500071 -536387 -577581
34371 -577581 -620862 -663803 -704479 -741338 -773005 -798238 -816142 -826541 -830211 -828761 -824100 -817790
34359 -817790 -810655 -802937 -794871 -787296 -781707 -779595 -781379 -785680 -789371 -788433 -779125 -758972 -727285 -685219
34345 -685219 -635518 -582070 -529244 -481101 -440695 -409759 -388817 -377509 -374835 -379323 -389240 -402913
34333 -402913 -418980 -436461 -454567 -472378 -488516 -500973 -507345 -505512 -494530 -475255 -450267 -423165
34321 -423165 -397686 -377150 -364348 -361481 -369802 -388970 -416606 -448554 -479836 -505882 -523539 -531552
34309 -531552 -530569 -522811 -511557 -500552 -493375 -492822 -500372 -515887 -537669 -562862 -588013 -609481 -623647
34296 -623647 -627091 -617005 -591894 -552243 -500767 -442029 -381630 -325277 -277945 -243154 -222344 -214565
34284 -214565 -216763 -224718 -234279 -242341 -247318 -249132 -248904 -248521 -250160 -255865 -267110 -284334 -306525 -331116
34270 -331116 -354247 -371270 -377352 -368243 -341265 -296278 -236067 -165834 -91960 -20608 43353 96783
34258 96783 138130 166962 183554 188746 184127 172341 157289 143964 137748 143303 163421 198250
34246 198250 245133 299124 353964 403237 441425 464737 471658 463090 441933 412121 377590 341552
34234 341552 306184 272563 240739 210039 179533 148427 116114 81992 45352 5636 -37041
34223 -37041 -81496 -125638 -167272 -205052 -238921 -269838 -299118 -327925 -357027 -386664 -416416 -445199
34211 -445199 -471391 -493005 -507862 -513970 -510268 -497456 -478387 -457629 -440335 -430872 -431689 -442747
34199 -442747 -461707 -484807 -508078 -528373 -543832 -553781 -558307 -557823 -552865 -544191 -533009 -521025 -510067
34186 -510067 -501409 -495279 -491011 -487798 -485546 -485164 -488098 -495522 -507857 -524919 -546364 -571893 -600975
34173 -600975 -632369 -663847 -692222 -713581 -723642 -718310 -694528 -651245 -590201 -516152 -436303 -358927
34161 -358927 -291435 -238608 -201706 -178799 -166040 -159112 -154211 -148373 -139415 -125828 -106762 -82031
34149 -82031 -52058 -17830 19155 56956 93338 125984 152562 170640 177681 171379 150314 114504
34137 114504 65501 6101 -60065 -128889 -196212 -258457 -313294 -360011 -399337 -432793 -461923
34126 -461923 -487765 -510717 -530616 -546755 -557762 -561658 -556308 -540226 -513218 -476553 -432674 -384822
34114 -384822 -336760 -292505 -255875 -229822 -215900 -214205 -223797 -243288 -271201 -305987 -345883 -388857
34102 -388857 -432737 -475486 -515415 -551238 -581911 -606477 -624067 -634070 -636310 -631158 -619581 -603108
34090 -603108 -583611 -562946 -542690 -524216 -508958 -498582 -494912 -499752 -514638 -540405 -576641 -621395
34078 -621395 -671558 -723802 -775509 -825155 -872101 -916149 -957310 -995815 -1032220 -1067168 -1100635
34067 -1100635 -1131077 -1155181 -1168729 -1168287 -1152752 -1123884 -1085623 -1042680 -999158 -957690 -919209 -883241
34055 -883241 -848632 -814491 -780975 -749474 -722118 -700887 -686738 -678916 -674618 -669270 -657694 -635854
34043 -635854 -602312 -558531 -507903 -454126 -399848 -346162 -293021 -240228 -188395 -139365 -95928
34032 -95928 -61028 -36755 -23553 -19931 -22869 -28718 -34216 -37229 -37046 -34253 -30372 -27417 -27470 -32256
34018 -32256 -42616 -57979 -76252 -94362 -109309 -119148 -123499 -123500 -121347 -119562 -120177 -124167 -131458 -141568
34004 -141568 -154396 -170622 -191478 -218110 -251023 -289801 -333104 -378747 -423919 -465655 -501548
33993 -501548 -530417 -552622 -569902 -584840 -600118 -617710 -638261 -660857 -683295 -702622 -715684
33982 -715684 -719565 -712026 -691932 -659518 -616291 -564594 -507092 -446369 -384637 -323515 -263964 -206562
33970 -206562 -152054 -101756 -57450 -20670 8105 29830 46538 60471 73236 85527 97531
33959 97531 109552 122214 136011 150677 165044 177516 186667 191425 190826 183832 169546 147762 119398
33946 119398 86500 51696 17355 -15228 -46274 -77374 -110758 -148238 -190299 -235734 -281957
33935 -281957 -325704 -363663 -392921 -411445 -418775 -416551 -408290 -398150 -389227 -382374 -376241 -368404 -356877
33922 -356877 -341133 -322113 -301387 -280064 -258215 -235029 -209421 -180470 -147517 -110176 -68621
33911 -68621 -24143 20545 61768 96110 121854 139880 153541 167518 186175 212142 245787 285795
33899 285795 330370 378252 428974 482326 537572 592832 644943 689819 723275 742003 744198 729450
33887 729450 698140 650984 589212 515177 432630 346229 260394 178189 100872 28266 -40228
33876 -40228 -104632 -163918 -216353 -260274 -294648 -319113 -333627 -338264 -333335 -319598 -298209 -270361
33864 -270361 -236909 -198256 -154510 -105753 -52329 4899 64378 123930 181111 233633 279667
33853 279667 317900 347553 368457 381079 386320 385072 377830 364674 345689 321570 293909 264937
33841 264937 236892 211440 189475 171337 157149 147020 141023 139000 140403 144337 149722 155396 159987
33828 159987 161645 157841 145419 120979 81624 25950 -45070 -127863 -216857 -305734 -388805 -462082
33816 -462082 -523862 -574721 -616982 -653765 -687943 -721201 -753499 -783038 -806818 -821621 -825132 -816841
33804 -816841 -798356 -772986 -744686 -716822 -691216 -667831 -645121 -620871 -593219 -561373 -525716
33793 -525716 -487323 -447261 -406095 -363864 -320444 -276037 -231389 -187470 -144772 -102679 -59468
33782 -59468 -13114 37399 90970 144279 193030 233993 266711 293839 319983 349711 385784 428324
33770 428324 475174 523012 568527 609102 642924 668826 686089 694247 692959 682159 662521 635906
33758 635906 605275 573907 544343 517751 494178 473382 455578 441472 431606 425650 422195 419165
33746 419165 414471 406475 394209 377519 357221 335223 314307 297523 287306 284748 289373 299540
33734 299540 313216 328689 344845 361005 376581 390863 403017 412076 416779 415420 405995 386835
33722 386835 357503 319390 275475 229241 183324 138796 95514 53144 12015 -26679 -61229
33711 -61229 -89858 -111110 -124235 -129520 -128397 -123120 -116243 -110284 -107763 -111361 -123719 -146712 -180504
33698 -180504 -223081 -270699 -319129 -364996 -406639 -444158 -478820 -512190 -545363 -578667 -611911
33687 -611911 -644881 -677722 -711004 -745621 -782621 -822811 -866121 -910958 -954171 -991812 -1020271
33676 -1020271 -1037195 -1041933 -1035605 -1020928 -1001650 -981615 -963679 -948891 -936330 -923675 -908269 -888212
33664 -888212 -862933 -833138 -800388 -766611 -733655 -702841 -674673 -648926 -625119 -603075 -583211
33653 -583211 -566369 -553208 -543379 -534942 -524499 -508226 -483431 -449926 -410471 -369985 -333718 -305227
33641 -305227 -285258 -272086 -262930 -255350 -247828 -239576 -230074 -218831 -205306 -188926 -169157 -145748
33629 -145748 -119091 -90432 -61728 -35330 -13758 314 4146 -4634 -27178 -62557 -107406 -156439
33617 -156439 -203821 -244862 -277278 -301413 -319494 -334416 -348701 -363862 -380178 -396754 -411814
33606 -411814 -423165 -428776 -427277 -418196 -401833 -378910 -350334 -317214 -281057 -243797 -207497 -173874
33594 -173874 -143962 -118143 -96383 -78466 -64071 -52842 -44582 -39450 -38000 -41042 -49470 -64179
33582 -64179 -85949 -115279 -152246 -196502 -247360 -303840 -364633 -428046 -491946 -553777 -610694 -659903
33570 -659903 -699136 -727053 -743402 -748882 -744741 -732263 -712365 -685506 -652001 -612563 -568706 -522647
33558 -522647 -476604 -431793 -387748 -342411 -292960 -236910 -172952 -101342 -23888 56347 135576
33547 135576 209928 276049 331431 374443 404271 421049 426158 422352 413351 402967 394187 388723
33535 388723 387107 389064 393699 399261 402771 400019 386210 357079 309959 244582 163608 72815 -19452
33522 -19452 -103901 -172657 -221340 -249805 -261301 -260824 -253763 -245294 -240112 -241829 -252004 -269514 -290979
33509 -290979 -312179 -329732 -342211 -350340 -356411 -363327 -373585 -388512 -407891 -430179 -453278 -475520
33497 -475520 -496276 -515856 -534790 -553041 -569666 -583085 -591756 -594684 -591501 -582174 -566814 -545820
33485 -545820 -520154 -491283 -460661 -429084 -396405 -361913 -325153 -286696 -248422 -213138 -183762
33474 -183762 -162369 -149427 -143546 -141921 -141371 -139395 -134639 -126619 -115167 -100180 -81921 -61589 -41632
33461 -41632 -25462 -16545 -17313 -28478 -49153 -77626 -112190 -151383 -193534 -236207 -276340 -311208
33449 -311208 -339444 -361091 -376556 -385392 -386003 -376521 -356024 -325130 -285648 -239732 -189196 -135343
33437 -135343 -79203 -21918 34945 89239 138208 178598 206988 220383 217010 197015 162686 118027
33425 118027 67791 16484 -32346 -76430 -114910 -148299 -178196 -206595 -235000 -263761 -291990
33414 -291990 -318019 -340051 -356750 -367686 -373642 -376700 -379942 -386805 -400237 -421935 -451893 -488459
33402 -488459 -528965 -570706 -611880 -652081 -692104 -733112 -775526 -818210 -858476 -892908 -918555
33391 -918555 -933768 -938305 -932847 -918445 -896304 -867768 -834145 -796292 -754407 -708465 -659004 -607480
33379 -607480 -555742 -505149 -456160 -408776 -363325 -320871 -282967 -250954 -225288 -205213 -188994
33368 -188994 -174580 -160396 -145924 -131917 -120331 -114111 -116847 -132138 -162659 -209224 -270225 -341731
33356 -341731 -418092 -492766 -559208 -611784 -646639 -662419 -660609 -645335 -622585 -598899 -579776 -568290
33344 -568290 -564397 -565200 -566001 -561629 -547575 -520702 -479587 -424561 -357469 -281180 -199052 -114471 -30638
33331 -30638 49418 122715 186222 237019 272769 292329 296192 286492 266579 240325 211435 182929
33319 182929 156903 134587 116665 103690 96337 95318 100969 112688 128456 144694 156651 159349
33307 159349 148819 123125 82793 30643 -28750 -89777 -146710 -194675 -230437 -252715 -261983 -260038
33295 -260038 -249585 -233938 -216758 -201720 -192105 -190368 -197783 -214171 -237873 -266074 -295400 -322484
33283 -322484 -344216 -357842 -361313 -353971 -337065 -313495 -286690 -259339 -232766 -207266 -182977 -160589
33271 -160589 -141534 -127675 -120716 -121486 -129282 -141583 -154616 -164757 -170144 -171549 -171911 -174809 -182662
33258 -182662 -195518 -210879 -224596 -232452 -231672 -221640 -203522 -179291 -150902 -119974 -87822 -55467
33246 -55467 -23610 7343 37145 65620 92669 118126 141322 160541 172838 174595 162618 135193
33234 135193 92493 36237 -30968 -106058 -185607 -265902 -343221 -414277 -476575 -528507 -569205
33223 -569205 -598296 -615749 -621888 -617587 -604456 -584877 -561819 -538444 -517559 -501115 -489953 -483965
33211 -483965 -482483 -484702 -490010 -498221 -509617 -524615 -543093 -563766 -584003 -600245 -608895 -607345 -594730
33198 -594730 -572069 -541808 -507080 -471077 -436664 -406162 -381277 -363215 -352911 -351148 -358407 -374447
33186 -374447 -397882 -426064 -455458 -482398 -503808 -517534 -522252 -517324 -502860 -479835 -449893 -414751
33174 -414751 -375600 -333079 -287976 -242209 -199380 -164518 -143026 -139238 -155035 -189103 -237275 -293963
33162 -293963 -354009 -413969 -472272 -528528 -582600 -633938 -681179 -721932 -752805 -769854 -769513 -749776
33150 -749776 -711091 -656560 -591313 -521355 -452345 -388718 -333403 -288088 -253720 -230838 -219583
33139 -219583 -219574 -229960 -249701 -277775 -313016 -353628 -396846 -439112 -476725 -506423 -525439 -531130
33127 -531130 -520823 -492408 -445529 -382595 -308893 -231632 -158507 -96503 -51257 -26665 -24324 -42890
33115 -42890 -77916 -122581 -169133 -210432 -241126 -258229 -261066 -250722 -229358 -199754 -165057 -128494
33103 -128494 -92926 -60504 -32645 -10256 6107 16307 20904 21410 20234 20119 23176 30070 39927
33090 39927 51063 62067 72647 83965 98441 119191 149324 191302 246435 314440 392937 477209
33078 477209 560557 635497 695349 735595 754405 752309 731366 694319 644076 583557 515670 443226
33066 443226 368632 293494 218300 142482 64996 -14707 -95716 -175237 -248960 -312053 -360312
33055 -360312 -391022 -403341 -398222 -377945 -345312 -302630 -250988 -190365 -120799 -43919 36304 114262
33043 114262 184519 243551 290488 326698 354738 377311 396649 414312 431199 447608 463373
33032 463373 478235 492336 506500 521934 539320 557701 573756 582029 576241 551148 504058 435258
33020 435258 347427 244629 131425 12235 -109186 -230125 -348947 -464722 -576572 -683079
33010 -683079 -781982 -870347 -945176 -1004215 -1046482 -1072210 -1082389 -1078422 -1062252 -1036778 -1005987 -974498
32998 -974498 -946617 -925368 -911915 -905506 -903848 -903622 -901104 -892972 -877299 -854345 -826648 -798277 -773608
32985 -773608 -756199 -747922 -748439 -755025 -762990 -766722 -761108 -742832 -711014 -666969 -613314 -552986 -488655
32972 -488655 -422561 -356389 -291022 -226329 -161341 -94890 -26422 43343 112155 176321 231236
32961 231236 272312 296204 301868 290955 267276 235598 200273 164216 128540 92852 55970 16648
32949 16648 -25896 -71568 -118975 -165140 -205712 -235847 -251500 -250546 -233242 -201950 -160447 -113148
32937 -113148 -64418 -17989 23463 58356 85865 105540 117282 121791 121111 118767 119134 126076 141374
32924 141374 163726 188921 211118 224499 224597 208906 176862 129401 68373 -3942 -85074 -172387
32912 -172387 -263052 -353996 -441804 -522475 -591187 -642455 -671081 -673813 -650938 -606856 -549305 -487624
32900 -487624 -430807 -385772 -356163 -341930 -339881 -345009 -352018 -356541 -355798 -348743 -335899 -319062 -300879
32887 -300879 -284281 -271808 -265157 -265135 -271836 -284662 -302168 -322145 -342334 -361540 -380447 -401531
32875 -401531 -427929 -461815 -503032 -548641 -593509 -631523 -656882 -665053 -653435 -621793 -572480 -510186
32863 -510186 -441097 -371643 -307304 -251807 -206783 -171753 -144449 -121532 -99577 -75987 -49566
32852 -49566 -20746 8455 34788 54528 64472 62699 48771 23466 -11583 -54046 -100894 -148578
32840 -148578 -193574 -233147 -265915 -291874 -311898 -327101 -338490 -347010 -353789 -360297 -368280 -379498
32828 -379498 -395320 -416294 -441815 -470047 -498187 -522983 -541383 -551183 -551607 -543650 -529893 -513729
32816 -513729 -498218 -485068 -474285 -464590 -454393 -442763 -429881 -416802 -404900 -395498 -389976 -389972 -397163
32803 -397163 -412531 -435624 -464491 -496422 -529140 -561778 -595194 -631404 -672361 -718681 -768839
32792 -768839 -819157 -864487 -899339 -919143 -921387 -906229 -876407 -836412 -791243 -745149 -700847 -659497
32780 -659497 -621327 -586475 -555615 -530228 -512621 -505816 -513318 -538658 -584464 -651090 -735208 -829333
32768 -829333 -923059 -1005832 -1070014 -1112616 -1134895 -1140327 -1132389 -1113406 -1084703 -1047423 -1003229 -954599
32756 -954599 -904771 -857426 -816123 -783649 -761626 -750523 -749916 -758774 -775654 -798871 -826655 -857254
32744 -857254 -888881 -919452 -946257 -965951 -975260 -972284 -957627 -934353 -906573 -877452 -847980 -817216
32732 -817216 -783646 -746543 -706477 -664932 -623597 -583845 -546606 -512524 -482254 -456720 -437171
32721 -437171 -424995 -421369 -426805 -440667 -460838 -483868 -505824 -523572 -535841 -543451 -548626 -553779
32709 -553779 -560402 -568532 -576945 -583905 -588036 -588933 -587237 -584310 -581822 -581507 -585016 -593616 -607690 -626379
32695 -626379 -647674 -668954 -687605 -701449 -708921 -709111 -701768 -687361 -667226 -643714 -620072 -599886
32683 -599886 -586181 -580500 -582410 -589622 -598692 -606066 -609093 -606674 -599342 -588885 -577711 -568293 -562822
32670 -562822 -563033 -570062 -584289 -605251 -631780 -662381 -695685 -730666 -766379 -801331 -832950 -857681
32658 -857681 -871858 -872906 -860211 -835293 -801387 -762749 -723859 -688576 -659452 -637679 -623872 -619174
32646 -619174 -625677 -645570 -679512 -725518 -779135 -834727 -886953 -931857 -967424 -993648 -1011967 -1024139
32634 -1024139 -1031027 -1031972 -1025065 -1008044 -979284 -938631 -887870 -830605 -771354 -714152 -661357 -613367
32622 -613367 -569327 -528251 -489795 -454359 -422598 -394789 -370413 -348087 -325799 -301251 -272171
32611 -272171 -236669 -193798 -144255 -90841 -38167 8486 44687 68041 78568 78296 70353 57993
32599 57993 43826 29372 14870 -741 -19708 -45047 -79809 -126105 -184199 -252020 -325402 -399012
32587 -399012 -467522 -526389 -571899 -600824 -610345 -598582 -565358 -512532 -443588 -362838 -274902 -184754
32575 -184754 -97994 -20738 41147 83184 103220 101697 81219 45721 -314 -52228 -105231 -154572
32563 -154572 -196185 -227639 -248755 -261380 -268465 -273041 -277485 -283065 -289652 -295700 -298731 -296244 -286597
32550 -286597 -269421 -245533 -216539 -184382 -150958 -117897 -86562 -58170 -33805 -14224 458
32539 458 10901 18398 24539 30788 38023 46165 54045 59672 60874 56042 44699 27738 7337 -13405
32525 -13405 -31127 -43103 -48190 -47471 -44267 -43394 -49767 -66779 -95081 -132353 -174231 -215892 -253515
32512 -253515 -285072 -310417 -331064 -349857 -370512 -396775 -431269 -474466 -524388 -577258 -628651
32501 -628651 -674563 -712042 -739619 -757752 -769141 -778477 -791465 -813384 -847817 -895897 -956176 -1025055
32489 -1025055 -1097676 -1169092 -1235315 -1293808 -1343229 -1382766 -1411638 -1429151 -1435123 -1430277 -1416197 -1394884
32477 -1394884 -1368141 -1337045 -1301759 -1261793 -1216601 -1166323 -1112342 -1057571 -1006394 -964128 -935866
32466 -935866 -924865 -931165 -951254 -979166 -1008479 -1034202 -1053641 -1066108 -1071951 -1071548 -1064764 -1050965
32454 -1050965 -1029521 -1000455 -964836 -924648 -882226 -839612 -798179 -758580 -720868 -684637 -649173
32443 -649173 -613712 -577845 -541944 -507371 -476206 -450670 -432630 -423600 -425112 -438966 -466938 -509888
32431 -509888 -566791 -634276 -707123 -779599 -846902 -905972 -955398 -994803 -1024268 -1044062 -1054596
32420 -1054596 -1056419 -1050165 -1036495 -1016123 -989991 -959456 -926205 -891876 -857704 -824683 -794161 -768270
32408 -768270 -749597 -740133 -740257 -748501 -762157 -778088 -793099 -803836 -806756 -798711 -777908 -744632 -701184
32395 -701184 -651123 -598229 -545788 -496488 -452863 -417782 -394480 -386024 -394527 -420506 -462491 -516847
32383 -516847 -577918 -638708 -692263 -733423 -760230 -774246 -779550 -780972 -782497 -786442 -793327 -802120 -810693
32370 -810693 -816562 -817770 -813536 -804308 -791307 -775915 -759242 -741918 -724007 -705002 -684081 -660651
32358 -660651 -635042 -608783 -584185 -563358 -547313 -535711 -527334 -520817 -515051 -509010 -501245 -489577
32346 -489577 -471344 -444158 -406813 -359881 -305746 -248029 -190675 -137093 -89593 -49261 -16150
32335 -16150 10288 30755 45830 55984 61822 64302 64757 64743 65771 69065 75305 84332 94851 104396
32321 104396 109868 108605 99369 82512 59140 30029 -4863 -45905 -92758 -143458 -194081 -239133
32309 -239133 -272697 -290040 -289100 -271252 -241099 -205483 -172180 -148563 -140351 -150567 -178903 -221816
32297 -221816 -273464 -327253 -377467 -420378 -454525 -480274 -498976 -512002 -519983 -522502 -518465 -506906
32285 -506906 -487771 -462303 -433052 -403627 -378127 -360191 -351841 -352676 -359751 -368246 -372690 -368472 -353249
32272 -353249 -327691 -295219 -260825 -229545 -205210 -189855 -183839 -186503 -196980 -214760 -239752 -271955
32260 -271955 -311037 -356082 -405524 -457206 -508483 -556501 -598687 -633305 -659786 -678594 -690759
32249 -690759 -697269 -698543 -694176 -683083 -664128 -637049 -603055 -564688 -524948 -486238 -449771 -415608
32237 -415608 -383072 -351134 -318605 -284260 -247167 -207285 -166077 -126635 -93044 -69154 -57382
32226 -57382 -58072 -69566 -88766 -111798 -134567 -153036 -163365 -162038 -146251 -114502 -67170 -6682
32214 -6682 62851 136400 208719 274731 329619 368935 388982 387350 363249 317453 251902 169170
32202 169170 72028 -36884 -155163 -280483 -410149 -540499 -666567 -782327 -881512 -958649
32192 -958649 -1009761 -1032686 -1027278 -995683 -942443 -874050 -797906 -721202 -650109 -589348 -541853 -508440
32180 -508440 -487727 -476581 -471047 -467364 -462565 -454499 -441522 -422293 -395934 -362472 -323173 -280427
32168 -280427 -237167 -196100 -159165 -127375 -101083 -80418 -65689 -57505 -56494 -62836 -75965 -94625
32156 -94625 -117127 -141536 -165857 -188384 -208171 -225245 -240345 -254406 -268280 -282809 -299004 -317963
32144 -317963 -340459 -366493 -395114 -424601 -452882 -477970 -498298 -512959 -521759 -524958 -522829 -515423
32132 -515423 -502870 -486017 -466782 -447807 -431622 -419937 -413440 -412068 -415370 -422783 -433747 -447781
32120 -447781 -464570 -484078 -506577 -532507 -562161 -595388 -631490 -669375 -707828 -745775 -782496
32109 -782496 -817821 -852125 -885990 -919598 -952236 -982300 -1007740 -1026622 -1037356 -1038500 -1028392 -1004997
32097 -1004997 -966354 -911648 -842510 -763689 -682458 -606796 -543256 -495613 -464807 -449872 -449023 -460374
32085 -460374 -482130 -512520 -549694 -591723 -636774 -683324 -730227 -776498 -820959 -862027 -897836
32074 -897836 -926485 -946141 -954975 -951165 -933236 -900655 -854367 -796873 -731783 -662990 -593941 -527361
32062 -527361 -465470 -410325 -363873 -327663 -302607 -289180 -287988 -300191 -327274 -370185 -428288 -498679
32050 -498679 -576239 -654404 -726494 -787156 -833423 -865016 -883998 -894098 -899923 -905940 -915249 -928530
32038 -928530 -943797 -957150 -964183 -961542 -948097 -925332 -896672 -865985 -836108 -808254 -782413 -758171
32026 -758171 -735295 -713862 -694071 -675891 -658710 -641225 -621688 -598407 -570210 -536682 -498099
32015 -498099 -455218 -409081 -360987 -312582 -265765 -222277 -183155 -148497 -117687 -89923 -64686
32004 -64686 -41940 -21998 -5196 8299 18373 24648 26434 23053 14160 -339 -20791 -48206
31992 -48206 -84090 -129694 -185066 -248490 -316629 -385226 -450054 -507738 -556224 -594802 -623654 -643183
31980 -643183 -653554 -654708 -646743 -630308 -606779 -578180 -546918 -515381 -485624 -459297 -437754 -422142
31968 -422142 -413315 -411665 -416961 -428168 -443214 -458801 -470511 -473271 -462199 -433697 -386575 -322726
31956 -322726 -246942 -165773 -85899 -12659 50757 103327 145560 178523 202970 218946 226055 224229
31944 224229 214439 198796 179946 160135 140591 121494 102367 82447 60763 36058 6867 -27990
31932 -27990 -68716 -114041 -161308 -207014 -247491 -279450 -300334 -308555 -303604 -286068 -257631 -221170
31920 -221170 -180742 -141168 -106968 -81026 -63660 -52627 -44068 -33894 -19041 1688 27382 55334
31908 55334 81909 103662 118320 125239 125253 120170 112150 103118 94121 84746 72973 55798 30463
31895 30463 -4385 -48180 -98618 -152246 -205219 -254116 -296601 -331657 -359250 -379701 -393222 -399895
31883 -399895 -400071 -394817 -386048 -376108 -367031 -359884 -354582 -350251 -345880 -340898 -335360 -329748 -324634 -320467
31869 -320467 -317476 -315441 -313247 -308546 -297994 -278238 -247279 -205612 -156538 -105473 -58578 -21396
31857 -21396 1994 9171 -791 -27530 -69546 -124385 -188916 -259694 -333270 -406302 -475501 -537620
31845 -537620 -589695 -629427 -655504 -667692 -666846 -654956 -635112 -611180 -587056 -565663 -548163 -533863
31833 -533863 -520993 -507996 -494534 -481564 -470466 -461735 -453993 -443868 -426893 -399107 -358531 -305776
31821 -305776 -243517 -175353 -104835 -35059 31305 91970 145166 189963 226464 255692 279054
31810 279054 297601 311462 319872 321718 316237 303505 284622 261692 237654 215847 199324 190126
31798 190126 188741 193932 203002 212566 219548 221943 218984 210809 198040 181448 161598 138474 111320
31785 111320 78954 40455 -4198 -53844 -106382 -159361 -210598 -258425 -301364 -337586 -364665
31774 -364665 -379907 -381021 -366767 -337401 -294953 -243423 -188799 -138637 -100905 -82076 -85152 -108689
31762 -108689 -147390 -193902 -240732 -281602 -312051 -329577 -333452 -324331 -303766 -273780 -236580 -194469
31750 -194469 -149856 -105222 -62860 -24559 8534 35698 56332 69868 75936 74620 66569 52857
31738 52857 34691 13169 -10664 -35496 -59531 -80774 -97687 -109689 -117058 -120412 -120297 -117185 -111741
31725 -111741 -104972 -98115 -92398 -88856 -88238 -90955 -97110 -106656 -119659 -136454 -157652 -184085 -216885
31712 -216885 -257596 -308132 -370369 -445515 -533406 -631980 -737172 -843321 -943892 -1032003 -1100663
31701 -1100663 -1142995 -1153018 -1127035 -1065050 -971503 -854882 -726166 -596401 -474207 -364181
31691 -364181 -266913 -180436 -102222 -30654 34552 92858 143729 187265 224254 255680 281845
31680 281845 301613 312282 310446 293548 261275 216004 162151 104938 49204 -1443 -45113 -81729
31668 -81729 -112693 -140239 -166789 -194581 -225571 -261408 -303286 -351593 -405439 -462259 -517840 -567115
31656 -567115 -605634 -631048 -643694 -645984 -641142 -632305 -622442 -614709 -612516 -619047 -636609 -666379 -708718
31643 -708718 -763671 -831038 -909796 -997194 -1088308 -1176543 -1254946 -1317766 -1361646 -1386160 -1393492 -1387350
31631 -1387350 -1371474 -1348486 -1319654 -1285501 -1246611 -1203986 -1158878 -1112457 -1065600 -1018759 -971697
31620 -971697 -923203 -871185 -813427 -748748 -677833 -603170 -528211 -456356 -390291 -331820 -281976
31609 -281976 -241066 -208650 -183518 -163961 -148416 -136331 -128681 -127521 -134507 -149129 -167903 -185275
31597 -185275 -195729 -195753 -184563 -163531 -135082 -101864 -66380 -31028 1707 29094 48260 56710
31585 56710 53020 37349 11391 -22177 -60443 -100772 -141028 -179641 -215821 -249875 -283422 -319120
31573 -319120 -359842 -407515 -462236 -522231 -584706 -646917 -706612 -761685 -809644 -847653 -873181
31562 -873181 -884680 -881752 -864815 -834748 -792888 -741428 -683873 -625106 -570806 -526333 -495549 -480112
31550 -480112 -479493 -491614 -513676 -542761 -576095 -611103 -645386 -676518 -701704 -717643 -720991 -709443
31538 -709443 -682845 -643822 -597627 -551330 -512458 -487416 -480089 -491086 -517780 -555059 -596558 -636000
31526 -636000 -668173 -689274 -696822 -689532 -667380 -631617 -584504 -528799 -467280 -402505 -336877 -272874
31514 -272874 -213229 -160783 -117920 -85893 -64518 -52477 -48063 -49977 -57791 -71939 -93335 -122821
31502 -122821 -160726 -206556 -258838 -315139 -372372 -427410 -477705 -521610 -558299 -587586 -609876
31491 -609876 -626305 -638778 -649685 -661306 -675060 -690907 -707132 -720660 -727801 -725148 -710472 -683575
31479 -683575 -647039 -606460 -569689 -545143 -539821 -557879 -600073 -663925 -744311 -834347 -926484 -1013623
31467 -1013623 -1089968 -1151420 -1195442 -1220592 -1226083 -1211770 -1178605 -1129252 -1068373 -1002241 -937775
31456 -937775 -881303 -837433 -808303 -793274 -789117 -790792 -792826 -790952 -783383 -771242 -758113 -748975 -748772
31443 -748772 -760865 -785813 -821015 -861459 -901249 -935263 -960365 -975974 -983987 -988252 -993680 -1005106
31431 -1005106 -1025995 -1057414 -1097789 -1143575 -1190449 -1234346 -1271989 -1301007 -1319928 -1328165 -1325917 -1313976
31419 -1313976 -1293408 -1265282 -1230511 -1189862 -1144090 -1094137 -1041383 -987817 -935896 -887966 -845498
31408 -845498 -808630 -776303 -746894 -718903 -691369 -663897 -636393 -608711 -580340 -550230 -516745
31397 -516745 -477802 -431249 -375496 -310185 -236679 -158132 -79067 -4517 60979 114116 152977
31386 152977 176712 185088 178240 156632 121070 72630 12542 -57768 -136506 -221274 -309038 -396346
31374 -396346 -479768 -556304 -623597 -679917 -723987 -754843 -771853 -774867 -764344 -741325 -707290 -664070
31362 -664070 -613915 -559589 -504289 -451243 -403207 -362237 -329987 -308325 -299610 -306157 -329033 -366972
31350 -366972 -416172 -471105 -525924 -575765 -617407 -649140 -670078 -679516 -676865 -662145 -636428 -601601
31338 -601601 -559441 -510788 -455688 -394643 -330193 -267694 -214550 -178094 -163182 -170752 -197982 -239696
31326 -239696 -290020 -343441 -395197 -441330 -478742 -505160 -518839 -518025 -500593 -464238 -407222 -329253
31314 -329253 -232004 -119131 4101 131539 257113 375707 483436 577156 653736 709913
31304 709913 742990 751869 737670 703588 654118 594152 528370 461098 396372 337803 288201 249260
31292 249260 221609 205117 199136 202459 213200 228818 246395 263075 276396 284354 285226 277452 259773
31279 259773 231528 192837 144522 87933 24832 -42628 -111935 -180309 -244887 -303064 -352976
31268 -352976 -393924 -426494 -452328 -473812 -493841 -515610 -542182 -575768 -617013 -664626 -715721
$$ [...]
##END NTUPLES=NMR SPECTRUM
##END=
