##TITLE=31Pdec_E3d-3
 CDCl3, 24 sc
 15.6.2023
##JCAMPDX= 6.0         $$ Bruker NMR JCAMP-DX V2.0
##DATA TYPE= NMR SPECTRUM
##DATA CLASS= NTUPLES
##ORIGIN= UXNMR, Bruker Analytische Messtechnik GmbH
##OWNER= root
$$ XWIN-NMR		Version 3.5
$$ Thu Jun 15 10:41:04 2023 Russian Standard Time (UT+4h)  she@DPX200
##.OBSERVE FREQUENCY= 81.013821
##.OBSERVE NUCLEUS= ^31P
##.ACQUISITION MODE= SIMULTANEOUS
##.ACQUISITION SCHEME= undefined
##.AVERAGES= 24
##.DIGITISER RES= 16
##SPECTROMETER/DATA SYSTEM= spect
##.PULSE SEQUENCE= zgpg30
##.SOLVENT NAME= CDCl3
##.SHIFT REFERENCE= (INTERNAL, CDCl3, 0, 248.564)
##AUDIT TRAIL= $$ (NUMBER, WHEN, WHO, WHERE, WHAT)
$$ ##TITLE= Audit trail, XWIN-NMR		Version 3.5
$$ ##JCAMPDX= 5.01
$$ ##ORIGIN= Bruker BioSpin GmbH
$$ ##OWNER= she
$$ F:/spectra/data/she/nmr/P31/1/pdata/1/auditp.txt
$$ ##AUDIT TRAIL=  $$ (NUMBER, WHEN, WHO, WHERE, WHAT)
(   1,<2023-06-15 10:40:08.53 +0400>,<she>,<DPX200>,
      <created by zg, POWCHK disabled, PULCHK disabled
       configuration hash MD5:
       00 E9 B6 7A A2 85 ED C7 34 08 36 98 17 FE 4E 26
       data hash MD5: 32K
       A5 F8 ED 5D 56 0D FF 44 DB 68 A8 E0 92 DA 4E 7D>)
(   2,<2023-06-15 10:40:10.92 +0400>,<she>,<DPX200>,
      <Start of raw data processing
       efp BC_mod = 2 LB = 1 FT_mod = 6 PKNL = 1 PHC0 = -10706.12 PHC1 = 136.2848 SI = 64K 
       data hash MD5: 64K
       B2 9D CC 7C E0 44 97 39 9F 5B D0 C6 BE 86 42 A1>)
(   3,<2023-06-15 10:40:27.53 +0400>,<she>,<DPX200>,
      <pk PHC0 = 1.929545 PHC1 = 0 
       data hash MD5: 64K
       54 EB B3 E5 EA 23 6E 74 60 C8 DC E2 AB D2 6D 07>)
$$ ##END=
$$ 
$$ hash MD5
$$ 03 04 35 00 1F 6F 1E B5 06 23 41 69 26 7F E3 26
##$RELAX= 
##$RELAX= 
##$RELAX= 
##$RELAX= 
##$RELAX= 
##$RELAX= 
##$RELAX= 
##$RELAX= 
##$RELAX= 
$$ Bruker specific parameters
$$ --------------------------
##$DU= <F:/spectra>
##$EXPNO= 1
##$NAME= <P31>
##$PROCNO= 1
##$TYPE= <nmr>
##$USER= <she>
##$AMP= (0..31)
100 100 100 100 100 100 100 100 100 100 100 100 100 100 100 100 100 100 
100 100 100 100 100 100 100 100 100 100 100 100 100 100 
##$AQSEQ= 0
##$AQ_mod= 1
##$AUNM= <au_zg>
##$AUTOPOS= <>
##$BF1= 81.014009
##$BF2= 200.13
##$BF3= 200.13
##$BF4= 200.13
##$BF5= 200.13
##$BF6= 200.13
##$BF7= 200.13
##$BF8= 200.13
##$BYTORDA= 1
##$CFDGTYP= 0
##$CFRGTYP= 5
##$CHEMSTR= <none>
##$CNST= (0..31)
1 1 145 1 1 1 1 1 1 1 1 1 1 1 1 1 1 1 1 1 1 1 1 1 1 1 1 1 1 1 1 1 
##$CPDPRG= <waltz16>
##$CPDPRG1= <>
##$CPDPRG2= <waltz16>
##$CPDPRG3= <>
##$CPDPRG4= <mlev>
##$CPDPRG5= <mlev>
##$CPDPRG6= <mlev>
##$CPDPRG7= <mlev>
##$CPDPRG8= <mlev>
##$CPDPRGB= <>
##$CPDPRGT= <>
##$D= (0..31)
0 1 0 0 0 0 0 0 0 0 0 0.03 2e-05 3e-06 0 0 0 0 0 0 0 0 0 0 0 0 0 0 0 0 
0 0 
##$DATE= 1686811207
##$DBL= (0..7)
120 120 120 11 120 120 24 19 
##$DBP= (0..7)
150 150 150 150 150 150 150 150 
##$DBP07= 0
##$DBPNAM0= <>
##$DBPNAM1= <>
##$DBPNAM2= <>
##$DBPNAM3= <>
##$DBPNAM4= <>
##$DBPNAM5= <>
##$DBPNAM6= <>
##$DBPNAM7= <>
##$DBPOAL= (0..7)
0.5 0.5 0.5 0.5 0.5 0.5 0.5 0.5 
##$DBPOFFS= (0..7)
$$ [...]
##$SUBNAM2= <"">
##$SUBNAM3= <"">
##$SUBNAM4= <"">
##$SUBNAM5= <"">
##$SUBNAM6= <"">
##$SUBNAM7= <"">
##$SUBNAM8= <"">
##$SUBNAM9= <"">
##$SW= 501.771253377433
##$SWIBOX= (0..15)
0 1 3 0 0 0 0 0 0 0 0 0 0 0 0 0 
##$SW_h= 40650.406504065
##$TD= 32768
##$TD0= 1
##$TE= 0
##$TE2= 300
##$TE3= 300
##$TEG= 300
##$TL= (0..7)
0 120 53 12 22 120 120 120 
##$TP= (0..7)
150 150 150 150 150 150 150 150 
##$TP07= 0
##$TPNAME0= <>
##$TPNAME1= <>
##$TPNAME2= <>
##$TPNAME3= <>
##$TPNAME4= <>
##$TPNAME5= <>
##$TPNAME6= <>
##$TPNAME7= <>
##$TPOAL= (0..7)
0.5 0.5 0.5 0.5 0.5 0.5 0.5 0.5 
##$TPOFFS= (0..7)
0 0 0 0 0 0 0 0 
##$TUNHIN= 0
##$TUNHOUT= 0
##$TUNXOUT= 0
##$USERA1= <user>
##$USERA2= <user>
##$USERA3= <user>
##$USERA4= <user>
##$USERA5= <user>
##$V9= 5
##$VALIST= <valist>
##$VCLIST= <CCCCCCCCCCCCCCC>
##$VD= 0
##$VDLIST= <DDDDDDDDDDDDDDD>
##$VPLIST= <PPPPPPPPPPPPPPP>
##$VTLIST= <TTTTTTTTTTTTTTT>
##$WBST= 1024
##$WBSW= 4
##$XGAIN= (0..3)
0 0 0 0 
##$XL= 0
##$YL= 0
##$YMAX_a= 6067
##$YMIN_a= -6184
##$ZGOPTNS= <>
##$ZL1= 120
##$ZL2= 120
##$ZL3= 120
##$ZL4= 120
##$ABSF1= 0
##$ABSF2= 0
##$ABSG= 0
##$ABSL= 0
##$ALPHA= 0
##$AQORDER= 0
##$ASSFAC= 0
##$ASSFACI= 0
##$ASSFACX= 0
##$ASSWID= 0
##$AUNMP= <proc_1d>
##$AZFE= 0.1
##$AZFW= 0.5
##$BCFW= 0
##$BC_mod= 2
##$BYTORDP= 0
##$COROFFS= 0
##$CY= -3
##$DATMOD= 1
##$DC= 0
##$DFILT= <>
##$DTYPP= 0
##$F1P= 0
##$F2P= 0
##$FCOR= 1
##$FTSIZE= 65536
##$FT_mod= 6
##$GAMMA= 0
##$GB= 0
##$INTBC= 1
##$INTSCL= 6.047779e-11
##$ISEN= 30
##$LB= 1
##$LEV0= 0
##$LPBIN= 0
##$MAXI= 10000
##$MC2= 0
##$MEAN= 0
##$ME_mod= 0
##$MI= 50
##$NCOEF= 0
##$NC_proc= -5
##$NLEV= 6
##$NOISF1= 182.463
##$NOISF2= 159.3651
##$NSP= 0
##$NTH_PI= 0
##$NZP= 0
##$OFFSET= 248.5645
##$PC= 4
##$PHC0= -10704.19
##$PHC1= 136.2848
##$PH_mod= 1
##$PKNL= yes
##$PPARMOD= 0
##$PSCAL= 0
##$PSIGN= 0
##$REVERSE= no
##$SF= 81.0140089999694
##$SI= 65536
##$SIGF1= 159.3651
##$SIGF2= -187.1042
##$SINO= 113.3802
##$SIOLD= 16384
##$SREGLST= <1H.CDCl3>
##$SSB= 0
##$STSI= 65536
##$STSR= 0
##$SW_p= 40650.406504065
##$SYMM= 0
##$S_DEV= 0
##$TDeff= 32768
##$TDoff= 0
##$TI= <>
##$TILT= no
##$TM1= 0
##$TM2= 0
##$TOPLEV= 0
##$USERP1= <user>
##$USERP2= <user>
##$USERP3= <user>
##$USERP4= <user>
##$USERP5= <user>
##$WDW= 1
##$XDIM= 65536
##$YMAX_p= 406784022
##$YMIN_p= -169290749
$$ End of Bruker specific parameters
$$ ---------------------------------
##NTUPLES= NMR SPECTRUM
##VAR_NAME=  FREQUENCY,     SPECTRUM/REAL,   SPECTRUM/IMAG
##SYMBOL=    X,             R,               I
##VAR_TYPE=  INDEPENDENT,   DEPENDENT,       DEPENDENT
##VAR_FORM=  AFFN,          ASDF,            ASDF
##VAR_DIM=   65536,         65536,           65536
##UNITS=     HZ,            ARBITRARY UNITS, ARBITRARY UNITS
##FACTOR=    0.620285442955139, 1,           1
##FIRST=     20137.2065510682, 0,            0
##LAST=      -20513.1999529968, 0,           0
##MIN=       -20513.1999529968, -169290749,  0
##MAX=       20137.2065510682, 406784022,    0
$$ Real data points
##PAGE= N=1
##DATA TABLE= (X++(R..R)), XYDATA
$$ [...]
39878g74303l443K03872r2160l11312K22163R68339Q27420j20734o58232k38576
39868B3034L25562K47687j45830k10171n1992j24597l11391j71761J90429K31254
39858B224j39455m00026k13220J45903L04120K83998K56070J65460p1955k40435
39848I2684o4432L10449M29614J46281j88982k57637j92917k60333l69376k37058
39838e91707Q8408K54811J55643N9786R9652M1174k22321l48772p3899K70280
39828b66945K20802p2463j09212R6129M4010l30466m31411O5345O14840N15502
39818C46131j64472p45629p53883k69149L06793N60793L58761K8446J4937K42423
39808g4849K06675j63259l00013N4795L46841J37138j28116M6817K41450j11764
$$ plain form
39878 -774303 -777746 -573874 -666034 -977346 -755183 213156 1040576 919842 261610 23034
39868 23034 348596 596283 450453 240282 188290 63693 -247698 -419459 -229030 2224
39858 2224 -137231 -537257 -750477 -604574 -300454 -16456 239614 405074 333119 92684
39848 92684 28252 338701 768315 914596 725614 467977 275060 14727 -354649 -591707
39838 -591707 -503299 -248488 -92845 -33059 66593 107767 -114554 -463326 -537225 -266945
39828 -266945 -46143 -118606 -227818 -131689 -87679 -418145 -849556 -784211 -169371 346131
39818 346131 181659 -563970 -1317853 -1587002 -1280209 -719416 -360655 -332209 -317272 -74849
39808 -74849 131826 -31433 -331446 -276651 70190 207328 79212 126029 367479 255715
39798B55715n38005k21564M63928M16963l22550n59837N7301M71451Q0245k55288
39788a51641J82795O47629K44894m79411m69826R8479K59356j19069l83894l74287
39778e44975m27675l85206J83938R05975R46926L85147O6365J00461k32189r43041
39768E5726j052517k39309M93588L85338K613N7763K22400l218j89835J97503
39758f9948O10470K06417o50623q31621j40786N02177M90213J48582j01697k72156
39748a08972l36382n3564M61707O52028K90722j90233l89481m37625n36969m96532
39738a145301j07907L66867M88573K43975L5908J43728M01831M05189k5070n48912
39728B58881n58191J19941Q67208Q86423J30567o59248q17716l60587K37321N14065
$$ plain form
39798 255715 -282290 -503854 -39926 377037 54487 -505350 -448049 23402 103647 -151641
39788 -151641 31154 678783 923677 444266 -25560 72919 332275 213206 -170688 -544975
39778 -544975 -972650 -1357856 -1173918 -267943 678983 1064130 1130495 1230956 998767 55726
39768 55726 -996791 -1236100 -742512 -357174 -354561 -296798 -74398 -77616 -267451 -69948
39758 -69948 540522 746939 96316 -735305 -876091 -373914 116299 264881 163184 -108972
39748 -108972 -445354 -498918 -37211 614817 905539 715306 325825 -111800 -648769 -1145301
39738 -1145301 -1253208 -886341 -397768 -153793 -117885 25843 427674 832863 807793 258881
39728 258881 -299310 -179369 687839 1574262 1704829 1045581 227865 -132722 104599 618664
39718F18664K65157l08746o57896m42528k7717K525k33100r4221M39632O13747
39708A75517J64336j43735J85248M10994k11538r59893o29814M34191P45199O1077
39698B31582k19565N43261J030369J17189j127141j011293J29034N36816j49864
39689H0388m94174K35908R04291M44061m97915p54594l56785m3602O6571K31679
39679a84172J95415l20181p27305l22888M37770N65873J34885K0940K70226J17801
39669A88364l90158l18410L59607M59828l54656p68412L7761Q79301M43857n49468
39659a2386n88790J42554K51355l98273n24523L04432R38499N21623l14535o46482
39649c26526m80550j97812K12301O84832O63170r9744q82089q20929l7505O10460
$$ plain form
39718 618664 883821 575075 -82821 -525349 -553066 -550541 -783641 -877862 -438230 175517
39708 175517 339853 196118 381366 792360 580822 -379071 -1008885 -574694 170505 231582
39698 231582 12017 555278 1585647 1702836 575695 -435598 -306564 230252 80388
39689 80388 -413786 -177878 726413 1170474 672559 -82035 -438820 -482422 -415851 -184172
39679 -184172 11243 -308938 -1036243 -1359131 -921361 -355488 -220603 -199663 70563 188364
39669 188364 -201794 -520204 -160597 299231 -55425 -823837 -786076 93225 537082 -12386
39659 -12386 -601176 -458622 -207267 -605540 -1130063 -825631 112868 634491 319956 -326526
39649 -326526 -807076 -1004888 -792587 -107755 555415 455671 -426418 -1247347 -1284852 -674392
39639f74392O20539K40790j7409Q8137L60177L59847p6627n34377n14921j33900
39629b82136J03241Q7737Q7294O5519k22620m96870k12780L55229L02101l83661
39619e96946n79920K03003R13901N57351k74408l98005J97645N92397L91042k6199
39609I79861l11354l63284j03713K34719O3065o12018q15299k6738P49134M31903
39599B26276l22581j44147P45894Q79532j5208o36085l11789Q1367j52421m07551
39589e6713o6797L75729K79598q9742k39945k90258m24939l46650M5193K42142
39579e72382M6263M8096M85765N50853k79262j078935p27013L37295P64864K56525
39569a67931k63687j70493K28451M61110L77713m5927o00464o88198m7256N85261
$$ plain form
39639 -674392 -53853 186937 169528 257665 617842 977689 901062 366685 -148236 -282136
39629 -282136 -178895 -91158 -3864 61655 -160965 -657835 -870615 -515386 -213285 -596946
39619 -596946 -1176866 -973863 -59962 497389 222981 -175024 22621 615018 1006060 979861
39609 979861 668507 305223 201510 436229 499294 -112724 -928023 -954761 -205627 226276
39599 226276 -96305 -240452 505442 1384974 1369766 733681 421892 503259 350838 -56713
39589 -56713 -123510 252219 531817 442075 202130 -88128 -513067 -859717 -814524 -572382
39579 -572382 -526119 -478023 7742 558595 279333 -799602 -1526615 -1189320 -424456 -167931
39569 -167931 -431618 -602111 -373660 87450 465163 419236 -181228 -869426 -916682 -331421
39559c31421L71582k99028l43491L14027O63296K51597k24488k10531j01919l13721
39549b24097m72833j37362L80490N24055L10482J02907o515j02697j12191o458
39539B55781j0556k16181l17067j03473J31835Q3676k6491J30254L48089K08070
39529D83937j69176k68840p13J77087n493k51222j97352O7091J82491j009k89945
39518b73144l85635j72997J64936L23422K30334J41387K65087M19481K71911j68551
39508H16231n51195o31108m48604r3032L73953P01000N29668r1503n64026m01243
39498c59859J44200M04307J27262l10804m53443k15659J94512M99376M68058J09490
39488F07440j96695p9059K35388R6539o06599j072755n67792N11456J052361O00298
$$ plain form
39559 -331421 40161 -258867 -602358 -288331 374965 626562 402074 191543 89624 -224097
39549 -224097 -696930 -834292 -453802 70253 380735 483642 477127 374430 262239 255781
39539 255781 245225 29044 -288023 -391496 -259661 -175985 -202476 -72222 275867 483937
39529 483937 314761 45921 45208 222295 216802 -34420 -231772 -164681 17810 16801 -273144
39518 -273144 -658779 -831776 -666840 -343418 -113084 28303 293390 712871 984782 816231
39508 816231 265036 -366072 -814676 -907708 -533755 167245 696913 605410 41384 -359859
39498 -359859 -215659 188648 315910 5106 -448337 -663996 -469484 29892 497950 607440
39488 607440 410745 331686 567074 663613 57014 -1015741 -1583533 -1072077 -19716 580582
39478E80582j75666m25952p6260L31701M01151J92134o9785l03066n19878o05170
39468f70209l49479J85127N05701K15253l55579m92935j32203M9725j99366k01123
39458a445088M55548R88918N94052j05769J9736O56118M83071n26056q95445p7200
39448A47885N83050Q6957n67945j61990O39387M75548l59256m92620J11541J26154
39438E88711p89428j311757n22051P21014J098399N16248j65823l62063j26850
39429c53600K03668K77307k0972l41959k55981P3036J02190j71571j73881K37263
39419d24500M79235K49884O7090L39607N75144J56389n66306o74584L1147P67834
39409A000940P72950J16939n38088o75890l33249M9638Q6072k16553n23899n06898
$$ plain form
39478 580582 404916 -21036 -97296 234405 635556 827690 757905 454839 -65039 -670209
39468 -670209 -1019688 -834561 -328860 -113607 -469186 -962121 -1094324 -1044599 -1243965 -1445088
39458 -1445088 -989540 -622 593430 487661 507397 1163515 1646586 1120530 225085 147885
39448 147885 730935 817892 249947 87957 727344 1202892 843636 351016 462557 588711
39438 588711 -200717 -1512474 -2034525 -1313511 -215112 301136 135313 -226750 -353600
39429 -353600 -149932 127375 106403 -235556 -491537 -418501 -316311 -487882 -661763 -424500
39419 -424500 54735 304619 371709 711316 1286460 1442849 876543 201959 233106 1000940
39409 1000940 1773890 1890829 1352741 676851 343602 393240 479312 262759 -261140 -768038
39399g68038q3755N19963Q55512N99658q230l16066o6282K57737J93329q211O0469
39388A236086J48112j81406n80210l37588L37124M40451k94728r39932p37918
39379i10009q5498K47685J50563l3336j30784j07559R0799K93402J59551k39884
39369e65070m00478j68691M4702N5088J91270M91787M30711r3086l24720J61163
39359a77324O23654K81934l99028m52311Q0473L53223R8422j56245j01590N812
39349A57020p404R702P5453l805k04912k82441j91387p6335Q6796L85288N97964
39338E45939M05060p3332l70062k71294J2142J88289J11323j77519l75538j34728
39328a39720L82497N27821P9168l31298j54818K14001J22460k72433l69006j67663
$$ plain form
39399 -768038 -851793 -331830 523682 1123340 1115110 799044 732762 990499 1183828 1175617 1236086
39388 1236086 1384198 1202792 622582 284994 622118 1062569 767841 -172091 -910009
39379 -910009 -995507 -747822 -597259 -630595 -761379 -868938 -778139 -484737 -325186 -565070
39369 -565070 -965548 -1134239 -1089537 -1034449 -843179 -351392 79319 -13767 -338487 -177324
39359 -177324 446330 728264 329236 -123075 -42602 310621 409043 252798 151208 157020
39349 157020 149616 159318 234771 230966 26054 -256387 -447774 -524109 -437313 -52025 545939
39338 545939 950999 877667 507605 236311 248453 436742 548065 370546 -4992 -139720
39328 -139720 242777 770598 849766 518468 363650 577651 700111 427678 58672 -108991
39318a08991j20014k10014n6177K47858K68174R1728J72640L82802J35937n08795
39308B95148p90967m29099K4300J89139L37943O02655N68664O0854m12764m40699
39298E174k90141k98320k90651l7570K57401L51300L50498L38378J36324j99542
39288C22851k23485J21725J80519l96274q77643m25224N66100R10462K36196o07481
39278a92254p41042k03502L89350O00833M00378J6770k23363j25417J66822L20621
39268D09196K04517n853j05562p5248L122Q1510J24978O5922j14683k84201k38717
39257F4981M8071L17471K93923L5677j66980k39296l71661n40245l84919J73555
39247g69423O09729N04283K00699K11497L26856L4318m31439l51279K24226M45837
$$ plain form
39318 -108991 -229005 -439019 -495196 -247338 20836 112564 285204 668006 803943 295148
39308 295148 -495819 -924918 -900618 -711479 -373536 229119 797783 858637 445873 5174
39298 5174 -284967 -583287 -873938 -911508 -654107 -302807 47691 386069 522393 322851
39288 322851 99366 221091 401610 5336 -872307 -1297531 -731431 179031 415227 -192254
39278 -192254 -933296 -1136798 -747448 -146615 253763 270533 47170 -78247 88575 409196
39268 409196 613713 607860 502298 427050 430172 511682 636660 702582 587899 303698 64981
39257 64981 113052 430523 724446 760123 593143 353847 -17814 -558059 -942978 -769423
39247 -769423 -159694 344589 545288 756785 1083641 1117959 686520 335241 559467 1005304
39237A005304L4617k91637q8128Q3281k63826n93401k35406M35470N44501R885
39227F40660m90614n40325k62273J60168N55511N71876P4503m33866l98063k2455
39217a44878J06950l4379l8835Q9794K0289j26581M9682L32591R8423n04274n65589
39206g16807J49274P30269M91243p8139k44526r5031m6502l2520J00608L8216
39196B96085l71211n16857N3076O26053K68641o04372p64276r2380K86556j24415
39186i43100m72976r4233M21267L58691P8377K22307M81088J46576n64788p32869
39176a099660r7010O45589Q53254N44640R403n24856p69821m92781R8714M85044
39166c47484M27443J37944r4332j30547N3498K90267K61486m1101j51483J58460
$$ plain form
39237 1005304 1039921 748284 660156 743437 479611 -113790 -349196 86274 630775 640660
39227 640660 150046 -390279 -652552 -492384 63127 635003 709506 275640 -122423 -144878
39217 -144878 -37928 -72307 -111142 -21348 -1059 -127640 -77958 254633 353056 -151218 -716807
39206 -716807 -567533 162736 653979 575840 331314 236283 189781 157261 257869 296085
39196 296085 -75126 -591983 -538907 87146 355787 -248585 -1012861 -1105241 -818685 -943100
39186 -943100 -1416076 -1510309 -1089042 -730351 -651974 -429667 51421 197997 -366791 -1099660
39176 -1099660 -1196670 -551081 302173 846813 856216 331360 -438461 -931242 -832528 -347484
39166 -347484 79959 217903 123571 -6976 46522 336789 598275 557174 405691 564151
39156E64151L64730k0790n30394m06467J11804J39205l66133n48002j17385K57807
39146e51474K18749K18553M22026K81334k76722m09563K01169N94935Q6993m89300
39136B96700j66764M76471L01607m55376o45621j50626P6804k67568m48750p1416
39126a054539L58009M27811L62474L74592L52141L32121M68745M60816j33926
39117A948244r44272j052171l52084K55533K19429p641P5040K76116K72101J40777
39107H31072m677k26231l40387n769N20196M85400k03688p21959n44080j08022
39097c18145J02266K57455M85815L70148k19704o03737l30649j339k47419n78604
39087a083913k08620N11926N74660o9252m62044j58804K20677J25517j17696J0070
$$ plain form
39156 564151 928881 908091 377697 -28770 83034 222239 -143894 -691896 -809281 -551474
39146 -551474 -332725 -114172 307854 589188 312466 -97097 104072 699007 786000 296700
39136 296700 129936 606407 908014 452638 -192983 -343609 -266805 -534373 -983123 -1054539
39126 -1054539 -696530 -268719 93755 468347 820488 1152609 1621354 2082170 1948244
39117 1948244 1003972 -48199 -400283 -144750 74679 67038 142078 418194 690295 831072
39107 831072 826395 600164 259777 254008 774204 1259604 1055916 333957 -210123 -318145
39097 -318145 -215879 41576 527391 897539 677835 74098 -256551 -257890 -505309 -1083913
39087 -1083913 -1292533 -780607 -205947 -275199 -737243 -896047 -675370 -549853 -667549 -657479
39077f57479L73795M82013K51607L8364O0192J41917N4235j23899j38954O761
39067D88552n238l08372n14921j91738M46515P09253K93149l89635p61852o03314
39057h37601m3492N41808O38199R8486m33375j72255O57451R64800K58615p12369
39047I60267j064886q25971m69971j05006L02864M60833J77359j30875j768L02598
39037c94556K12226k00742l34901j8734K56747J16190j81611j72059J69995M22906
39027a24539K80756k9892l9607K54862K87074k16032o38369k91096M46319N65745
39017D95221p6074n67956l39146J44652L12362K36632J13831j48179m04644j72872
39007d06173M61371O54968N9620n41151m17938R3823L75758M62111N04504J96803
$$ plain form
39077 -657479 -283684 198329 449936 488300 548492 690409 744644 620745 481791 488552
39067 488552 483314 174942 -339979 -531717 -85202 624051 917200 527565 -234287 -837601
39057 -837601 -881093 -339285 298914 397400 -35975 -208230 449221 1414021 1672636 960267
39047 960267 -104619 -930590 -1400561 -1505567 -1202703 -741870 -564511 -695386 -697154 -394556
39037 -394556 -182330 -383072 -717973 -736707 -479960 -363770 -545381 -717440 -547445 -124539
39027 -124539 156217 126325 86718 341580 628654 412622 -225747 -516843 -70524 495221
39017 495221 419147 -148809 -487955 -343303 -30941 205691 319522 171343 -233301 -406173
39007 -406173 55198 710166 769786 228635 -189303 -95480 280278 742389 1246893 1443696
38997A443696m45580o09887P4111O56456K56279m94575n48449j77732k71682n96069
38987g13432k92937L62166L45966k06449j51977N99958Q25632M7915o70623m69433
38977c23214J10129K57293Q6924N2406R3934J1312m3927K4493j5666k04998k20953
38966a72267j6492L9263r6600o878L08695K52349k92734n36002L3174P58753P52269
38955A023530J54391j96375J5618L06045J61551l65544p90772p04422j82819K87866
38945b90931L86490K85136K11851M5838k48185k38305K65820N65446J6586p45515
38935B54231o11738K04862M39593j93177o15074k37390K02557J14248J6168L44400
38925h1320N13461K2449n12538l52156J55710K49564n0779k62621l38252m36824
$$ plain form
38997 1443696 998116 388229 462340 1118796 1375075 880500 332051 154319 -117363 -713432
38987 -713432 -1006369 -644203 -298237 -504686 -656663 -56705 768927 816842 146219 -323214
38977 -323214 -213085 44208 131132 183538 277472 288784 244857 269350 253684 48686 -172267
38966 -172267 -188759 -149496 -246096 -252974 55721 308070 15336 -520666 -487492 271261 1023530
38955 1023530 1177921 981546 997164 1303209 1464760 1099216 308444 -395978 -578797 -290931
38945 -290931 95559 380695 592546 638384 390199 151894 417714 983160 999746 254231
38935 254231 -357507 -152645 286948 93771 -521303 -758693 -556136 -441888 -425720 -81320
38925 -81320 432141 454590 -57948 -410104 -254394 -4830 -55609 -318230 -656482 -1093306
38915a093306l40255J39375O24295O82659M18515N8621m37565q63110o25137K61623
38905a174285Q37621N46283Q3159J33884K04432l04808p77983l63447M68365O66775
38895C19996K97760J32084P9500m48574r96821n48402N58857Q62934N8067n58907
38885b43506k39158J90104n264k44818J12549N39636L30962j39828j37588J90480
38875C53569K31506M915m0889R9544J25468Q8833J80127J75315j80416n17971
38865E20001l20958J47942J74736k38914l37293J60758N44541J49528o38537q80085
38855g18281l09997L77080M43966j6307k85518L5932N43449N99083J85848j23299
38845G31956j0411J80994L9019l04468m66684m14262l55416k41417J16859N00782
$$ plain form
38915 -1093306 -1433561 -1294186 -669891 12768 431283 489904 52339 -810771 -1435908 -1174285
38905 -1174285 -336664 209619 292778 426662 631094 326286 -451697 -815144 -346779 319996
38895 319996 617756 749840 829340 380766 -616055 -1164457 -605600 257334 315401 -243506
38885 -243506 -482664 -292560 -297824 -542642 -430093 109543 440505 300677 163089 353569
38875 353569 585075 589990 549101 648645 774113 862946 1043073 1218388 1037972 520001
38865 520001 199043 346985 521721 282807 -54486 106272 650813 800341 161804 -718281
38855 -718281 -1028278 -651198 -207232 -223539 -509057 -473125 70324 669407 855255 731956
38845 731956 721545 902539 941558 637090 170406 -243856 -599272 -840689 -723830 -223048
38835b23048M03234j90104o29133m35103J03596M41059M77257L93526J79295j65078
38825C55501k60381J66940O01632K91532n28139p98933k12775K76540m5206n27065
38815f80354k62107M26205N78015J53263j04321m2023j51681l68682q3349N31976
38805c058N04040k70809o16715M4990O30551J10754p63571o31839L29386P49750
38795H3479J78356m28277k77122L04299O22665M68340K6890l97127m48357o1037
38785G2109K58489K4854m38495m19654Q0038L83165K31810N8007R6083L9124k21530
38774A64000k88540k919J82127n8908l84755l60721p3691J69716K88379K41711
38764a23601j16520o23418p00892j01083O04535P11495K66430j30712j47863M7258
$$ plain form
38835 -223048 180186 -9918 -639051 -1074154 -970558 -529499 -52242 341284 520579 355501
38825 355501 95120 262060 863692 1155224 627085 -171848 -384623 -108083 -153289 -680354
38815 -680354 -942461 -516256 61759 215022 110701 68678 -83003 -451685 -535034 -3058
38805 -3058 500982 230173 -386542 -341552 288999 399753 -363818 -995657 -666271 83479
38795 83479 261835 -166442 -443564 -139265 483400 951740 978630 581503 133146 72109
38785 72109 330598 355452 -83043 -502697 -422659 -39494 192316 250323 346406 385530 164000
38774 164000 -124540 -127459 54668 -4240 -388995 -749716 -823407 -653691 -365312 -123601
38764 -123601 -240121 -863539 -1564431 -1665514 -1060979 -349484 -83054 -213766 -361629 -314371
38754c14371J79938J42452Q82m7943J12747K45399J1441l86984l08210L25212
38744c9437O97499K45808m11861l77989J27276J56663l77224n30666R7909O05064
38734A93042J20163q19496r82322j57237O29101N46441r0960m82320l67815l1438
38724a442841L19842O59733P75077L50645m55819r51392o82782j577M11044L56098
38714f61972J42272n73j12040j66302O874L63456N57066L73388R813k11825k00901
38703I9256o3644O1182K0840k60327n68743n15135l9538M05365L85159K9166j84885
38692f31304p1211R2982J8247j87481j60124K14336N38139L05114l77376p27124
38682i85802k34912N41116O19370m2156m66383q5663M47787L00400k99684n05246
$$ plain form
38754 -314371 -134433 8019 8901 -39042 73705 319104 330545 -56439 -364649 -39437
38744 -39437 658062 903870 492009 114020 241296 397959 20735 -509931 -412022 193042
38734 193042 313205 -506291 -1488613 -1645850 -1016749 -470308 -561268 -1043588 -1411403 -1442841
38724 -1442841 -1122999 -463266 311811 662456 206637 -744755 -1427537 -1429114 -1018070 -661972
38714 -661972 -519700 -520273 -632313 -798615 -791741 -428285 128781 502169 511982 300157 99256
38703 99256 35612 96794 117634 -142693 -711436 -1226571 -1266109 -860744 -475585 -446419 -631304
38692 -631304 -702515 -609533 -591286 -778767 -938891 -724555 -186416 118698 -258678 -985802
38682 -985802 -1220714 -679598 -60228 -102384 -568767 -654430 -206643 93757 -205927 -711173
38672g11173j38691K06485J75213K0628l4639j17075k39051j13080L27557O83068
38662E9242O10148K30077j66013m44608m98098k18872J62776J59480k47701m09846
38652g63415O1051N93141M28452k34536n29825j86268K03105J77629k0476m7567
38642c18709l324n6312l9896J66987K47848r2977n38820n14335o614M15358L66430
38631c74364L1502k23342k41484r258M22806P86232O86159J01993m26440m05436
38621C48368m1257M3827k92717m94448j33756L99255M13772n3772k54384J39783
38611G4671M67696M2161p37036q69419j86378M39407L99986J08202J19456K20745
38601G9491p062k78966m8220M62125N26003J04135r8068J63581K75013j32712
$$ plain form
38672 -711173 -849864 -643379 -468166 -447538 -482177 -599252 -838303 -951383 -623826 59242
38662 59242 669390 899467 733454 288846 -209252 -428124 -265348 -105868 -353569 -763415
38652 -763415 -702364 -109223 319229 84693 -445132 -631400 -428295 -250666 -271142 -318709
38642 -318709 -322033 -378345 -418241 -251254 -3406 -96383 -635203 -1149538 -1156152 -740794 -374364
38631 -374364 -342862 -566204 -807688 -816946 -394140 392092 1078251 1180244 753804 348368
38621 348368 307111 350938 58221 -436227 -569983 -170728 243044 189272 -65112 74671
38611 74671 542367 584528 -152508 -1021927 -1208305 -768898 -368912 -260710 -141254 79491
38601 79491 72429 -206537 -254757 207368 733371 837506 739438 903019 1178032 1045320
38591A045320m74071j25512N29466O04657n9930p55778q48266l92654J30907L32362
38581a3499J70694o6967p2339R8192J09837r5341j49481J34169L80444K25448
38571G21157o8333l7535J91130R5278l54781n74803k10135L67974N70683K59594
38561I60229k44429n55072m83260j15708K33356K75322K8644k26751k55626l8657
38551d21952K66588L94176J36017l52886n62329k16527K71856K74025k11189n65084
38541i87305l80488J08989M74284N70780M52123J57065k25112n08500n75568m30282
38531a344014p9067L92226O52603M18371l4760q3866L74285P16532M74961m2712
38521A444559l41096m66169o55322o71249j60527N36809O79987K23846r8289P3418
$$ plain form
38591 1045320 571249 445737 975203 1579860 1519930 764152 -84114 -476768 -345861 -13499
38581 -13499 157195 90228 17889 116081 225918 130577 -18904 115265 495709 721157
38571 721157 652824 615289 806419 901697 546916 -27887 -238022 129952 700635 960229
38561 960229 715800 160728 -322532 -438240 -204884 70438 99082 -127669 -383295 -421952
38551 -421952 -155364 238812 374829 21943 -540386 -756913 -485057 -211032 -422221 -987305
38541 -987305 -1367793 -1258804 -784520 -213740 238383 395448 170336 -338164 -913732 -1344014
38531 -1344014 -1423081 -1030855 -378252 40119 5359 -78507 295778 1012310 1487271 1444559
38521 1444559 1103463 637294 -18028 -689277 -849804 -312995 366992 590838 492549 565967
38511E65967K15029j09097m47434k07910K97778K88600k56861n70637k67911J71087
38501c21389K32236L5888p8765o8196L6352L33405O49145M56845l02562q15636
38491A57323m45195K47002K95592j92786k93489J76215M20320Q0581j99271J6939
38481B63231J95645j43426n12863k98652J72973K12549j09495k28529q1128l4975
38471e64670j11498l8240J39194J88820K07250L34832K48598l05916p72538m56141
38461a130309K76711M36470o3798l66684j64615j02720m56783n28907J48442R37192
38451a015001J017256M71862q3764l31177k41028J36124M27959J36207m95138
38442B3300n32434K38508P77083L13075m39821m56174P574P5862j43365P6445
$$ plain form
38511 565967 780996 671899 224465 16555 314333 602933 346072 -224565 -492476 -321389
38501 -321389 -89153 -53265 -132030 -200226 -163874 169531 818676 1275521 972959 157323
38491 157323 -287872 -40870 254722 61936 -231553 -55338 364982 445563 246292 263231
38481 263231 458876 315450 -197413 -496065 -323092 -110543 -220038 -448567 -529695 -564670
38471 -564670 -676168 -714408 -575214 -386394 -179144 155688 404286 98370 -674168 -1130309
38461 -1130309 -853598 -417128 -480926 -847610 -1012225 -1114945 -1571728 -2100635 -1952193 -1015001
38451 -1015001 2255 474117 390353 59176 -181852 -45728 382231 518438 23300
38442 23300 -509134 -270626 506457 819532 379711 -76463 -68889 6973 -136392 -59947
38432e9947N13941K50464n77146p46319N1786N71148l6095q46850o34062K49912
38422a263168N69599J73970J5445L94988M57608k64473q68634l55115P60683J019983
38412F40886L6453r43739p35032K52990P29308L19757j18914R2599N28027M38662
38402A240997j27068m95914l51657l0497O6053o8258j96819j70438m3967N330
38392a72238j16100k51325j63149Q6726J64844l1296j95875j00214P9113J37752
38382e61762J83583L11193L22431J30275M0606K06449K43168p9721k53019J41724
38372F84927M83629l0978q87603p93487K98543R69064M28652l90463m13271K6811
38362C75824N3060k55005k57820r234j6199j40996J54612O48942N28785k32861
$$ plain form
38432 -59947 453994 704458 127312 -619007 -567221 3927 -32168 -879018 -1513080 -1263168
38422 -1263168 -693569 -519599 -504154 -109166 348442 83969 -784665 -1139780 -379097 640886
38412 640886 677339 -266400 -1001432 -748442 -19134 300623 181709 274308 802335 1240997
38402 1240997 1113929 618015 266358 235861 301914 233656 36837 -133601 -177568 -172238
38392 -172238 -288338 -539663 -702812 -616086 -451242 -482538 -678413 -778627 -699514 -561762
38382 -561762 -378179 -66986 255445 385720 426326 632775 875943 796222 543203 684927
38372 684927 1168556 1137578 249975 -543512 -244969 724095 1152747 762284 349013 375824
38362 375824 428884 173879 -83941 -93175 -109374 -250370 -95758 553184 1081969 849108
38352H49108o62343k06585M57717M33718j88227n85510k97239L20041N63813J20733
38342H05226n70104p19789j35764M33981K77336k21935j46023M76899O29484j06729
38332G22582q38173o90999n3684J88000K8656J08284M82633N56253J61415j47193
38322E17774j6693J87127N8537k06060k10665j9368M137j74201j93549J26427
38312G3466M44643L08911k04506n05543k37323K21409K86196L7280O6378M31151
38302I22062M14221l28352r90956o42347L61435P87046K21185m62113m46312k0006
38292a84137P9375k06882l15035R694L24434R4976n26171p25060J8354J075563
38282c54889J200251J20642r29682p79043J00008L77529j61275n18766k29708
$$ plain form
38352 849108 186765 -19820 437897 871615 683388 97878 -199361 120680 684493 805226
38342 805226 235122 -484667 -620431 -186450 90886 -131049 -277072 199827 829311 722582
38332 722582 -115591 -806590 -860274 -672274 -643618 -535334 -52701 503552 664967 517774
38322 517774 501081 688208 746745 540685 330020 310652 314789 140588 -52961 73466
38312 73466 518109 827020 622514 116971 -120352 101057 387253 424533 490911 922062
38302 922062 1336283 1007931 16975 -625372 -263937 523109 744294 282181 -164131 -184137
38292 -184137 -104762 -311644 -626679 -616985 -292551 -197575 -723746 -1448806 -1430452 -354889
38282 -354889 845362 966004 36322 -742721 -642713 -265184 -426459 -945225 -1174933
38273a174933N9085l1369O7960O34804R10596L79269k21644j03657K36383m6036
38263G10458o09098n45988j392J32939j86809j83764K58793M54622K69339L09596
38253F08696N79905K72959o84131j125931l54242P03557Q40728K27919j48130
38244I21330l2603O3995m5612n6869O3329l2163l83108n52273k59208K46844N48616
38233D82278M95392K13390r2938k86546l53156l28308j87590O1822K13825M7243
38223B65412k85381l54617l2762L27065L97650K39797L4228j83377l34133k10925
38213a37043J58615L75588J80294j54434k18121l5632L8007j45849l48100k52362
38203e39037J63473N41340M68022j5141l82752l06844j02830j36299j44306K28282
$$ plain form
38273 -1174933 -1115848 -1147217 -1079257 -444453 466143 845412 623768 520111 756494 710458
38263 710458 101360 -444628 -446020 -313081 -499890 -683654 -424861 29761 299100 608696
38253 608696 1188601 1461560 777429 -348502 -702744 813 841541 1069460 921330
38244 921330 888727 952722 907110 850241 913570 881407 498299 -53974 -313182 -66338 482278
38233 482278 977670 1191060 1098122 811576 458420 130112 -57478 4344 218169 265412
38223 265412 -19969 -374586 -407348 -80283 317367 557164 591392 408015 73882 -137043
38213 -137043 21572 397160 577454 423020 204899 169267 207274 61425 -286675 -539037
38203 -539037 -375564 165776 633798 618657 235905 -70939 -173769 -310068 -454374 -226092
38193b26092N39510R9522p26954q36863r6439M18092J79060k0681L95766P18037
38183D42958K66564l25796k24726J41640n3855m70912k38407M01492M88103J8570
38173D45631j79633l1854k24418o77388m86970M11298R08066M21881k95609m81106
38163a90102l29812j74890J55398N71389M10458l82068p53495n7994Q04683O87276
38153G40843j15473m87597k14649O860q2930n7785J99131K50607l4948j88467
38143A5592P7560M03396L48030j6227l06923l34975k15119j43795j91834k58960
38133f23255k14181p5594M2014J23429J98429J46381j18874l09929p9460L06603
38123f04437K23963k38716k19274N36180J036645M52349n43659p36776j66951
$$ plain form
38193 -226092 313418 412940 -314014 -1150877 -1247316 -829224 -650164 -670845 -275079 442958
38183 442958 709522 383726 159000 300640 246785 -224127 -462534 -61042 427061 445631
38173 445631 265998 234144 9726 -667662 -1154632 -743334 164732 586613 291004 -190102
38163 -190102 -519914 -694804 -539406 31983 442441 60373 -693122 -751116 53567 740843
38153 740843 625370 137773 -76876 -70016 -152946 -210731 -11600 239007 204059 15592
38143 15592 93152 496548 844578 828351 521428 186453 -28666 -172461 -364295 -623255
38133 -623255 -837436 -913030 -871016 -747587 -549158 -402777 -521651 -831580 -911040 -604437
38123 -604437 -380474 -619190 -838464 -302284 734361 1186710 643051 -93725 -260676
38114b60676J03072k30803l34873K38341P25458L22125n79242r12525k96557O10302
38104f15378R20848L84618m34780p10447k09337M09134L73997k04309n01129j03525
38094f90308N15885P43330N44354K24514q3911l79689n64003n81905n65369n57669
38084a394771l12287L27987J002470J102502M52485m73036r99645q17640j74393
38075a286328L75923M61337K04282L324K1252N1097p5729j72341M3459M94890
38065A21166P56317N40121O1505j80044r73K01715l6892n36145o18114p6824M33436
38054F65268L05282j36233j80772J52156K42725m0318j88814l8295n7150m04084
38044C19765n16879q8976K73655j8939n44383n16105m557K55755K8832k10755
$$ plain form
38114 -260676 -157604 -388407 -723280 -484939 240519 562644 -16598 -929123 -1225680 -615378
38104 -615378 305470 690088 255308 -455139 -664476 -255342 118655 -85654 -586783 -690308
38094 -690308 -174423 568907 1113261 1337775 1253864 874175 310172 -271733 -837102 -1394771
38084 -1394771 -1707058 -1379071 -376601 725901 1178386 705350 -294295 -1111935 -1286328
38075 -1286328 -910405 -449068 -244786 -241462 -220210 -169113 -244842 -417183 -373724 121166
38065 121166 877483 1417604 1479109 1299065 1298092 1499807 1462915 926770 308656 231832 665268
38054 665268 970550 834317 653545 805701 1048426 1008108 819294 780999 723849 319765
38044 319765 -197114 -286090 -12435 -31374 -575757 -1091862 -1096419 -840664 -811832 -1022587
38034a022587j35026N6234J26588R1288k9490k31971k70492J13506O47611P26891
38024G2552K69282j24853m5359J68895K0997l76842m93281j37635L06271L82769
38014D2796R9349j11597O0013L74600L27176j29291m47423k45448J51148K65983
38004C87306K10693L41645M61317P7701o14136p86881j76696M67469M26206p8227
37994G16397l76139k73567n9196N7458Q5951L8839q1981j94154k24598j73125
37984d84115k8425J73286K21614j6344k60711j69659L4348j12777l88276r1905
37974a122964O51192P65884j28558r14207n70183K75248L80450j88385l62726
37965a214249R8776L78436J18115q1971J27385K58031j6786k35966m781L26513
$$ plain form
38034 -1022587 -1157613 -1101379 -974791 -883503 -912993 -1144964 -1415456 -1301950 -654339 72552
38024 72552 341834 216981 171622 340517 361514 -15328 -508609 -646244 -339973 42796
38014 42796 142145 30548 90561 465161 792337 663046 215623 -29825 121323 387306
38004 387306 597999 939644 1400961 1478662 864526 77645 -99051 368418 794624 716397
37994 716397 340258 66691 7495 64953 150904 189743 107762 -86392 -310990 -484115
37984 -484115 -512540 -339254 -117640 -133984 -394695 -564354 -530006 -642783 -1031059 -1122964
37974 -1122964 -471772 294112 165554 -748653 -1318836 -1043588 -663138 -851523 -1214249
37965 -1214249 -1115473 -737037 -618922 -700893 -573508 -315477 -332263 -568229 -573010 -246497
37955b46497L56145K91956L53456J74916m92198j000788n63950M69727R16785
37946B59552L17668n16388o62219j94505J69182J10035l8745O9446L09450L39077
37936A62553J10825p1219L1476K83834L56472J20895k36388m62071m94699m45774
37926f44096l87081k47458K6488K74991K65714O7800M1101K80632L50934q4214
37916e5189o11248n50486M6611M82270M45168K70739J43572j30169l70811M354
37906c25189Q41979J062953K59152m79876k05901L53768N1215p03750o73914L5248
37896B15685J98889l16493l19133N17712R38775J86987o92756n19048K45139M00711
37886H56468j73592o51750o11950l17246l1710J70335J95360J07358J98396M47674
$$ plain form
37955 -246497 109648 401604 755060 929976 437778 -563010 -1126960 -657233 259552
37946 259552 577220 60832 -601387 -795892 -626710 -516675 -555420 -485974 -176524 162553
37936 162553 273378 202159 233635 517469 873941 994836 758448 296377 -198322 -644096
37926 -644096 -1031177 -1278635 -1252147 -977156 -711442 -643642 -602541 -321909 29025 -55189
37916 -55189 -666437 -1216923 -1170312 -688042 -242874 27865 171437 41268 -329543 -325189
37906 -325189 516790 1579743 1838895 1359019 1153118 1506886 1558101 854351 180437 215685
37896 215685 414574 98081 -221052 296660 1235435 1422422 729666 210618 455757 856468
37886 856468 682876 31126 -580824 -898070 -929780 -759445 -564085 -456727 -258331 189343
37876A89343L63287j93184n82329l26876J01615P4754j70387n2111K84055K51882
37866e9951j40324l69897k97992j93957k9481M28040Q71006O41888j86907o55777
37856F648j55758O98731Q25879K8497p87091p27955J2900M37143P4214l85977
37846B7231j53750L92008K83520l82645m76992K78940O86783l1641q59218n32620
37836g68384M40816O07444j70608o88363l95254j5455q9036j75019J45104N18183
37826e90572N33788L75996L16344K17990m9502k67477k93081l06081l28751n2796
37816d44142M97525O77855Q4595p01583p65886l6682O59132O35716N5887m30331
37806B32086m63474k27720l1712J16823L38167M44349J02892m94238o46576j32139
$$ plain form
37876 189343 552630 359446 -222883 -549759 -448144 -373390 -543777 -595888 -311833 -59951
37866 -59951 -200275 -570172 -868164 -1062121 -1091602 -663562 207444 849332 662425 6648
37856 6648 -149110 549621 1375500 1403997 616906 -111049 -98149 338994 413208 27231
37846 27231 -126519 265489 549009 166364 -310628 -31688 655095 623454 -235764 -768384
37836 -768384 -327568 279876 109268 -579095 -974349 -989804 -1078840 -1253859 -1108755 -590572
37826 -590572 -56784 319212 635556 853546 804044 536567 243486 -62595 -391346 -444142
37816 -444142 53383 731238 815833 114250 -651636 -688318 -29186 606530 662417 232086
37806 232086 -231388 -459108 -490820 -373997 -35830 408519 511411 17173 -629403 -761542
37796g61542L32921J06971l79831l10293K22588M43098J90670L0365R6570j33182
37786a61665o78473o94801J99397J072938Q80165o3103n69103k00914L48012L72374
37776E04827k2111k91934j59787K22034N17847M75609J15163k66155l72940k11216
37766E11337j9996O1929J13963K00184J85067p4089m17410m77777j71631J05204
37756A6781l852k48032q2483M72467P43437L44659k32411l04202O7254K51037
37746A024655l7393m46031n53523l40577n3888J26232J93268K10076J54535p8390
37736A98964m16912m82789l1082N59703O79547L40206P8383J2146k43354n93179
37726A01633l69318L78278N56621k84064r61996l82839O50726O42196k64951o55938
$$ plain form
37796 -761542 -428621 -321650 -701481 -1011774 -789186 -346088 -155418 -125053 -28483 -161665
37786 -161665 -840138 -1534939 -1335542 -262604 617561 554458 -14645 -215559 132453 504827
37776 504827 482716 190782 30995 253029 770876 1246485 1361648 1095493 722553 511337
37766 511337 491341 553270 667233 867417 1052484 978395 560985 83208 -88423 16781
37756 16781 12929 -235103 -317586 154881 898318 1242977 1010566 706364 773618 1024655
37746 1024655 987262 541231 -12292 -352869 -406757 -280525 -87257 122819 277354 198964
37736 198964 -217948 -700737 -731819 -172116 507431 847637 926020 938166 694812 101633
37726 101633 -267685 110593 667214 383150 -578846 -961685 -310959 331237 66286 -589652
37716e89652j55893K38215O6017K4115M21366N19878n2128n16404k41878K40325
37706d6039K28299m0753Q82K67838L51981K56228J83660Q3363r5716j72941j49437
37695H67365l20000o34408n85528j10414J19927k08718m27048L0811O20430N32486
37685a15097k5429k28955Q2413L48479K57982K2134j66544k94469k58845m582
37675c82913J81991J6855k78983k89823n0939R7099J19051K21762L24025J65071
37665A23196j07234l7685L72144N23634M2054o51495q49517m12872J37909L02098
37655e57768J44251Q3382K67168L81094J47492k27048l31773j01039K06640M13471
37645D25870M52806J75972l98591p82341n34736p219P9389k34919k23661K44919
$$ plain form
37716 -589652 -745545 -507330 -441313 -417198 4168 524046 471918 -44486 -286364 -46039
37706 -46039 182260 141507 142389 410227 762208 1018436 1202096 1285459 1189743 1016802 867365
37695 867365 547365 -87043 -672571 -782985 -663058 -871776 -1298824 -1268013 -647583 -115097
37685 -115097 -140526 -369481 -287068 61411 319393 341527 174983 -119486 -378331 -382913
37675 -382913 -200922 -184067 -463050 -752873 -803812 -706713 -587662 -365900 -41875 123196
37665 123196 15962 -21723 350421 874055 916109 264614 -584903 -997775 -859866 -557768
37655 -557768 -413517 -330135 -62967 318127 465619 238571 -93202 -194241 12399 425870
37645 425870 878676 1054648 656057 -126284 -661020 -668239 -588850 -823769 -1047430 -802511
37635h02511M24061j578k74458J80589P04313M20838l28302n19439m1557K31549
37625f495j29044n13449k79765L35584O34074L76236k2966n6391L15298O63325
37615A316407O06091K37327q7554k78333n10907p47883p04349l75653j23081p0027
37605g37962Q3869M10603M61331l475m83178l97977J04700M56140M31804J70581
37595D96436k15183n61310n08425L0575N18483M37288M9294l3288J79301J46883
37585E40054k37287m45921j63559K44421L15761J11479r212N1865P6301q1480
37575D02422k64512k00802J54332N24672N89485L04986j11939m32423n17497k89843
37565A58881J55713M72651L60477p1546m56416o00487n18373k15351K00403L78099
$$ plain form
37635 -802511 -378450 -380028 -654486 -473897 230416 651254 322952 -196487 -238044 -6495
37625 -6495 -135539 -648988 -928753 -593169 40905 417141 394175 337784 653082 1316407
37615 1316407 1922498 2159825 2072271 1793938 1283031 535148 -169201 -544854 -667935 -737962
37605 -737962 -654093 -243490 217841 214366 -268812 -666789 -562089 -105949 325855 496436
37595 496436 281253 -280057 -788482 -757907 -239424 197864 247158 213870 393171 540054
37585 540054 302767 -143154 -306713 -62292 253469 364948 355736 407601 483902 402422
37575 402422 137910 -62892 91440 616112 1205597 1510583 1398644 966221 448724 158881
37565 158881 314594 787245 1147722 1076176 619760 19273 -499100 -714451 -514048 -135949
37555a35949J61794k1705K28227N00096J25659o20863p79920j83882L03600K04069
37545b18874M9569K41379L34488J9606j67054J50177L41029k02076r08387q56295
37535a216438k13352J30979p275k6427L07639N42275L68030L5885j32131j19976
37525c30791m7512P945J8436M7055J59326J92454o6195l70041j84287M42733P75041
37514F44164M31348j15975l98190n52255o58702l43020L68547O63035J56186l36495
37504a41357r2938K85928m3127o35246n20500J09103K90889m0952j16988J77853
37494g27335K04822j02015o7367M73240Q50547O36043J20950l33274n74868l73382
37484A07361K38215M94074j88763r92644o21886O15955J042335R7052q52858o52772
$$ plain form
37555 -135949 25845 4140 232367 732463 858122 237259 -542661 -726543 -422943 -218874
37545 -218874 -169305 72074 406562 426168 259114 409291 750320 548244 -360143 -1216438
37535 -1216438 -1429790 -1298811 -1306086 -1332513 -1024874 -482599 -114569 -78684 -210815 -330791
37525 -330791 -378303 -370358 -351922 -304867 -145541 46913 -19282 -389323 -573610 -130877 644164
37514 644164 1075512 959537 561347 9092 -649610 -992630 -624083 38952 195138 -141357
37504 -141357 -234295 51633 8506 -626740 -1147240 -1038137 -747248 -788200 -905188 -727335
37494 -727335 -522513 -624528 -691895 -218655 631892 1267935 1388885 1055611 480743 107361
37484 107361 345576 839650 650887 -341757 -963643 -347688 694647 791699 -61159 -713931
37474g13931P1414K18509j03180j38835J44587K38070O5096q4999j90059l39229
37464h32557k93861J42416N97719N64292J38893j71226j79018r0727k4460Q8051
37454f0478K05250J73580J8811l7351J16942L19477L03134j8525m24224n73588
37444B3028l73386o8568R9377J48695J55182O2709q6491m4536K03596K30631j85271
37433A64966n46769l12858K13312L22507L535j28896R2223J72348j19782l46593
37423d86007j21083L50688O50895O06796K36882l06567o40213m42177N7213K79109
37413A85536M1600k89001l81627k45225K3469L36830M75251K91273J1261q5111
37403C64256j36540l53959m32600J9838O41437O92561K07302p0654Q2593J10268
$$ plain form
37474 -713931 -642517 -424008 -527188 -666023 -521436 -283366 -218270 -303269 -493328 -832557
37464 -832557 -1126418 -984002 -386283 178009 316902 145676 -33342 -124069 -148529 -60478
37454 -60478 144772 318352 337163 299812 416754 736231 1039365 1020840 596616 23028
37444 23028 -350358 -418926 -319549 -170854 -15672 47037 -39454 -83990 119606 350237 164966
37433 164966 -381803 -694661 -481349 -158842 -155307 -284203 -191980 -19632 -139414 -486007
37423 -486007 -607090 -256402 394493 1001289 1238171 931604 291391 -150786 -93573 185536
37413 185536 227136 -61865 -443492 -688717 -665248 -328418 146833 438106 449367 364256
37403 364256 227716 -126243 -558843 -539005 102432 794993 1002295 931641 1014234 1124502
37393A124502k17726l77575q7082J54028k7210k10247K5612L11662J32139k63102
37383E65001k76931M0609J03548k33957m27725o1048N10402N74371j2583n69129
37373B12558m11503K08181L80561j65776o01048k17784M34924L50200l75386o85998
37363h71071j66334M46572M85524K02723O8822j4605l07259n71354l64332K65492
37353h25822P69703O84586N9689n78161o68390j96782K47984K17566j3629K1334
37343b81922J62376n4643m40022k96296M28845R01326N48548j91131n71491m56578
37333b50988j93683n955J00846R7952n4887k63000l49522k09439J08096L86464
37323f34116L83124J10430j40200j67367n6263R0386K82621L59210M9603m18457
$$ plain form
37393 1124502 906776 529201 442119 596147 568937 358690 384302 695964 828103 565001
37383 565001 288070 328679 432227 198270 -229455 -290503 219899 794270 781687 212558
37373 212558 -198945 9236 389797 224021 -377027 -594811 -159887 190313 -185073 -871071
37363 -871071 -1037405 -590833 -105309 97414 166236 151631 -155628 -726982 -1091314 -825822
37353 -825822 -56119 628467 688156 109995 -558395 -755177 -507193 -289627 -303256 -281922
37343 -281922 -119546 -174189 -614211 -910507 -481662 419664 968212 777081 205590 -250988
37333 -250988 -444671 -450626 -349780 -251828 -306715 -569715 -919237 -1128676 -1020580 -634116
37323 -634116 -250992 -140562 -280762 -448129 -504392 -414006 -131385 227825 277428 -141029
37313a41029l49368L62724Q19642L45006m65977o39275k22249M7756J4587R3306
37303a34877K88762J79655k46922n54743n42256l21492L5289L26261J33312m20110
37293a257121m20698M90351J227134P66878j84777l29974J20512M7512m37666
37284B2151k74965M11292M04890l57197n62168J92452P43710M27052J7577M4643
37274A069437j05870o81525p91063j8990O50409M42938j0181m844J4123m28270
37264A36164p10389k12340M86826N89340L47135L29399L01856j09274m29943j04202
37254F24572L99175K88536k69160n27710l65245k11198j52147N3119L35598L92659
37244E68199K02666l5374k28005k99105j20585J80690K48015L8144j24759j55730
$$ plain form
37313 -141029 -490397 -127673 691969 1036975 570998 -68277 -290526 -242770 -228183 -134877
37303 -134877 153885 333540 86618 -468125 -1010381 -1331873 -1296584 -970323 -837011 -1257121
37293 -1257121 -1677819 -1187468 39666 806544 621767 291793 412305 459817 22151
37284 22151 -252814 158478 563368 206171 -355997 -163545 580165 1007217 1024794 1069437
37274 1069437 963567 282042 -509021 -528011 122398 565336 555155 550311 564434 136164
37264 136164 -574225 -786565 -299739 289601 636736 966135 1267991 1158717 728774 624572
37254 624572 1023747 1312283 1043123 515413 150168 -61030 -213177 -160058 175540 568199
37244 568199 770865 735491 507486 208381 87796 268486 516501 554645 429886 274156
37234B74156k85706m56420l46608p9700j01715k81923n2555M69229N45963J45664
37224a69615L6303L28825K14631m56493o87744j6146O08044L57468k32157l47094
37214c63978j33740l4501J02812M18497M72499R1537q9971K90721N62051J13709
37204A429636n44798n92134p7745L65455L89117M3257l67684l15409L27360P13364
37194A370419J07825o23133r7801J099449R63793o68105j629243q54863L5567
37185b96092l15373p97571j23919P79703N56698j69980j57188J87526r9875n03354
37175i39425j13117M36963J54548k84817K15792R15439M31781o43662o36571K91817
37165a71252M54060m25059q35398o9089Q28974R08985M31279q3592m98899o08161
$$ plain form
37234 274156 -11550 -467970 -814578 -894278 -995993 -1277916 -1330471 -861242 -315279 -169615
37224 -169615 -133312 195513 410144 -46349 -734093 -750239 -142195 215273 -16884 -363978
37214 -363978 -497718 -532219 -429407 -10910 461589 553126 463155 753876 1315927 1429636
37204 1429636 884838 292704 214959 580414 969531 1012788 645104 329695 657055 1370419
37194 1370419 1478244 855111 757310 1856759 2820552 2152447 523204 -331659 -296092
37185 -296092 -611465 -1409036 -1532955 -753252 -196554 -366534 -523722 -336196 -436071 -939425
37175 -939425 -1052542 -615579 -461031 -745848 -530056 385383 817164 173502 -463069 -171252
37165 -171252 282808 -142251 -977649 -1046738 -217764 691221 1122500 1038908 540009 -68152
37155f8152k39346J74362J40887k3762J35677K05823k69748o07623j6308Q05729
37145B37539O45540j81766m01995M7531J37493k70982l26113P1213J37790j92114
37135i5864j59841K76616L39011n1529j37126J84403J72563k97782m78804j46364
37125c94717N5926j15471j29555J97517L64583J97656J31940K88212K64507q967
37115H51631j57983j78935m11195o64680l69133L34200O26131K55100j49612j31303
37105D221O3599J34469J41404J25344m5695l15348l94926j38980L07724O05702
37095D87514L44549m93784j092945n68208O15458R83018J73158m89643j35716
37086a76599L37733K8550l33329J73691Q40843N03626m34361p39119l35582k9975
$$ plain form
37155 -68152 -307498 -133136 7751 -16011 119666 325489 55741 -551882 -568190 237539
37145 237539 883079 701313 299318 346849 484342 213360 -112753 -41540 96250 -95864
37135 -95864 -255705 20911 359922 308393 171267 355670 528233 230451 -248353 -394717
37125 -394717 -338791 -454262 -583817 -386300 -21717 175939 307879 596091 860598 851631
37115 851631 693648 514713 103518 -561162 -930295 -596095 30036 285136 135524 4221
37105 4221 67820 202289 343693 469037 423342 107994 -286932 -425912 -118188 487514
37095 487514 832063 338279 -754666 -1322874 -707416 275602 448760 -40883 -176599
37086 -176599 161134 189684 -143645 30046 870889 1374515 940154 201035 -134547 -164522
37076a64522P3700L74336N90268K42501j98620l2435L20428K7139o02814o02833
37066B7148M4151N22112N16465L48115J89173O3492J34090K69788K0327m15673
37056A719188k17456N20634O32437r7747l99843J97017M54842j80290m19388L29235
37046B538629N66054n24258j283068m84454M00797M1860j85163R46186J636631
37037C653214J17485j749719j363581J74907J73127r06701p19144M24200L59112
37028A62900o53272m94749P05077R20175J01500m4144M10139q70p71806k06414
37018A28536R52247M99331j041872j092292M17350J052283K52927j74697J87760
37009A181573J2246m88849J62131J234522N90056j096161j039626O84666J130420
$$ plain form
37076 -164522 -90822 283514 873782 1116283 917663 885228 1205656 1232795 629981 27148
37066 27148 71299 593411 1109876 1457991 1647164 1710656 1844746 2114534 2134861 1719188
37056 1719188 1501732 2022366 2654803 2557056 2157213 2354230 2809072 2628782 2209394 2538629
37046 2538629 3104683 2580425 1297357 812903 1213700 1255560 1070397 2016583 3653214
37037 3653214 3770699 2020980 657399 832306 1005433 98732 -620412 -196212 162900
37028 162900 -490372 -985121 -280044 640131 741631 697487 1107626 1106756 334950 128536
37018 128536 1080783 1580114 538242 -554050 -136700 915583 1168510 993813 1181573
37009 1181573 1193819 704970 867101 2101623 2691679 1595518 555892 1240558 2370978
37000B370978l42507j195059m38687N4175m34122l49777N26092M47375n96116
36991D2352n50923O69335Q37341l13898n74485M05729M90063o04553o74212N36191
36981B62940O60630o89409j061160J95486Q07850K5584k00739O20493O02995m31085
36971G93585m16134O62017N31606o90812m42524J103539R75653q34773j022319
36962F59838Q17563J324603k91111r15666L25868N89414p61429q53647P35754
36953A631187R18757p05856r53911M90590M22615j072444l91976K001136J640683
36944C980781j179997j249615J636325J885966j090206j383856J908523K506241
36936G014162q97145j749869J630306K551308p77204j333431K663747L587233
$$ plain form
37000 2370978 2028471 833412 394725 448900 14778 -334999 191093 638468 42352
36991 42352 -508571 160764 998105 684207 109722 515451 1005514 400961 -273251 262940
36981 262940 923570 234161 -826999 -631513 176337 201921 1182 621675 1224670 793585
36971 793585 377451 1039468 1571074 880262 437738 1541277 2516930 1682157 659838
36962 659838 1477401 2802004 2510893 1595227 1921095 2510509 1749080 895433 1631187
36953 1631187 2549944 1844088 890177 1380767 1803382 730938 338962 2340098 3980781
36944 3980781 2800784 1551169 3187494 5073460 3983254 2599398 4507921 7014162
36936 7014162 6117017 4367148 5997454 8548762 7771558 6438127 9101874 12689107
36928A2689107l13649m16320N219676O724959J736218J503600Q740788J0313564
36920D6197943L545151N519809K0371632K5869132J6498391K7763401P8367981
36913B24133440J14704721O7945861m1791210j15875788r9708211m2073132j4253222
36906I3082459k0622489k2218954q431924n11146n111998p158205k028320j004758
36898B5994665o231025p046665j422567J003701k154378k964481M27375J148784
36890H755409j952172k379573P01423J059288j930418k079209J312183K063578
36882E550509r72396k038871L00622Q99692j566900k168494N50221J889183j9393
36873B424173j249755K631O32189m84761m36541J210794J080268j243681j979624
$$ plain form
36928 12689107 12375458 11959138 17178814 23903773 25639991 27143591 35884379 46197943
36920 46197943 49743094 55262903 75634535 101503667 118002058 145765459 224133440
36913 224133440 338838161 406784022 364992812 249117024 149408813 107335681 93082459
36906 93082459 72459970 50241016 41809092 41297946 36185948 29027743 26999423 25994665
36898 25994665 19763640 12716975 11294408 12298109 10143731 7179250 7606625 8755409
36890 8755409 6803237 4423664 5125087 6184375 4253957 2174748 3486931 5550509
36882 5550509 4578113 2539242 2839864 3739556 2172656 4162 554383 2443566 2424173
36873 2424173 1174418 1177049 1809238 1324477 887936 2098730 3178998 1935317 -44307
36864d4307j45659Q19062k48039m19325J093775J278047o22342j460010j12278
36855A38924P03971p1652j49229J001224R02495p20418r25903Q62600J568009
36846C310021J48074o44386L78734Q69652j39791l89985R03775J372464K07567
36837F016125j62909J176241J818237P37924K71416J526414K246339J288398R67377
36828A5885562K683145M122276L136399R33337p07501k114235l657479m159984
36820A6121520l264593k520591k539066j922816l34261M12953l76164r87489n18492
36811D071001k66942p19553m36759P61389Q48924p12890j648471p85261m464n99750
36801E07224r72792J07190J044985L50765p15964n41052K39340M54517M38383
$$ plain form
36864 -44307 -189966 629096 381057 -38268 1055507 2333554 1711212 251202 138924
36855 138924 842895 771243 622014 1623238 2525733 1805315 879412 1742012 3310021
36846 3310021 3458095 2813709 3192443 4062095 3922304 3532319 4436094 5808558 6016125
36837 6016125 5853216 7029457 8847694 9585618 9857034 11383448 13629787 14918185 15885562
36828 15885562 18568707 22690983 25827382 26760719 26053218 23938983 20281504 16121520
36820 16121520 12856927 10336336 7797270 5874454 5540193 5953146 5576982 4589493 4071001
36811 4071001 3804059 3084506 2647747 3409136 4258060 3545170 1896699 1111438 1106974 507224
36801 507224 -465568 -358378 686607 1037372 321408 -219644 19696 474213 912596
36792I12596O10632K57719o51170o65994N81903J259436K85693q25565n87528
36783A177722J90469K84391J06999L48787M86284N7817l03676k25690k68914m76664
36773A377525j36703N16086N42718N26431J876724L570348K791661m26281k611856
36764H026653k018697q80209j081218j235952o9913P84884j29163j234832p50821
36755A410732K44341J14135m12706j18949K14163l22566o11365L23505J122102
36746A963392M88769l28290J19374Q31269N88322N83431J970417K893901J163040
36737A0273625j793584k886956j942912j156711j124310o52647K45991L27916
36729A290412k78251k49576L71251L13548m28622o01802m1198J92787p7223L1345
$$ plain form
36792 912596 1523228 1780947 1129777 463783 1045686 2305122 2590815 1765250 1177722
36783 1177722 1368191 1652582 1759581 2108368 2594652 2652469 2348793 2123103 1854189 1377525
36773 1377525 1240822 1756908 2299626 2826057 4702781 8273129 11064790 10638509 8026653
36764 8026653 6007956 5127747 4046529 2810577 2740664 3525548 3396385 2161553 1410732
36755 1410732 1655073 1769208 1356502 1237553 1451716 1129150 517785 841290 1963392
36746 1963392 2452161 2123871 2243245 3074514 3662836 4246267 6216684 9110585 10273625
36737 10273625 8480041 5593085 3650173 2493462 1369152 716505 962496 1290412
36729 1290412 1012161 762585 1133836 1447384 1018762 416960 375762 568549 491326 522671
36719E22671N70163O00592m7792n34923n15143m02973k50381K50047P86996P17166
36709A696423J48178l17173n46238o31698k92041M64631P98117K21188m59342
36700A082045m34861j89736l77714m79384J01595O61137L58285k27109j70693
36691C23565J29467j28420n25167k85998J45822l830k68165J35128O90650N35148
36681G48200J33490L22220N74832j063p87155o37891K4848L78m98433l76540K24108
36670b73006K92588o5503N4123M74524K82412k96513k24949M27662O53699L00503
36660A625540K6794j40992n38196o50971N7657O73794R3376q18613m28910Q07656
36650G07135R98422L689m74441N7060K49018m10850p13271p2730M43979J26487
$$ plain form
36719 522671 1092834 1693426 1645634 1110711 595568 192595 -57786 192261 979257 1696423
36709 1696423 1844601 1527428 981190 349492 57451 522082 1320199 1541387 1082045
36700 1082045 647184 457448 79734 -399650 -298055 363082 721367 494258 323565
36691 323565 453032 324612 -200555 -486553 -340731 -344561 -612726 -477598 213052 748200
36681 748200 881690 1203910 1778742 1777679 990524 352633 377481 377859 -120574 -497114 -273006
36670 -273006 19582 -45921 8202 482726 765138 468625 243676 671338 1325037 1625540
36660 1625540 1652334 1511342 973146 322175 379832 1053626 1147002 328389 -100521 707135
36650 707135 1705557 1709246 1234805 1291865 1540883 1130033 416762 344032 788011 914498
36640I14498k92598k38467j79440k83650O1919P68602P88455l6013n30842j99039
36630G73425K8995l19743l97031J79515M36751j34968n44544r9334L52371P8934
36620C54371j79704K48679N35742j21054q15104l47323O65558P21741k00346p54108
36610A08452l14382M01932O06562K31487l91612p68192m00406N20667R40297K36214
36600A171019p47759q29730j86015J19758o6355Q5732P22405Q65855J0868r04585
36590B41193p64929K04218Q82050P67695L33248O7656j14755m10152o29117m73551
36580A03556j2417M15431O03361N42364K67096p1694j36587K48654P82529J045421
36570C787714J010120P94174J82795r25906j787150j451816k32114M51271j6755
$$ plain form
36640 914498 621900 383433 203993 -79657 -17738 750864 1539319 1503306 972464 773425
36630 773425 802420 482677 85646 265161 701912 566944 22400 -76934 275437 354371
36620 354371 174667 423346 959088 838034 22930 -324393 341165 1062906 862560 108452
36610 108452 -205930 196002 802564 1034051 642439 -125753 -526159 -5492 934805 1171019
36600 1171019 423260 -406470 -592485 -472727 -539082 -453350 269055 1134910 1145778 241193
36590 241193 -523736 -319518 562532 1330227 1663475 1731131 1616376 1206224 577107 103556
36580 103556 91139 506570 1109931 1652295 1919391 1847697 1711110 1959764 2742293 3787714
36570 3787714 4797834 5592008 5774803 4848897 3061747 1609931 1377817 1829088 1812333
36561A812333o63205n16813K7513J34443j01795j24879k8360k03519m12591k03012
36551b79885J62114J40579o3540J43445O24743O77262J57590l85950n71616m43484
36541A61258p1063L86503M49710j01271o42190m40324K58396O08793L70414j9487
36531I60739k93369m73622m03732K0353L66501J96405j60166j30702J04153j6552
36521A70008l63246l37679N2619K59332J78582J99386L89013M29931K47465J3572
36511A238983k46598m30207j61583M86339O56813n0425o55995j53451Q65770J142681
36501B692327P06298N46824Q26098Q61551N46503L49260J82866l16460p05363
36492E689904l91232j5097n80095j523970j414897l61699J38881k89850m82504
$$ plain form
36561 1812333 1149128 632315 659828 794271 692476 567597 539237 335718 -76873 -279885
36551 -279885 -117771 22808 -40732 102713 727456 1404718 1562308 1176358 604742 161258
36541 161258 90195 476698 926408 825137 182947 -257377 1019 609812 980226 960739
36531 960739 667370 193748 -209984 -189631 176870 373275 213109 82407 186560 170008
36521 170008 -193238 -530917 -478298 -218966 -40384 159002 548015 977946 1225411 1238983
36511 1238983 992385 562178 400595 886934 1543747 1493322 837327 683876 1549646 2692327
36501 2692327 3398625 3945449 4771547 5633098 6179601 6528861 6711727 6395267 5689904
36492 5689904 5298672 5283575 4703480 3179510 1764613 1402914 1541795 1251945 769441
36483G69441M5391L71327p887m04011l81271l34043l01940J78903P84010N95653
36473A315573k08703n27966k78991l50889o19670r5359Q68558Q18165j32624l25423
36463D62671M53206O57687N7980J89510J110488R25920n13427q67004M96714J234908
36453D208653N26048P28742K459679K760033J402784L761224J1985539J7730508
36445D5563210J1188557m499509j5540200j4325839o929048k514615k277910k212148
36437H452498j108297p71233j372988j290254l77781n639m49960p17778m89585
36428A868983l36791m13222l65077j35601J46475N22392P45028K73410o75988
36419A629609j057736n31804M3943J41696K51846N03421J55053p67650r47974
$$ plain form
36483 769441 814832 1186159 1178272 774261 392990 58947 -242993 -64090 719920 1315573
36473 1315573 1106870 578904 299913 -50976 -670646 -766005 102553 920718 788094 462671
36463 462671 915877 1573564 1631544 1821054 2931542 3857462 3344035 2477031 2973745 4208653
36453 4208653 4734701 5463443 7923122 10683155 12085939 15847163 27832702 45563210
36445 45563210 56751767 52252258 36712058 22386219 15457171 12942556 10664646 8452498
36437 8452498 7344201 6572968 5199980 3909726 3531945 3526306 3076346 2358568 1868983
36428 1868983 1532192 1118970 753893 618292 764767 1287159 2032187 2305597 1629609
36419 1629609 571873 40069 84012 225708 477554 980975 1136028 368378 -579596
36410e79596J02717R55242M53996m68750m59091J41164K58000k6015j5820J52743
36400E14590K1864r1742J99010L77071m0616m37998j49418K94882J37477k78139
36390E46981k96631j43931j95595n2449M93123O64519J02675j41916O29063J300698
36380B906537P79011m7105Q4307N63009K17210m05926k04303K37614j45416o19634
36370C365304k2289P63237L62176k68366M74295J594643J333284R26514K488436
36361A1017234M471736M412840N283812J2217885K1906756K2982317J0812198
36354I3104778m654981j1278601r653672r003465j2250833j3549536r472908m305589
36346A8935193k567790k880723k139889q41124r00635j669793j450155o80318
$$ plain form
36410 -579596 -476879 478363 932359 463609 4518 145682 403682 377667 361847 514590
36400 514590 536454 444712 643722 1020793 980177 542179 392761 687643 825120 546981
36390 546981 250350 106419 -89176 -141625 351498 1016017 1118692 976776 1605839 2906537
36380 2906537 3685548 3638443 3722750 4285759 4502969 4097043 3892740 4130354 3984938 3365304
36370 3365304 3343015 4106252 4468428 4200062 4674357 6269000 7602284 8528798 11017234
36361 11017234 15488970 19901810 25185622 37403507 59310263 82292580 93104778
36354 93104778 88449797 77171196 67517524 58514059 46263226 32713690 23240782 18935193
36346 18935193 16367403 13486680 11346791 10505667 9605032 7935239 6485084 5804766
36338E804766p49842j283332j055893l54190k73495o24062m30893K05688L99150
36329A637897Q1793q8426o968j15275m30991n50168l63204p0075K02776L01994
36319E99353J1887m73881n91136k47076K7595L0313J71763N22173N39775J37252
36309G28018k6665K10683J17697m98514o82093N3274P06660L95385j39775J81710
36299A046380R51983J035641M01473j32820l89183p43940j020560p64319k79631
36290A05024j68490j57619L70481R78710O85768k39274m28345M73347J182266
36281B801868O63994m96067j150998j081591p78625m45487L9062N15892N55280
36272F23328N4102n26092o13813j52387L06308K52139j03122j24187K60370M21617
$$ plain form
36338 5804766 5054924 3771592 2715699 2361509 2088014 1463952 1033059 1238747 1637897
36329 1637897 1719690 1631264 1624296 1509021 1078030 527862 164658 94583 297359 599353
36319 599353 611240 137359 -453777 -700853 -673258 -642945 -471182 50991 590766 728018
36309 728018 701353 912036 1029733 531219 -150874 -97600 609060 1004445 864670 1046380
36299 1046380 1998363 3034004 3435477 3302657 2913474 2169534 1148974 384655 105024
36290 105024 -63466 -221085 149396 1128106 1813874 1574600 1146255 1619602 2801868
36281 2801868 3465862 2969795 1818797 737206 -41419 -486906 -447844 68048 623328
36272 623328 677430 151338 -462475 -614862 -308554 -56415 -159537 -283724 -23354 398263
36262C98263R1212j25346K14412N06619J4365q28836r40173j65055N59490N45824
36252B70775N5115l56996m58653k15667L10396P83649P95475L56282j55751m89854
36242H94771o16011m86405j45963P9699k4781j52348P2188M29416M25531Q2395
36232E58492j51777j14364n54R8393J79313O2395k78686l71822J20070O71166
36222G72626N21956j74990o03736m90964k39907j2782M02702Q32603P45954J63619
36212A917081k68999k41111p0675K2802J60397K40110n9854n78653p44936m76048
36202i9886k42415j65060R2252M38564L40463j04263j18500L81165M38500l69649
36192E91171j040910n91481M47015Q47621L84142j67198k77454q0382J75943L53612
$$ plain form
36262 398263 489475 364129 578541 1085160 1099525 270689 -669484 -834539 -275049 270775
36252 270775 325890 -31106 -489759 -705426 -395030 388619 1184094 1540376 1384625 894771
36242 894771 278760 -207645 -353608 -273909 -298690 -451038 -378850 50566 476097 558492
36232 558492 406715 292351 291797 390190 569503 631898 353212 -18610 101460 772626
36222 772626 1294582 1119592 515856 24892 -215015 -227797 174905 1007508 1753462 1917081
36212 1917081 1648082 1406971 1336296 1359098 1519495 1759605 1699751 1121098 376162 -99886
36202 -99886 -342301 -507361 -415109 23455 363918 259655 141155 522320 960820 591171
36192 591171 -449739 -1041220 -594205 253416 637558 470360 192906 112524 288467 642079
36182F42079K85119K0763L6011O36569J329782J328091N53615l42385q38653r47512
36172B703479q55308o49313m24495k80618j66447j048P4875j27853m27648l72661
36162e27037J17565N00206K50746l89265o35740j76528L84043L49025j01843k42011
36152d70839O8588K48201M3656o4197J82166K47273k42481o82172l85838K65576
36142g90067M28103R3382j22880j04361j69595j99017J28342M58369K15344k41315
36132c03695p4372N27183N60508o9234l78614j8109K19568p1596k41267O9256
36122B19628K22464j48827l98613j04235J02282k79475o69220m71151r6244p0825
36112a694216n9994L50057P67495P31753M82095K31276l41142j059724q76652
$$ plain form
36182 642079 927198 947961 983972 1620541 2950323 4278414 4832029 4489644 3650991 2703479
36172 2703479 1848171 1198858 774363 493745 327298 326250 401125 273272 -154376 -527037
36162 -527037 -409472 90734 341480 -47785 -683525 -860053 -476010 -126985 -228828 -470839
36152 -470839 -402251 -154050 -110394 -174591 7575 254848 12367 -669805 -1055643 -790067
36142 -790067 -361964 -268582 -391462 -495823 -665418 -864435 -736093 -277724 -62380 -303695
36132 -303695 -378067 149116 709624 640390 261776 243667 463235 391639 150372 219628
36122 219628 442092 293265 -105348 -209583 -107301 -386776 -1055996 -1527147 -1623391 -1694216
36112 -1694216 -1754210 -1404153 -636658 95095 577190 808466 467324 -592400 -1469052
36103a469052M27450J336033O75826m80621m63855M25722O79154J05742k42037
36094I94362j22123j91972l78074m5121L89527o9812r55978p75180L69936O98267
36084h6168k74348q42705k0600P67286J83349o96061k48367R23726J031088J6002
36074G53202n46446o6163M08270J73654j52135q015J26695k53104o94281n49268
36064h07591n5869P6837k20786l54928j0541M54905O04199M60089K73305Q6633
36054E06253j53446k42979P9332N61498N50978r2850o45892m74080N4097J64271
36044C07182j30831j61900K24206M54168K47546J4216K0366l4612k77683k98477
36034C64181J7512Q0053l79581o42376j55056L53525m8513q11411n71935O48560
$$ plain form
36103 -1469052 -1041602 294431 970257 489636 25781 451503 1130657 1236399 994362
36094 994362 872239 680267 302193 257072 646599 576787 -379191 -1154371 -784435 -86168
36084 -86168 -360516 -1203221 -1223821 -456535 -273186 -969247 -1217614 -293888 737200 753202
36074 753202 206756 140593 548863 722517 570382 562367 689062 435958 -258323 -807591
36064 -807591 -863460 -786623 -1007409 -1362337 -1372878 -917973 -313774 146315 419620 506253
36054 506253 352807 109828 189160 750658 1301636 1208786 562894 88814 142911 307182
36044 307182 176351 14451 238657 692825 940371 954587 974953 940341 662658 364181
36034 364181 381693 461746 82165 -560211 -715267 -361742 -410255 -1221666 -1793601 -1145041
36024a145041J266900M30635p34035p93784K8271M40116M4354k87844J10615P25014
36014H5201O48269j32333o81619l12225M90797O31376j59194q96924o48081J88384
36004g86349N15065J52718o2502K26564L50620r9096m56233j20380L45368J40373
35994B06148m14606m55324k4295J58642N4527K42332O21997M29925l32631p00099
35984b13384k87928R3379j69733n43083l91905l6061l4580j99720q5950J78177
35974a690788K69478L06579M34959L60560k9665j98705J70158M83929K23843o6643
35964B63705K55166O27027J17525q89807j129001l60127L85997M22735J21529
35955a85251l3048l7581Q9609M02789N64013J69063m28335n01458j16320M4621
$$ plain form
36024 -1145041 121859 552494 -181541 -975325 -947054 -506938 -462584 -750428 -639813 85201
36014 85201 733470 601137 -80482 -392707 98090 729466 570272 -326652 -974733 -786349
36004 -786349 -271284 -118566 -181068 45496 396116 297020 -159213 -279593 65775 206148
35994 206148 -208458 -663782 -688077 -529435 -474908 -232576 389421 819346 486715 -213384
35984 -213384 -501312 -407933 -577666 -1120749 -1512654 -1548715 -1583295 -1783015 -1868965 -1690788
35974 -1690788 -1421310 -1114731 -679772 -319212 -348877 -547582 -377424 106505 330348 263705
35964 263705 518871 1145898 1263423 373616 -755385 -1115512 -729515 -306780 -185251
35955 -185251 -218299 -255880 -166271 236518 800531 969594 541259 39801 -76519 -31898
35945c1898p0043P6716L64300Q9744n88187o31194J38598O17269K00138l15302
35935a49859j94355J24431R3123L6733K58018K72135j76522l81338Q6122M12825
35925C81313j12080p35127m29171L58973M72536n5178k36607J29781L08349L7379
35915A20168j54858k7841N6943n6537j19856j08794k20885k82179K4667M03734
35905c65438K67085k23970l10765J48303M88047L46907J01427K9085j08278l72928
35895e25l47042Q4239L31365l4811n49377n08150J1605L12403P0543l08776l20346
35884a258872K0531L18278L54556K84260K87914K71770R2528j07068j00036m06
35874A63455r0464k84757k51453n6264q9987k83038j05763M32522N80912N7894
$$ plain form
35945 -31898 -101941 -25225 339075 428819 -159368 -790562 -651964 -34695 165443 -149859
35935 -149859 -344214 -219783 -126660 -89927 168091 440226 263704 -117634 -31512 381313
35925 381313 269233 -465894 -895065 -536092 -63556 -118734 -355341 -225560 82789 120168
35915 120168 -34690 -62531 -5588 -62125 -181981 -290775 -511660 -793839 -769172 -365438
35905 -365438 -98353 -322323 -633088 -484785 3262 350169 451596 480681 372403 -525
35895 -525 -347567 -263328 68037 33226 -516151 -1024301 -1012696 -700293 -629750 -938526 -1258872
35884 -1258872 -1238341 -920063 -565507 -281247 6667 278437 370965 263897 163861 163455
35874 163455 72991 -211766 -463219 -519483 -609470 -892508 -998271 -565749 15163 73057
35864G3057l30510R0391P24097N71875k78267q73913p52040k52208K62356O85698
35854g9464Q13511M59992r6796l74243l21353k07863p6531J43194K04441j34365
35844C30523n18943l87891J40928M06519J87580n3624O0374L32647L57635J4862
35834H70610m42790n91542k43786K22549K57889j5732Q4046O03764O58545j41784
35824A261769q30099m88385K51366K03908m68809o26923n9787L39066J99726J23213
35814i4955L67237L57785j44707m99299k60004J27429J73092P7885J44638J85800
35804D34901L2489j669K81678M28850k984o01503n38139K58682Q87194N52814
35794A732313m29475r77732n60989J56707K68129j05722j46765K00852R4187o42749
$$ plain form
35864 73057 -257453 -167062 557035 1128910 850643 -23270 -775310 -1027518 -765162 -79464
35854 -79464 734047 1194039 1097243 723000 401647 193784 117253 260447 464888 330523
35844 330523 -188420 -576311 -435383 -28864 158716 105092 165466 498113 855748 870610
35834 870610 427820 -163722 -407508 -184959 72930 57198 141244 745008 1403553 1261769
35824 1261769 431670 -56715 194651 398559 -70250 -697173 -756960 -417894 -218168 -94955
35814 -94955 272282 630067 485360 -13939 -273943 -146514 26578 104463 249101 434901
35804 434901 467390 465721 747399 1176249 1173265 571762 33623 292305 1179499 1732313
35794 1732313 1302838 325106 -235883 -79176 188953 83231 -63534 137318 231505 -411244
35784d11244r42624j59545P29059N77449j45946k45260K23159K57427k36432l73659
35774g27616Q7415M62002M73738N41199O53736K72017m60036o58993j42747K24056
35764G24771o9938n17004o06868m47453j12128N34266J079856P78665j50552n96198
35754F17417k72426j19484n53201o88638L475O14159L14066k27459m7009M70920
35744A11820L68223k18371m07908r3095Q0017m9711k9521K30644L08437R4740
35734C95275j7769J55137K96418R7039l65108p85552q69484m73510K05174O57077
35724g05303N18677m0509n02143m83614l6803L70885K51599k86108m95637N7783
35714a351173P56503P02327o525n00977m64750l37212k56200J54437P77367Q42814
$$ plain form
35784 -411244 -1353868 -1513413 -784354 -206905 -352851 -598111 -374952 -117525 -353957 -727616
35774 -727616 -640201 -178199 295539 836738 1490474 1762491 1302455 643462 500715 724771
35764 724771 654833 137829 -469039 -916492 -1028620 -494354 585502 1364167 1213615 617417
35754 617417 344991 225507 -327694 -1016332 -1012857 -398698 -84632 -312091 -359100 111820
35744 111820 480043 261672 -146236 -239331 -159314 -209025 -238546 -7902 300535 395275
35734 395275 377506 532643 829061 926100 560992 -224560 -1094044 -1567554 -1362380 -705303
35724 -705303 -186626 -227135 -729278 -1212892 -1249695 -878810 -627211 -913319 -1408956 -1351173
35714 -1351173 -594670 107657 101132 -399845 -864595 -1201807 -1458007 -1303570 -526203 316611
35704C16611J62822m02031j75807M30382O93984N06650R4741m38553q36236o64634
35694c12071l3557L15367N4317k57514j21754J87214K52996J41218r095k94595
35684g7474n61435l69362J69396L22051q7618l02160J07513N21312L68519L0345
35674A21087P4K7918j75291k13744K26738O18296L87745j45665l33273j16439
35664C97446K05149M84733M90533r4108r13609j032009l32519J28247k16933n08856
35654a391926J7333O83532N49066m8475k34923l2059L9937J4056R5340J2077k73159
35643e69201r8932O33859P88960k14403j061386m56900O87725O96281j74979m17067
35633a86043O8742J01000l97093l22662L74505N01861j43690l53362K88957O58210
$$ plain form
35704 316611 479433 77402 -98405 331977 1025961 1532611 1627352 1188799 352563 -312071
35694 -312071 -345628 -30261 24056 -233458 -355212 -167998 84998 226216 217121 -77474
35684 -77474 -638909 -1008271 -838875 -516824 -604442 -906602 -799089 -277777 90742 121087
35674 121087 121161 149079 -26212 -239956 -13218 605078 992823 847158 513885 397446
35664 397446 602595 1087328 1577861 1483753 570144 -461865 -794384 -666137 -883070 -1391926
35654 -1391926 -1374593 -691061 -141995 -190470 -425393 -457452 -417515 -403459 -308119 -296042 -569201
35643 -569201 -668133 -34274 754686 540283 -521103 -978003 -290278 406003 231024 -186043
35633 -186043 -117301 -16301 -413394 -736056 -361551 140310 -3380 -356742 -67785 590425
35623E90425J32413l46309l3518L23948r4098p12738n57739J57138M26964p6493
35613a90007o92932o66562N8924P50474N55496m28164r98865l31499P64730R18730
35603b59675J58914l18605j03460M8258j96389j96720L01956N69521J75029k49342
35593g0513j19965J78279Q6768k31185l71739l65576l42629j44753K46366M45309
35583f89638K47175r965j337J25907J18552P140p8353r9101j5580J35005J22822
35572a37373j08528j60281K20213N55218L15548j54000j85651Q1119M5623k07692
35562B64196j48423J08430P2411m7463K41648N21659O0793o54434n32576J59752
35552D5993J72874m61750m73418K26436K94844m67291n55911M52327Q60632k22262
$$ plain form
35623 590425 722838 376529 343011 666959 572861 -139877 -697616 -540478 -113514 -190007
35613 -190007 -882939 -1549501 -1490577 -740103 -184607 -612771 -1611636 -1943135 -1178405 -259675
35603 -259675 -100761 -419366 -522826 -474568 -670957 -867677 -565721 3800 178829 -70513
35593 -70513 -190478 -12199 74569 -156616 -528355 -893931 -1236560 -1381313 -1134947 -689638
35583 -689638 -442463 -452428 -453765 -327858 -209306 -202166 -280519 -379620 -395200 -260195 -137373
35572 -137373 -245901 -406182 -185969 369249 684797 530797 345146 426265 471888 264196
35562 264196 115773 224203 296614 249151 490799 1012458 1073251 418817 -113759 45993
35552 45993 218867 -242883 -716301 -489865 -195021 -662312 -1218223 -765896 94736 -127526
35542a27526j126121l72966P94912N56451m81358n68630J87765L92541K2793J92581
35532e29558P70127N08926n56891r36826q6072Q25323Q64655M72941K49142J5741
35522A597508l92427n97825m72929m81644p53325o95880r716O80533P02489K39180
35512a84036q8632o7139O5624O9163r0561k45449j26009L08080O65296N55999
35502H62336J49462o6396J1661M8827j45757l95531m83152l56044p8874J22033
35492c31435n7195n27872o64422o5622P69369J026685O45891K53371J72908J14861
35482A336539j56646m26861m32238k33253k9801J16689K54560L78526L41113n4869
35472A093759p01148r68587k94015Q81898J319706M75945p16027j017926l71384
$$ plain form
35542 -127526 -1253647 -1626613 -831701 -275250 -756608 -1325238 -1137473 -744932 -722139 -529558
35532 -529558 240569 749495 192604 -744222 -830294 -4971 859684 1332625 1581767 1597508
35522 1597508 1205081 607256 134327 -347317 -1100642 -1796522 -1806238 -1125705 -423216 -184036
35512 -184036 -272668 -339807 -274183 -205020 -295581 -541030 -667039 -358959 306337 862336
35502 862336 1011798 945402 957063 1005890 860133 464602 -18550 -374594 -453468 -331435
35492 -331435 -388630 -916502 -1580924 -1646546 -877177 149508 795399 1048770 1221678 1336539
35482 1336539 1179893 753032 320794 87541 57740 174429 428989 807515 1148628 1093759
35472 1093759 392611 -575976 -869991 11907 1331613 1807558 1091531 73605 -297779
35463b97779L28517N10784L26062P3949q3797L949K99531L88091k7182n84725
35453I37400o91477l21829O3254J93753J26680p3848l13545l32432m5014K08138
35443b48920J55102K4403N9279K3700k76675m44781j16286L07633K85261O4617
35433a66667J63495L27974k6538o30903o58823n4755M50964N55517N84106N47737
35423A092107J13281m37733l71429J89635K55738m26050q75029m29663K57509
35414f31634L56241N5122l7037J07108K02367K53632K73775K3311m09749m37086
35404b43950M5454K33275l33464q34270l55136O32034R79761N57459J44498j0306
35394H15355l18292o74844m24855L20343N20733k01008q36979m90108K73727L87093
$$ plain form
35463 -297779 30738 541522 867584 941533 857736 861685 1161216 1549307 1522125 937400
35453 937400 245923 -75906 -12652 181101 307781 233933 -79612 -412044 -457058 -248920
35443 -248920 -93818 -69415 -10136 13564 -263111 -707892 -824178 -516545 -231284 -166667
35433 -166667 -3172 324802 298264 -332639 -991462 -1046217 -595253 -39736 544370 1092107
35423 1092107 1205388 767655 396226 585861 841599 415549 -459480 -889143 -631634
35414 -631634 -275393 -220271 -257308 -150200 52167 305799 579574 602885 193136 -243950
35404 -243950 -198496 34779 -298685 -1132955 -1488091 -856057 123704 681163 825661 815355
35394 815355 497063 -177781 -602636 -282293 238440 37432 -799547 -1289655 -1015928 -628835
35384f28835m8109m5573O03275R83231M72912l50686n92314k16228J43793J68298
35374D89764Q7396P2803n4937l88721n91520k67342M56055R48471P27793P624
35364A487386m92623l33127J26730J70779l21204o72607l29439L53041O02435
35355E91371K57728j75669l51192l86574l60094j28484K05817K35273r5646l03020
35345e10490j17926R2999j168j34553J0184J88095N3072j70588m8972L32866N46634
35334B40153M63573K20343j60172n78972o10984o5927M72955L44393j80123l06939
35324a61700K7381J27351k60642n48326k76927K15997L73892J39389j56572k28215
35314g48372J5516M28116O45662M39750L6155k05183k87313l90362m16372k11452
$$ plain form
35384 -628835 -676944 -722517 -119242 863989 1336901 986215 393901 177673 321466 489764
35374 489764 577160 649963 595026 206305 -385215 -652557 -196502 751969 1479762 1487386
35364 1487386 994763 661636 788366 959145 637941 -34666 -364105 -11064 591371
35355 591371 849099 673430 322238 -64336 -424430 -552914 -347097 -111824 -207470 -510490
35345 -510490 -628416 -535417 -536585 -671138 -660954 -472859 -419787 -590375 -639347 -306481 240153
35334 240153 703726 924069 763897 184925 -426059 -491986 -19031 325362 145239 -161700
35324 -161700 -134319 -6968 -267610 -815936 -1092863 -876866 -502974 -363585 -520157 -748372
35314 -748372 -732856 -304740 340922 780672 816827 611644 324331 -66031 -482403 -693855
35304f93855j0979p4880j01866L07111P96154O54781m2515n27747n04996l50722
35294e49514j99622J76227N21964K17587n43202p73851k23278K01116l0928k35841
35284a439342J70703O01117L46196k13980l36632r9906J4079M2459J82210J53299
35274e79797j93807k69038L17045Q29077M71767j98150j15510M96060N04442j95639
35264A066450n30689o5299L72474J54387k51317k66474o6637K5610J28188K70028
35254H36721P1454m86551o92454j40999M68896K94269l47608m30418K47884P72492
35244E93686M07538m51047q73429n47278M461J88587j5767k27538k03526J4440
35234a109873L33959O53908P02405K55516l61259m36368J96098P92978O20923
$$ plain form
35304 -693855 -704834 -779714 -881580 -574469 221685 876466 833951 306204 -198792 -549514
35294 -549514 -749136 -572909 -50945 166642 -376560 -1150411 -1373689 -1172573 -1203501 -1439342
35284 -1439342 -1268639 -667522 -321326 -535306 -871938 -971844 -957765 -915306 -733096 -579797
35274 -579797 -773604 -1042642 -725597 103480 575247 377097 261587 757647 1262089 1066450
35264 1066450 535761 470462 842936 997323 746006 479532 412895 438505 566693 836721
35254 836721 908175 421624 -270830 -411829 57067 351336 3728 -426690 -178806 593686
35244 593686 1001224 550177 -323252 -870530 -866069 -677482 -693249 -920787 -1124313 -1109873
35234 -1109873 -775914 -122006 580399 835915 474656 38288 234386 1027364 1648287
35225A648287j24426p04275p68617m54542N0429M84034M15584j73556n42761j39356
35215c09199M45605L22940k15853j58272M40883M34677m64073j043632m58428
35206a005352M51694N10514r4221m09278k60759j49970j22550J65692N13366L46691
35196e4173k08312l50959J64749N97777K78388m69132p78232k90969M82988P29982
35186A02107J94291m85189m64137K09870N76609R0920n46872m23680J98983L42015
35176b05083j21087l41548L0775K80795j04854n13819j91243N10394O58747J60918
35166A63995j63085J46746N82769N02599L141l50465l11209j18983o7379k07657
35156A80472m02538m32129j19083M02689O24543K08739m18116m64882J06107L95853
$$ plain form
35225 1648287 1523861 819586 50969 -403573 -353144 130890 546474 372918 -169843 -309199
35215 -309199 136406 459346 243493 85221 526104 960781 496708 -546924 -1005352
35206 -1005352 -553658 -43144 -137365 -546643 -807402 -957372 -1079922 -914230 -400864 -54173
35196 -54173 -262485 -613444 -448695 149082 427470 -41662 -819894 -1110863 -627875 102107
35186 102107 296398 -188791 -652928 -443058 133551 224471 -322401 -746081 -547098 -205083
35176 -205083 -326170 -667718 -636943 -356148 -461002 -974821 -1166064 -655670 3077 163995
35166 163995 910 147656 730425 1233024 1236165 885700 574491 455508 388129 180472
35156 180472 -222066 -654195 -773278 -370589 253954 462693 44577 -420305 -314198 81655
35146H1655j44928p89322n37492L47831O92499J70771k87722k9817L81512K34008
35136A18995k01143k89433r8724o0606r0662J31159M04317L58650K17845L58736
35126H49134M42523l4884n89590l08285M99507M94096n98972j360362p20290M84980
35116h42143Q27672K83811q6589J16019K81976o603l77005l73568r6211P8486
35106a94155K1523q3916k5124J67079K08443o8983l65559k27220K56163M81500
35096A69751J97488j36579r9009Q3795L0279j57618j90847j29814j45552q7648
35086d65754K13402N06229M68275K23020M2104j58128n08162p02117m32976m0954
35076h55061o1424l28019k33700K39440M92035K86720K4215l4433j20280l52625
$$ plain form
35146 81655 -63273 -852595 -1390087 -1042256 -349757 -178986 -466708 -496525 -115013 118995
35136 118995 -82148 -371581 -470305 -530911 -621573 -490414 -86097 272553 490398 849134
35126 849134 1291657 1256773 667183 358898 858405 1352501 753529 -606833 -1327123 -842143
35116 -842143 -14471 269340 182751 298770 580746 574143 197138 -176430 -272641 -194155
35106 -194155 -172632 -256548 -281672 -114593 93850 24867 -340692 -567912 -311749 169751
35096 169751 367239 230660 131651 215446 245725 88107 -102740 -232554 -378106 -465754
35086 -465754 -252352 253877 722152 945172 987276 829148 320986 -381131 -814107 -855061
35076 -855061 -916485 -1244504 -1478204 -1238764 -746729 -460009 -435794 -470227 -590507 -943132
35066i43132m07136n5979M27530O40846M80437Q4577k92232l07500J44746O00083
35056C72240M74118j07636m26801j83642J53651J35352j00849k52647l01856k70654
35046e08724k9244L31672L77204o2597n14096m47647K5971L60491K62721q0279
35036b84528k91234j43049K34030M14741J52525k28510k24785J17631K99642J66069
35026B12532N5355J04414L9891j70227j24431K59852M38567P3203m00128m55176
35016C3852j99367K0373K05078M14543L99851N8256j97928n0240J96760J98095
35006A079273J55039K50425J03455m76952p99700k84007L72454J33156o27049
34997i3906n88782L98841J022433N23184k75611m17255j35709p1306j31347N7234
$$ plain form
35066 -943132 -1350268 -1406247 -978717 -337871 142566 227143 -65089 -372589 -227843 372240
35056 372240 846358 738722 311921 128279 281930 417282 316433 63786 -238070 -508724
35046 -508724 -537968 -206296 170908 108311 -405785 -853432 -827461 -466970 -204249 -284528
35036 -284528 -575762 -718811 -484781 -70040 82485 -146025 -370810 -253179 46463 212532
35026 212532 267887 372301 412192 241965 117534 377386 815953 889156 489028 33852
35016 33852 -165515 -145142 59936 474479 874330 932586 734658 684418 881178 1079273
35006 1079273 1234312 1484737 1588192 1111240 311540 27533 399987 533143 -93906
34997 -93906 -682688 -283847 738586 1261770 986159 568904 433195 361889 230542 287776
34987B87776K85196J88547P986J24854K61727o0015n81792o28642j84380J18918
34977a79825J1286j32048l6534J01467R4730M7725K3996p3993j67958k8064K32296
34966a06922J84289k06254l96884n9546M18012N45411L96062K70524J23731j79316
34956I89107m03406l17666k37044n28825p98008l54900N63149R17396L83100j37660
34946G5243Q9741N39354L46221l28108o35870l41327L0340J33135J24874J21903
34936A55506K0422j13907o6661Q4504P4785j8317J01812L29920K70369k8948j17767
34925F91718K7812n7735m21008m89596n5811K97579J47520j13985o7701k0925
34915f2132l38233o08009k48387M44848O48221K10382k18182j83026P6809J54813
$$ plain form
34987 287776 572972 761519 769505 894359 1156086 1096071 514279 -114363 -298743 -179825
34977 -179825 -168539 -300587 -337121 -235654 -140924 -93199 -69203 -143196 -311154 -339218 -106922
34966 -106922 77367 -128887 -525771 -585317 -167305 378106 774168 1044692 1168423 989107
34956 989107 585701 268035 30991 -497834 -1295842 -1650742 -1087593 -170197 212903 75243
34946 75243 164984 704338 1050559 722451 86581 -254746 -224406 -91271 33603 155506
34936 155506 175928 62021 -4640 79864 154649 136332 238144 568064 838433 809485 691718
34925 691718 719530 661795 240787 -248809 -304620 -7041 140479 26494 -41207 -62132
34915 -62132 -400365 -1008374 -1256761 -811913 -163692 46690 -171492 -354518 -277709 -122896
34905a22896k269j74291j32107J89357N51182N47970J04344l52137m40686k84118
34895a15651j55761j9847K12597L25906J43584r0424j36905k23188n56327p43317
34885a359333l43802L01012N04454K61508R0296O2488j53392m04449j64987M15524
34875g90681N39576M2613k79575M1940M19544K42967j55385j76200O2071R5995
34865D2865k6651L1800J75605O0478k23976k90175j31875q6047j89464j18517
34855g55957K14664M73010L77788L6124k66473l29122r5711K85960M96992L92769
34845H30044K35094K88558L17157q4954p10198q26656j99145M77518M62666j05544
34835F84540n32203m91803j94090J38241M27453M67592O0126m97848n79395p1049
$$ plain form
34905 -122896 -125165 -299456 -431563 -242206 308976 856946 961290 609153 168467 -115651
34895 -115651 -271412 -291259 -78662 247244 390828 300404 163499 -59689 -616016 -1359333
34885 -1359333 -1703135 -1402123 -897669 -636161 -545865 -483377 -636769 -1041218 -1206205 -790681
34875 -790681 -251105 -208492 -488067 -446127 -26583 216384 60999 -115201 -53130 42865
34865 42865 16214 48014 223619 284097 60121 -230054 -361929 -447976 -637440 -755957
34855 -755957 -541293 -68283 309505 345629 79156 -249966 -345677 -59717 437275 830044
34845 830044 1065138 1353696 1670853 1585899 875701 49045 -150100 327418 790084 684540
34835 684540 152337 -339466 -533556 -395315 32138 499730 559856 62008 -517387 -588436
34825e88436M07884L73350J08319Q7377K22757J79665P4406K24320M22130J71286
34815A683058m04444o10358k45274P7711q4796l44636j77759K54451M41684K90727
34805H80364Q7517k6302r9633r2990N2678J98823J70334J1784j44828k85339l66717
34794C85691k03170K17938N07366K71930l61867q40352p18815k3057P46284R42670
34784I24618L98296k53824k67153J95854K74517k65244o29847k34878L86724M45998
34774I75061N0828j58653n9601l1632j97252l16417k46380j3750L47837O31831
34764I81872M57277j60618o21391n25521j94867l569K11014N41996M99400j82017
34754A003576q43873q10449m06326k29858n3097N47132J059631P22557r5638m11341
$$ plain form
34825 -588436 -180552 192798 301117 388494 611251 790916 865322 1089642 1511772 1683058
34815 1683058 1278614 668256 422982 500693 415897 71261 -106498 147953 589637 880364
34805 880364 967881 941579 841946 748956 801634 1000457 1170791 1182575 1037747 752408 385691
34794 385691 182521 400459 907825 1179755 817888 -22464 -741279 -764336 -18052 924618
34784 924618 1322914 1069090 801937 997791 1272308 1007064 377217 142339 529063 975061
34774 975061 1025889 867236 807635 776003 578751 262334 15954 2204 350041 981872
34764 981872 1439149 1278531 657140 131619 -63248 -66817 144197 686193 1185593 1003576
34754 1003576 159703 -650746 -1057072 -1286930 -1340027 -792895 266736 989293 893655 482314
34744D82314j88781j66487m18553l85290j26173j83000l08709K46511J161918
34735A13750J208304J74843p32949o92072j67674K50484N97523P69130L26589
34726A847928m70304o63000j00976K38249j20603m50328k47445m0408j51149O851
34716a51185O02347O65521l19579j253804r61614N5614N25773K77540P8282K05472
34706b75633K69850R8569q9314j48385o3227J49319K45236m3055l90144j91862
34696d38646L25596K97900k30917k00380N83132Q75455M0573p79907n38999N8146
34686h047l2848m18547k76068K9664j57194k98797L17275R57600N25912m46512
34676A92438n93028P6683M34815K19431P9354M6539l30282o44981j53397N94780
$$ plain form
34744 482314 293533 127046 -291507 -676797 -802970 -985970 -1294679 -1048168 113750
34735 113750 1322054 1496897 763948 71876 -95798 154686 752209 1521339 1847928
34726 1847928 1377624 714624 613648 851897 731294 280966 33521 -6887 -158036 -151185
34716 -151185 451162 1116683 797104 -456700 -1418314 -1362700 -836927 -559387 -481105 -275633
34706 -275633 -5783 92786 3472 -144913 -208140 -58821 186415 143360 -246784 -438646
34696 -438646 -113050 184850 -46067 -246447 336685 1212140 1252713 472806 -66193 -8047
34686 -8047 -40895 -459442 -735510 -705846 -863040 -1161837 -844562 113038 638950 192438
34676 192438 -400590 -323907 110908 330339 409693 456232 125950 -519031 -672428 -77648
34666g7648L90508n05064o55617J35989N45699M6443l17710R5471M75996J23897
34656B57964l88962l43526J3845J47953O7144l2004j21660m7773K91533M01754
34646B46268j79425p61809k81217P85869Q13728m02116j113729k64520R09591
34637b47360Q33789j81705p50364m24541J78939N35472N39506K03026k29925l09251
34627A47586j6585J26127r7431k94689k46245j88389j02734L04767O79804K48728
34617E60939o65191o98838L95969J099206M81196k57163J93154J038583P51263
34608B899118l90592q92468n18353l54747o71981n05405M73565J210560Q57259
34599B106956m0707m78666k93448l2745q9324l80770n77129m34893q5585N7670
$$ plain form
34666 -77648 312860 -192204 -847821 -711832 -166133 -119690 -437400 -341929 134067 257964
34656 257964 -130998 -474524 -460679 -312726 -245582 -277586 -399246 -447019 -155486 246268
34646 246268 66843 -694966 -976183 -190314 623414 221298 -892431 -1156951 -247360
34637 -247360 586429 404724 -345640 -770181 -591242 -55770 483736 686762 456837 147586
34627 147586 131001 257128 159697 -134992 -381237 -569626 -672360 -367593 312211 560939
34617 560939 -104252 -803090 -407121 692085 1173281 916118 1109272 2147855 2899118
34608 2899118 2508526 1616058 1097705 742958 70977 -434428 39137 1249697 2106956
34599 2106956 2066249 1587583 1294135 1261390 1172066 791296 214167 -220726 -306311 -248641
34589b48641j06719j29606K67152N79954K14211m85849o17400l3708M55669K83487
34579A78550j33479r9212L88211O97298L88344k65773n87923k86503J56403Q1867
34569E17783m26027o27289k11089K40952J56313j98882k46490l07J27320R8362
34559e69354K04889M23050M04416P4652k45543l30290k75397k21418j66585q8311
34549g89891k7985k5215o9697q6553K6424K09795J76736j75429m02733l1499O22274
34538e73773P61344K69602j46171j08009m5494k49950l33440r1085l2154m22532
34528i71662n96318K1725Q84535J101917O62171J21870l09158n82892l76701K54990
34518B10477M48062k38548q08012k18309Q14884Q01859j69724o39513j59280J91138
$$ plain form
34589 -248641 -355360 -484966 -217814 362140 576351 90502 -526898 -560606 -104937 178550
34579 178550 45071 -54141 334070 1031368 1419712 1153939 566016 279513 435916 517783
34569 517783 91756 -535533 -746622 -505670 -349357 -548239 -794729 -795036 -667716 -569354
34559 -569354 -364465 58585 463001 537653 292110 -38180 -313577 -534995 -701580 -789891
34549 -789891 -817876 -843091 -912788 -999341 -972917 -763122 -586386 -761815 -1164548 -1196047 -573773
34538 -573773 187571 457173 311002 202993 157499 -92451 -425891 -516976 -549130 -971662
34528 -971662 -1567980 -1546255 -661720 440197 1102368 1224238 915080 332188 -44513 210477
34518 210477 658539 419991 -388021 -606330 208554 1010413 840689 201176 41896 233034
34508B33034j74382m39921J6708N54115M80521J48393Q0020N938m11586p17714
34498b24874l70333K87173N10166J77910k55226m36893k77196J53360N02284L67865
34488D34236m1733n6580L47684L41496l95881r39353m72514L58162L91189k67296
34478c00590m75502J64051Q03759O71073M924n23800o35277m30397q0996K07669
34468e95086K76416K22863K58848L12322J04436l35184o05694m83884j82051N8123
34458i68891K62879M41497L78025J3188k47509p833M71362N29965L0664m07778
34448D95569k82601P3235J1527m47724o69765l84738l2733K6503O8478L92733
34438g49516O54555L79841j70215l07745M5982K89745R4735k07464k67774j40906
$$ plain form
34508 233034 58652 -381269 -364561 189554 670075 818468 898488 904426 492840 -224874
34498 -224874 -595207 -308034 202132 380042 124816 -312077 -589273 -435913 66371 434236
34488 434236 392503 335923 683607 1025103 629222 -310131 -782645 -424483 -33294 -300590
34478 -300590 -776092 -612041 191718 862791 867715 343915 -291362 -721759 -802755 -595086
34468 -595086 -318670 -95807 163041 475363 579799 244615 -361079 -844963 -1027014 -968891
34458 -968891 -706012 -264515 113510 126698 -120811 -128644 342718 872683 903347 495569
34448 495569 212968 286203 297730 -149994 -819759 -1204497 -1237230 -1210727 -1142249 -749516
34438 -749516 -94961 284880 114665 -193080 -147098 142647 237382 29918 -237856 -378762
34428c78762Q0038M48929P68567N92413p1069n79684n13193k04727o9886M0990
34418A13616L43850N01758J39760l96742m77841j36082J00171J48805M19075R29433
34408A685803J094205N68484k42502p36620p63135n38603k87152j54105j78869
34399D47506j94947o543K43878J69542k94271p01353o10742q1131M30880M81013
34389a16168l0216o72635p10178J04948J017496J047252K78055k56467o9652J83020
34379G75455o6893l48631j05027J71701k47654q96675p02621J79181M36933l10145
34369a114376q11847j54080P43942N52211m03083o79082J24458R63780J016325
34360B38248O09981L04699N3335k98487m62244k01359J60549K28326J16767R8921
$$ plain form
34428 -378762 -298724 150205 918772 1511185 1440116 860432 347239 142512 72626 113616
34418 113616 457466 959224 1098984 702242 224401 88319 188490 337295 756370 1685803
34408 1685803 2780008 3348492 3105990 2369370 1606235 1067632 780480 626375 447506
34399 447506 252559 246016 489894 659436 365165 -336188 -946930 -1028061 -597181 -116168
34389 -116168 -146384 -819019 -1529197 -1424249 -406753 640499 918554 662087 592435 775455
34379 775455 708562 359931 254904 426605 178951 -717724 -1420345 -1241164 -804231 -1114376
34369 -1114376 -1926223 -2080303 -1336361 -784150 -1187233 -1866315 -1741857 -778077 238248
34360 238248 848229 1152928 1206263 907776 445532 244173 404722 633048 749815 848736
34350H48736P4570j30903k93910j44624R6442P8992l2065J24252L42739J14204
34340A078433m22976n65817j79451M2697k63482m85973n7952N35943M98124N235
34330A84781j10264K34818K31997m30767r18656m35845N72158J009071N62829
34321I00122p6367k91538k21054k70963m31072l63786M3269M83327N80240L08918
34311F61096O913l8324O9394M6965q3069l9888J19684q3164p21671j024390l59163
34300a445617O70415R00647K55510j90428J05615M12715O7861m17502l09300Q7652
34290A37568L6308l41027l83519j03223j0666O641M70457J056124P95656k78499
34280A385820r06956m35279K52305K13543j95104k25122n6734k09424l50245J50975
$$ plain form
34350 848736 923306 792403 498493 353869 450311 529303 497238 621490 964229 1078433
34340 1078433 655457 89640 -89811 -47114 -310596 -796569 -854521 -318578 179546 184781
34330 184781 74517 309335 541332 110565 -808091 -1243936 -671778 337293 900122
34321 900122 823755 532217 311163 40200 -390872 -754658 -711389 -228062 352178 661096
34311 661096 668009 629685 699079 746044 662975 623087 742771 659607 -62064 -1086454 -1445617
34300 -1445617 -775202 125445 380955 190527 296142 708857 776718 359216 49916 137568
34290 137568 173876 -167151 -550670 -653893 -664559 -657918 -187461 868663 1664319 1385820
34280 1385820 478864 43585 295890 509433 314329 89207 32473 -176951 -527196 -376221
34270c76221Q86042Q04865j56559q97529o97028m2840K87589K11382R5572J15579
34260B30852K13103L17494L33441J60409j12322k39704j32625M3268Q0534j17565
34250G76885m88141p23913m60680J66055M46524j685n64330m23504K50383N97480
34240d24926L72406J25159J22684j381l62671m80429j40519J88228J91355K14585
34230a95509M82197N52575J22212l12083k65461j30418m64394r22819p62596n8448
34220a954744M51389N02606M43872M08513K15344K3380K08899N51542L88777k98116
34210I41462p58453n95626k21564R762K81256O16059N53561j7490m67001l85047
34200d3081k10949l32446l10592K64082Q31076O63714O9234j65366p5175k23720
$$ plain form
34270 -376221 509821 1314686 1158127 260598 -436430 -479270 -191681 19701 115273 230852
34260 230852 443955 761449 1094890 1255299 1142977 903273 770648 813916 894450 776885
34250 776885 288744 -435169 -895849 -729794 -283270 -284955 -849285 -1272789 -1022406 -424926
34240 -424926 -52520 72639 195323 193942 -168729 -649158 -789677 -601449 -410094 -195509
34230 -195509 286688 839263 961475 649392 383931 253513 -210881 -1133700 -1896296 -1954744
34220 -1954744 -1503355 -1000749 -556877 -148364 66980 90360 299259 850801 1239578 941462
34210 941462 183009 -412617 -634181 -624419 -343163 272896 826457 808967 341966 -43081
34200 -43081 -254030 -586476 -897068 -632986 198090 861804 931038 765672 690497 466777
34190D66777m56156j20875N93343P42506J32934l86850l34227j97427l40102l91147
34180b91224j52725o6746k43737n2066O73004J012904L62970m76062n27393j14085
34170A24840o7835k47155n7014K00071j34471o20550k72099O37593Q13381O485
34160C83246o13560l71366M8209N1514Q7122N08262O97613J57737m79676m02898
34150F6203J52594M24527K56694k0878k85125m95736l92554J9614J81065j84086
34140b77682m52217j0973O98702P94568K14163l61420n09958l10324R0252M73364
34130C48475M21809j46678o25384n22349k31904l19057m90859j44233M44596M80666
34120g84918k3614l14474j84768j37564k43500O2713Q10516J145467N77124k61017
$$ plain form
34190 466777 10621 -110254 483089 1225595 1358529 971679 637452 440025 99923 -291224
34180 -291224 -443949 -510695 -754432 -806498 -133494 879410 1242380 766318 238925 124840
34170 124840 57005 -190150 -247164 -47093 -181564 -802114 -1074213 -436620 376761 383246
34160 383246 -230314 -601680 -553471 -501957 -414835 93427 791040 948777 469101 66203
34150 66203 218797 643324 900018 879140 594015 98279 -294275 -274661 -93596 -277682
34140 -277682 -729899 -740872 -42170 752398 966561 605141 95183 -215141 -124889 348475
34130 348475 770284 623606 -1778 -524127 -756031 -1075088 -1565947 -1710180 -1265584 -784918
34120 -784918 -808532 -1123006 -1307774 -1445338 -1688838 -1626125 -815609 329858 906982 645965
34110F45965n69715m04003k52092j95929k0486K69849N07342O20438N23142J05849
34100A230360l84160l85828J89098O22408K93762m06392n89367j04300K99593
34091G65174O0764m49755n02986j2781M00118K76745j17026k56888r1948L4338
34081A05755J7394O6836J75555O5628k15185k22190J21223K80322k7880l37068
34071C0390k33288j3417N218J40391N83434O85469l2355p64032m83190L35051
34061B53671L99877k58506l65235L49178N97921l02489j204376q66106K48621
34052a147444Q39524N63371L2943l09320m20128k35493J77407L90579J77031m4614
34042B3856J19707L34884R5224l95720n36009k29298J11762K40205K24392J17507
$$ plain form
34110 645965 76250 -327753 -579845 -775774 -796260 -526411 -19069 601369 1124511 1230360
34100 1230360 846200 460372 649470 1271878 1565640 1159248 569881 465581 765174
34091 765174 825938 376183 -126803 -139584 260534 537279 420253 163365 71417 105755
34081 105755 123149 189985 365540 431168 215983 -6207 115016 395338 367458 30390
34071 30390 -202898 -216315 -211097 -70706 512728 1198197 1165842 401810 -81380 253671
34061 253671 653548 395042 29807 378985 976906 674417 -529959 -1396065 -1147444
34052 -1147444 -307920 255451 288394 -20926 -441054 -676547 -499140 -108561 68470 23856
34042 23856 143563 478447 573671 177951 -358058 -587356 -475594 -235389 -10997 106510
34032A06510n2712j29976m0820L6889O494N1634K13364J76996j41976k47845K00273
34021A78831O98118N23602k24129p86256p48869l55226L1468K64360K85217R1112
34011d1772j78590l68898m22286k42755K42686P09569N80105j35376o24910l38390
34001h20617K17003K85269k792Q650L59442M86480K16652j5624O1441K18464K13193
33990A227561P9643j23362l81315n04374k73164J57121L82204K94055J49183J08472
$$ plain form
34032 106510 53798 -76178 -116998 -80109 -73615 -21981 191383 368379 226403 -21442 178831
34021 178831 876949 1400551 1176422 390166 -358703 -713929 -682461 -418101 -132884 -41772
34011 -41772 -220362 -589260 -1011546 -1254301 -1011615 -302046 278059 142683 -482227 -820617
34001 -820617 -603614 -318345 -321137 -312487 46955 533435 750087 734463 795904 1014368 1227561
33990 1227561 1307204 1183842 802527 298153 24989 182110 564314 858369 1007552 1116024
$$ [...]
##END NTUPLES=NMR SPECTRUM
##END=
