##TITLE=31Pdec_E3d-2
 CDCl3, 24 sc
 15.6.2023
##JCAMPDX= 6.0         $$ Bruker NMR JCAMP-DX V2.0
##DATA TYPE= NMR SPECTRUM
##DATA CLASS= NTUPLES
##ORIGIN= UXNMR, Bruker Analytische Messtechnik GmbH
##OWNER= root
$$ XWIN-NMR		Version 3.5
$$ Thu Jun 15 09:29:39 2023 Russian Standard Time (UT+4h)  she@DPX200
##.OBSERVE FREQUENCY= 81.013821
##.OBSERVE NUCLEUS= ^31P
##.ACQUISITION MODE= SIMULTANEOUS
##.ACQUISITION SCHEME= undefined
##.AVERAGES= 24
##.DIGITISER RES= 16
##SPECTROMETER/DATA SYSTEM= spect
##.PULSE SEQUENCE= zgpg30
##.SOLVENT NAME= CDCl3
##.SHIFT REFERENCE= (INTERNAL, CDCl3, 0, 248.564)
##AUDIT TRAIL= $$ (NUMBER, WHEN, WHO, WHERE, WHAT)
$$ ##TITLE= Audit trail, XWIN-NMR		Version 3.5
$$ ##JCAMPDX= 5.01
$$ ##ORIGIN= Bruker BioSpin GmbH
$$ ##OWNER= she
$$ F:/spectra/data/she/nmr/P31/1/pdata/1/auditp.txt
$$ ##AUDIT TRAIL=  $$ (NUMBER, WHEN, WHO, WHERE, WHAT)
(   1,<2023-06-15 09:28:56.14 +0400>,<she>,<DPX200>,
      <created by zg, POWCHK disabled, PULCHK disabled
       configuration hash MD5:
       00 E9 B6 7A A2 85 ED C7 34 08 36 98 17 FE 4E 26
       data hash MD5: 32K
       73 1E B6 DC AB 03 2F 18 40 1B 63 4B CB 15 52 0C>)
(   2,<2023-06-15 09:28:59.18 +0400>,<she>,<DPX200>,
      <Start of raw data processing
       efp BC_mod = 2 LB = 1 FT_mod = 6 PKNL = 1 PHC0 = -10706.7 PHC1 = 136.2848 SI = 64K 
       data hash MD5: 64K
       0D AF AB 4A 7F 9E BF 00 4E 8F 78 4B A4 C1 AB 54>)
(   3,<2023-06-15 09:29:14.06 +0400>,<she>,<DPX200>,
      <abs ABSG = 5 
       data hash MD5: 64K
       F1 78 11 93 9A B0 B3 97 6A CF 56 86 81 30 E1 B1>)
$$ ##END=
$$ 
$$ hash MD5
$$ C0 B7 B5 B0 F5 DB E7 86 8B 32 A4 D0 68 94 E1 01
##$RELAX= 
##$RELAX= 
##$RELAX= 
##$RELAX= 
##$RELAX= 
##$RELAX= 
##$RELAX= 
##$RELAX= 
##$RELAX= 
$$ Bruker specific parameters
$$ --------------------------
##$DU= <F:/spectra>
##$EXPNO= 1
##$NAME= <P31>
##$PROCNO= 1
##$TYPE= <nmr>
##$USER= <she>
##$AMP= (0..31)
100 100 100 100 100 100 100 100 100 100 100 100 100 100 100 100 100 100 
100 100 100 100 100 100 100 100 100 100 100 100 100 100 
##$AQSEQ= 0
##$AQ_mod= 1
##$AUNM= <au_zg>
##$AUTOPOS= <>
##$BF1= 81.014009
##$BF2= 200.13
##$BF3= 200.13
##$BF4= 200.13
##$BF5= 200.13
##$BF6= 200.13
##$BF7= 200.13
##$BF8= 200.13
##$BYTORDA= 1
##$CFDGTYP= 0
##$CFRGTYP= 5
##$CHEMSTR= <none>
##$CNST= (0..31)
1 1 145 1 1 1 1 1 1 1 1 1 1 1 1 1 1 1 1 1 1 1 1 1 1 1 1 1 1 1 1 1 
##$CPDPRG= <waltz16>
##$CPDPRG1= <>
##$CPDPRG2= <waltz16>
##$CPDPRG3= <>
##$CPDPRG4= <mlev>
##$CPDPRG5= <mlev>
##$CPDPRG6= <mlev>
##$CPDPRG7= <mlev>
##$CPDPRG8= <mlev>
##$CPDPRGB= <>
##$CPDPRGT= <>
##$D= (0..31)
0 1 0 0 0 0 0 0 0 0 0 0.03 2e-05 3e-06 0 0 0 0 0 0 0 0 0 0 0 0 0 0 0 0 
0 0 
##$DATE= 1686806935
##$DBL= (0..7)
120 120 120 11 120 120 24 19 
##$DBP= (0..7)
150 150 150 150 150 150 150 150 
##$DBP07= 0
##$DBPNAM0= <>
##$DBPNAM1= <>
##$DBPNAM2= <>
##$DBPNAM3= <>
##$DBPNAM4= <>
##$DBPNAM5= <>
##$DBPNAM6= <>
##$DBPNAM7= <>
##$DBPOAL= (0..7)
0.5 0.5 0.5 0.5 0.5 0.5 0.5 0.5 
##$DBPOFFS= (0..7)
0 0 0 0 0 0 0 0 
##$DE= 6
$$ [...]
##$SUBNAM3= <"">
##$SUBNAM4= <"">
##$SUBNAM5= <"">
##$SUBNAM6= <"">
##$SUBNAM7= <"">
##$SUBNAM8= <"">
##$SUBNAM9= <"">
##$SW= 501.771253377433
##$SWIBOX= (0..15)
0 1 3 0 0 0 0 0 0 0 0 0 0 0 0 0 
##$SW_h= 40650.406504065
##$TD= 32768
##$TD0= 1
##$TE= 0
##$TE2= 300
##$TE3= 300
##$TEG= 300
##$TL= (0..7)
0 120 53 12 22 120 120 120 
##$TP= (0..7)
150 150 150 150 150 150 150 150 
##$TP07= 0
##$TPNAME0= <>
##$TPNAME1= <>
##$TPNAME2= <>
##$TPNAME3= <>
##$TPNAME4= <>
##$TPNAME5= <>
##$TPNAME6= <>
##$TPNAME7= <>
##$TPOAL= (0..7)
0.5 0.5 0.5 0.5 0.5 0.5 0.5 0.5 
##$TPOFFS= (0..7)
0 0 0 0 0 0 0 0 
##$TUNHIN= 0
##$TUNHOUT= 0
##$TUNXOUT= 0
##$USERA1= <user>
##$USERA2= <user>
##$USERA3= <user>
##$USERA4= <user>
##$USERA5= <user>
##$V9= 5
##$VALIST= <valist>
##$VCLIST= <CCCCCCCCCCCCCCC>
##$VD= 0
##$VDLIST= <DDDDDDDDDDDDDDD>
##$VPLIST= <PPPPPPPPPPPPPPP>
##$VTLIST= <TTTTTTTTTTTTTTT>
##$WBST= 1024
##$WBSW= 4
##$XGAIN= (0..3)
0 0 0 0 
##$XL= 0
##$YL= 0
##$YMAX_a= 5846
##$YMIN_a= -5711
##$ZGOPTNS= <>
##$ZL1= 120
##$ZL2= 120
##$ZL3= 120
##$ZL4= 120
##$ABSF1= 248.5645
##$ABSF2= -253.2056
##$ABSG= 5
##$ABSL= 3
##$ALPHA= 0
##$AQORDER= 0
##$ASSFAC= 0
##$ASSFACI= 0
##$ASSFACX= 0
##$ASSWID= 0
##$AUNMP= <proc_1d>
##$AZFE= 0.1
##$AZFW= 0.5
##$BCFW= 0
##$BC_mod= 2
##$BYTORDP= 0
##$COROFFS= 0
##$CY= -3
##$DATMOD= 1
##$DC= 0
##$DFILT= <>
##$DTYPP= 0
##$F1P= 0
##$F2P= 0
##$FCOR= 1
##$FTSIZE= 65536
##$FT_mod= 6
##$GAMMA= 0
##$GB= 0
##$INTBC= 1
##$INTSCL= 6.047779e-11
##$ISEN= 30
##$LB= 1
##$LEV0= 0
##$LPBIN= 0
##$MAXI= 10000
##$MC2= 0
##$MEAN= 0
##$ME_mod= 0
##$MI= 50
##$NCOEF= 0
##$NC_proc= -5
##$NLEV= 6
##$NOISF1= 182.463
##$NOISF2= 159.3651
##$NSP= 0
##$NTH_PI= 0
##$NZP= 0
##$OFFSET= 248.5645
##$PC= 4
##$PHC0= -10706.7
##$PHC1= 136.2848
##$PH_mod= 1
##$PKNL= yes
##$PPARMOD= 0
##$PSCAL= 0
##$PSIGN= 0
##$REVERSE= no
##$SF= 81.0140089999694
##$SI= 65536
##$SIGF1= 159.3651
##$SIGF2= -187.1042
##$SINO= 113.3802
##$SIOLD= 16384
##$SREGLST= <1H.CDCl3>
##$SSB= 0
##$STSI= 65536
##$STSR= 0
##$SW_p= 40650.406504065
##$SYMM= 0
##$S_DEV= 0
##$TDeff= 32768
##$TDoff= 0
##$TI= <>
##$TILT= no
##$TM1= 0
##$TM2= 0
##$TOPLEV= 0
##$USERP1= <user>
##$USERP2= <user>
##$USERP3= <user>
##$USERP4= <user>
##$USERP5= <user>
##$WDW= 1
##$XDIM= 65536
##$YMAX_p= 352743297
##$YMIN_p= -138937874
$$ End of Bruker specific parameters
$$ ---------------------------------
##NTUPLES= NMR SPECTRUM
##VAR_NAME=  FREQUENCY,     SPECTRUM/REAL,   SPECTRUM/IMAG
##SYMBOL=    X,             R,               I
##VAR_TYPE=  INDEPENDENT,   DEPENDENT,       DEPENDENT
##VAR_FORM=  AFFN,          ASDF,            ASDF
##VAR_DIM=   65536,         65536,           65536
##UNITS=     HZ,            ARBITRARY UNITS, ARBITRARY UNITS
##FACTOR=    0.620285442955139, 1,           1
##FIRST=     20137.2065510682, 0,            0
##LAST=      -20513.1999529968, 0,           0
##MIN=       -20513.1999529968, -138937874,  0
##MAX=       20137.2065510682, 352743297,    0
$$ Real data points
##PAGE= N=1
##DATA TABLE= (X++(R..R)), XYDATA
$$ [...]
##PAGE= N=2
##DATA TABLE= (X++(I..I)), XYDATA
13417B25658n82857m34549R1824K44314j44270m03620j48630J61238J57856J69223
13407f63813L94270L98272K8860j18102J74918J87433l55559m70390M21847J119527
13397A117263L49384j029798j177851o0353O51184K22110l41739k34667K5306
13388d79161j50718l77482j32465L17309M37950K25395k59j24108k09641k69315
13378g62495k57518r4156K59000N55730L92526j11091k21316L26903P03947J60537
13368I52067o99612p58525j03239J73106k93864p11079m70838Q2142M01873M22513
13358a005456K84088N4254j19587j16092j03519k04380r2330M57858R06192O25805
13348F86833j6232j69041J25089R3421l51046m89561j28111J06940j6258L9778
$$ plain form
13417 225658 -357199 -791748 -699924 -455610 -599880 -1003500 -1152130 -990892 -833036 -663813
13407 -663813 -269543 128729 157589 39487 214405 401838 46279 -424111 -2264 1117263
13397 1117263 1466647 436849 -741002 -801355 -150171 71939 -269800 -504467 -479161
13388 -479161 -629879 -1007361 -1139826 -822517 -384567 -159172 -159431 -283539 -493180 -762495
13378 -762495 -1020013 -1114169 -855169 -299439 93087 -18004 -239320 87583 791530 952067
13368 952067 252455 -506070 -609309 -436203 -730067 -1441146 -1911984 -1829842 -1427969 -1005456
13358 -1005456 -721368 -667114 -786701 -902793 -1006312 -1210692 -1303022 -845164 61028 686833
13348 686833 670601 501560 626649 720070 369024 -120537 -248648 -141708 -157966 -118188
13338a18188M28816M86787q7979n93147m09569Q7605K50695Q2714q0719j78337
13328a31322k20032m3996K77079L11284o1317l66019k61820j7964N6400R1105
13318c66602K26722K81558J98992K53786M53204L34058k30286o19949l50307J79452
13308C60628L41130J93068J79869L19102K73301k4398l17234m24720l38752j18196
13298D43798M8655o0792l25443l34971l5605J03817j55739l81385j59350K18014
13288f39001K29726n7036j51177J06549M06182M51161K25008j13644l49525l50598
13278b42355k42642k53199l12334j34818K26674L66592K13325J92719M52605N09779
13268G76346O1428m17196m01759j53385k24241n25395n42127k01051J27630L05121
$$ plain form
13338 -118188 310628 797415 709436 116289 -293280 -205675 45020 127734 47015 -131322
13328 -131322 -351354 -395350 -118271 193013 131696 -234323 -496143 -514107 -457707 -366602
13318 -366602 -139880 141678 340670 594456 1047660 1381718 1151432 531483 181176 360628
13308 360628 701758 894826 1074695 1393797 1667098 1642700 1325466 900746 561994 443798
13298 443798 492453 431661 106218 -228753 -264358 -160541 -316280 -697665 -857015 -639001
13288 -639001 -409275 -466311 -617488 -510939 -104757 346404 571412 457768 108243 -242355
13278 -242355 -484997 -738196 -1050530 -1185348 -958674 -592082 -378757 -186038 266567 776346
13268 776346 837774 420578 18819 -134566 -358807 -884202 -1426329 -1627380 -1499750 -1194629
13258a194629M76001N70613L64603p845j49077q199P3910p8619k97931m10168
13248f61341l49556l4669M24956N44015M0244n15730l11156M51398O89082J1014
13238B88257o64662m80786J31306K44216j44127l17183j05755p747j32884J8891
13228a170474N44664P85039L87436m0401P9417K98614q7161p35035o76774J20958
13218d93717O11626K15384l96369m10792P522K13898R8081J5323J09883K50069
13208B20908L46757K97540p2761o08870p45529k92746J24532l4611l41823j20047
13198a226650L69692L65330l3324J2901O02469Q08675J48841o18535o42682j56902
13188c70185Q0691n2756r3063J43079L47457K65280J6030j19560M177K80925M20629
$$ plain form
13258 -1194629 -718628 -148015 216588 208743 59666 51467 125377 46758 -251173 -661341
13248 -661341 -1010897 -1045566 -620610 -76595 -36351 -552081 -863237 -411839 277243 288257
13238 288257 -376405 -857191 -725885 -481669 -625796 -942979 -1048734 -1056481 -1189365 -1170474
13228 -1170474 -625810 159229 546665 506264 585681 884295 797134 62099 -614675 -493717
13218 -493717 117909 333293 -63076 -473868 -466346 -252448 -154367 -139044 -29161 220908
13208 220908 567665 865205 792444 183574 -561955 -854701 -730169 -764780 -1106603 -1226650
13198 -1226650 -856958 -491628 -524952 -512051 90418 899093 1047934 429399 -213283 -370185
13188 -370185 -289494 -342250 -435313 -292234 55223 320503 336533 216973 221150 502075 922704
13177I22704K24287j67305m30062m35762k84161m2439K46910L62822Q7628l94041
13167I0581o23519m09843N4597N27257P87896N39564k19240q16593n45632L04003
13157c10929P18275L29614k04176l30482l00754m18589l93310J7631L65860J56594
13147c70266l03652l27731J68894O46311O98824L77317q9959n04101p08862o58351
13137a071576m02852M8745O15185R04985N43282j77293n08008k68517n5763j98185
13127e69997k25623J88430M95416J50900l75193k86076K49710L81888l3642k25248
13117b49435K36316P27060M31175n30257j182337q03361K19441P35818J37325
13108b78255q23387q98690J8948P50416M94212j13800r8300L89272M88603O9936
$$ plain form
13177 922704 1146991 979686 549624 113862 -170299 -212738 34172 396994 484622 90581
13167 90581 -532938 -942781 -888184 -360927 426969 966533 747293 -69300 -614932 -310929
13157 -310929 407346 736960 532784 202302 -98452 -517041 -910351 -892720 -526860 -370266
13147 -370266 -673918 -1001649 -832755 -186444 512380 889697 799738 295637 -413225 -1071576
13137 -1071576 -1474428 -1425683 -810498 94487 637769 460476 -47532 -316049 -371812 -569997
13127 -569997 -795620 -607190 -111774 39126 -336067 -622143 -372433 9455 -24187 -249435
13117 -249435 -13119 713941 1145116 614859 -567478 -1370839 -1151398 -415580 -278255
13108 -278255 -1101642 -2000332 -1981384 -1230968 -736756 -850556 -948856 -559584 -70981 -1045
13098a045j61074J33707M68087L86227J02445M9544K35510L05739K7832m33928
13088A113044o63787m41673n6115L2226j39386q2766L09262M97833J56477k50807
13078D74308k01043P3207N5479j90246k41521o7756N5597R5072J33697j375l84520
13067a99101n82614k35302K81878M33581L80420N05768N20603r071n97421m29675
13057F9066J66281P2152p67484j112849l27536O77531Q68136M13349J2593j90548
13047a19309l46512k88696J01937M45065L89839J79806J92571L19832K53580J3675
13037A141788k01380l37599l54286j50995J31159J59930m9871j38466o0483j12326
13027B7471j91806J41000O43153M30502n14528r42124j50621Q06395O62556j92775
$$ plain form
13098 -1045 -162119 -28412 439675 825902 928347 977891 1213401 1519140 1546972 1113044
13088 1113044 449257 7584 -48531 -16305 -155691 -238457 70805 568638 725115 474308
13078 474308 273265 346472 401951 211705 -29816 -97572 -41975 53097 186794 185419 -199101
13067 -199101 -781715 -1017017 -735139 -301558 78862 584630 1105233 1096162 498741 69066
13057 69066 235347 307499 -459985 -1572834 -1900370 -1222839 -354703 58646 71239 -119309
13047 -119309 -465821 -754517 -652580 -207515 182324 362130 554701 874533 1128113 1141788
13037 1141788 940408 602809 248523 97528 228687 388617 338746 200280 139797 27471
13027 27471 -164335 -23335 619818 1050320 535792 -406332 -556953 249442 911998 719223
13017G19223n01001r1212J82386o10j69473j23665j26359j76020p1998l0989k95908
13006f85626m03711J20784O59663L11096m46711l19011O38578R73832J73618n40533
12996D81979k61653K60086Q4849m39011n84086m84274m77280k28058M30554O96649
12986e20245j982p73063m46430O04207J058100N94940R311k54408m11129m05248
12976e45947N3525N87950M86335m7853j29928K83432L10467k62276n52733j07890
12966G5082L29630J13813l04296l19320j89592l68034n79869l60154P4328K39885
12956a288527J88526J97455J12535k64640n13124j03371O43637Q56063L09550
12947A38104l04258l33179J09261M39442K77964k17093m97537j82711M05691N07772
$$ plain form
13017 719223 218222 127010 309396 308786 139313 15648 -110711 -286731 -358729 -389718 -685626
13006 -685626 -1089337 -968553 -308890 2206 -444505 -763516 -124938 848894 1022512 481979
12996 481979 220326 480412 565261 126250 -457836 -942110 -1419390 -1647448 -1216894 -520245
12986 -520245 -522227 -1295290 -1741720 -1137513 -79413 515527 524838 270430 -140699 -545947
12976 -545947 -492422 95528 581863 534010 404082 687514 997981 735705 182972 75082
12966 75082 404712 518525 214229 -105091 -294683 -662717 -1242586 -1602740 -1528412 -1288527
12956 -1288527 -1100001 -902546 -790011 -1054651 -1567775 -1671146 -1027509 -171446 138104
12947 138104 -166154 -499333 -390072 49370 327334 110241 -387296 -570007 -164316 343456
12937C43456r6963p20700o62742j04013K84433K78101J53384P7628N72O120K30830
12926b09894M76298L76547m2543l69877l83437k59470j90930j33806m913J21513
12916f20512J15143k7709j42212l6804K37446L19691j6442m04054k68866K95424
12906e48895N48274J49911l67481m31671j62666O6846K23676L45374K47784k4745
12896D6407k4602L24657M07208n8701l82714j9456M15678J72105k97909j58147
12886D24526K50195o932p10340p71563r1375L37137J94332K09914N72643M68378
12876H76915l38449q54070m34895J85502J71669j64877j52811J19163K31653K03050
12866a57150J51072p3414l34034j10064M78592M94171k87294p08250K931Q25475
$$ plain form
12937 343456 246493 -474207 -1136949 -1240962 -956529 -678428 -525044 -447416 -446844 -440724 -209894
12926 -209894 266404 642951 600408 230531 -152906 -412376 -603306 -737112 -742025 -620512
12916 -620512 -505369 -533078 -675290 -712094 -474648 -154957 -171399 -575453 -844319 -548895
12906 -548895 -621 149290 -218191 -649862 -812528 -745682 -522006 -176632 71152 46407
12896 46407 21805 346462 753670 694969 312255 292799 708477 880582 582673 424526
12886 424526 674721 667789 -42551 -814114 -905489 -568352 -374020 -164106 408537 876915
12876 876915 538466 -315604 -750499 -564997 -393328 -558205 -711016 -591853 -360200 -157150
12866 -157150 -6078 -79492 -413526 -523590 -44998 449173 161879 -546371 -543440 282035
12856B82035M72269n51212p83053p1997M66820M03522L88164O54509N76298n0635
12846A786720n26968m36024k72831m42349n34170j34551L71319M10334J13115
12837C34595Q875J64879J70062j68338n37374n37491j57611K22578K49667q401
12827b58559j53736K5634K94857L34063J47033p2856k45590l22288j50016K49894
12817a51564M88230K80565n9805k5835L06015L59663j01093o41924p37481l64749
12807f47978O7091J73232n8851k60410p4111L79111O11850M26137J33617l1689
12797G17999k60580o01492n62491J38859Q14356N34792n32591j232499q70579
12788a854226O4963O83257O32720J73777j94937q1495M17330O57171J88081n12275
$$ plain form
12856 282035 754304 203092 -579961 -651958 -185138 218384 606548 1261057 1837355 1786720
12846 1786720 1259752 823728 550897 108548 -425622 -560173 -188854 221480 334595
12837 334595 343470 508349 678411 510073 -27301 -564792 -722403 -499825 -250158 -258559
12827 -258559 -412295 -386661 -91804 242259 389292 316436 70846 -251442 -401458 -151564
12817 -151564 336666 617231 557426 531591 837606 1197269 1096176 454252 -283229 -647978
12807 -647978 -580887 -407655 -466506 -726916 -801027 -421916 189934 616071 749688 717999
12797 717999 457419 -144073 -706564 -567705 246651 781443 248852 -983647 -1854226
12788 -1854226 -1789263 -1106006 -473286 -299509 -494446 -575941 -158611 498560 686641 174366
12778A74366n93844p4014J78471j97205m95135r6096N27716N37028l2014m05964
12768d76691k04585J86743L12428J92198R4272J26679J77602O9082k70414o47977
12758d40663o78331k15546L45401M61572J30533j17458J5800J93688L3614k29406
12748e00796r4606L52268M79256N9114l60965k84388L4622J11671J8114R5385
12738i0325K12831m336l77331l54118L5479J81193n3521r6387K65743M26360J8629
12727A64217l47645n1675M76226M25644j26898m40685k97063j29921j15705M6823
12717c96682M08531N39616K08790k39015l84273k35996q3257j19535l01615l91008
12707i94444j58938K77638M62025J65079k45503k84722J4407K65006K87157J37571
$$ plain form
12778 174366 -419478 -493492 -315021 -512226 -1007361 -1103457 -575741 -38713 -70727 -476691
12768 -476691 -681276 -494533 -182105 10093 104365 231044 408646 477728 207314 -440663
12758 -440663 -1118994 -1334540 -989139 -527567 -397034 -514492 -498692 -305004 -271390 -500796
12748 -500796 -595402 -243134 236122 295236 -65729 -350117 -315495 -203824 -185710 -90325
12738 -90325 122506 118170 -259161 -613279 -577800 -396607 -450128 -546515 -280772 145588 164217
12727 164217 -183428 -235103 241123 666767 539869 99184 -197879 -327800 -443505 -396682
12717 -396682 11849 551465 760255 521240 136967 -99029 -182286 -301821 -603436 -994444
12707 -994444 -1153382 -875744 -413719 -248640 -494143 -778865 -764458 -499452 -212295 -74724
12697g4724j62436m96695n03629m4131M09336L71787R4557J22583L40435J87690
12687B44773k99954m73028j33041J68715O8021r5563L4804K58439K57478J05630
12677A36274J9730J4625N7083J75280K22455m3141m53527m73162J8121M50195
12667A23933L51952l0847k24317k02408j94759j85734k6018K07271L24167K96992
12657D40232J60633j04477l49623k56649J40490L07774l5239m04035k78312M5848
12647c33358j2437k41953M2268O69368N93457m79826j347438q52767M48658J015404
12637d98624L97280l38907k65807K36230L25546j6872j72795N5596K59688J80330
12627A61665N1591J10446K02836M4300l73209p37338o55110j0365P42444Q34667
$$ plain form
12697 -74724 -237160 -733855 -1237484 -1281615 -872279 -500492 -405935 -283352 57083 244773
12687 244773 -55181 -528209 -661250 -492535 -424514 -520077 -485273 -226834 30644 136274
12677 136274 156004 170629 227712 402992 625447 582306 128779 -344383 -326262 123933
12667 123933 475885 445038 220721 18313 -176446 -362180 -388198 -180927 143240 440232
12657 440232 600865 496388 146765 -109884 30606 338380 303141 -100894 -379206 -333358
12647 -333358 -345795 -587748 -545480 123888 717345 237519 -1109919 -1962686 -1514028 -498624
12637 -498624 -101344 -440251 -706058 -469828 -144282 -161154 -333949 -278353 -18665 161665
12627 161665 213256 323702 526538 570838 197629 -539709 -1194819 -1205184 -462740 371927
12617C71927O2383p75107p55546j581N71209N52757L79988L56002J64100l36443
12607E89689o05781k38028L08458L73797L4303k01153k37521l08499l42697q4432
12597g11864K94662L28455j1856k32146j6043L75888M77978J37439l62742n54163
12587b74392k28217K80608M28583J34921j70292k20320j89505j67679P2144M96602
12577A62453O03210K09953j21828L8927K65681K6454l87982m15334k17442k93907
12567a29815m81009k44121K71821M09653J07432n6811Q9625R9371j72322k60736
12557c66912O6813L63297J97724k26798m37027k98519m1285P7344K1925K2324
12547f21114K96771O29137N09910j03127n88430n37100l03990k51931q3807M21636
$$ plain form
12617 371927 434310 -340797 -1096343 -1097924 -526715 26042 406030 762032 926132 589689
12607 589689 -16092 -254120 54338 428135 462438 261285 23764 -284735 -627432 -711864
12597 -711864 -417202 -88747 -100603 -332749 -348792 27096 505074 642513 279771 -274392
12587 -274392 -502609 -222001 206582 341503 171211 -49109 -238614 -406293 -334149 162453
12577 162453 765663 975616 853788 892715 1158396 1184850 796868 381534 164092 -129815
12567 -129815 -610824 -854945 -583124 -173471 -66039 -122850 -33225 66146 -106176 -366912
12557 -366912 -300099 63198 260922 34124 -402903 -701422 -742707 -665363 -643438 -621114
12547 -621114 -324343 304794 814704 711577 123147 -413953 -717943 -969874 -1053681 -632045
12537f32045O66684J31060n19853k83347N77272Q81400K66553n18215q97172r21987
12527a249650n43442L60189J175926R87621J3142n16398j48441K48430M1296k33557
12517A35116j258L40337K12885j46111j58393J86438M36463K79541k74824r04075
12507A06119j042548m52825K67003L67839M5448N8000L88787L28049j38771k27686
12497c00585K06700L79928J1587k20258m8709j19519n85400n47144L64033J109719
12487B50352Q08362J9955m10238o21088q71701o11600L83147J028374M53197m14427
12477A4333k45812M97458L93238m90572p42258N61N44125J88202k79050q8942
12467b08717K96844J41969l30121l73722J58940P23326Q18756M30291j03818m33803
$$ plain form
12537 -632045 34639 165699 -354154 -637501 -60229 821171 1087724 569509 -327663 -1249650
12527 -1249650 -1793092 -1432903 -256977 730644 743786 227388 78947 327377 368673 135116
12517 135116 133858 474195 687080 540969 382576 569014 1005477 1285018 1010194 106119
12507 106119 -936429 -1389254 -1122251 -754412 -708964 -650964 -262177 65872 -72899 -300585
12497 -300585 -93885 286043 297630 77372 28663 -90856 -676256 -1223400 -859367 250352
12487 250352 1058714 1078669 668431 47343 -824358 -1435958 -1052811 -24437 428760 14333
12477 14333 -231479 265979 659217 168645 -573613 -573052 -28927 159275 -119775 -208717
12467 -208717 88127 230096 -100025 -473747 -314807 408519 1227275 1657566 1553748 1119945
12457A119945m59467l13785j26350L0479r205l32770n74126k43276M11350N36585
12447C9380l0606l80295O0246N61719K81514l51081m06758j726N2093k60191k15982
12436f51687K53115M11281K2394k72012r7588P6037j56967m43247l12992O3555
12426a108111K01713J5519j58860o1876J92797K60295j8145l13294j24024M84623
12416f29363Q02281M04211k13029l19071P6766M00381L46559M8018k95133m58693
12406A62927j71807M37061P06138K96868k03565j63638N5258k41568p74091o63224
12396e59641N2282L73558q7344n29816k70415K67063L39214k5184k65006j60833
12386h66122N4042J98794L11279L88713K88007l8735l39490k52319J97503M40048
$$ plain form
12457 1119945 660478 346693 220343 250822 241617 -91153 -665279 -908555 -497205 39380
12447 39380 8774 -371521 -311275 250444 531958 180877 -225881 -227607 -175514 -435705 -651687
12436 -651687 -398572 12709 35103 -236909 -334497 -258460 -415427 -858674 -1171666 -1108111
12426 -1108111 -906398 -890879 -1049739 -1111615 -918818 -658523 -676668 -989962 -1113986 -629363
12416 -629363 172918 577129 364100 45029 121795 522176 868735 916753 621620 162927
12406 162927 -8880 428181 1134319 1431187 1227622 1063984 1119242 877674 103583 -559641
12396 -559641 -507359 -133801 -221145 -750961 -1021376 -754313 -415099 -440283 -705289 -866122
12386 -866122 -812080 -613286 -302007 86706 374713 335978 -3512 -255831 -58328 381720
12376C81720K4721o24869o38745L3189M50000P1827m11105j86874M25254N86577
12366A11695K62338O1103J24780P6994j42867k34415j79107j83738j56059N9248
12356b00028J70770r7682l58162j88112j0081l57073o72599p5819R53781J079195
12346B44190K32159k86028J6333J59269l49589n46841J69788P57978K16405o62051
12336d8387n64180K31990M72260M1060o6524L61709L95961l37576r00221m80105
12326h94013L59313N25551p9344n44701k30650M87994P96590M19997j55436l27840
12316C57461l9990K78378K69729k8869l33337l77339r9084K25349J49772l68709
12306C3361p26923m05435K11948K99779j88442m39999l7184M28240L17341j17292
$$ plain form
12376 381720 406441 -218428 -857173 -823984 -373984 -302157 -713262 -900136 -474882 111695
12366 111695 374033 435136 559916 636910 494043 259628 80521 -103217 -259276 -200028
12356 -200028 -29258 -126940 -485102 -673214 -683295 -1040368 -1712967 -1788786 -835005 244190
12346 244190 476349 190321 206654 365923 16334 -530507 -360719 397259 613664 -48387
12336 -48387 -612567 -380577 91683 132743 66219 427928 823889 486313 -413908 -894013
12326 -894013 -534700 -9149 -88493 -633194 -863844 -375850 420740 840737 685301 357461
12316 357461 317471 595849 865578 836709 503372 126033 26949 252298 402070 33361
12306 33361 -693562 -1098997 -887049 -587270 -775712 -1215711 -1252895 -824655 -507314 -624606
12296f24606k28003O9625L44860L34332J22879j18260k10771j8415K97501L54718
12286C23860J26183N3104K98270L80036k2292m15092k39356J76917J56366j67460
12276F70536r1276L93363M90936j35914q17641q60850m08084L928J71121J58553
12266d25328Q388j19133O0325M65638N66097J49495k56357j57813J42918R4751
12256E28981j88435k22263o4835j62531m21688k65648L34380O96444M84865J65250
12246H84520J17055M4248l12505n83550m30329j75373j69634j20261K54743M75620
12236a5466O3857m27338j64379N14541N45220j00633l48588J62362M79314k0165
12226F88725n74000l40582K18122J66894l76935n25722n1098L72007K26920k44258
$$ plain form
12296 -624606 -852609 -782984 -438124 -103792 19087 -99173 -309944 -328359 -30858 323860
12286 323860 450043 503147 801417 1181453 1159161 744069 504713 681630 837996 670536
12276 670536 579260 972623 1463559 1327645 510004 -350846 -758930 -755002 -583881 -425328
12266 -425328 -416940 -536073 -475748 -10110 555987 705482 449125 291312 434230 528981
12256 528981 340546 118283 53448 -109083 -530771 -796419 -462039 234405 719270 884520
12246 884520 1001575 1045823 733318 149768 -280561 -455934 -625568 -745829 -491086 -15466
12236 -15466 48391 -378947 -543326 -28785 516435 415802 67214 229576 708890 688725
12226 688725 114725 -225857 -7735 159159 -217776 -743498 -794596 -422589 -195669 -439927
12216d39927m92958k36663L79899Q56765O97164j8486n97599n23798m2083K68950
12206a48736J99361o0007k42533j23859K99562N45213O1602q48160j150672m78290
12196a946519L18086M83210L97781O08742O86577P6378o09670m08863L20680L97405
12186C23807k23925m13415J66097N10934O3088l30918P2474O17011L78285k83639
12176H79799l54037K01730M90507J30526l31452m29558l65766m15310m19858j77489
12166g90908J36210K68527K80594L19310K66086k1422l03937k26231Q1442J33576
12156A43247j32998k18721J09877L77901J60598j96755j47278J68447K54953J67413
12146F86684L08959N29624L12499k00920l12957L2713J31966k22462l96350j42963
$$ plain form
12216 -439927 -932885 -1169548 -789649 67116 764280 745794 148195 -375603 -417686 -148736
12206 -148736 50625 -9382 -251915 -375774 -76212 469001 530603 -317557 -1468229 -1946519
12196 -1946519 -1628433 -1145223 -747442 -138700 547877 624255 14585 -394278 -73598 323807
12186 323807 99882 -313533 -147436 363498 426586 95668 168142 785153 1163438 879799
12176 879799 525762 727492 1217999 1348525 1017073 587515 221749 -193561 -613419 -790908
12166 -790908 -654698 -386171 -105577 213733 479819 458397 154460 -71771 9671 143247
12156 143247 10249 -208472 -98595 279306 439904 243149 95871 264318 519271 686684
12146 686684 995643 1525267 1837766 1636846 1323889 1356602 1488568 1266106 869756 726793
12136G26793r6562n40865p59738k96526J64502J2818j64704L03218Q00531L86181
12126E35648n17225p22051j65303J39815j29454k08204K93572P18862M78982q0264
12116C44378l27991k03652n6293p6842j75723j72146J8320K53094K97001J82691
12106H2837J71616K53546J38492r7347k422L38538J92600n55276r24667l15868
12096g17951M41777L95876n4670n5695J55092j27459n59634k65691N43689Q43158
12086E98492M14740p5774l59621o53205p24882j92682M29598K88431l55760n02000
12076a132663m9178K48830K50915M35044O17241J76837n30852n34065K9655J32117
12066c56119k46595j46175M29094M48743j00697p4370N96366N78989m01768q72426
$$ plain form
12136 726793 630231 89366 -670372 -966898 -802396 -789578 -954282 -651064 149467 535648
12126 535648 18423 -703628 -868931 -729116 -858570 -1066774 -773202 -54340 424642 344378
12116 344378 16387 -187265 -243558 -320400 -496123 -668269 -649949 -396855 -99854 82837
12106 82837 254453 507999 646491 549144 546722 885260 1077860 522584 -402083 -717951
12096 -717951 -276174 119702 65032 9337 164429 36970 -522664 -788355 -244666 598492
12086 598492 1013232 937458 577837 -75368 -800250 -992932 -563334 -274903 -630663 -1132663
12076 -1132663 -1181841 -933011 -682096 -247052 370189 547026 16174 -517891 -488236 -356119
12066 -356119 -602714 -748889 -319795 128948 28251 -46119 550247 1129236 727468 -144958
12056a44958j68096L95736o1592m35477J88332P14660p301j042771r29932m4701
12046a536100L52156K96636N66197Q86280M98804j83694k19602J20775j00037
12037F81415o68835n82001J00475L50508m4266k78036n0883Q8679m2378J4208
12027d31114L03356K79912j43054l82350j94826J677k3031L6068L43472O00309
12017C90419N43224K07326l13488q23533q54990j72386O48127P92121K86686j19491
12007E84015n7389J51231K27995K81166L49704K23482j35046m49095n18512m12693
11997B44858k49937p6311O3458J56058K14567J10749l01494p36963o15142N5019
11987a135138M54756O5677n23310m84049O0449L83710K91040J61882J35066Q435
$$ plain form
12056 -144958 -313054 82682 21090 -414387 -226055 488605 481304 -561467 -1491399 -1536100
12046 -1536100 -1183944 -887308 -321111 565169 1063973 880279 660677 781452 681415
12037 681415 12580 -569421 -468946 -118438 -162704 -440740 -491623 -402944 -445322 -431114
12027 -431114 -127758 152154 9100 -373250 -568076 -566399 -589430 -553362 -209890 390419
12017 390419 933643 1140969 827481 3948 -851042 -1023428 -375301 416820 703506 584015
12007 584015 526626 677857 905852 1187018 1536722 1760204 1625158 1176063 657551 244858
11997 244858 -5079 -81390 -17932 138126 352693 463442 161948 -575015 -1190157 -1135138
11987 -1135138 -680382 -614705 -1138015 -1622064 -1561615 -1177905 -886865 -724983 -589917 -581482
11977e81482j85110j75201L3210J85469K19751K21928J17395j24618k10279N3424
11967d45513L05162J41490j79264j41820J59940K26173M8695R2234M19499N17956
11957A144552R7845m85547p49767o20710l36676j19021k1925O3649K41413L78120
11947d08067K44180l1970k4286K86584L42532j23607n43804l21995K51962M78742
11937A50271K89925J61401K20772J28480k07071m05550j99022J74094K75549l9173
11927E49676m53248m55892P3711N55228L28264l82417o41540r4070N33016N10231
11917E22959M6625k59517k82850j77684Q0618L84688K86562k75701n86094j63193
11907d23587L78462K56396k05931j63420K75389K21396m60360q28571k55743O72770
$$ plain form
11977 -581482 -766592 -941793 -908583 -723114 -503363 -281435 -164040 -288658 -498937 -445513
11967 -445513 -140351 1139 -178125 -319945 -160005 66168 114863 207097 626596 1144552
11957 1144552 1242397 756850 7083 -613627 -950303 -1069324 -1091249 -1027600 -786187 -408067
11947 -408067 -163887 -195857 -220143 66441 408973 285366 -258438 -580433 -328471 150271
11937 150271 440196 601597 822369 950849 743778 338228 139206 313300 588849 549676
11927 549676 96428 -359464 -285753 269475 597739 215322 -426218 -520288 12728 522959
11917 522959 569584 310067 27217 -150467 -69849 314839 601401 325700 -260394 -423587
11907 -423587 -45125 211271 5340 -158080 117309 338705 -121655 -950226 -1205969 -533199
11897e33199R61166L72956m75124q53479n56523K9890M04052M76842M77441M07804
11887G11826M2581m54008n23895r3939J82491m4274k20475J37735N32316K75034
11877E45392l27212m05204J62345O39264M75157j56014p37266q66724m96421l1909
11867a198592P1217j9027K49898P50614O72736p0005m49201L3287L99881j74942
11857B65866q55412n05049L53447M39533q7634j3760O96512Q09470j1471o20976
11847D70526l06709J80791M6122l43734l28914m7895M0134p439R1841K37420J78707
11836B10850J94l3520J27873L19094L46743R9933l00989n04761l34821n9354L1734
11825i7024O9680K53157L78151K08836j9565k6971n1722l45257n03672r2204M14214
$$ plain form
11897 -533199 427967 800923 325799 -527680 -1084203 -1054313 -650261 -173419 304022 711826
11887 711826 754407 300399 -223496 -317435 -134944 -179218 -399693 -261958 270358 545392
11877 545392 218180 -187024 -24679 614585 1089742 933728 196462 -670262 -1166683 -1198592
11867 -1198592 -1127375 -1146402 -896504 -145890 526846 456841 7640 40927 440808 265866
11857 265866 -589546 -1094595 -741148 -301615 -389249 -403009 293503 1102973 1091502 470526
11847 470526 163817 344608 390730 46996 -281918 -329813 -289679 -297118 -205277 32143 210850
11836 210850 211044 177524 305397 624491 971234 1071167 770178 265417 -69404 -128758 -97024
11825 -97024 -27344 225813 603964 812800 793235 766264 714542 369285 -134387 -226591 187623
11814A87623K27476m59842p45342m29996j44826j21781P8316M92282M88644r3858
11804e21304m83867j18514N04326O16106K32140r5218j52439j76336k84285k23318
11794g02709K37480Q19402Q48940P5202p62034o88738J37864N28225k6183o07813
11784a40364l75350J19656j3942m63700l49960K11177M20439K40130K53589L90462
11774B92137J09428l35572j68209M28272M65444j54262m64070j32413M2105l35108
11764b52248n72151k35214Q1451m8247o6423M51330Q78934N76548O613o3436J90914
11753I48071R6867k99807l60246L4371K75633o6110o68508q88036m79396J92712
11743a214449N56961M07470K3651k58906l45851j82975K83425O80696L42900o06978
$$ plain form
11814 187623 415099 -44743 -790085 -1220081 -1364907 -1486688 -1408372 -916090 -427446 -521304
11804 -521304 -1005171 -1123685 -619359 -3253 228887 133669 -18770 -195106 -479391 -702709
11794 -702709 -465229 354173 1203113 1278315 516281 -172457 -34593 493632 467449 -140364
11784 -140364 -515714 -396058 -410000 -873700 -1223660 -1012483 -592044 -351914 -98325 292137
11774 292137 401565 65993 -102216 326056 791500 637238 173168 40755 82860 -252248
11764 -252248 -824399 -1059613 -978162 -1026409 -1092832 -641502 237432 813980 820593 757157 948071
11753 948071 1044938 745131 384885 419256 694889 628779 -39729 -927765 -1407161 -1214449
11743 -1214449 -657488 -250018 -226367 -485273 -831124 -1014099 -730674 -49978 292922 -314056
11733c14056r53513J5178J178736R43921m36157j174020m84000N25292O91584
11724g035K60458L0958J02256J17072P634r7580j99267k44619o4645K40527L06896
11713D52655O5270j74110k61910l02778k21444J11864L37130l9612o81948o58683
11703a373566J66032Q08533N39062j64284m14121n8936L53326L18549j89236p08961
11693g23602o48337L2240O19862N42095J65998J34229L11062J93708l6445J01356
11683F92166K85397j23823p09394m50735M95389Q79174L33825j72877r5537l1714
11673A101871k98539k95309J51049K69536j50749k07364L54727L52432p68444
11664E09210j525571n07051J261977J701930O45199k73636k45837r3424m70473
$$ plain form
11733 -314056 -1267569 -1252391 -73655 870266 434109 -739911 -1223911 -698619 -7035
11724 -7035 253423 284381 386637 503709 511343 413763 214496 -30123 -94768 145759 452655
11713 452655 517925 343815 81905 -220873 -442317 -330453 6677 -32935 -714883 -1373566
11703 -1373566 -1207534 -399001 140061 -24223 -438344 -497280 -143954 174595 -14641 -723602
11693 -723602 -1371939 -1339699 -719837 -177742 -11744 122485 433547 627255 590810 692166
11683 692166 977563 853740 144346 -306389 189000 1068174 1401999 1229122 1133585 1101871
11673 1101871 803332 508023 659072 928608 777859 570495 925222 1277654 509210
11664 509210 -1016361 -1523412 -261435 1440495 2085694 1812058 1566221 1472797 1002324
11655A002324q18276n14403Q3680L02890J30817P816P9865J05612o5117k32509
11645H2699j12449K32642L79384Q0951l44850m42207k65248j76070j53658R2189
11635f26617L81593J89865l76253n19180M2075N49787L23607k44359l40115J13383
11625e06214N01057M11681Q584l30403l97010k46969p8373J3815J01956J53828
11615c68048k3500l13247j97924L83415O04253q1302q41381n41920M64510Q32275
11605h2869K85631j69146o5038k5955k73175j09911N75403P33241j31010r02629
11595a65458m60087O52951J120543O49397l5618l77169l41340o3173J83371O1042
11585A224459l07847l61925J5622K52063M9309j51235m5950J5343j47371p4254
$$ plain form
11655 1002324 184048 -330355 -246675 56215 187032 194848 274713 380325 315208 82699
11645 82699 -29750 202892 582276 663227 318377 -123830 -389078 -565148 -718806 -626617
11635 -626617 -245024 -55159 -431412 -950592 -908517 -358730 -35123 -279482 -619597 -506214
11625 -506214 -5157 406524 415108 84705 -312305 -559274 -637647 -623832 -521876 -368048
11615 -368048 -391548 -704795 -902719 -519304 84949 3647 -837734 -1379654 -915144 -82869
11605 -82869 202762 33616 -31422 -57377 -330552 -440463 134940 868181 737171 -165458
11595 -165458 -625545 27406 1147949 1797346 1761728 1384559 1043219 980046 1163417 1224459
11585 1224459 916612 554687 570309 822372 871681 720446 674496 689839 542468 468214
11575D68214M10342O50409J92589m08645m97235k87265k43221k32316m4217m6447
11565c7792m89208p66978k48098O28195R15108M56356j18766l70331l25895o4541
11555d21950L22665N34136L39143p4975l61811l98926k02155J82264M94978M01855
11545H15224J7653j62776n765J13283J2004p5938r7248k86319n30220m02502o166
11534f08770N1748k68767k96377J70610M93665L27501J45141K44001K14392j54024
11524C19120l99820k81380j82507k01797J20657P01163O73696j55194p55800m72680
11514f34542l8561j96243m27229j3972O11004O23757J44994j59380j74761j78623
11504d43556j66620o6277n4659r0152K09652P39137P57776O8056n38461n11110
$$ plain form
11575 468214 878556 1528965 1721554 1312909 815674 528409 285188 52872 8655 -37792
11565 -37792 -527000 -1293978 -1542076 -913881 1227 457583 338817 -31514 -357409 -421950
11555 -421950 -99285 434851 773994 699019 337208 -61718 -263873 -81609 413369 815224
11545 815224 832877 670101 664336 777619 789623 713685 616437 330118 -200102 -602604 -608770
11534 -608770 -557022 -825789 -1122166 -951556 -457891 -130390 14751 258752 473144 319120
11524 319120 -80700 -362080 -544587 -746384 -625727 75436 749132 593938 -161862 -634542
11514 -634542 -673103 -869346 -1296575 -1310547 -699543 -75786 69208 -90172 -264933 -443556
11504 -443556 -610176 -676453 -731112 -821264 -611612 127525 885301 953357 414896 -96214
11494i6214k69281k18275r6018J68994Q6597l33241l39576J70281L36148j0580
11484f01165Q6570P59528O81372n74016j337714l99728R22981Q96124J6877k45961
11474B04868J5849j44736m35181r567O12222L39509m38356n12864J7146J36929
11464b14181j10105R7752N62014L97072j83460j98498K70458L08985l9937N7193
11454I47293M73587K58345n71207r96145p04619l27541o9272M04940Q24550N50246
11444G90177j16390k79447J4569r858l03920j51588K87803J64693m06523m51049
11434d61533J02824L12235n6326k03230J62800L92478J80562m0130j13265l02918
11424b6503l90329P8675O58666M72266k08742k71334L45586N61138L8795l71497
$$ plain form
11494 -96214 -365495 -583770 -679788 -510794 -424197 -757438 -1097014 -926733 -590585 -601165
11484 -601165 -514595 244933 926305 352289 -985425 -1385153 -462172 433952 450829 204868
11474 204868 220717 75981 -359200 -368767 243455 582964 144608 -368256 -351110 -214181
11464 -214181 -324286 -226534 335480 732552 549092 350594 621052 930037 890100 947293
11454 947293 1420880 1679225 1108018 111873 -592746 -920287 -989559 -584619 239931 790177
11444 790177 673787 394340 408909 399051 95131 -56457 231346 396039 -10484 -461533
11434 -461533 -358709 -46474 -102800 -306030 -143230 249248 429810 389680 276415 -26503
11424 -26503 -416832 -338157 320509 792775 584033 312699 658285 1219423 1258218 886721
11414H86721k68255k53071n55446n67633j24658J22378j4048O8235M44174L66957
11404A05354k74132n31418K2198N30075K88849j64795q4203L08378L61192K497
11394E63995l63512m51165k15463J97714M78601N02860N20696N78621K09668o35070
11384A386945r98964k66676N70306K90274n25337m12878M71940O06977k94317
11375H28270q65472m44196K8190j07948j90947K87116O98174M92754J07682p213
11365H26410j26764m32561n21206k42674m0591n5943J22176N02633N15834O1537
11355F08851k91703l41929m23775m57683k2104N57883N02469K3914N5235M76692
11345F87850K51967m99120m27726O02498R51921j30259j135567o68223M47048
$$ plain form
11414 886721 618466 365395 -190051 -757684 -882342 -759964 -774012 -705777 -261603 105354
11404 105354 -168778 -700196 -677998 -147923 140926 -23869 -108072 200306 561498 563995
11394 563995 200483 -250682 -466145 -268431 210170 713030 1233726 1812347 2022015 1386945
11384 1386945 387981 121305 691611 981885 456548 43670 515610 1122587 828270
11375 828270 -37202 -481398 -453208 -561156 -752103 -464987 233187 725941 833623 826410
11365 826410 699646 267085 -254121 -496795 -537386 -593329 -471153 31480 547314 608851
11355 608851 317148 -24781 -448556 -906239 -928343 -370460 132009 155923 211158 687850
11345 687850 939817 440697 12971 615469 1567390 1437131 301564 -366659 80389
11336H0389O75835L0264m70486m82557k56603J95327P41782P59652R2055m12791
11326I52867j67929K04710J3055l49824k80082p0392j75429k27052J94800N63088
11316F57812K21428m21519n20206j05115J57482Q0638k2509p1502k07076l19534
11306e50101j96146R2688L45929M56219K71023k70578p07086m31971L20330O43541
11296b6152K94134n2008q2222k95705q06517q72491j85894M77918N45764M91283
11286e11890O97630O06749j37820p61265n47477j9128O7435n71K97440M85747
11276A76850p7515p91511n54653M58254R94701N37608j56940l08171M604K78423
11266E61650K32649p0138l24426k32237R1459J85777o7742k16784K4455K85434
$$ plain form
11336 80389 756224 786488 316002 -166555 -423158 -227831 513951 1273603 1365658 952867
11326 952867 784938 989648 1002703 652879 372797 302405 126976 -100076 94724 657812
11316 657812 879240 457721 -62485 -167600 -10118 70520 48011 -23491 -230567 -550101
11306 -550101 -746247 -653559 -307630 148589 419612 149034 -558052 -990023 -669693 -26152
11296 -26152 267982 215974 133752 -161953 -968470 -1840961 -2026855 -1548937 -1003173 -511890
11286 -511890 185740 792489 654669 -106596 -654073 -673201 -605766 -606337 -308897 176850
11276 176850 99335 -692176 -1246829 -788575 206126 743734 586794 278623 283227 561650
11266 561650 794299 724161 399735 167498 258957 444734 376992 160208 184663 470097
11256D70097J51106j96917l41931k19121k520J72789J09516l32962p72133n37773
11246a499849L40134R88772Q37174K71797j34019l31283l97204j79806K35054
11237A30770L98148K31850J82486L08444O6464n85749q31532l10480J63732q7054
11227c32921m87726k42348L39557M97028K97364K45714J87915l05991q37078n62873
11217a201359M19466J030276O26573k48483o59258l20604K61198L90561j02221
11208A96149o29029m81387K41275O82906L38771l07852m69859J6573O67055Q93984
11198A148586M27816m24588q64417l94517M37649O26932M3548m78460m13405j20419
11188a1275j4686K887L7346p5031k34553m8217L61627L17165k94799o68141k64196
$$ plain form
11256 470097 621203 424286 82355 -136766 -139286 33503 143019 -189943 -962076 -1499849
11246 -1499849 -1159715 -170943 666231 938028 804009 472726 75522 -104284 130770
11237 130770 528918 760768 943254 1251698 1318162 732413 -99119 -409599 -245867 -332921
11227 -332921 -820647 -1062995 -723438 -226410 70954 316668 504583 198592 -638486 -1201359
11217 -1201359 -781893 248383 874956 626473 -32785 -353389 -92191 298370 196149
11208 196149 -432880 -914267 -672992 9914 348685 40833 -429026 -412453 254602 1148586
11198 1148586 1576402 1151814 287397 -107120 330529 957461 1001009 522549 109144 -11275
11188 -11275 -25961 -23074 14272 -60759 -295312 -343529 18098 335263 40464 -627677 -891873
11177h91873M03992O21463L97520R9917j55414l04778j69097R3469j9691n37781
11167d62273q12451m69047P9607L78074M98457N50983L52418m9147k07624N800
11157a35203J72939R5552Q8890K53298K20574r1286k55444j44135j42890k95277
11147b32982j25089L76536N19086M9116l93399l51431j67523j23343P3353M69867
11137I4191M98219k3088m06187j81542J56255M2758k89610l60364j45996J92900
11127d22464N93205P90491M89978L2920L2314K48611j04558q41665r02350j90924
11117b74442J59826k30035l43152K62981N18476j71451o17864J94265J219416
11108G18020R10950l80424j090424p69417k63227p8532O3177K92741L58070K27448
$$ plain form
11177 -891873 -487881 133582 531102 631019 475605 170827 1730 95199 75508 -462273
11167 -462273 -1274724 -1743771 -1664164 -1286090 -787633 -236650 115768 66621 -141003 -135203
11157 -135203 37736 133288 222178 475476 696050 604764 349320 205185 62295 -232982
11147 -232982 -358071 18465 537551 586667 193268 -158163 -325686 -449029 -375676 94191
11137 94191 592410 569322 163135 -18407 137848 180606 -109004 -469368 -615364 -422464
11127 -422464 170741 961232 1451210 1484130 1516444 1765055 1660497 818832 -83518 -274442
11117 -274442 -114616 -344651 -687803 -424822 93654 -77797 -695661 -501396 718020
11108 718020 1628970 1248546 158122 -611295 -874522 -953054 -889877 -597136 -239066 -11618
11098a1618J03179l0500k57820l66975j52583J90152L68322L61323K21657o7543
11088C57594l41817l51223k05054j71503r2728K87888N83152K74915k26966j56541
11078d2283J93707l5396n66197l59867M02412N07885q4788j99824K46411P9814
11068A41874o47805m34640P62405R79557l58004j128920n9424J005707K73612
11059E34362r31174n78449N91268N76494m21174o76046j5458K96537K9726L3367
11049e60547L14116J47082k79086j87531J88763M3454l64147j51772M71741N18928
11039A41001m7317l58375j48932R1248J86635L17038L30262O2929r6789Q8418
11029E66118O0798n23493r06488l87988M25096O01632L03052J58240R9124j07286
$$ plain form
11098 -11618 91561 61061 -196759 -563734 -716317 -526165 -157843 203480 425137 357594
11088 357594 15777 -335446 -540500 -712003 -804731 -516843 66309 341224 114258 -42283
11078 -42283 151424 116028 -450169 -810036 -407624 100261 15473 -184351 62060 141874
11068 141874 -505931 -940571 -178166 801391 443387 -685533 -744957 260750 534362
11059 534362 -396812 -975261 -383993 192501 -228673 -904719 -920177 -623640 -593914 -560547
11049 -560547 -246431 -99349 -378435 -565966 -377203 -333749 -697896 -849668 -377927 141001
11039 141001 93684 -264691 -413623 -322375 -135740 181298 511560 574489 477700 566118
11029 566118 626916 103423 -803065 -1191053 -765957 -164325 138727 296967 396091 288805
11019B88805r1519K84096L20967k36345m55679J48176N35301n8081o42677k28187
11009a35143L86392J77001j99868J49540M43310k47308r12800k57108P71076M72203
10999F47295n96759o18510K62795L26565n74003q29615N8553P89708N69691P5095
10989A10815n9954M434J49607L95832K94369m05575q72080l78843K47094n3397
10979e67698n64515K7279J145808J107077q1950q31848n85501k48003j89983J36499
10969f52835O35560N33996o4721k92344r4005r4284j52987K80908P23704L18718
10959A141710m29098l89901J34293K098n44301l16465M88002N53667j34579l11224
10949A94202K03393L03508k21372m15067j34676k29461o34854l47313N37428P88862
$$ plain form
11019 288805 197286 481382 802349 566004 110325 258501 793802 735721 93044 -135143
11009 -135143 251249 428250 228382 377922 821232 573924 -338876 -595984 175092 647295
10999 647295 50536 -567974 -305179 21386 -552617 -1382232 -1323679 -533971 35720 110815
10989 110815 50861 55295 204902 600734 895103 489528 -382552 -761395 -514301 -567698
10979 -567698 -1132213 -1104934 40874 1147951 1066001 234153 -351348 -599351 -789334 -652835
10969 -652835 -17275 516721 452000 159656 65651 -28633 -181620 99288 822992 1141710
10959 1141710 712612 322711 457004 459102 -85199 -401664 86338 640005 505426 194202
10949 194202 397595 701103 479731 64664 -70012 -299473 -934327 -1281640 -744212 44650
10939D4650K38928K0046L99770L83081k55007n31977j95858j68823o66567p44707
10929a476464j43372K15006m62O964N00306O88698K86905m502N9152q8693m36305
10918c92767k32020M79098P03534J78193k71881k46459j70971j07097K95841O49650
10908H85121K53141l80023j72750M28640M906j176730j256752J39566J144330
10899a30551O02622k95147k06673L83124M11430l2215k62310j72718l7636J7148
10889B77074j20059m34862m35268K09273Q33783O35921L4076q5509l46m86534
10879D27549j012722m52677P12817R14659R2596k77560K29025M54158j02831n39777
10869D45237l65857j77060j97610O7315M58835K02520m72274n05752N7550J09969
$$ plain form
10939 44650 283578 303624 703394 1086475 831468 299491 103633 -65190 -731757 -1476464
10929 -1476464 -1619836 -1404830 -1405292 -1398328 -898022 -209324 77581 73079 132231 43538 -392767
10918 -392767 -624787 -145689 557845 736038 464157 217698 46727 -60370 235471 885121
10908 885121 1138262 758239 585489 1014129 1019035 -157695 -1414447 -1274881 -130551
10899 -130551 472071 176924 -29749 353375 764805 732590 470280 297562 259926 277074
10889 277074 157015 -277847 -713115 -503842 329941 965862 999938 914429 914083 427549
10879 427549 -585173 -1037850 -325033 589626 682222 404662 633687 1087845 985014 445237
10869 445237 79380 -97680 -295290 -227975 230860 433380 -38894 -544646 -487096 -377127
10859c77127m42158n33616k3J69069j80152r4394N31015O77154J42562j53327
10849b60997k3631k33582o83556l83385N27912P57325J08849k33177J12640K71200
10839d0402J5651P0028L70580J27515l15917R2967Q45066M55330o74030o65552
10829B81236M16780M98695p43293j142884J40005J119262M40121n28976m17185
10820F3761j0373k01935k26531M78208Q33538J08984o09720l82123J6321j80121
10810a09991k68269L31909P72300L49263k38023l33082m10289p06769m58510M82123
10800e89338R46909L64585k59948j74992j9663k84559l48783R3431L19277N9515
10790A06434K3394L17548J23637n00592m38896L25954M55608k71854m59299K87486
$$ plain form
10859 -377127 -819285 -1352901 -1352924 -1183855 -1364007 -1458401 -927386 -250232 -107670 -260997
10849 -260997 -284628 -518210 -1201766 -1585151 -1057239 -299914 -191065 -424242 -311602 -40402
10839 -40402 -24751 45277 415857 543372 227455 320422 1165488 1620818 946788 281236
10829 281236 698016 1196711 453418 -689466 -549461 569801 1009922 480946 63761
10820 63761 53388 -148547 -375078 103130 936668 1045652 435932 53809 70130 -109991
10810 -109991 -378260 -46351 725949 1075212 837189 504107 93818 -612951 -1071461 -589338
10800 -589338 357571 722156 462208 287216 267553 -17006 -365789 -272358 46919 106434
10790 106434 129828 447376 571013 70421 -368475 -42521 413087 141233 -318066 -30580
10780c0580N92276l5851k11390O59249J114969K36787p32510o24114j33312j58316
10770F77208k91862j03482q7276l56053j96514L23138K16777l95133k69893M87342
10760D252L76378n74092n65556O14457R41462k16220q73308k9611N80309j95627
10750F2444q62939k25555M48634K3985m13286R3180M82186k7493k49158N29162
10740a38840Q91199m9526p88348j51406N23751p4328q21797l41182N47605N58230
10730A55358J33710Q1456l1595m68697l37268M75728N56962m15004o94568M19016
10720a24902J090519J99170o18744j464P54292L07975l52121j74618r0841p50318
10710B38948q26369L18071R16051r0175r10282j36213O40956j09679r15189r7962
$$ plain form
10780 -30580 561696 525845 314455 973704 2088673 2325460 1592950 968836 835524 677208
10770 677208 385346 281864 194588 -161465 -357979 -34841 181936 -213197 -483090 4252
10760 4252 380630 -193462 -759018 -144561 796901 580681 -292627 -322238 258071 62444
10750 62444 -800495 -1026050 -577416 -553431 -966717 -873537 -391351 -418844 -668002 -138840
10740 -138840 752359 702833 -85515 -236921 286830 212502 -609295 -950477 -402872 155358
10730 155358 289068 370524 338929 -129768 -467036 8692 565654 150650 -543918 -124902
10720 -124902 965617 1164787 546043 544579 1298871 1606846 1254725 1080107 989266 238948
10710 238948 -587421 -269350 646701 556526 -353756 -489969 150987 41308 -873881 -971843
10700i71843J032977O08181m77953m60578J65667Q1115k58996L4254K62237k31231
10690b16170l95500M25425Q87736J81954k40837M65102O46717o29710j366389
10681b41672j77757R05723n114j212232o05239N45280K58331l79980L97522J348136
10671H32998N48737p78095m15990Q14118P46310j93896k38371K08387k60587r10036
10661C53575k51920Q12748M70801o59355p08395J33672L44620p3596j02844J06490
10651D25796q8998k46852K9554o6530p63983p20694M40682R40864l350n25747
10641e79258M39721J067691J75888m10349N19641J002645k95672j237706j76791
10632E05810Q03790j52531j093355r9624R25842J2098r66920l5065Q68369k70024
$$ plain form
10700 -971843 61134 669315 191362 -269216 -103549 -22434 -281430 -247176 15061 -216170
10690 -216170 -611670 -186245 701491 883445 642608 1107710 1754427 1124717 -241672
10681 -241672 -419429 486294 481180 -731052 -1336291 -791011 -532680 -912660 -515138 832998
10671 832998 1381735 603640 187650 1001768 1748078 1554182 1315811 1524198 1263611 353575
10661 353575 101655 914403 1385204 725849 17454 151126 495746 422150 319306 425796
10651 425796 336798 89946 119500 52970 -711013 -1431707 -991025 -50161 -53511 -579258
10641 -579258 -139537 928154 1104042 693693 1213334 2215979 1920307 682601 505810
10632 505810 1309600 1157069 63714 -35910 889932 902030 -64890 -99955 768414 498390
10622D98390j329596n9870J327321K07318j356176m56330J124069L67306j214462
10613h92030n97527R65691O01065n48987J72912J438100M72168j353601r82510
10604g24719N96361N10915m18796K76981J406127L82565j390270r25791O82870
10595C96243M56335p84558l74672P74480J94815r49237j86254J078588K27104
10586H32844j190183l51930J168001M15459j008566n3254J553870M90542j535177
10577C21606q88740R96092M78427j130666k69572J604152O77210j671071j304895
10568a187457Q99935J017294m00491n5925J102773J5183j703492n97906J451471
10559E41385N10069j588016n94476J753912R60907j406158p53121J447113N75671
$$ plain form
10622 498390 -831206 -891076 436245 643563 -712613 -1168943 -44874 322432 -892030
10613 -892030 -1489557 -523866 77199 -471788 -298876 1139224 1611392 257791 -724719
10604 -724719 -128358 382557 -36239 240742 1646869 2029434 639164 -286627 396243
10595 396243 852578 68020 -306652 467828 662643 -286594 -472848 605740 832844
10586 832844 -357339 -709269 458732 874191 -134375 -187629 1366241 1856783 321606
10577 321606 -567134 428958 907385 -223281 -492853 1111299 1788509 117438 -1187457
10568 -1187457 -287522 729772 329281 273356 1376129 1391312 -312180 -910086 541385
10559 541385 1051454 -536562 -1131038 622874 1583781 177623 -575498 871615 1447286
10550A447286j806912q55715J903400J351060j270034q94919J361660O86030j526066
10541C95790m90975J902576M85960k496562j182335K234748J252039k307818j588659
10532a795236K065959J846830j170111n60023K188018O61303k878045j261592
10524i02897K902312J449657l153321j907771L093315K261635k699533j811799
10516g68402L462256K768555k600916k001920L187124J927190l996151k677795
10508g00059L782901K367620m536818k530151N644058L620144n812932l915214
10500b080451O876195N291254o572902m371245R954741P611683r803136o669202
10492B36937J6937663J5253405j4291428l969819O9914934J14754034M3283676
$$ plain form
10550 1447286 -359626 -1215341 688059 2039119 769085 -125834 1235826 1921856 395790
10541 395790 -95185 1807391 2293351 -203211 -1385546 849202 2101241 -206577 -1795236
10532 -1795236 270723 2117553 947442 387419 2575437 3236740 358695 -902897
10524 -902897 1999415 3449072 295751 -1612020 1481295 3742930 1043397 -768402
10516 -768402 2693854 5462409 2861493 859573 4046697 5973887 1977736 -700059
10508 -700059 3082842 5450462 913644 -1616507 4027551 7647695 1834763 -2080451
10500 -2080451 4795744 10086998 3514096 -857149 9097592 16709275 6906139 236937
10492 236937 17174600 32428005 18136577 14166758 84081692 198835726 242119402
10485B42119402q2219272j22584414n3175208J7063309J3953693j6272476j1305592
10478a2420558J1069271P858538r388859o803826P486926N508505o572227m768672
10470h030902O079007M780650m999783m292275M360029M085215l382764l170088
10462d570911L301609K799265l206630k603103L043187K332379l183372k535269
10454d622845K988822K799861k339811k479926K086475K296115j660202j517122
10446b448633K306075J939192k018976j796934K096534J972620j952278k185420
10438b087820J474087J975872j206431j673364J099928J254901j523201j619141
10430b305169J210296J555878q82537j117123R54136P12263j405600o61022K059120
$$ plain form
10485 242119402 159900130 37315716 -15859492 1203817 15157510 -1114966 -12420558
10478 -12420558 -1351287 6507251 -2881608 -9685434 -2198508 3309997 -3262230 -8030902
10470 -8030902 -1951895 2828755 -2171028 -6463303 -2103274 1981941 -1400823 -4570911
10462 -4570911 -1269302 1529963 -1676667 -4279770 -1236583 1095796 -2087576 -4622845
10454 -4622845 -1634023 1165838 -1173973 -3653899 -1567424 728691 -931511 -2448633
10446 -2448633 -142558 1796634 -222342 -2019276 77258 2049878 97600 -2087820
10438 -2087820 -613733 1362139 155708 -1517656 -417728 837173 -686028 -2305169
10430 -2305169 -1094873 461005 -421532 -1538655 -584519 127744 -1277856 -1938878 120242
10421A20242J393946j921515j941526J322032J883719j006099j791775P40202
10413a200774J623419n21225j307521N45681J068052p75211j133263R48820J672581
10404I20559q2476q96074K70313M19925j001550r25675R02649J089554p31477
10395c4252j037441P42720J107485p29758j423266j0464N08491o83579p20252
10386b280316R96160J395017l05625j059326J76953O93225m88039q49298M63672
10377a257577R95384q4473m66558N49287P30578m36456o60504M35721M14086j003300
10367g83812j011113R31936J746014K01029j002744k33785N26901j63253p89749
10358e78576l23235r2819o17173l46377R68076J297044O3458o87137l4392L72567
$$ plain form
10421 120242 1514188 -407327 -2348853 -1026821 856898 -149201 -1940976 -1200774
10413 -1200774 422645 -98580 -1406101 -860420 207632 -567579 -1700842 -752022 920559
10404 920559 838083 -57991 212322 632247 -369303 -1294978 -392329 697225 -34252
10395 -34252 -1071693 -328973 778512 48754 -1374512 -1384976 -876485 -1560064 -2280316
10386 -2280316 -1284156 110861 -194764 -1254090 -1077137 -383912 -871951 -1721249 -1257577
10377 -1257577 -262193 -346666 -813224 -263937 466641 30185 -630319 -194598 219488 -783812
10367 -783812 -1794925 -862989 883025 1084054 81310 -152475 374426 211173 -578576
10358 -578576 -901811 -994630 -1611803 -1958180 -990104 306940 370398 -316739 -351131 21436
10348B1436l17199p69704l87747k48486l79611M56616J668937J148570p45583
10339D47229j263676O1036O84302l10669q38227L3170N24912j59270m00898M18719
10329h03372P20001L2903p1886O46868M18081q84466j089597K47455Q80012j1132
10319H4867m74751L24331O60135j15267k90333N61211M75793r63150j407888J0586
10309a134466J007443L16620k51091L69479M56660p89342j283417M4001J013280
10300b50833J40108p01328M6857P34148j15462q17706K51967J452925Q21446m70122
10290A092000n00765K7719l02349o49660K12820J092949L72228r41629r29155
10281e25842K2033L12254l315P4343K53634j99829o14380j21634M83845J60092
$$ plain form
10348 21436 -295763 -1065467 -1453214 -1701700 -2081311 -1624695 44242 1192812 447229
10339 447229 -816447 -755411 -71109 -381778 -1220005 -1186835 -661923 -821193 -1222091 -803372
10329 -803372 -83371 -50468 -122354 524514 942595 58129 -1031468 -784013 95999 84867
10319 84867 -389884 -65553 594582 479315 188982 750193 1225986 262836 -1145052 -1134466
10309 -1134466 -127023 189597 -61494 307985 764645 -24697 -1308114 -1264113 -250833
10300 -250833 -110725 -812053 -765196 -31048 -146510 -964216 -712249 740676 1562122 1092000
10290 1092000 591235 618954 316605 -333055 -120235 972714 1344942 403313 -525842
10281 -525842 -503809 -191555 -194870 -120527 133107 -66722 -681102 -802736 -318891 -158799
10271a58799l52844N6090P01719M03010k75235j65919K51462j49205q88690p16168
10261a294579J21751M15496J02776K0726J86279M3127j47223K21188P26314M92481
10251H88336k90736p06736n33747k29707m672J23097n9868m27659k99688M37109
10241a104271Q23094K54360m92864m99447j7503K89465M28393N37457K73663l75445
10231A16902o47610k11664J81090J9597j04232K48464M53531P1957k07752J36722
10221E7005M05983m0877n80466m66263r6415p7928q4523K64067M09691j25330
10211c35056o52419l62821L45410N86579K83167j07160l83625m08768K0893N24341
10201d89459L55883k41940j52832O48839P89454j51987p20475j5648P28241K97043
$$ plain form
10271 -158799 -511643 -455553 246166 649176 373941 208022 459484 310279 -578411 -1294579
10261 -1294579 -1172828 -757332 -654556 -633830 -447551 -404424 -551647 -330459 395855 888336
10251 888336 597600 -109136 -642883 -872590 -877262 -754165 -814033 -1241692 -1541380 -1104271
10241 -1104271 -281177 -26817 -519681 -1019128 -1036631 -747166 -318773 218684 492347 116902
10231 116902 -530708 -742372 -561282 -541685 -645917 -397453 56078 128035 -79717 57005
10221 57005 462988 422111 -158355 -624618 -721033 -798961 -883484 -619417 -209726 -335056
10211 -335056 -987475 -1350296 -1004886 -418307 -135140 -242300 -625925 -1034693 -1013800 -489459
10201 -489459 -133576 -375516 -528348 120491 909945 757958 37483 21835 750076 1047119
10191A047119m55438k63162L65799L25404m2829J40864M65924R1233n38057n43555
10181E93302k60446l69240l60510L75076R12352J90227q37507n56363N20973N81917
10171G89781l59857n74528K91931O96355M3046l17476L65566Q23163k2457j139546
10161E95978r99633J03932P03977L68059k1204J36566L82235R5286n62078r01593
10151i8475o11732j06605M6527j64283k93326j23775J37627L26141M61365L76282
10141e0254j36680o50141l68259N93775J052172L95182m76157n23944m7654O9710
10131a42250j71958j85665L5723R5505P5473K34165K59332j54283m27621P2401
10121c09178P24925M49090m57996o67403N1856M96509K3182n41974m49115j60903
$$ plain form
10191 1047119 591681 328519 694318 1019722 976893 1117757 1583681 1674914 1136857 593302
10181 593302 332856 -36384 -396894 -21818 890534 1080761 243254 -313109 207864 789781
10171 789781 429924 -144604 147327 843682 886728 569252 934818 1757981 1735524 595978
10161 595978 -403655 -299723 404254 772313 751109 887675 1269910 1365196 803118 -98475
10151 -98475 -710207 -816812 -770285 -934568 -1227894 -1351669 -1214042 -887901 -426536 -50254
10141 -50254 -186934 -837075 -1205334 -611559 440613 835795 359638 -164306 -211960 -142250
10131 -142250 -314208 -499873 -464150 -368645 -293172 -59007 200325 46042 -381579 -309178
10121 -309178 415747 864837 406841 -260562 -208706 287803 310985 -230989 -680104 -841007
10111h41007k32986k06876M30515J050814P45784j39636m51209O141K17435m09452
10101A69523j105762q79488O7043O86152N23470J30903P8321K12641J51316k7772
10091F347n1045l5839k39508m37407j98257K92893L85925Q254j71435J61766M43062
10080A64756J80951k39906k37977M8879J38421L5403K5969J0247k48006m73824
10070e95087k36753J96719J46689l51539m80773J21771P58373O49866O991l11790
10060i5533P1769O66955P62071K04209m68901n88621o8992M71638M10887j35150
10050A230332m83356k48362K53736M96618L27196n8051m24917n90771m40073j00244
10040c7892O7117q6908k01088J32628O94477Q16498K86639l20448m04181q8956
$$ plain form
10111 -841007 -1073993 -1280869 -850354 200460 946244 806608 355399 361540 578975 169523
10101 169523 -936239 -1815727 -1748684 -1062532 -539062 -408159 -329838 -117197 34119 6347
10091 6347 -44698 -80537 -320045 -757452 -955709 -662816 -276891 -268637 -440072 -278306 164756
10080 164756 345707 105801 -132176 -83297 55124 90527 116496 126743 -121263 -595087
10070 -595087 -831840 -635121 -488432 -839971 -1320744 -1198973 -440600 209266 216257 -95533
10060 -95533 -23764 643191 1405262 1609471 1140570 551949 482957 954595 1365482 1230332
10050 1230332 746976 498614 752350 1248968 1576164 1518113 1093196 502425 62352 -37892
10040 -37892 29225 -57683 -258771 -126143 568334 1384832 1671471 1351023 946842 857886
10030H57886Q3543m8738j76011r5581L8450N2361k6124j43486k91931l38331j18324
10019b06286K02339K21921q7085k36599P3237M67596M35309N0418k23624k12384
10009D84842r4815L5734K16485L02957P3849l32433m93454k79027K743R3782N8824
9998F9487o123j43574k69314j35585K21121L76359J45832n8759J25021L73874
9988F98339J87902k69581m64656l98093m58406m92344L4261Q49401R24287J08786
9978G19896l82821J79141P74105K38213q06120r55833k45847J81772J52335M76658
9968C31499J072921Q97511q7987o43857k99453K4457j29360m5550M30649K93843
9958A844673o63345j105117l65907L62809J74619l1926N25351Q94328K29650m77529
$$ plain form
10030 857886 941429 892691 716680 621099 659549 711910 685786 542300 250369 -87962 -206286
10019 -206286 -3947 217974 130889 -105710 -32473 435123 870432 920850 697226 484842
10009 484842 390027 425761 642246 945203 1019052 686619 193165 -85862 -83119 10663 69487
9998 69487 63364 -80210 -349524 -485109 -263988 112371 258203 199444 324465 698339
9988 698339 886241 616660 152004 -246089 -704495 -1196839 -1162578 -313177 611110 719896
9978 719896 337075 516216 1290321 1528534 722414 -233419 -479266 -297494 -145159 331499
9968 331499 1404420 2301931 2213944 1570087 1270634 1295091 1165731 1120181 1550830 1844673
9958 1844673 1181328 76211 -289696 73113 247732 215806 741157 1635485 1865135 1387606
9948A387606k02280K18377k21706p08362k08239M93081L30682l379L96887O77138
9938B159805l6989n88900J78235J032187M83259m52145k70926J24935n30192r54459
9928A144810K58374J360330K91601j210143m31980J317463J021063n45726m92323
9919B713469O57140L00215q92444m22178P40322O8185r72960M27172K134871N44401
9909E298193j757039m8780K959240J374251k088217k89951L855942J483533l803392
9900F983780M38420J0050422L746555k1798257l7495856k0104923J1893043K2854558
9892b3432258Q739043l636444J44871O620920L409833j925081j9744L691011J621668
9883d786181j865226k88861K596271R10165k121828r49458J865143J193048j030117
$$ plain form
9948 1387606 1185326 1403703 1181997 473635 265396 758477 1089159 1085780 1482667 2159805
9938 2159805 2122816 1533916 1712151 2744338 3227597 2775452 2504526 2629461 2099269 1144810
9928 1144810 1403184 2763514 3055115 1844972 1412992 2730455 3751518 3205792 2713469
9919 2713469 3370609 3670824 2778380 2356202 3096524 3164709 2191749 2618921 4753792 5298193
9909 5298193 3541154 3492374 6451614 7825865 5737648 5447697 9303639 10787172 6983780
9900 6983780 7422200 17472622 21219177 -579080 -38074936 -58179859 -46286816 -23432258
9892 -23432258 -14693215 -18329659 -18184788 -11563868 -8154035 -10079116 -10098860 -6407849 -4786181
9883 -4786181 -6651407 -6940268 -4343997 -3433832 -5555660 -6505118 -4639975 -3446927 -4477044
9874d477044l01691J713712R73865j015543n24437J140296O00904r35985m21981
9865c247904R19041K69682j063205l56512J028565L78396r51115k32487J205999
9856b049540N76821q73251k64556J324588R16333p52464q04293L79351L01256
9847a245755o94632m05534O98474N04155m93689l27154L99670j45135j027986
9838b737586j87896J290041Q85416o22918n24445Q26239Q15804n22897q33120
9829a611362J7412N5941o30138j33147J172513R67443o50824j172234j14355M10798
9819a687953k36362l41220N94396R42963J69906k62289K07947L72250j96705m26910
9809h63977o320J36332j26468K8537M09698N3910o26395l32183O13737O59530
$$ plain form
9874 -4477044 -4778735 -3065023 -2091158 -3106701 -3631138 -2490842 -1889938 -2825923 -3247904
9865 -3247904 -2328863 -2059181 -3122386 -3478898 -2450333 -2071937 -3023052 -3255539 -2049540
9856 -2049540 -1472719 -2345970 -2610526 -1285938 -369605 -1122069 -1926362 -1547011 -1245755
9847 -1245755 -1940387 -2345921 -1647447 -1143292 -1636981 -1964135 -1564465 -1709600 -2737586
9838 -2737586 -2925482 -1635441 -750025 -1372943 -1897388 -1071149 -255345 -778242 -1611362
9829 -1611362 -1593950 -1538009 -2168147 -2301294 -1128781 -161338 -812162 -1984396 -2098751 -1687953
9819 -1687953 -1924315 -2265535 -1671139 -728176 -558270 -820559 -612612 -240362 -437067 -863977
9809 -863977 -870297 -733965 -860433 -831896 -422198 -368288 -994683 -1326866 -713129 -53599
9799e3599k36594o54901k74942q043Q6695N79942Q21080j12907j123749n01977
9789a478995Q66174O76659p91533j054594L11001J085520L17894m09287j42712
9780f19873O7147l25474k98145M55436P14774K6500m85816k83216j86684m46030
9770a381381k33998M24783M05403l55477n96645m6846J62352k32434j72375N08053
9760a518565O65523Q4511j11604K90883K19334l87356k85397N55615O01521m12003
9750b97538p81511J66520Q26750J41661o32670k57917M60499L51285j90222k81645
9740d94788o5406L0733K04636M79449K85127l55472n31615j3314K59283j33750
9730c35117l72629J74K52008q0131l46841r5476J51608O4326J09879M22993M07954
$$ plain form
9799 -53599 -290193 -945094 -1220036 -1228079 -1141384 -561442 259638 146731 -977018 -1478995
9789 -1478995 -612821 63838 -727695 -1782289 -1471288 -385768 -67874 -477161 -619873
9780 -619873 -552726 -878200 -1176345 -720909 -6135 20365 -465451 -748667 -935351 -1381381
9770 -1381381 -1615379 -1190596 -785193 -1140670 -1737315 -1784161 -1621809 -1854243 -2026618 -1518565
9760 -1518565 -853042 -768531 -880135 -589252 -369918 -757274 -1042671 -487056 114465 -297538
9750 -297538 -1079049 -912529 -85779 55882 -576788 -834705 -374206 -22921 -213143 -494788
9740 -494788 -560194 -529461 -324825 154624 439751 84279 -447336 -460650 -201367 -335117
9730 -335117 -707746 -707572 -455564 -535695 -882536 -978012 -826404 -762078 -652199 -229206 178748
9719A78748k8104j87888N8688L5514k87344j40624L98460K69702o21367j018983
9709a343198l95114K86071M02968N10366P68393M04409n31307p48256Q1400N46225
9699a8043j08092o53540j02515N34478J02672o62917n01349K45322M15344l5051
9689g83691l08722k22787j22840L6328M30613P01719M41488j17180n23813o76561
9679a145446n21541P6067P31604O61460j26637o26371k64616L51493N36055M11731
9669H3799K53935n1883m01334k95630K14267L45474j73790o12004m40725q2624
9659a160515J1467Q6475L83013N76275L85091L485l64367o56733n69250O8652
9649a236407N59666J13172o64910m11833P56202J181679K00579q14105n83889
$$ plain form
9719 178748 150644 -37244 21444 56958 -230386 -371010 27450 297152 -324215 -1343198
9709 -1343198 -1738312 -1452241 -1049273 -538907 229486 633895 102588 -645668 -564268 -18043
9699 -18043 -126135 -779675 -882190 -347712 -245040 -907957 -1409306 -1163984 -748640 -783691
9689 -783691 -1092413 -1315200 -1438040 -1401712 -971099 -269380 172108 54928 -468885 -1145446
9679 -1145446 -1666987 -1590920 -859316 -197856 -324493 -950864 -1215480 -863987 -327932 83799
9669 83799 337734 285851 -115483 -411113 -196846 148628 -25162 -637166 -1077891 -1160515
9659 -1160515 -1149048 -1062573 -679560 -103285 281806 285291 -79076 -735809 -1305059 -1236407
9649 -1236407 -676741 -563569 -1228479 -1640312 -884110 297569 498148 -315957 -899846
9640h99846K91853N10671p2377n97066m54386K20050P70658N22677l77536p88698
9630h74000m1786Q40285N42847m32667n89568Q2505L01924r9193m9691N26191
9620B06847N59873O0133J72540P43211L09056r76982j077689M06480J170871m8298
9610A526042j290530o40959O85128N75537o05575j053293m41183K50830O28642
9601c65361P57730K46907q33124j186733p9037J175700J079322J85821j36241
9592H44984q955l28139p89706n42757O176p7689m01387L4525Q16485O67703l44540
9581a23300q92769m69009J82743N30301O98373O18241J02470l67489j83151K43936
9571C40346P9604m44388m08385J52240L24627n3649j91092J59421K81631j67620
$$ plain form
9640 -899846 -607993 -97322 -169699 -766765 -1221151 -1001101 -230443 292234 -85302 -874000
9630 -874000 -915786 -75501 467346 34679 -554889 -472384 -170460 -269653 -319344 206847
9620 206847 766720 826853 999393 1742604 2051660 1074678 -3011 403469 1574340 1526042
9610 1526042 235512 -405447 279681 855218 249643 -803650 -1244833 -994003 -365361
9601 -365361 392369 639276 -193848 -1380581 -1459618 -283918 795404 981225 844984
9592 844984 836029 507890 -281816 -824573 -818397 -896086 -1297473 -1262948 -446463 221240 -123300
9581 -123300 -1016069 -1485078 -1302335 -772034 -73661 544580 647050 279561 96410 340346
9571 340346 419950 -24438 -432823 -280583 44044 -9605 -200697 -41276 240355 72735
9561G2735n29514k56411K32534K70630j05576l53637j94746J41330K77369J29063
9551c16223k3123M5103J15320j27368m46580k84282L26531P04694N08143J25287
9541F27502q0722k14322l40550k80706j37624k63739n01471k80409L29529N73126
9531e69386K42236k5060P8360J12735o6797J613L18693K58535j50112r3999M24746
9520E31564L18589o31533j087377k75326O89167O31058P3942R042J98338j9684
9510D37780l55641k83229j38252l06557k97028K07474M07061k73201r25260n51459
9500b078312K66206M46757J99394K90360M31406l6079o03742l43769L91617N53825
9490d82337J79532R7341K94289O3894n22306o86549k84036J29124L08717L41015
$$ plain form
9561 72735 -456779 -713190 -480656 -210026 -315602 -669239 -863985 -722655 -445286 -316223
9551 -316223 -339346 -294243 -178923 -306291 -752871 -1037153 -710622 -5928 502215 627502
9541 627502 546780 332458 -8092 -288798 -426422 -690161 -1191632 -1472041 -1142512 -569386
9531 -569386 -327150 -352210 -273850 -161115 -227912 -226299 92394 350929 200817 106818 531564
9520 531564 850153 218620 -868757 -1144083 -454916 176142 250084 259126 457464 437780
9510 437780 82139 -201090 -339342 -645899 -942927 -735453 -328392 -601593 -1526853 -2078312
9500 -2078312 -1812106 -1365349 -1165955 -875595 -444189 -480268 -1084010 -1427779 -1036162 -482337
9490 -482337 -302805 -205464 88825 152719 -369587 -1056136 -1340172 -1211048 -902331 -561316
9480e61316O3705m67475m85223L57448R95149L99749o25831o05763K28051M24784
9470b76722j80482l15791L99973Q28623L37370k13979q7320J53089j66875n87166
9460a09280l47560K92697M51059m0992m39547j69829M08652N10993j8905n15951
9450B1337m63438k25670l52419n58485k09515M27301M88385J4146q9704K96184
9440f51878K90834k34943k43320N38929Q73950P7030p18876m56617J53510R7484
9430b73897j79241R2543L80840n6615n62417j99922M79173M28289k6543K0764
9420A02974K53423j23674o07562k14468N51217M33649l42296m66761J54978L71758
9410A13238j06591l64371k7495K74743K33387J87636J45171j68794l95560j7658
$$ plain form
9480 -561316 -497611 -965086 -1450309 -1092861 -97712 302037 -323794 -929557 -701506 -276722
9470 -276722 -457204 -772995 -373022 455601 792971 578992 491672 644761 477886 -109280
9460 -109280 -456840 -164143 286916 245924 -193623 -363452 45200 556193 537288 21337
9450 21337 -442101 -667771 -1020190 -1578675 -1788190 -1360889 -872504 -858358 -948062 -651878
9440 -651878 -361044 -595987 -839307 -300378 573572 650602 -68274 -524891 -371381 -273897
9430 -273897 -453138 -360595 20245 -36370 -598787 -798709 -319536 108753 82210 102974
9420 102974 356397 232723 -374839 -589307 -38090 395559 53263 -413498 -258520 113238
9410 113238 6647 -357724 -385219 -110476 122911 310547 455718 286924 -108636 -126294
9400a26294M44345J04629o35345n83551K48086O55729J97988l23670l56729k00476
9390e75288q1483J10249J64175k02411n37543k13885M29045O09716L89071K64402
9380C56048M0226n52518p73491J1672P97312L15548o77192n20664M76190N79933
9370E3064k69564m30406L58687N02039m37201q37436P7011Q37314L07790m79784
9360c18486l11276K54157K34713o3201q358L9919l48249n94198j25131N21757
9350g18353O17905L43187J29094j19714l77462j25147N77960P30483n3901o98128
9340C05924k96760M28956L44740l25363n55459j71989J38004N1280r2106O30K21290
9329D9147K85889r382n31169p39441k88346L69773N54242L37780J99419K0674
$$ plain form
9400 -126294 318051 422680 -212665 -796216 -548130 107599 305587 -18083 -374812 -575288
9390 -575288 -656771 -546522 -382347 -584758 -1122301 -1336186 -907141 -297425 91646 356048
9380 356048 396274 -156244 -929735 -918063 -120751 194797 -482395 -1003059 -526869 53064
9370 53064 -216500 -646906 -288219 213820 -223381 -1060817 -983806 -146492 161298 -318486
9360 -318486 -629762 -375605 -140892 -204093 -212451 -172532 -520781 -1114979 -1240110 -718353
9350 -718353 -100448 242739 371833 252119 -125343 -250490 327470 1057953 1004052 305924
9340 305924 9164 438120 782860 457497 -97962 -269951 -131947 -80667 -172773 -172143 49147
9329 49147 335036 325654 -205515 -944956 -1233302 -863529 -309287 28493 227912 248586
9319B48586n08262q04818j04257R21594Q67037q5526l45045L85681N91993l26165
9309H40818r01640j43886P18327L35919o04777p74783l14414o4239N5375M02338
9299d50962M88157k4004k79217L21106P38145j4824r02159m58765N95823M71853
9289D85153o08204p66852L06912Q61105O8582p16239l78389K39759P0050l47236
9279g85359m8234N24116K98209n32360p82888j46028M56587L97513J28653J63425
9269c26366J94356j98042n93619k84624M82881O77997m882o05743k69541N11782
9259d15801O66888Q0897m23679l88898j65904j04727r8211l4532j0985L0866K50703
9248f13383M04779P5599m90280n26791O9650M73916J61009l35829l15599R1240
$$ plain form
9319 248586 -259676 -1064494 -1168751 -247157 619880 534354 189309 574990 1166983 840818
9309 840818 -60822 -204708 513619 849538 244761 -530022 -844436 -908675 -853300 -450962
9299 -450962 37195 13191 -266026 55080 793225 778401 -123758 -582523 13300 485153
9289 485153 -123051 -889903 -582991 278114 346696 -369543 -747932 -508173 -438123 -785359
9279 -785359 -833593 -309477 -11268 -543628 -1326516 -1472544 -1015957 -618444 -489791 -326366
9269 -326366 -132010 -330052 -923671 -1208295 -725414 -47417 -52299 -658042 -927583 -415801
9259 -415801 251087 331984 -91695 -480593 -646497 -751224 -849435 -883967 -894952 -864086 -613383
9248 -613383 -208604 -133005 -623285 -1150076 -1080426 -606510 -445501 -781330 -1096929 -1005689
9238a005689L08297J87152J540o8475l8815L3039N3171j6372m74K12840K97611
9227c6175q0297n24154l07702M49108Q15222M17707o9830p8482P1111o4895k91808
9216B99805k64713p0248J25717L83479N56453K35572m64913p82458m17827l1684
9206d30817j32338k62314P0718M27867K05847k69201l02509j0938l1044l59093
9196a093822l84871L9859L80204K97478Q2075P3338J55088M8195j93398k26585
9186h22439Q6456L99684K88989p8528p0614L96747N12077k12489r28676n75747
9176a004540L86017N74073j36103m47323J56654N52029q9713q96051p38539L6450
9166a607046L76291J62098Q716P8098J16777J77954L80275L82970o0437m67933
$$ plain form
9238 -1005689 -697392 -510240 -508700 -577175 -615990 -582951 -529780 -546152 -546626 -333786 -36175
9227 -36175 -116472 -640626 -948328 -499220 316002 733709 663879 585397 656508 591613 299805
9216 299805 35092 -35156 90561 474040 1030493 1266065 801152 18694 -399133 -430817
9206 -430817 -563155 -825469 -754751 -326884 -121037 -390238 -692747 -703685 -734729 -1093822
9196 -1093822 -1478693 -1438834 -1058630 -761152 -679077 -605739 -450651 -402456 -595854 -822439
9186 -822439 -735983 -336299 -47310 -125838 -196452 200295 712372 499883 -428793 -1004540
9176 -1004540 -618523 -44450 -180553 -627876 -471222 80807 -8906 -904957 -1643496 -1607046
9166 -1607046 -1230755 -1068657 -1059941 -981843 -865066 -687112 -306837 76133 15696 -452237
9156d52237l46007n4553j25794k40422J63401P08735N75433r6130l69770J9200
9146b18144L65623J93751j46747k16878o8292P6622J26503o157l24625n10460
9136g28804k57911J73733K46080n2951k11658Q200K95781L41562J86841j8364
9126a7491j80077j60922Q3168K72412J14225j75741j04173L31912N69048K71639
9116A004000k12954l70899j76943k2745j74323m74277n30757j61014L29725M08015
9106c82172n2598n46395n29402r7380J85834N3250j71672o8850L49531P03404
9096e56450O69108K39382l06898n73296l00478L43431P57480M69016j98419l48591
9086A94285L11250Q76432L90599o72083r33591j38723M08859j48821q76321n46700
$$ plain form
9156 -452237 -798244 -852797 -978591 -1219013 -1055612 -346877 228556 132426 -237344 -218144
9146 -218144 147479 341230 194483 -22395 -90687 -14065 112438 106281 -218344 -728804
9136 -728804 -986715 -812982 -566902 -619853 -831511 -823311 -527530 -185968 873 -17491
9126 -17491 -197568 -358490 -275322 -2910 111315 -64426 -168599 163313 732361 1004000
9116 1004000 791046 420147 243204 220459 46136 -428141 -958898 -1119912 -790187 -382172
9106 -382172 -434770 -981165 -1510567 -1607947 -1422113 -1368863 -1540535 -1609385 -1259854 -556450
9096 -556450 112658 352040 45142 -528154 -828632 -485201 272279 741295 542876 194285
9086 194285 505535 1381967 1772566 1100483 166892 28169 437028 288207 -588114 -1134814
9076a134814M17965O80326P9341l21528k7955L32070K59990K4280j10751k67741
9066f8817l69161r6544L68273M32118P7754j06360P244o2145l50241k90672J51294
9055c07257K67680j13338k15193L35562P71354M08110k86691n04501k24487P4433
9045B05672J70106M6900k78434m64934o7721N97675O10885j53971o76420k96904
9035c07146L63026N33635L74541K56967m4450o12434p42028o302P59622N44307
9025A119738l35209p82274n12024j41971k8153O7192K85213L94502J95528k39731
9015B2811o38464o29988q3024N28809N80195K09074J19296L76740K88146l01671
9005D71924o28303l17444L444p5317l3384M18481O09807J53845j93391J43939
$$ plain form
9076 -1134814 -716849 -36523 42818 -278710 -306665 25405 285395 309675 198924 -68817
9066 -68817 -437978 -534522 -166249 265869 343623 237263 244507 182362 -167879 -458551 -307257
9055 -307257 -39577 -152915 -368108 -32546 738808 1146918 860227 355726 131239 205672
9045 205672 375778 422678 144244 -320690 -388411 209264 820149 666178 -10242 -307146
9035 -307146 55880 589515 964056 1221023 1176573 564139 -177889 -184191 575431 1119738
9025 1119738 784529 2255 -509769 -651740 -679893 -612701 -327488 67014 262542 22811
9015 22811 -615653 -1245641 -1328665 -799856 -219661 -10587 108709 485449 773595 471924
9005 471924 -156379 -473823 -470379 -545696 -579080 -160599 449208 603053 409662 553601
8995E53601M44168n2575p59703p60649l04531j04710j3927L45390M68452j33706
8985c18190o67093j75215O77831N22535m38570p06367J19518P99912M28716m11541
8975a68464p42345l79302K40523O36833N48224J86840J32090M82464N15198j93252
8965A258809q89446p05201M811L34949K29347J59453L0869l87062n29463J27514
8955c65420Q02539M20799n19153o20596J57177N25163K5600m43838l17152m2738
8945c77619O3724K20614K87314j47546o66441m13276L27782M37778n9791j2086
8935c39547O29608M70088q33916j609577o93675P14423R54370K94530M1028L29833
8925d2835L01981j83906m26779j67240J44474K25576K31003K49946K03590J28080
$$ plain form
8995 553601 997769 945194 185491 -575158 -879689 -984399 -998326 -652936 -184484 -318190
8985 -318190 -985283 -1160498 -482667 39868 -398702 -1105069 -985551 -185639 243077 -168464
8975 -168464 -910809 -1290111 -1049588 -412755 135469 322309 454399 936863 1452061 1258809
8965 1258809 369363 -335838 -331027 3922 233269 392722 423591 36529 -492934 -365420
8955 -365420 437119 857918 338765 -281831 -124654 400509 426109 -17729 -334881 -377619
8945 -377619 -313895 -93281 194033 46487 -619954 -1033230 -705448 -267670 -327461 -339547
8935 -339547 290061 760149 -73767 -1683344 -2377019 -1662596 -708226 -413696 -372668 -42835
8925 -42835 259146 75240 -351539 -518779 -374305 -148729 82274 332220 535810 663890
8915F63890N8597j66190n55229o97671k86424L35867N59748K52325j79509k94720
8905c09316p557L44948K97585j37079l24159R2559M42904n7797q98823q42753
8895a399488J33954P23541L28828j38745l775N0627n27941q76844j54548P93510
8885a070881O57182j86646l01871M57607Q34909L06684k34762j50177L6110j33042
8875B15113j79772K53497N43339J35365l79046k03390K62481M5313p15192q54209
8865h76501K6572R12334Q27982P2400m69615n45744m56361k76990J18247N22508
8855a45168N66573L27279J94308J93188j2283m64063p84210p27589l95181P4721
8845a172425N35591O28545J44770m40965m47876J3496K39861J14729K02403N59238
$$ plain form
8915 663890 722487 556297 1068 -696603 -983027 -647160 -87412 164913 -14596 -309316
8905 -309316 -316873 28075 325660 188581 -135578 -43019 399885 342088 -556735 -1399488
8895 -1399488 -1265534 -541993 -213165 -351910 -355685 -305058 -832999 -1709843 -1864391 -1070881
8885 -1070881 -413699 -600345 -902216 -444609 390300 696984 462222 312045 348155 215113
8875 215113 35341 288838 832177 967542 588496 385106 647587 692900 -22292 -876501
8865 -876501 -849929 62405 890387 962787 493172 -52572 -508933 -785923 -667676 -145168
8855 -145168 421405 748684 942992 1136180 1123897 659834 -124376 -851965 -1247146 -1172425
8845 -1172425 -636834 -8289 136481 -304484 -752360 -738864 -499003 -384274 -181871 377367
8835C77367M85532j86180n85406j54247M17423L03582k04360l16587L8892L64443
8825E40459M00650J32946m36520r33606o98656J59569N68644M4344m37701J7684
8815f42187P33404O06151q0672k74502N3278R1313k75887m41162k74947j28890
8805f34101O0107N01477P44509L33166j49489L8241L60667r7762p91473m95029
8795a29687M05676L61815o35545q82694J75480R70794M03101m73777l53814L29778
8785A71127M78707J23179n9378n6546k30400m27293l26167j06184k9004P7324
8775c84635L16480L27374n0114l34359j45774K00514K71541Q6035j96944m76939
8765c86821m01226K96623R69109O08697n12948r60017k70974L63980J43150r8668
$$ plain form
8835 377367 862899 676719 91313 -62934 354489 658071 453711 137124 176016 540459
8825 540459 941109 1074055 637535 -296071 -994727 -835158 -266514 -222170 -659871 -642187
8815 -642187 91217 697368 616696 342194 395472 486785 210898 -230264 -505211 -634101
8805 -634101 -573994 -72517 671992 1005158 855669 893910 1254577 1156815 365342 -129687
8795 -129687 275989 637804 2259 -880435 -704955 265839 668940 195163 -158651 171127
8785 171127 649834 773013 713635 657089 426689 -604 -326771 -432955 -461959 -384635
8775 -384635 -68155 259219 209105 -125254 -271028 -70514 201027 287062 90118 -386821
8765 -386821 -788047 -491424 477685 1086382 573434 -386583 -657557 -293577 -150427 -249095
8755b49095M10410Q58789K81519o61338p51356j61763Q8826q0473j9067K10143
8745g3405L4427l47516k68265Q1999k8259m06346j50214O86118R82787K99128
8735H10454m78611n49076j93340K4165J03542J86237Q0381k65203m24422j25038
8725h30911K63511L02181J18573O0589R3204j3293j70630j08709J17421J75984
8715G920j1737j42690j792K13468J85453q3873l16179l46804k50814j00836J39487
8704g08397M03074M66801K77598R5062J05282J33366j4638j90518j98105j70178
8694A99347k63634k63407L0382K91787J22416k15836j82516J14080J27841j09563
8684a49103n5960K53304J47743m46656o90015j58026L95596J94844l77537m65746
$$ plain form
8755 -249095 161315 1020104 1301623 640285 -111071 -272834 -184008 -264481 -283548 -73405
8745 -73405 -38978 -386494 -654759 -572760 -601019 -1007365 -1157579 -471461 511326 810454
8735 810454 331843 -217233 -410573 -386408 -282866 -96629 -16248 -281451 -705873 -830911
8725 -830911 -567400 -265219 -146646 -86057 7147 -6146 -176776 -285485 -168064 7920
8715 7920 -3817 -146507 -148299 65169 250622 166749 -149430 -496234 -747048 -847884 -708397
8704 -708397 -305323 161478 439076 534138 639420 772786 758148 567630 369525 199347
8694 199347 -64287 -327694 -297312 -5525 116891 -98945 -281461 -167381 -39540 -149103
8684 -149103 -205063 48241 195984 -250672 -940687 -1098713 -703117 -508273 -885810 -1351556
8674a351556n6154J79099L3178k8107K41806M39309J69744k72277k19840M33105
8664d31693R20508M87182n33148r92997m15941L59594L95215q3368k59869k8509
8654e83026J20971J30340L17448N14784K53811k93895n12919l83323l55022l29807
8644a120638J25981O63223N05026q2335n6951N31267M64499m96333r89760k39399
8634f95420O64559N81034L6512K0752K55237n4061o25969n80721N7223M81950
8624A41096L55800K1761j90333j54365J54009L94748N3627o16877o16695K61306
8614a95923Q35219K61423n92618n03362K34775M57651j0790l74035k83247q1644
8604b52551O1469K23392J92803k11802n50894l34513J18437J88330m2002r8938
$$ plain form
8674 -1351556 -1407710 -1228611 -1195433 -1223540 -981734 -542425 -372681 -644958 -864798 -431693
8664 -431693 488815 975997 442849 -550148 -966089 -606495 -211280 -294648 -554517 -583026
8654 -583026 -462055 -331715 -14267 500517 754328 460433 -52486 -435809 -790831 -1120638
8644 -1120638 -994657 -331434 173592 91257 34306 565573 1030072 533739 -456021 -695420
8634 -695420 -30861 550173 586685 607437 862674 808613 182644 -398077 -340854 141096
8624 141096 496896 518657 328324 173959 327968 722716 776343 159466 -457229 -195923
8614 -195923 639296 900719 308101 -195261 39514 497165 486375 112340 -170907 -252551
8604 -252551 -191082 32310 225113 13311 -537583 -872096 -753659 -565329 -607331 -706269
8594g06269l0003j52380k72940k6444L47810L86357K01215J28431J8844l15519
8584d20898m49652k4989M22415K47481j94292j97813O0724L13j87112R755K84857
8573d49211P4193k03359J83207P47980M14112n52489p92136k1785N71847K72368
8563B44727k77645m13409l26030k30067J05520N58304N00405j12600n00679k81211
8553g32685L7406Q9181J46646K58833j1730n68291n92888R5946N57980K11193
8543e08409k31924k8294L67469K16520j77374n5891M36034M79964j14041o85825
8533c01771o90673k43656K29124M05486K13073r3924j23657J55948L28738J38844
8523A7532j34482j64939q4831j60721k70863j12154K54651M48032K91636J5541
$$ plain form
8594 -706269 -736272 -888652 -1161592 -1188036 -840226 -453869 -252654 -124223 -105379 -420898
8584 -420898 -870550 -895539 -473124 -225643 -419935 -617748 -557024 -556711 -743823 -734068 -449211
8573 -449211 -375018 -578377 -395170 352810 766922 214433 -577703 -599488 -27641 244727
8563 244727 -32918 -446327 -772357 -1002424 -896904 -338600 161805 49205 -451474 -732685
8553 -732685 -695279 -606098 -459452 -200619 -212349 -780640 -1373528 -1277582 -719602 -508409
8543 -508409 -740333 -768627 -401158 -184638 -362012 -417903 18131 498095 384054 -301771
8533 -301771 -992444 -1236100 -1006976 -601490 -388417 -482341 -605998 -450050 -121312 17532
8523 17532 -116950 -281889 -366720 -527441 -798304 -910458 -655807 -207775 83861 99402
8513I9402p3352M2052R4536j10999l69252k51471K84980O84373M42686k12398
8503F30557o04201m23452N6464M22076M36713Q3483l52856m28609j01308J23060
8493a58073l2433j09794K71488N76826J33108o21204o47126R0851N72080K99750
8483C75473j08788j18335n9478l07668n27732k85359J79703L10211o644l91005
8473i39622m28186j7845M90941N56866J50135m3474L85231P51348K31152p17291
8463D19255r30168l15056J70996K36880N18381R66609N84281o69507j277500l83264
8453f79093P56917O67716j87031m48182p5092j7867l52637l14552J28772K11896
8443c09153j85720l38733N249K64098J41919P1096K92387M09767J65716j09556
$$ plain form
8513 99402 26050 68102 162638 51639 -317613 -569084 -284104 400269 842955 630557
8503 630557 26356 -397096 -340632 81444 518157 601640 248784 -179825 -281133 -158073
8493 -158073 -190506 -300300 -28812 548014 681122 59918 -587208 -496357 75723 375473
8483 375473 266685 148350 88872 -218796 -746528 -1031887 -852184 -541973 -548617 -939622
8473 -939622 -1367808 -1385653 -894712 -337846 -187711 -231185 154046 905394 1136546 419255
8463 419255 -510913 -825969 -654973 -418093 100288 1066897 1651178 981671 -295829 -679093
8453 -679093 77824 745540 558509 110327 35235 17368 -335269 -649821 -521049 -309153
8443 -309153 -494873 -833606 -828357 -564259 -422340 -351244 -58857 350910 516626 407070
8433D07070j26832p2202j55377k80847l54690l98774k65771J87506N86039L65455
8423a08423k74279m76281O881M15970J82743k25709j40524K81570M44248K22996
8413C29192q6071l17279l91421j14984M21098O31089K19355k16650m5868L31557
8403G60018J23478m63112n06636N2002K64609k14883n29782q1768M76310L91803
8393B72039K0796J9575J18098k55379p12306m39578L36106O08731J81959j74128
8383b4087j47336k40220n19154k74901N90744J011049L25479n55963m50092L73878
8373H9397P43522L51023n3153m738J04357j40446n16085n57541j88736K21335
8363D8935K53651j28318m84681l93107l6236N1645j64697j80489J12489J68627
$$ plain form
8433 407070 280238 208036 52659 -228188 -582878 -981652 -1247423 -1059917 -473878 -108423
8423 -108423 -382702 -858983 -852102 -436132 -253389 -479098 -619622 -338052 106196 329192
8413 329192 243121 -74158 -465579 -580563 -159465 471624 690979 474329 428461 760018
8403 760018 883496 420384 -86252 -34250 230359 15476 -514306 -596074 -119764 272039
8393 272039 292835 312410 430508 175129 -537177 -976755 -640649 -31918 150041 -24087
8383 -24087 -171423 -411643 -930797 -1205698 -614954 396095 721574 165611 -284481 89397
8373 89397 832919 1183942 1130789 1126051 1230408 1089962 573877 16336 -172400 48935
8363 48935 302586 174268 -310413 -703520 -739756 -688111 -852808 -1033297 -920808 -752181
8353g52181k00735l42307J52466O15135L10065l44953m50414l6617J56316j9307
8343i12532l4200K51656L88784J99140J4421J9575O8550J45763L31435L58283
8333H30875q9042o76883p52856l46303r3829j77433j35265K00137L90829K09991
8323f39779L2904J58271L62484L71838K37297N1581j93121l27263j07515K78708
8313B25405L32694k3825l48904l80643k89463j74221Q5067L58083K64337j71798
8303a23268m11960j39500L60457O65304N97469J24517n74257r28436m91033L04653
8293f16054N50860J10028k39915l0011K88512K15797l8874o2198Q0128Q6796o1979
8282B83090j65840r1993J62231M08366K80647k91170p27084m57386J80684L73248
$$ plain form
8353 -752181 -952916 -1295223 -1142757 -527622 -217557 -562510 -1012924 -1049541 -893225 -912532
8343 -912532 -946732 -695076 -306292 -107152 -92731 -73156 -4606 141157 472592 830875
8333 830875 741833 64950 -687906 -1034209 -1128038 -1305471 -1440736 -1240599 -849770 -639779
8323 -639779 -606875 -448604 -86120 285718 523015 574596 381475 54212 -53303 225405
8313 225405 558099 534274 185370 -195273 -484736 -658957 -573890 -215807 48530 -123268
8303 -123268 -535228 -674728 -314271 351033 948502 1073019 498762 -429674 -920707 -616054
8293 -616054 -65194 44834 -195081 -225092 63420 279217 240343 178145 258273 345069 283090
8282 283090 117250 25257 187488 595854 876501 585331 -141753 -599139 -418455 -45207
8272d5207M7228j45441p041j0993k50378j87045K81949M96936J64714j19267N4892
8261B80347K13469o6219l59067j76890J74101J95069L1596M1405O8181j93202
8251B08790n49879o22669m24408j50342J90883N16133N19011K01744L6351J79955
8241A05569J25899l81142p28127l46688L34352N35619K48925K1186K0901P717
8231e5789q4360j64756l07891m98926l74186K14714O92730M32883k93293o25532
8221a064406k31595L86898O03459K84993k11305l96616j26631J87066J06735j25250
8211e86652N6348M73883L02292n42053j015501m34327M96610P74877M60319K17361
8201B03157J69067J5338k18632l10452l03663k38823Q2896N24996M53285k36195
$$ plain form
8272 -45207 2021 -143420 -150461 -161454 -411832 -598877 -316928 180008 344722 225455 280347
8261 280347 493816 427597 68530 -108360 65741 260810 292406 333811 401992 208790
8251 208790 -341089 -963758 -1388166 -1538508 -1347625 -831492 -312481 -110737 -74386 105569
8241 105569 231468 -149674 -877801 -1224489 -890137 -354518 -105593 -84407 -63506 -55789
8231 -55789 -140149 -304905 -612796 -1111722 -1485908 -1271194 -578464 -145581 -438874 -1064406
8221 -1064406 -1296001 -909103 -305644 -20651 -231956 -628572 -755203 -568137 -461402 -586652
8211 -586652 -530304 -56421 245871 -296182 -1311683 -1746010 -1249400 -474523 -14204 203157
8201 203157 372224 387562 168930 -141522 -445185 -684008 -601112 -76116 377169 140974
8191A40974o69956k96703J82443L5943k35093P3223M54634J38815l06082J23155
8181c58647R00244O45516m72598q23179Q9133Q52475M00086n17165p59235l98736
8171d42106j26582p7759k4486J9296L9701K53660O01313N99286J07614l48924
8161F01013l74816k14310j58064p7771J21219K07181J03787P4015J65542R8792
8151E46588q2311K9902L65621L12956j93804m02485J1060L30878L320m32607l32148
8140A56970n0432k09508n41816m13207J1262R7372j15454n1062L38164N29907
8130b47804L42823R3196p6435k79893l71606r3722K86952K25014j96677l32678
8120f50830k0223J81012l8345k48798n5955K76372L45102K10580Q0916j27987
$$ plain form
8191 140974 -528982 -825685 -643242 -607299 -842392 -769169 -314535 -175720 -481802 -358647
8181 -358647 541597 1187113 714515 -108664 -19531 832944 1233030 715865 -43370 -442106
8171 -442106 -568688 -646447 -670933 -651637 -611936 -358276 243037 842323 949937 601013
8161 601013 226197 11887 -146177 -223948 -102729 104452 208239 282254 447796 546588
8151 546588 464277 494179 859800 1172756 978952 576467 587527 918405 921725 489118 156970
8140 156970 106538 -102970 -644786 -1057993 -1046731 -949359 -1064813 -1115875 -777711 -247804
8130 -247804 95019 188215 111780 -168113 -539719 -633441 -346489 -121475 -318152 -650830
8120 -650830 -671053 -490041 -528386 -777184 -833139 -556767 -211665 -1085 79831 -48156
8110d8156m57891n32862n8037N54830O16241J23296k20392N321L83011K91178
8100F56539k26311n35777k65160K15220K82449j26512m33523j85541L44915N35779
8090B62078K29062j51015k46731j60763j19641j14350p5218q5169j54295o5976
8080f82018K28237L23184j09586o95539p58493k60166K00929L29690M59356P67579
8070a96827P99943J91534n98676q02022l37810J87005L22681J65810j9822j34664
8060d22848j64215j05020l9019o4005j30356j04526M6437K51337L88420K46466
8050i7329k92624q48452p11513K11225J001306Q00273m4514n26757l83279j67592
8040a059256j09601J34786N31469M73339j28893m71070p8334L93245K15481k40304
$$ plain form
8110 -48156 -506047 -1038909 -1096946 -542116 74125 197421 -22971 -17650 365361 656539
8100 656539 430228 -105549 -370709 -155489 126960 448 -433075 -618616 -273701 262078
8090 262078 491140 340125 93394 -67369 -187010 -301360 -376578 -461747 -616042 -682018
8080 -682018 -453781 -130597 -240183 -935722 -1694215 -1954381 -1753452 -1423762 -964406 -196827
8070 -196827 603116 794650 195974 -606048 -943858 -756853 -434172 -268362 -288184 -422848
8060 -422848 -587063 -692083 -731102 -795107 -925463 -1029989 -983552 -732215 -343795 -97329
8050 -97329 -389953 -1238405 -1949918 -1738693 -737387 62886 18372 -508385 -891664 -1059256
8040 -1059256 -1168857 -1034071 -502602 -29263 -158156 -629226 -707560 -314315 -98834 -339138
8030c39138j73247L23158M98684K21974R7894L37551L67833j93019q18516p29866
8020d06692Q0086Q37388Q60559K07590m84558o35599j98443L73086N48859J56610
8010A338886m77029p75956m45650J60535L81651O7310k21670m8707K41057J33810
8000C54237j45355l079M58545N41875P9566l57183m43844m40812l92395O7873
7990b80572P79723Q82770J01404o75958p09522m33084m47737l90501K19718P79846
7980a73913M42757l52162m54548J70540M69490Q0425j94435J19838L94561M7692
7970E50245m85731m91933m830M26694N01636K76590p7133k88736j29023K00010
7960D77789J90660k31134n04627k28373K59155M07727J97681o877n9366r4768
$$ plain form
8030 -339138 -512385 -189227 309457 531431 629325 966876 1334709 1141690 323174 -406692
8020 -406692 -326606 510782 1371341 1578931 1094373 458774 260331 633417 1182276 1338886
8010 1338886 861857 85901 -359749 -199214 182437 249747 28077 -20630 220427 354237
8000 354237 208882 205803 664348 1206223 1285789 928606 484762 43950 -348445 -280572
7990 -280572 499151 1381921 1483325 807367 97845 -335239 -782976 -1173477 -953759 -173913
7980 -173913 268844 -83318 -537866 -367326 102164 182589 -11846 107992 502553 550245
7970 550245 64514 -427419 -432249 -5555 496081 772671 695538 406802 277779 477789
7960 477789 668449 437315 -67312 -295685 -36530 371197 568878 562001 502635 407867
7950D07867j59100j31630K7967J92149K10878K6755k82264m89235l69876J8447
7940e48042L22930K89244Q0139N7479K91677M47826K07570l12546o88652o88137
7930e40512m54094j63294K18529O40561P26413K40678l88091n25724k28091q8655
7920e62280k13105p9833M25241O49514K33919k29241j42284J76671J66251j3371
7910D11482N0118J48465p0611k27593J80722O40472K27274p71743j040565j82153
7900f34132O57094M92805j76247l39881L1773K09504p2437l53256k28409J57757
7890b55429L91227K38618j83324n24553n18987k48066k2824k1429j56730k35356
7880a536853r9498K76247O51463O50818K46188j12408j05294K3378j0136K8140
$$ plain form
7950 407867 248767 117137 145104 337253 548131 574886 292622 -196613 -566489 -548042
7940 -548042 -225112 64132 144271 201750 493427 941253 1148823 836277 147625 -540512
7930 -540512 -994606 -1157900 -939371 -298810 427603 668281 280190 -245534 -473625 -562280
7920 -562280 -775385 -855218 -429977 219537 453456 224215 81931 258602 424853 411482
7910 411482 461600 610065 539454 311861 492583 1133055 1360329 588586 -451979 -634132
7900 -634132 22962 515767 339520 -361 31412 240916 168479 -184777 -413186 -255429
7890 -255429 135798 374416 191092 -333461 -852448 -1100514 -1123338 -1144767 -1301497 -1536853
7880 -1536853 -1636351 -1360104 -708641 -57823 188365 75957 -29337 -5959 -16095 12045
7870A2045L70524N50137J788q40753r32587j18648O13915N48940R1844q5435N34
7859B12304j9081j59720j98837j11942j0245O4271M1494j52488l18991j53869
7849h07104J64468Q6805l83929n03916P9516O20935L14974m24973n05995K29981
7839a129238P61661L76478l25058l39942K86966N60706J2264n87617l41438M27667
7829b97551O14905l5781n70576k91657K61177L14060Q0035J71767L89453J25636
7819G61468l71915k96520K58314L39817k22808m40708J47670N69020o6034j052386
7809c74082j045150K8898R47866Q27545q308p01437p70458l25552J80733L50125
7799h89820K06172J17206K52406L49873J78438r4617k37276l15122m06378k83610
$$ plain form
7870 12045 382569 932706 934494 93741 -838846 -957494 -343579 205361 297205 211770 212304
7859 212304 193223 33503 -165334 -277276 -287521 -223250 -181756 -334244 -653235 -807104
7849 -807104 -642636 -555831 -939760 -1443676 -1364160 -743225 -428251 -853224 -1359219 -1129238
7839 -1129238 -367577 8901 -316157 -656099 -369133 191573 203837 -383780 -725218 -297551
7829 -297551 317354 281573 -289003 -580660 -319483 -5423 74612 246379 635832 761468
7819 761468 389553 93033 351347 691164 468356 27648 175318 744338 678304 -374082
7809 -374082 -1419232 -1390334 -442468 385077 376769 -324668 -1095126 -1420678 -1239945 -889820
7799 -889820 -683648 -566442 -314036 35837 214275 119658 -117618 -432740 -839118 -1122728
7789a122728K05835O73675N70533m0698m91499l26098J78334M15417K02363m5577
7779B19557P4369L30165J43025m69268p09293j03489O69263O59974J6536l29319
7769E01520j39041o0526l30931l59695R9229L91793Q9555k56876j26699O4519
7759a27152j63773l61292L6372N22619K37826n16378o18434J41051P46884M85171
7749C82894j56108l83609j48422O3949k4175k92579m64140l32201L1685K55815
7739a066891J04588j27820o734L43645L88641L1123j97407O1453M43365L69703
7729C43666j81728o72983o33436j16084M12001N46463L15583N6419l7615o0504
7719b8218p0024M6788K18029P8953m52700q35347n71358N9482M15943L92990L48539
$$ plain form
7789 -1122728 -916893 -243218 327315 286617 -204882 -530980 -352646 62771 265134 219557
7779 219557 293926 624091 767116 297848 -411445 -514934 154329 814303 830839 501520
7769 501520 362479 301953 -28978 -388673 -289444 102349 191904 -64972 -191671 -127152
7759 -127152 -290925 -652217 -615845 -93226 144600 -371778 -990212 -849161 -102277 382894
7749 382894 226786 -156823 -305245 -241296 -265471 -558050 -1022190 -1354391 -1322706 -1066891
7739 -1066891 -962303 -1090123 -1096857 -753212 -364571 -333448 -530855 -469402 -26037 343666
7729 343666 161938 -511045 -1144481 -1260565 -848564 -302101 13482 69901 32286 -28218
7719 -28218 -98242 -51454 166575 245528 -207172 -1042519 -1613877 -1554395 -1138452 -745462 -396923
7708c96923L56659K06130K4143J46240L46331k41p97891j076916l46693N91220
7698i47941P11509J02461l64076k95029n3034P099n1623n8286L7609K50157M91453
7687a69701M64340j717n40474n66550l0708M92972N24633J64729j91758l08438
7677a62672j77643P7190K34865J25826j42104k80719k00167r5513j10413j34708
7667h66058q150K63550N35609N89687K23274m50160q59198n36544J78430M74233
7657d55327J55138j73734j36086r0424k78367k35617L47146Q51083O11318L7500
7647F32630o0545J60575n2417n82397n53888R7408M07278k0505l82620q2697L31933
7636a05245K55379N0392K13854L53024j05314p99903r30625m36432J28366N11981
$$ plain form
7708 -396923 -40264 165866 190009 336249 682580 682339 -115552 -1192468 -1539161 -947941
7698 -947941 -236432 -133971 -498047 -793076 -846110 -839011 -890634 -948920 -911311 -661154 -169701
7687 -169701 294639 292922 -247552 -814102 -844810 -351838 172795 337524 145766 -162672
7677 -162672 -340315 -263125 -28260 97566 -44538 -325257 -525424 -620937 -731350 -866058
7667 -866058 -874208 -610658 -75049 514638 737912 287752 -571446 -1107990 -929560 -455327
7657 -455327 -300189 -473923 -610009 -700433 -978800 -1214417 -867271 -16188 595130 632630
7647 632630 572085 732660 680243 97846 -456042 -358634 48644 28139 -354481 -437178 -105245
7636 -105245 150134 200526 414380 767404 662090 -137813 -1068438 -1504870 -1376504 -864523
7626h64523P77723P39544J93683m85832o87190l53281J05266M29131N25333K41344
7616F21198k83278m58884q6857J30710l21275p40873k58213N94554O05088j25609
7606c23439l12936L93584Q60140L48529l85039m40233r0844k5394j68170o0836
7596b04638K23483L06195J93563J09843J9760j38802j14902K26493M60440J34497
7586A215932m86185p27047m16024r438J33623J48806K54726L11146N6984l47441
7576A35082l79634P2293L23321k28563r91604p35980N58330J341597N82274o61083
7566A6033p28823K50973P15406N4498p30514p54591l15086L0416K82359M82057
7556f97272L66817l368j08777J50493K29993p3552k49376l5749J20283k0926q446
$$ plain form
7626 -864523 -86800 652744 846427 360595 -326595 -679876 -574610 -145479 379854 621198
7616 621198 337920 -120964 -207821 -77111 -398386 -1139259 -1397472 -802918 -197830 -323439
7606 -323439 -636375 -242791 617349 965878 580839 140606 49762 24368 -143802 -204638
7596 -204638 18845 325040 518603 628446 648206 509404 394502 620995 1081435 1215932
7586 1215932 729747 2700 -413324 -422762 -289139 -140333 114393 425539 482523 135082
7576 135082 -244552 -172259 151062 -77501 -1069105 -1805085 -1246755 94842 677116 16033
7566 16033 -712790 -461817 253589 308087 -422427 -1177018 -1492104 -1461688 -1179329 -697272
7556 -697272 -330455 -333823 -442600 -292107 -62114 -135666 -385042 -420791 -300508 -321434 -329880
7545c29880L63054N03851K0096n27273n01894j45475k1236j37291k32700l21422
7535a330170l54334K8497P72720J067272M37696l79919m11123J85282M86392J68499
$$ plain form
7545 -329880 33174 537025 557121 29848 -472046 -617521 -638757 -776048 -1008748 -1330170
7535 -1330170 -1684504 -1656007 -883287 183985 621681 241762 -169361 15921 502313 670812
$$ [...]
##END NTUPLES=NMR SPECTRUM
##END=
