##TITLE=31Pdec_E3b0502-2
 CDCl3
 24 sc
 6.2.2024
##JCAMPDX= 6.0         $$ Bruker NMR JCAMP-DX V2.0
##DATA TYPE= NMR SPECTRUM
##DATA CLASS= NTUPLES
##ORIGIN= UXNMR, Bruker Analytische Messtechnik GmbH
##OWNER= root
$$ XWIN-NMR		Version 3.5
$$ Tue Feb  6 14:51:48 2024 Russian Standard Time (UT+4h)  she@DPX200
##.OBSERVE FREQUENCY= 81.013821
##.OBSERVE NUCLEUS= ^31P
##.ACQUISITION MODE= SIMULTANEOUS
##.ACQUISITION SCHEME= undefined
##.AVERAGES= 24
##.DIGITISER RES= 16
##SPECTROMETER/DATA SYSTEM= spect
##.PULSE SEQUENCE= zgpg30
##.SOLVENT NAME= CDCl3
##.SHIFT REFERENCE= (INTERNAL, CDCl3, 0, 248.564)
##AUDIT TRAIL= $$ (NUMBER, WHEN, WHO, WHERE, WHAT)
$$ ##TITLE= Audit trail, XWIN-NMR		Version 3.5
$$ ##JCAMPDX= 5.01
$$ ##ORIGIN= Bruker BioSpin GmbH
$$ ##OWNER= she
$$ F:/spectra/data/she/nmr/P31/1/pdata/1/auditp.txt
$$ ##AUDIT TRAIL=  $$ (NUMBER, WHEN, WHO, WHERE, WHAT)
(   1,<2024-02-06 14:50:47.31 +0400>,<she>,<DPX200>,
      <created by zg, POWCHK disabled, PULCHK disabled
       configuration hash MD5:
       00 E9 B6 7A A2 85 ED C7 34 08 36 98 17 FE 4E 26
       data hash MD5: 32K
       D9 32 85 E4 D1 98 F6 DD 96 07 1C FD FC FF 8A 9C>)
(   2,<2024-02-06 14:50:54.00 +0400>,<she>,<DPX200>,
      <Start of raw data processing
       efp BC_mod = 2 LB = 10 FT_mod = 6 PKNL = 1 PHC0 = -13218.54 PHC1 = 1905.685 SI = 64K 
       data hash MD5: 64K
       59 2E 5A 82 CF 26 0B D0 41 FB 18 13 1C 83 05 15>)
(   3,<2024-02-06 14:51:05.81 +0400>,<she>,<DPX200>,
      <pk PHC0 = -93.77081 PHC1 = 0 
       data hash MD5: 64K
       92 8B F0 44 05 A4 70 F9 06 5D 13 1D 5E 3E C2 41>)
(   4,<2024-02-06 14:51:08.42 +0400>,<she>,<DPX200>,
      <abs ABSG = 5 
       data hash MD5: 64K
       2F 93 8F 87 8C 53 76 04 95 A8 7E 01 8C 36 58 0C>)
$$ ##END=
$$ 
$$ hash MD5
$$ CB 5F FF BF E6 76 8C B6 F7 A1 14 32 91 32 27 06
##$RELAX= 
##$RELAX= 
##$RELAX= 
##$RELAX= 
##$RELAX= 
##$RELAX= 
##$RELAX= 
##$RELAX= 
##$RELAX= 
$$ Bruker specific parameters
$$ --------------------------
##$DU= <F:/spectra>
##$EXPNO= 1
##$NAME= <P31>
##$PROCNO= 1
##$TYPE= <nmr>
##$USER= <she>
##$AMP= (0..31)
100 100 100 100 100 100 100 100 100 100 100 100 100 100 100 100 100 100 
100 100 100 100 100 100 100 100 100 100 100 100 100 100 
##$AQSEQ= 0
##$AQ_mod= 1
##$AUNM= <au_zg>
##$AUTOPOS= <>
##$BF1= 81.014009
##$BF2= 200.13
##$BF3= 200.13
##$BF4= 200.13
##$BF5= 200.13
##$BF6= 200.13
##$BF7= 200.13
##$BF8= 200.13
##$BYTORDA= 1
##$CFDGTYP= 0
##$CFRGTYP= 5
##$CHEMSTR= <none>
##$CNST= (0..31)
1 1 145 1 1 1 1 1 1 1 1 1 1 1 1 1 1 1 1 1 1 1 1 1 1 1 1 1 1 1 1 1 
##$CPDPRG= <waltz16>
##$CPDPRG1= <>
##$CPDPRG2= <waltz16>
##$CPDPRG3= <>
##$CPDPRG4= <mlev>
##$CPDPRG5= <mlev>
##$CPDPRG6= <mlev>
##$CPDPRG7= <mlev>
##$CPDPRG8= <mlev>
##$CPDPRGB= <>
##$CPDPRGT= <>
##$D= (0..31)
0 1 0 0 0 0 0 0 0 0 0 0.03 2e-05 3e-06 0 0 0 0 0 0 0 0 0 0 0 0 0 0 0 0 
0 0 
##$DATE= 1707216646
##$DBL= (0..7)
120 120 120 11 120 120 24 19 
##$DBP= (0..7)
150 150 150 150 150 150 150 150 
##$DBP07= 0
##$DBPNAM0= <>
##$DBPNAM1= <>
$$ [...]
##$SUBNAM3= <"">
##$SUBNAM4= <"">
##$SUBNAM5= <"">
##$SUBNAM6= <"">
##$SUBNAM7= <"">
##$SUBNAM8= <"">
##$SUBNAM9= <"">
##$SW= 501.771253377433
##$SWIBOX= (0..15)
0 1 3 0 0 0 0 0 0 0 0 0 0 0 0 0 
##$SW_h= 40650.406504065
##$TD= 32768
##$TD0= 1
##$TE= 0
##$TE2= 300
##$TE3= 300
##$TEG= 300
##$TL= (0..7)
0 120 53 12 22 120 120 120 
##$TP= (0..7)
150 150 150 150 150 150 150 150 
##$TP07= 0
##$TPNAME0= <>
##$TPNAME1= <>
##$TPNAME2= <>
##$TPNAME3= <>
##$TPNAME4= <>
##$TPNAME5= <>
##$TPNAME6= <>
##$TPNAME7= <>
##$TPOAL= (0..7)
0.5 0.5 0.5 0.5 0.5 0.5 0.5 0.5 
##$TPOFFS= (0..7)
0 0 0 0 0 0 0 0 
##$TUNHIN= 0
##$TUNHOUT= 0
##$TUNXOUT= 0
##$USERA1= <user>
##$USERA2= <user>
##$USERA3= <user>
##$USERA4= <user>
##$USERA5= <user>
##$V9= 5
##$VALIST= <valist>
##$VCLIST= <CCCCCCCCCCCCCCC>
##$VD= 0
##$VDLIST= <DDDDDDDDDDDDDDD>
##$VPLIST= <PPPPPPPPPPPPPPP>
##$VTLIST= <TTTTTTTTTTTTTTT>
##$WBST= 1024
##$WBSW= 4
##$XGAIN= (0..3)
0 0 0 0 
##$XL= 0
##$YL= 0
##$YMAX_a= 7018
##$YMIN_a= -6916
##$ZGOPTNS= <>
##$ZL1= 120
##$ZL2= 120
##$ZL3= 120
##$ZL4= 120
##$ABSF1= 248.5645
##$ABSF2= -253.2056
##$ABSG= 5
##$ABSL= 3
##$ALPHA= 0
##$AQORDER= 0
##$ASSFAC= 0
##$ASSFACI= 0
##$ASSFACX= 0
##$ASSWID= 0
##$AUNMP= <proc_1d>
##$AZFE= 0.1
##$AZFW= 0.5
##$BCFW= 0
##$BC_mod= 2
##$BYTORDP= 0
##$COROFFS= 0
##$CY= -3
##$DATMOD= 1
##$DC= 0
##$DFILT= <>
##$DTYPP= 0
##$F1P= 0
##$F2P= 0
##$FCOR= 1
##$FTSIZE= 65536
##$FT_mod= 6
##$GAMMA= 0
##$GB= 0
##$INTBC= 1
##$INTSCL= 6.047779e-11
##$ISEN= 30
##$LB= 10
##$LEV0= 0
##$LPBIN= 0
##$MAXI= 10000
##$MC2= 0
##$MEAN= 0
##$ME_mod= 0
##$MI= 50
##$NCOEF= 0
##$NC_proc= -6
##$NLEV= 6
##$NOISF1= 182.463
##$NOISF2= 159.3651
##$NSP= 0
##$NTH_PI= 0
##$NZP= 0
##$OFFSET= 248.5645
##$PC= 4
##$PHC0= -13312.31
##$PHC1= 1905.685
##$PH_mod= 1
##$PKNL= yes
##$PPARMOD= 0
##$PSCAL= 0
##$PSIGN= 0
##$REVERSE= no
##$SF= 81.0140089999694
##$SI= 65536
##$SIGF1= 159.3651
##$SIGF2= -187.1042
##$SINO= 113.3802
##$SIOLD= 16384
##$SREGLST= <1H.CDCl3>
##$SSB= 0
##$STSI= 65536
##$STSR= 0
##$SW_p= 40650.406504065
##$SYMM= 0
##$S_DEV= 0
##$TDeff= 32768
##$TDoff= 0
##$TI= <>
##$TILT= no
##$TM1= 0
##$TM2= 0
##$TOPLEV= 0
##$USERP1= <user>
##$USERP2= <user>
##$USERP3= <user>
##$USERP4= <user>
##$USERP5= <user>
##$WDW= 1
##$XDIM= 65536
##$YMAX_p= 317439520
##$YMIN_p= -10012840
$$ End of Bruker specific parameters
$$ ---------------------------------
##NTUPLES= NMR SPECTRUM
##VAR_NAME=  FREQUENCY,     SPECTRUM/REAL,   SPECTRUM/IMAG
##SYMBOL=    X,             R,               I
##VAR_TYPE=  INDEPENDENT,   DEPENDENT,       DEPENDENT
##VAR_FORM=  AFFN,          ASDF,            ASDF
##VAR_DIM=   65536,         65536,           65536
##UNITS=     HZ,            ARBITRARY UNITS, ARBITRARY UNITS
##FACTOR=    0.620285442955139, 1,           1
##FIRST=     20137.2065510682, 0,            0
##LAST=      -20513.1999529968, 0,           0
##MIN=       -20513.1999529968, -10012840,   0
##MAX=       20137.2065510682, 317439520,    0
$$ Real data points
##PAGE= N=1
##DATA TABLE= (X++(R..R)), XYDATA
$$ [...]
$$ plain form
40064 632786 696855 752218 799896 842375 883049 925450 972461 1025747 1085665 1151573 1222295
40053 1222295 1296409 1372308 1448190 1522182 1592607 1658212 1718197 1772025 1819203 1859189 1891472
40042 1891472 1915676 1931625 1939275 1938471 1928496 1907663 1873489 1823646 1757299 1676078 1584153 1487512
40030 1487512 1392798 1306119 1232150 1173757 1132083 1106778 1096129 1097146 1105818 1117632 1128156 1133596
40018 1133596 1131309 1120215 1100909 1075300 1045889 1015104 984961 957030 932456 911969 895940
40007 895940 884537 877842 875864 878618 886386 899967 920491 948687 984101 1024961 1068763 1113077
39995 1113077 1155946 1195872 1231768 1263103 1290050 1313198 1332944 1349021 1360747 1367870 1371408 1373760
39983 1373760 1377927 1386240 1399365 1416108 1434074 1450739 1464431 1474838 1483001 1490823 1500222 1512258
$$ packed form
40064F32786O4069N5363M7678M2479M0674M2401M7011N3286N9918O5908P0722
40053A222295P4114P5899P5882P3992P0425O5605N9985N3828M7178L9986L2283
40042A891472K4204J5949P650q04r975k0833l4174m9843o6347q1221r1925r6641
40030A487512r4714q6679p3969n8393m1674k5305j0649J017Q672J1814J0524N440
40018A133596k287j1094j9306k5609k9411l0785l0143k7931k4574k0487j6029
40007H95940j1403o695j978K754P768J3581K0524K8196L5414M0860M3802M4314
39995A113077M2869L9926L5896L1335K6947K3148J9746J6077J1726P123L538K352
39983A373760M167Q313J3125J6743J7966J6665J3692J0407Q163P822R399J2036
$$ plain form
39971 1512258 1526588 1541497 1554430 1562683 1563898 1556308 1538914 1511787 1476400 1435556 1392758 1351380
39959 1351380 1314180 1283338 1260622 1247272 1243559 1248318 1258747 1270719 1279722 1282238 1277044 1265722
39947 1265722 1252062 1240647 1235295 1237927 1248145 1263442 1279854 1292860 1298316 1293167 1275637 1244907
39935 1244907 1200700 1143289 1074085 996408 915793 839404 774566 726846 698445 687637 689668
39924 689668 698765 710324 722205 734575 748622 765018 782985 800261 813828 821014 820602 813590
39912 813590 803223 794239 791499 798449 815931 841797 871546 899720 921382 933054 932924 920583
39900 920583 896659 862466 819672 770041 715487 658513 602757 553048 514693 492290 488779 505241
39888 505241 541331 595881 667180 752839 849472 952613 1057129 1157989 1250952 1332807 1401197
$$ packed form
39971A512258J4330J4909J2933Q253J215p590j7394k7127l5387m0844m2798m1378
39959A351380l7200l0842k2716j3350l713M759J0429J1972R003K516n194j1322
39947A265722j3660j1415n352K632J0218J5297J6412J3006N456n149j7530l0730
39935A244907m4207n7411o9204p7677q0615p6389o4838m7720k8401j0808K031
39924F89668R097J1559J1881J2370J4047J6396J7967J7276J3567P186m12p012
39912H13590j0367q984k740O950J7482K5866K9749K8174K1662J1672j30j2341
39900I20583k3924l4193m2794m9631n4554n6974n5756m9709l8355k2403l511J6462
39888E05241L6090N4550P1299Q5659R6633J03141J04516J00860R2963Q1855O8390
$$ plain form
39877 1401197 1454323 1490897 1510445 1513821 1503495 1483264 1457377 1429608 1402748 1378591 1358023
39866 1358023 1340935 1326069 1311068 1292955 1268943 1237399 1198526 1154436 1108448 1063921 1023166
39855 1023166 986876 954280 923961 895026 868066 845347 830151 825563 833248 852594 880390 911170
39843 911170 938311 955754 959906 950889 932443 910377 890279 875652 867287 863883 863170 862881 861265
39830 861265 857173 849897 838966 824125 805631 784653 763399 744732 731459 725589 727839 737495
39818 737495 752706 771131 790539 808939 824275 834181 836346 829476 814261 793648 772143 754358
39806 754358 743454 740103 742446 746890 749289 746016 734700 714524 686101 650907 610468 565759
39794 565759 517122 464743 409398 353040 298905 250992 213050 187491 174803 173712 181965 197229
$$ packed form
39877A401197N3126L6574J9548L376j0326k0231k5887k7769k6860k4157k0568
39866A358023j7088j4866j5001j8113k4012l1544l8873m4090m5988m4527m0755
39855A023166l6290l2596l0319k8935k6960k2719j5196m588P685J9346K7796L0780
39843I11170K7141J7443M152r017j8446k2066k0098j4627q365l404p13k89j616
39830H61265m092p276j0931j4841j8494k0978k1254j8667j3273n870K250R656
39818G37495J5211J8425J9408J8400J5336R906K165o870j5215k0613k1505j7785
39806G54358j0904l351K343M444K399l273j1316k0176k8423l5194m0439m4709
39794E65759m8637n2379n5345n6358n4135m7913l7942k5559j2688j091Q253J5264
$$ plain form
39782 197229 217621 241859 269229 299599 333418 371526 414739 463407 517175 575043 635518
39771 635518 696693 756215 811304 859069 897102 924214 940912 949415 953174 956214 962539 975676
39759 975676 998148 1030788 1072149 1118438 1164296 1204184 1233830 1251096 1256055 1250404 1236694 1217670
39747 1217670 1195955 1174022 1154449 1140148 1134357 1140113 1159358 1192002 1235447 1284822 1333982 1376959
39735 1376959 1409395 1429441 1437909 1437674 1432616 1426443 1421836 1420163 1421694 1426086 1432812 1441494 1452003
39722 1452003 1464294 1477966 1491821 1503743 1510965 1510555 1499833 1476699 1439957 1389681 1327524 1256752
39710 1256752 1181860 1107802 1039082 978969 929020 888931 856823 829910 805403 781314 756845
39699 756845 732283 708480 686196 665680 646709 628985 612554 597958 586093 577920 574136 574925
$$ packed form
39782A97229K0392K4238K7370L0370L3819L8108M3213M8668N3768N7868O0475
39771F35518O1175N9522N5089M7765L8033K7112J6698Q503L759L040O325J3137
39759I75676K2472L2640M1361M6289M5858L9888K9646J7266M959n651j3710j9024
39747A217670k1715k1933j9573j4301n791N756J9245L2644M3445M9375M9160M2977
39735A376959L2436K0046Q468k35n058o173m607j673J531M392O726Q682J0509
39722A452003J2291J3672J3855J1922P222m10j0722k3134l6742n0276o2157p0772
39710A256752p4892p4058o8720o0113m9949m0089l2108k6913k4507k4089k4469
39699G56845k4562k3803k2284k0516j8971j7724j6431j4596j1865q173l784P89
$$ plain form
39687 574925 579970 588823 601418 618321 640377 667874 699665 732808 763013 785789 797844 798156
39675 798156 788336 772176 754557 740052 731687 730279 734562 742004 749979 756803 762218 767082 772486
39662 772486 778839 785483 790990 793895 793447 790077 785474 782297 783598 792212 810312 839182 879151 929552
39648 929552 988801 1054618 1124340 1195171 1264367 1329433 1388411 1440218 1484887 1523561 1558069
39637 1558069 1590127 1620521 1648763 1673487 1693334 1707797 1717635 1724626 1730761 1737190 1743470 1747586
39625 1747586 1746779 1738772 1722787 1699922 1672771 1644421 1617341 1592674 1570279 1549397 1529467 1510565
39613 1510565 1493264 1478135 1465391 1455004 1447081 1441978 1439916 1440447 1442381 1444412 1445999 1447812 1451384
39600 1451384 1458186 1468739 1482298 1497174 1511346 1523036 1531041 1534827 1534398 1530024 1522074 1511081 1497931
$$ packed form
39687E74925N045Q853J2595J6903K2056K7497L1791L3143L0205K2776J2055L12
39675G98156r820j6160j7619j4505q365j408M283P442P975O824N415M864N404
39662G72486O353O644N507K905m48l370m603l177J301Q614J8100K8870L9969N0401
39648I29552N9249O5817O9722P0831O9196O5066N8978N1807M4669L8674L4508
39637A558069L2058L0394K8242K4724J9847J4463R838O991O135O429O280M116
39625A747586q07q007j5985k2865k7151k8350k7080k4667k2395k0882j9930j8902
39613A510565j7301j5129j2744j0387p923n103k062N31J934K031J587J813L572
39600A451384O802J0553J3559J4876J4172J1690Q005L786m29m374p950j0993j3150
$$ plain form
39587 1497931 1483826 1469889 1456574 1443330 1428765 1411285 1389936 1365044 1338322 1312394 1290023
39576 1290023 1273415 1263797 1261172 1264178 1270218 1276142 1279389 1279063 1276241 1273344 1272976 1276887 1285505 1297951
39562 1297951 1312267 1325661 1334796 1336253 1327223 1306241 1273693 1231837 1184359 1135692 1090417 1052880
39550 1052880 1027015 1016168 1022839 1048336 1092476 1153444 1227789 1310489 1395068 1473936 1539223
39539 1539223 1584174 1604828 1601257 1577563 1540402 1496606 1451051 1405808 1360689 1314505 1266060
39528 1266060 1214481 1159106 1099527 1035985 969926 904192 842530 788572 744787 712004 689667
39517 689667 676586 671624 674050 683528 699920 723017 752219 786336 823642 862227 900482 937461
39505 937461 972954 1007191 1040336 1072027 1101371 1127516 1150513 1171848 1194254 1221020 1255294
$$ packed form
39587A497931j4105j3937j3315j3244j4565j7480k1349k4892k6722k5928k2371
39576A290023j6608r618k625L006O040N924L247l26k822k897l68L911Q618J2446
39562A297951J4316J3394R135J457r030k0982l2548m1856m7478m8667m5275l7537
39550A052880k5865j0847O671K5497M4140O0968P4345Q2700Q4579P8868O5287
39539A539223M4951K0654l571k3694l7161m3796m5555m5243m5119m6184m8445
39528A266060n1579n5375n9579o3542o6059o5734o1662n3958m3785l2783k2337
39517F89667j3081m962K426R478J6392K3097K9202L4117L7306L8585L8255L6979
39505I37461L5493L4237L3145L1691K9344K6145K2997K1335K2406K6766L4274
$$ plain form
39494 1255294 1299695 1356021 1424773 1504670 1592659 1684620 1776339 1864142 1944908 2015638 2072953
39483 2072953 2113021 2132130 2127889 2100440 2052932 1990921 1921025 1849512 1781281 1719291 1664351
39472 1664351 1615292 1569588 1524384 1477638 1428907 1379482 1331825 1288615 1251781 1221828 1197587
39461 1197587 1176387 1154622 1128629 1095621 1054333 1005023 948906 887424 821833 753284 683199
39450 683199 613726 548040 490367 445524 418007 410863 424776 457705 505204 561439 620639 678570
39438 678570 733413 785643 836927 888716 941326 994019 1045853 1096595 1146977 1198065 1250131
39427 1250131 1301744 1349682 1389820 1418595 1434446 1438631 1435088 1429286 1426412 1429713 1439747 1454785
39415 1454785 1471844 1487732 1499676 1505525 1503703 1493151 1473510 1445499 1411117 1373250 1334822 1298098
$$ packed form
39494A255294M4401N6326O8752P9897Q7989R1961R1719Q7803Q0766P0730N7315
39483B072953M0068J9109m241k7449m7508o2011o9896p1513o8231o1990n4940
39472A664351m9059m5704m5204m6746m8731m9425m7657m3210l6834k9953k4241
39461A197587k1200k1765k5993l3008m1288m9310n6117o1482o5591o8549p0085
39450F83199o9473o5686n7673m4843k7517p144J3913L2929M7499N6235N9200N7931
39438F78570N4843N2230N1284N1789N2610N2693N1834N0742N0382N1088N2066
39427A250131N1613M7938M0138K8775J5851M185l543n802k874L301J0034J5038
39415A454785J7059J5888J1944N849j822j0552j9641k8011l4382l7867l8428l6724
$$ plain form
39403 1298098 1264558 1235192 1210667 1191149 1176053 1164146 1154050 1144809 1136125 1128171 1121201 1115207
39391 1115207 1109744 1103873 1096229 1085300 1069894 1049577 1024822 996805 967020 936830 907003 877374
39379 877374 846907 814371 779437 743644 710652 685605 673917 679949 706087 752313 816215 893264
39367 893264 977412 1061990 1140765 1208802 1262913 1301708 1325422 1335679 1335224 1327631 1316905 1306852
39355 1306852 1300299 1298510 1301216 1307267 1315437 1324922 1335429 1347133 1360671 1377126 1397798 1423718
39343 1423718 1455132 1491337 1531073 1573274 1617581 1664184 1712991 1762657 1810135 1850972 1880241
39332 1880241 1893686 1888727 1865139 1825267 1773581 1715527 1656010 1598261 1543719 1492871 1446311
39321 1446311 1405228 1371048 1344596 1325444 1311923 1301842 1293468 1286190 1280464 1277167 1276774 1278877 1282291
$$ packed form
39403A298098l3540k9366k4525j9518j5096j1907j0096r241q684p954o970n994
39391A115207n463n871p644j0929j5406k0317k4755k8017k9785l0190k9827k9629
39379H77374l0467l2536l4934l5793l2992k5047j1688O032K6138M6226O3902P7049
39367H93264Q4148Q4578P8775O8037N4111L8795K3714J0257m55p593j0726j0053
39355A306852o553j789K706O051Q170R485J0507J1704J3538J6455K0672K5920
39343A423718L1414L6205L9736M2201M4307M6603M8807M9666M7478M0837K9269
39332A880241J3445m959k3588l9872n1686n8054n9517n7749n4542n0848m6560
39321A446311m1083l4180k6452j9152j3521j0081q374p278n726l297l93K103L414
$$ plain form
39308 1282291 1285586 1287690 1288265 1287771 1287249 1287759 1289574 1291485 1290836 1284471 1270097 1247256 1217421 1183376
39294 1183376 1148344 1115311 1086696 1064298 1049392 1042783 1044839 1055597 1074985 1103028 1139858 1185496
39282 1185496 1239568 1301181 1369018 1441534 1517063 1593730 1669345 1741549 1808295 1868451 1922074
39271 1922074 1970236 2014617 2057162 2099857 2144426 2191743 2240976 2288793 2329123 2353862 2354576 2324699
39259 2324699 2261497 2167078 2048052 1913866 1774362 1637474 1507915 1387275 1275190 1170911
39249 1170911 1074477 987041 910376 846043 794765 756303 729562 712731 703358 698614 695838 693183
39237 693183 689955 686417 683201 680816 679594 679968 682607 688227 697204 709347 723919 739743 755281
39224 755281 768765 778432 782900 781643 775400 766252 757286 751985 753658 765039 787925 822768 868410
$$ packed form
39308A282291L295K104N75m94n22N10J815J911o49o365j4374k2841k9835l4045
39294A183376l5032l3033k8615k2398j4906o609K056J0758J9388K8043L6830M5638
39282A185496N4072O1613O7837P2516P5529P6667P5615P2204O6746O0156N3623
39271A922074M8162M4381M2545M2695M4569M7317M9233M7817M0330K4739P14k9877
39259B324699o3202r4419j19026j34186j39504j36888j29559j20640j12085j04279
39249A170911r6434q7436p6665o4333n1278l8462k6741j6831r373m744k776k655
39237F93183l228l538l216k385j222L74K639N620Q977J2143J4572J5824J5538
39224G55281J3484R667M468j257o243r148q966n301J673J1381K2886L4843M5642
$$ plain form
39211 868410 922168 980346 1039007 1094777 1145393 1189780 1227721 1259463 1285597 1307163 1325672
39200 1325672 1342827 1360089 1378362 1397975 1418985 1441601 1466359 1493760 1523478 1553705 1581215
39189 1581215 1602104 1612857 1611244 1596891 1571339 1537566 1499031 1458705 1418539 1379569 1342338
39178 1342338 1307209 1274348 1243448 1213535 1183075 1150399 1114180 1073727 1028990 980425 928864
39167 928864 875381 821222 767811 716878 670561 631282 601356 582575 575969 581954 600759 632844
39155 632844 678911 739274 812854 896415 984565 1070611 1147798 1210507 1255037 1279840 1285209 1272700
39143 1272700 1244658 1204050 1154537 1100450 1046576 997750 958386 931910 920247 923527 940241
39132 940241 967801 1003146 1043201 1085029 1125837 1162895 1193487 1214913 1224656 1220798 1202697 1171692
$$ packed form
39211H68410N3758N8178N8661N5770N0616M4387L7941L1742K6134K1566J8509
39200A325672J7155J7262J8273J9613K1010K2616K4758K7401K9718L0227K7510
39189A581215K0889J0753j613j4353k5552l3773l8535m0326m0166l8970l7231
39178A342338l5129l2861l0900k9913l0460l2676l6219m0453m4737m8565n1561
39167I28864n3483n4159n3411n0933m6317l9279k9926j8781o606N985J8805L2085
39155F32844M6067O0363P3580Q3561Q8150Q6046P7187O2709M4530K4803N369j2509
39143A272700k8042m0608m9513n4087n3874m8826l9364k6476j1663L280J6714
39132I40241K7560L5345M0055M1828M0808L7058L0592K1426R743l858j8101l1005
$$ plain form
39120 1171692 1131340 1086780 1043425 1005615 975946 955371 943693 940009 942890 950415 960264 970135
39108 970135 978442 985044 991528 1000845 1016461 1041385 1077387 1124590 1181426 1244831 1310506 1373276
39096 1373276 1427704 1468998 1493960 1501588 1493173 1471944 1442370 1409156 1376055 1344961 1315719 1286858
39084 1286858 1256786 1224794 1191379 1157932 1126133 1097419 1072639 1051892 1034574 1019602 1005711
39073 1005711 991699 976557 959474 939887 917698 893685 869896 849538 836179 832613 840139 858618
39061 858618 887020 923924 967699 1016561 1068733 1122661 1177101 1230989 1283252 1332687 1378001
39050 1378001 1418015 1451930 1479413 1500324 1514166 1519715 1515207 1499047 1470658 1430999 1382587 1329045
39038 1329045 1274464 1222810 1177610 1141912 1118316 1108836 1114452 1134522 1166443 1205896 1247761 1287396
$$ packed form
39120A171692m0352m4560m3355l7810k9669k0575j1678l684K881P525R849R871
39108I70135Q307O602O484R317J5616K4924L6002M7203N6836O3405O5675O2770
39096A373276N4428M1294K4962P628q415k1229k9574l3214l3101l1094k9242k8861
39084A286858l0072l1992l3415l3447l1799k8714k4780k0747j7318j4972j3891
39073A005711j4012j5142j7083j9587k2189k4013k3789k0358j3359l566P526J8479
39061H58618K8402L6904M3775M8862N2172N3928N4440N3888N2263M9435M5314
39050A378001M0014L3915K7483K0911J3842N549m508j6160k8389l9659m8412n3542
39038A329045n4581n1654m5200l5698k3596r480N616K0070L1921L9453M1865L9635
$$ plain form
39026 1287396 1321779 1350084 1373471 1394113 1413803 1432709 1448922 1459077 1459809 1449423 1429088 1403040
39014 1403040 1377543 1358958 1351672 1356801 1372184 1393550 1416211 1436530 1452610 1464192 1471991 1476854
39002 1476854 1479126 1478465 1474122 1465312 1451300 1431203 1403983 1368908 1326256 1277702 1226154 1175250
38990 1175250 1128754 1089926 1060865 1042026 1032190 1028973 1029675 1032109 1035176 1039160 1045812 1058153 1079788
38977 1079788 1113761 1161392 1221791 1292338 1369780 1451278 1534927 1619696 1705127 1791134 1878035
38966 1878035 1966544 2057498 2151297 2247395 2344078 2438513 2526979 2605299 2669519 2716652 2745163
38955 2745163 2755071 2747754 2725578 2691392 2647914 2597198 2540388 2477803 2409235 2334282 2252643 2164326
38943 2164326 2069803 1970156 1867229 1763663 1662585 1567022 1479421 1401691 1335765 1284123 1249713
$$ packed form
39026A287396L4383K8305K3387K0642J9690J8906J6213J0155P32j0386k0335k6048
39014A403040k5497j8585p286N129J5383K1366K2661K0319J6080J1582P799M863
39002A476854K272o61m343q810j4012k0097k7220l5075m2652m8554n1548n0904
38990A175250m6496l8828k9061j8839r836l217P02K434L067L984O652J2341K1635
38977A079788L3973M7631O0399P0547P7442Q1498Q3649Q4769Q5431Q6007Q6901
38966A878035Q8509R0954R3799R6098R6683R4435Q8466P8320O4220M7133K8511
38955B745163R908p317k2176l4186m3478n0716n6810o2585o8568p4953q1639q8317
38943B164326r4523r9647j02927j03566j01078r5563q7601p7730o5926n1642l4410
$$ plain form
38932 1249713 1235149 1241555 1267611 1309263 1360346 1414025 1464454 1507904 1542886 1569422 1588035
38921 1588035 1599060 1602552 1598741 1588569 1573883 1557077 1540426 1525571 1513386 1504227 1498279 1495690
38909 1495690 1496415 1499908 1505000 1510050 1513217 1512763 1507407 1496782 1481710 1464006 1445813 1428896 1414273
38896 1414273 1402239 1392486 1384196 1376154 1367070 1356059 1342913 1327850 1310874 1291374 1268434 1241630
38884 1241630 1211627 1180192 1149790 1123119 1102825 1091322 1090619 1101990 1125406 1158894 1198328 1238069
38872 1238069 1272365 1296897 1309791 1311749 1305368 1294047 1281008 1268779 1259172 1253464 1252525 1256757 1265906
38859 1265906 1278881 1293775 1308114 1319392 1325678 1326132 1321250 1312720 1302891 1294060 1287851 1284971 1285248
38846 1285248 1287789 1291078 1293081 1291463 1283994 1269080 1246310 1216844 1183412 1149838 1120257 1098277
$$ packed form
38932A249713j4564O406K6056M1652N1083N3679N0429M3450L4982K6536J8613
38921A588035J1025L492l811j0172j4686j6806j6651j4855j2185r159n948k589
38909A495690P25L493N092N050L167m54n356j0625j5072j7704j8193j6917j4623
38896A414273j2034r753q290q042r084j1011j3146j5063j6976j9500k2940k6804
38884A241630l0003l1435l0402k6671k0294j1503p03J1371K3416L3488L9434L9741
38872A238069L4296K4532J2894J958o381j1321j3039j2229r607n708r39M232R149
38859A265906J2975J4894J4339J1278O286M54m882q530r829q831o209k880K77
38846A285248K541L289K003j618p469j4914k2770k9466l3432l3574k9581k1980
$$ plain form
38834 1098277 1086344 1085326 1094370 1111144 1132527 1155560 1178209 1199525 1219179 1236680 1250815 1259678
38822 1259678 1261340 1254674 1239753 1217547 1189322 1156347 1120190 1083297 1049376 1023234 1010135 1014816
38810 1014816 1040440 1087713 1154594 1236719 1328366 1423455 1516251 1601823 1676440 1737904 1785614
38799 1785614 1820176 1842673 1853884 1853799 1841665 1816587 1778326 1727753 1666623 1596857 1519961 1437072
38787 1437072 1349527 1259486 1170021 1084574 1006139 936697 877265 828381 790608 764704 751356
38776 751356 750650 761516 781418 806515 832386 855013 871629 880999 883140 878745 868750 854197 836302
38763 836302 816520 796511 778020 762673 751631 745183 742601 742567 744101 747416 754073 766208 785303
38750 785303 811316 842652 876861 911558 945142 977145 1008237 1039882 1073816 1111626 1154599
$$ packed form
38834A098277j1933j018R044J6774K1383K3033K2649K1316J9654J7501J4135Q863
38822A259678J662o666j4921k2206k8225l2975l6157l6893l3921k6142j3099M681
38810A014816K5624M7273O6881Q2125R1647R5089R2796Q5572P4617O1464M7710
38799A785614L4562K2497J1211q5j2134k5078l8261n0573o1130o9766p6896q2889
38787A437072q7545r0041q9465q5447p8435o9442n9432m8884l7773k5904j3348
38776G51356p06J0866J9902K5097K5871K2627J6616R370K141m395r995j4553j7895
38763H36302j9782k0009j8491j5347j1042o448k582l4J534L315O657J2135J9095
38750G85303K6013L1336L4209L4697L3584L2003L1092L1645L3934L7810M2973
$$ plain form
38739 1154599 1203756 1259767 1322620 1391130 1462566 1532632 1596007 1647466 1683243 1701998 1704846
38728 1704846 1694474 1673877 1645414 1610619 1570791 1527893 1485104 1446452 1415590 1394359 1381940
38717 1381940 1374983 1368549 1357398 1337192 1305466 1262306 1210571 1155440 1103209 1059766 1029384 1014207
38705 1014207 1014294 1027901 1051929 1082542 1115887 1148622 1178120 1202440 1220315 1231139 1234960 1232434
38693 1232434 1224774 1213674 1201192 1189506 1180540 1175446 1174246 1176023 1179763 1185309 1193603 1205971 1223021
38680 1223021 1244081 1267511 1291523 1314847 1336862 1357305 1375855 1391945 1404990 1414917 1422607 1429786
38668 1429786 1438321 1449408 1463275 1479555 1497869 1518011 1539558 1561284 1580966 1595847 1603525 1602661
38656 1602661 1593057 1575271 1550186 1518924 1482945 1443987 1403806 1363968 1325967 1291568 1263030
$$ packed form
38739A154599M9157N6011O2853O8510P1436P0066O3375N1459L5777J8755K848
38728A704846j0372k0597k8463l4795l9828m2898m2789l8652l0862k1231j2419
38717A381940o957o434j1151k0206l1726m3160n1735n5131n2231m3443l0382j5177
38705A014207Q7J3607K4028L0613L3345L2735K9498K4320J7875J0824L821k526
38693A232434p660j1100j2482j1686q966n094j200J777L740N546Q294J2368J7050
38680A223021K1060K3430K4012K3324K2015K0443J8550J6090J3045R927P690P179
38668A429786Q535J1087J3867J6280J8314K0142K1547K1726J9682J4881P678q64
38656A602661r604j7786k5085l1262l5979l8958m0181l9838l8001l4399k8538
$$ plain form
38645 1263030 1242975 1233877 1237348 1253454 1280312 1314217 1350392 1384288 1412999 1436135 1455533 1473804
38633 1473804 1492490 1510939 1526509 1535716 1535500 1524026 1501068 1468202 1428771 1387430 1349233 1318596
38621 1318596 1298555 1290396 1293619 1306177 1324954 1346398 1367099 1384151 1395431 1399890 1397750 1390356
38609 1390356 1379525 1366807 1353121 1338994 1325045 1312278 1302055 1295943 1295562 1302338 1317058 1339279
38597 1339279 1366899 1396197 1422544 1441662 1450969 1450351 1442029 1429755 1417737 1409506 1406834 1408973 1412794
38584 1412794 1413959 1408650 1394969 1373444 1346612 1318084 1291623 1270620 1257996 1256297 1267659 1293506
38572 1293506 1334098 1388192 1452977 1524355 1597510 1667606 1730570 1783820 1826773 1860863 1889040
38561 1889040 1914893 1941781 1972160 2007196 2046611 2088746 2130883 2169931 2203382 2230202 2251079
$$ packed form
38645A263030k0055r098L471J6106K6858L3905L6175L3896K8711K3136J9398J8271
38633A473804J8686J8449J5570R207k16j1474k2958l2866l9431m1341l8197l0637
38621A318596k0041q159L223J2558J8777K1444K0701J7052J1280M459k140p394
38609A390356j0831j2718j3686j4127j3949j2767j0223o112l81O776J4720K2221
38597A339279K7620K9298K6347J9118R307o18q322j2274j2018q231k672K139L821
38584A412794J165n309j3681k1525k6832k8528k6461k1003j2624j699J1362K5847
38572A293506M0592N4094O4785P1378P3155P0096O2964N3250M2953L4090K8177
38561A889040K5853K6888L0379L5036L9415M2135M2137L9048L3451K6820K0877
$$ plain form
38550 2251079 2267674 2281304 2291829 2297552 2296109 2285747 2266222 2238845 2205833 2169401 2131190 2092284
38538 2092284 2053719 2017085 1984656 1958884 1941477 1932749 1931685 1936611 1945843 1957835 1970752 1981945
38526 1981945 1987748 1983949 1966827 1934463 1887747 1830720 1770055 1713839 1669925 1644270 1639559 1654467
38514 1654467 1683763 1719446 1752725 1776313 1786123 1781763 1765716 1741790 1713552 1683339 1652041 1619518
38502 1619518 1585407 1549967 1514675 1482293 1456350 1440180 1435860 1443426 1460663 1483596 1507518 1528114
38490 1528114 1542325 1548787 1547983 1542014 1533938 1526746 1522474 1521941 1525066 1531351 1540133 1550580 1561538 1571461
38476 1571461 1578548 1581181 1578461 1570463 1557974 1541892 1522629 1499817 1472396 1438985 1398426 1350287
38464 1350287 1295099 1234308 1170089 1105220 1042992 987002 940649 906399 885196 876454 878703 890520
$$ packed form
38550B251079J6595J3630J0525N723j443j0362j9525k7377l3012l6432l8211l8906
38538B092284l8565l6634l2429k5772j7407q728j064M926R232J1992J2917J1193
38526A981945N803l799j7122l2364m6716n7027o0665n6216m3914k5655m711J4908
38514A654467K9296L5683L3279K3588R810m360j6047k3926k8238l0213l1298l2523
38502A619518l4111l5440l5292l2382k5943j6170m320P566J7237K2933K3922K0596
38490A528114J4211O462q04n969q076p192m272n33L125O285Q782J0447J0958R923
38476A571461P087K633k720p998j2489j6082j9263k2812k7421l3411m0559m8139
38464A350287n5188o0791o4219o4869o2228n5990m6353l4250k1203q742K249J1817
$$ plain form
38452 890520 911120 940353 978339 1025152 1080734 1144860 1216885 1295337 1377692 1460618 1540699
38441 1540699 1615314 1683249 1744761 1800982 1852836 1899959 1940267 1970499 1987499 1989426 1976237
38430 1976237 1949319 1910726 1862583 1806921 1745939 1682482 1620442 1564711 1520532 1492385 1482913
38419 1482913 1492312 1518309 1556636 1601891 1648629 1692460 1730663 1762138 1786841 1805166 1817536
38408 1817536 1824212 1825227 1820415 1809558 1792556 1769567 1741121 1708276 1672791 1637223 1604787 1578898
38396 1578898 1562349 1556344 1559873 1569865 1582076 1592224 1596818 1593571 1581503 1560911 1533204 1500686
38384 1500686 1466280 1433121 1404025 1380946 1364724 1355174 1351321 1351574 1353934 1356364 1357260 1355703 1351248
38371 1351248 1343379 1331078 1312948 1288041 1257007 1222821 1190469 1165580 1152644 1153636 1167597 1191250
$$ packed form
38452H90520K0600K9233L7986M6813N5582O4126P2025P8452Q2355Q2926Q0081
38441A540699P4615O7935O1512N6221N1854M7123M0308L0232J7000J927j3189
38430A976237k6918l8593m8143n5662o0982o3457o2040n5731m4179k8147r472
38419A482913R399K5997L8327M5255M6738M3831L8203L1475K4703J8325J2370
38408A817536O676J015m812j0857j7002k2989k8446l2845l5485l5568l2436k5889
38396A578898j6549o005L529R992J2211J0148M594l247j2068k0592k7707l2518
38384A500686l4406l3159k9096k3079j6222r550l853K53K360K430Q96j557m455
38371A351248p869j2301j8130k4907l1034l4186l2352k4889j2936R92J3961K3653
$$ plain form
38359 1191250 1220308 1250929 1280714 1308976 1336338 1364012 1393073 1423887 1455822 1487306 1516293
38348 1516293 1541049 1560967 1576911 1590768 1604293 1617860 1629864 1637105 1635978 1623980 1600981 1569759
38336 1569759 1535500 1504421 1482095 1472190 1475982 1492571 1519572 1554006 1593092 1634597 1676710 1717681
38324 1717681 1755592 1788413 1814271 1831778 1840367 1840514 1833657 1821708 1806344 1788407 1767803 1743960
38312 1743960 1716645 1686701 1656237 1628161 1605306 1589594 1581600 1580519 1584391 1590357 1594921 1594342 1585260
38299 1585260 1565470 1534544 1493982 1446906 1397462 1350067 1308513 1275105 1250176 1232339 1219399
38288 1219399 1209555 1202275 1198510 1200192 1209384 1227576 1255316 1292030 1335810 1383215 1429498 1469491
38276 1469491 1498896 1515431 1519365 1513302 1501357 1488118 1477670 1472969 1475567 1485634 1502254 1523937
$$ packed form
38359A191250K9058L0621K9785K8262K7362K7674K9061L0814L1935L1484K8987
38348A516293K4756J9918J5944J3857J3525J3567J2004P241j127j1998k2999l1222
38336A569759l4259l1079k2326r905L792J6589K7001L4434L9086M1505M2113M0971
38324A717681L7911L2821K5858J7507Q589J47o857j1949j5364j7937k0604k3843
38312A743960k7315k9944l0464k8076k2855j5712p994j081L872N966M564n79r082
38299A585260j9790l0926m0562m7076m9444m7395m1554l3408k4929j7837j2940
38288A219399r844p280l765J682R192J8192K7740L6714M3780M7405M6283L9993
38276A469491K9405J6535L934o063j1945j3239j0448m701K598J0067J6620K1683
$$ plain form
38264 1523937 1549163 1576661 1605311 1633798 1660462 1683615 1702251 1716763 1729249 1743281 1763306
38253 1763306 1793810 1838290 1898091 1971439 2053304 2136374 2212801 2275884 2321058 2346056 2350613
38242 2350613 2336125 2305456 2262805 2213446 2163184 2117494 2080624 2054958 2040917 2037436 2042820 2055649
38230 2055649 2075312 2101986 2136057 2177387 2224748 2275729 2327103 2375543 2418376 2454103 2482431
38219 2482431 2503938 2519581 2530292 2536666 2538729 2535765 2526343 2508659 2481147 2443095 2394937 2338104
38207 2338104 2274633 2206911 2137757 2070652 2009662 1958869 1921462 1898943 1890883 1895254 1909125 1929345
38195 1929345 1952962 1977346 2000123 2019127 2032517 2039049 2038429 2031450 2019777 2005378 1989807 1973622
38183 1973622 1956174 1935826 1910586 1878875 1840138 1795022 1745087 1692358 1638964 1587035 1538768
$$ packed form
38264A523937K5226K7498K8650K8487K6664K3153J8636J4512J2486J4032K0025
38253A763306L0504M4480N9801P3348Q1865Q3070P6427O3083M5174K4998M557
38242B350613j4488l0669m2651m9359n0262m5690l6870k5666j4041l481N384J2829
38230B055649J9663K6674L4071M1330M7361N0981N1374M8440M2833L5727K8328
38219B482431K1507J5643J0711O374K063k964r422j7684k7512l8052m8158n6833
38207B338104o3471o7722o9154o7105o0990n0793l7407k2519q060M371J3871K0220
38195A929345K3617K4384K2777J9004J3390O532o20o979j1673j4399j5571j6185
38183A973622j7448k0348k5240l1711l8737m5116m9935n2729n3394n1929m8267
$$ plain form
38172 1538768 1496508 1462662 1439375 1427984 1428423 1438950 1456451 1477298 1498383 1517854 1535240 1551096
38160 1551096 1566459 1582442 1600063 1620264 1644042 1672560 1707095 1748743 1797980 1854317 1916233
38149 1916233 1981427 2047184 2110742 2169544 2221430 2264686 2297965 2320065 2329687 2325419 2306052 2271142
38137 2271142 2221395 2158617 2085257 2003881 1916896 1826623 1735651 1647268 1565617 1495203 1439895
38126 1439895 1401947 1381665 1377780 1388107 1410000 1440445 1475880 1512099 1544552 1569224 1583747
38115 1583747 1588080 1584345 1575897 1566180 1557853 1552374 1550072 1550565 1553287 1557808 1563814 1570845 1578146 1584869
38101 1584869 1590613 1595944 1602471 1612318 1627315 1648346 1675147 1706467 1740337 1774329 1805788 1832148
38089 1832148 1851329 1862111 1864346 1858867 1847148 1830932 1811963 1791850 1771921 1753037 1735459 1718913
$$ packed form
38172A538768m2260l3846k3287j1391M39J0527J7501K0847K1085J9471J7386J5856
38160A551096J5363J5983J7621K0201K3778K8518L4535M1648M9237N6337O1916
38149A916233O5194O5757O3558N8802N1886M3256L3279K2100R622m268j9367l4910
38137B271142m9747o2778p3360q1376q6985r0273r0972q8383q1651p0414n5308
38126A439895l7948k0282l885J0327K1893L0445L5435L6219L2453K4672J4523
38115A583747M333l735q448r717q327n479k302M93K722M521O006P031P301O723
38101A584869N744N331O527R847J4997K1031K6801L1320L3870L3992L1459K6360
38089A832148J9181J0782K235n479j1719j6216j8969k0113j9929j8884j7578j6546
$$ plain form
38077 1718913 1702833 1686570 1669426 1650491 1628526 1602136 1570329 1533348 1493394 1454717 1422789
38066 1422789 1402759 1397846 1408355 1431615 1462833 1496590 1528538 1556566 1580839 1602736 1623519
38055 1623519 1643690 1663311 1682716 1702761 1724343 1747494 1770769 1791290 1805511 1810373 1804388 1788266
38043 1788266 1764817 1738204 1712850 1692392 1678926 1672593 1671533 1672171 1669936 1660415 1640747 1610771
38031 1610771 1573315 1533361 1496370 1466615 1446245 1435331 1432586 1436277 1444942 1457804 1474901 1496927
38019 1496927 1524760 1558686 1597522 1638100 1675519 1704278 1719846 1719954 1705069 1678017 1643199 1605705
38007 1605705 1570391 1540930 1519146 1505001 1497263 1494335 1494756 1497306 1501065 1505640 1511443 1519795 1532778
37994 1532778 1552896 1582638 1623882 1677154 1740926 1811368 1882923 1949594 2006423 2050587 2081972
$$ packed form
38077A718913j6080j6263j7144j8935k1965k6390l1807l6981l9954l8677l1928
38066A422789k0030m913J0509K3260L1218L3757L1948K8028K4273K1897K0783
38055A623519K0171J9621J9405K0045K1582K3151K3275K0521J4221M862n985j6122
38043A788266k3449k6613k5354k0458j3466o333j060O38k235r521j9668k9976
38031A610771l7456l9954l6991k9755k0370j0914k745L691Q665J2862J7097K2026
38019A496927K7833L3926L8836M0578L7419K8759J5568J08j4885k7052l4818l7494
38007A605705l5314k9461k1784j4145p738k928M21K550L759M575N803Q352J2983
37994A532778K0118K9742M1244N3272O3772P0442P1555O6671N6829M4164L1385
$$ plain form
37983 2081972 2103262 2119448 2136571 2159949 2192556 2234250 2282005 2330904 2375568 2411547 2436146
37972 2436146 2448293 2447708 2434150 2407361 2367670 2316557 2256654 2191125 2122820 2053713 1984846 1916723
37960 1916723 1849755 1784381 1720832 1658771 1597247 1535169 1472127 1409190 1349180 1296199 1254545
37949 1254545 1227507 1216663 1221812 1241343 1272656 1312619 1358115 1406530 1455899 1504622 1551098
37938 1551098 1593625 1630694 1661431 1686023 1705858 1723228 1740531 1759385 1780109 1801825 1822923
37927 1822923 1841605 1856386 1866597 1872714 1876318 1879562 1884395 1891929 1902256 1914689 1928246 1942090
37915 1942090 1955831 1969634 1984127 2000052 2017717 2036534 2054952 2070990 2083094 2090826 2094957 2097048
37903 2097048 2098969 2102698 2110369 2124213 2146163 2177203 2216769 2262527 2310719 2357025 2397603 2429820
$$ packed form
37983B081972K1290J6186J7123K3378L2607M1694M7755M8899M4664L5979K4599
37972B436146J2147n85j3558k6789l9691n1113n9903o5529o8305o9107o8867o8123
37960A916723o6968o5374o3549o2061o1524o2078o3042o2937o0010n2981m1654
37949A254545k7038j0844N149J9531L1313L9963M5496M8415M9369M8723M6476
37938A551098M2527L7069L0737K4592J9835J7370J7303J8854K0724K1716K1098
37927A822923J8682J4781J0211O117L604L244M833P534J0327J2433J3557J3844
37915A942090J3741J3803J4493J5925J7665J8817J8418J6038J2104P732M131K091
37903B097048J921L729P671J3844K1950L1040L9566M5758M8192M6306M0578L2217
$$ plain form
37891 2429820 2452457 2465421 2469287 2464896 2453059 2434315 2408779 2376149 2335973 2288052 2232711 2170770
37879 2170770 2103250 2031095 1955057 1875698 1793306 1707736 1618341 1524285 1425275 1322504 1219289
37868 1219289 1120930 1033671 963101 912600 882511 870317 871766 882423 899084 920588 947873
37857 947873 983343 1029846 1089591 1163329 1249953 1346605 1449241 1553448 1655110 1750649 1836927
37846 1836927 1911217 1971461 2016607 2046669 2062422 2064890 2054889 2032849 1999100 1954476 1900762
37835 1900762 1840521 1776306 1709875 1641932 1572481 1501472 1429334 1357144 1286386 1218471 1154332
37824 1154332 1094323 1038493 987031 940695 900924 869465 847654 835720 832618 836480 845413 858129
37812 858129 874099 893307 915888 941829 970818 1002210 1035223 1069254 1103963 1138859 1172705
$$ packed form
37891B429820K2637J2964L866m391j1837j8744k5536l2630m0176m7921n5341o1941
37879B170770o7520p2155p6038p9359q2392q5570q9395r4056r9010j02771j03215
37868A219289r8359q7259p0570n0501l0089j2194J449J0657J6661K1504K7285
37857I47873L5470M6503N9745P3738Q6624R6652J02636J04207J01662R5539Q6278
37846A836927P4290O0244M5146L0062J5753K468j0001k2040l3749m4624n3714
37835A900762o0241o4215o6431o7943o9451p1009p2138p2190p0758o7915o4139
37824A154332o0009n5830n1462m6336l9771l1459k1811j1934l102L862Q933J2716
37812H58129J5970J9208K2581K5941K8989L1392L3013L4031L4709L4896L3846
$$ plain form
37801 1172705 1203370 1228485 1246420 1256865 1260682 1259324 1254312 1247011 1238697 1230735 1224705 1222407 1225769
37788 1225769 1236685 1256798 1287248 1328489 1380284 1441831 1511851 1588565 1669683 1752596 1834732
37777 1834732 1913909 1988453 2057039 2118366 2170838 2212402 2240587 2252777 2246798 2221863 2179655
37766 2179655 2125012 2065507 2009803 1965419 1937108 1926572 1933269 1955368 1990229 2034546 2084572
37755 2084572 2136439 2186294 2230132 2263679 2282768 2284152 2266416 2230484 2179582 2118655 2053403
37744 2053403 1989127 1929607 1876354 1828526 1783656 1738979 1692815 1645413 1598925 1556525 1521059
37733 1521059 1493784 1473732 1458012 1442920 1425230 1403032 1375826 1344130 1309046 1271899 1233862
37722 1233862 1195572 1157062 1118175 1079175 1041033 1005254 973731 948957 934324 933749 950351 984824
$$ packed form
37801A172705L0665K5115J7935J0445L817j358n012p301q314p962o030k298L362
37788A225769J0916K0113L0450M1241N1795O1547P0020P6714Q1118Q2913Q2136
37777A834732P9177P4544O8586O1327N2472M1564K8185J2190n979k4935m2208
37766B179655n4643n9505n5704m4384k8311j0536O697K2099L4861M4317N0026
37755B084572N1867M9855M3838L3547J9089J384j7736l5932n0902o0927o5252
37744B053403o4276n9520n3253m7828m4870m4677m6164m7402m6488m2400l5466
37733A521059k7275k0052j5720j5092j7690k2198k7206l1696l5084l7147l8037
37722A233862l8290l8510l8887l9000l8142l5779l1523k4774j4633n75J6602L4473
$$ plain form
37710 984824 1034592 1094398 1157961 1219749 1275963 1324600 1365036 1397667 1423787 1445403 1464696
37699 1464696 1483111 1500510 1514928 1523217 1522297 1510341 1487335 1454901 1415651 1372470 1328044 1284749
37687 1284749 1244769 1210213 1183018 1164692 1156041 1157059 1166956 1184381 1207726 1235359 1265567 1296346
37675 1296346 1325330 1350197 1369327 1382287 1389829 1393468 1394929 1395719 1396850 1398743 1401221 1403595 1404829
37662 1404829 1403798 1399664 1392272 1382462 1372231 1364606 1363197 1371421 1391635 1424482 1468684 1521356 1578729
37649 1578729 1636989 1692773 1743141 1785209 1816038 1833103 1835107 1822400 1796673 1760140 1714937
37638 1714937 1663084 1606866 1549083 1492886 1441275 1396597 1360245 1332610 1313286 1301447 1296182
37627 1296182 1296507 1301007 1307580 1313758 1317582 1318331 1316466 1312863 1308050 1302080 1295021 1287557 1281162 1277842
$$ packed form
37710I84824M9768N9806O3563O1788N6214M8637M0436L2631K6120K1616J9293
37699A464696J8415J7399J4418Q289r20j1956k3006l2434l9250m3181m4426m3295
37687A284749l9980l4556k7195j8326q651J018R897J7425K3345K7633L0208L0779
37675A296346K8984K4867J9130J2960P542L639J461P90J131J893K478K374J234
37662A404829j031m134p392r810j0231p625j409Q224K0214L2847M4202N2672N7373
37649A578729N8260N5784N0368M2068L0829J7065K004j2707k5727l6533m5203
37638A714937n1853n6218n7783n6197n1611m4678l6352k7635j9324j1839n265
37627A296182L25M500O573O178L824P49j865l603m813n970p059p464o395l320
$$ plain form
37613 1277842 1279671 1288441 1305481 1331504 1366477 1409563 1459278 1513800 1571296 1630094 1688639 1745305
37601 1745305 1798172 1844949 1883117 1910268 1924612 1925458 1913498 1890689 1859750 1823529 1784593 1745118
37589 1745118 1706944 1671645 1640624 1615176 1596457 1585190 1581162 1582807 1587168 1590370 1588529 1578756
37577 1578756 1559896 1532690 1499300 1462371 1423994 1385065 1345359 1304307 1262034 1219953 1180561
37566 1180561 1146521 1119676 1100501 1088261 1081650 1079579 1081711 1088573 1101220 1120710 1147661 1182083
37554 1182083 1223397 1270445 1321434 1373955 1425250 1472680 1514185 1548497 1575124 1594240 1606629
37543 1606629 1613664 1617133 1618818 1620061 1621674 1624284 1628810 1636506 1648455 1664834 1684486 1705035 1723379
37530 1723379 1736283 1740958 1735676 1720370 1696936 1668951 1640823 1616887 1600869 1595812 1604111 1627364
$$ packed form
37613A277842J829Q770J7040K6023L4973M3086M9715N4522N7496N8798N8545N6666
37601A745305N2867M6777L8168K7151J4344Q46j1960k2809l0939l6221l8936l9475
37589A745118l8174l5299l1021k5448j8719j1267m028J645M361L202j841r773
37577A578756j8860k7206l3390l6929l8377l8929l9706m1052m2273m2081l9392
37566A180561l4040k6845j9175j2240o611k071K132O862J2647J9490K6951L4422
37554A182083M1314M7048N0989N2521N1295M7430M1505L4312K6627J9116J2389
37543A606629P035L469J685J243J613K610M526P696J1949J6379J9652K0549J8344
37530A723379J2904M675n282j5306k3434k7985k8128k3936j6018n057Q299K3253
$$ plain form
37518 1627364 1666025 1719133 1784229 1857481 1933951 2008033 2074211 2128096 2167375 2192153 2204370
37507 2204370 2206604 2200975 2188724 2170576 2147468 2121176 2094427 2070379 2051690 2039703 2034203 2033800
37495 2033800 2036537 2040293 2042837 2041831 2035035 2020798 1998595 1969314 1935160 1899306 1865383 1836923
37483 1836923 1816858 1807211 1809010 1822368 1846651 1880791 1923683 1974458 2032464 2096940 2166723 2240166
37471 2240166 2315279 2389989 2462375 2530842 2594152 2651382 2701880 2745212 2781088 2809276 2829627
37460 2829627 2842145 2846869 2843480 2830841 2807021 2769958 2718537 2653478 2577575 2495129 2410854 2328765
37448 2328765 2251516 2180341 2115399 2056196 2001987 1952228 1907024 1867306 1834395 1809085 1790874
37437 1790874 1777973 1768172 1759951 1753042 1748126 1745930 1746353 1748169 1749413 1748209 1743592 1735985 1727137 1719490
$$ packed form
37518A627364L8661N3108O5096P3252P6470P4082O6178N3885L9279K4778J2217
37507B204370K234n629j2251j8148k3108k6292k6749k4048j8689j1987n500m03
37495B033800K737L756K544j006o796j4237k2203k9281l4154l5854l3923k8460
37483A836923k0065r647J799J3358K4283L4140M2892N0775N8006O4476O9783P3443
37471B240166P5113P4710P2386O8467O3310N7230N0498M3332L5876K8188K0351
37460B829627J2518M724l389j2639k3820l7063n1421o5059p5903q2446q4275q2089
37448B328765p7249p1175o4942n9203n4209m9759m5204l9718l2911k5310j8211
37437A790874j2901r801q221o909m916k196M23J816J244j204m617p607q848p647
$$ plain form
37423 1719490 1715213 1715361 1719603 1726641 1734970 1743491 1751690 1759369 1766198 1771443 1774109 1773384 1769017 1761382
37409 1761382 1751280 1739780 1728276 1718777 1714093 1717593 1732300 1759566 1798078 1843808 1890948 1933213
37397 1933213 1965016 1982348 1983368 1968614 1940750 1903920 1862970 1822760 1787656 1761239 1746221
37386 1746221 1744463 1756929 1783520 1822797 1871901 1926788 1982804 2035314 2080175 2114077 2134876
37375 2134876 2141848 2135725 2118434 2092700 2061656 2028415 1995698 1965603 1939650 1918892 1903858 1894355
37363 1894355 1889266 1886615 1883952 1879106 1870997 1859998 1847338 1833835 1818973 1801139 1778926 1752354
37351 1752354 1723138 1693883 1666997 1643974 1625255 1610353 1598081 1586880 1575377 1562915 1549704
37340 1549704 1536458 1523833 1512130 1501449 1492064 1484703 1480467 1480429 1484997 1493331 1503268 1512026 1517452
$$ packed form
37423A719490m277J48M242P038Q329Q521Q199P679O829N245K666p25m367p635
37409A761382j0102j1500j1504r499m684L500J4707K7266L8512M5730M7140M2265
37397A933213L1803J7332J020j4754k7864l6830m0950m0210l5104k6417j5018
37386A746221j758J2466K6591L9277M9104N4887N6016N2510M4861L3902K0799
37375B134876O972o123j7291k5734l1044l3241l2717l0095k5953k0758j5034r503
37363A894355n089k651k663m846q109j0999j2660j3503j4862j7834k2213k6572
37351A752354k9216k9255k6886k3023j8719j4902j2272j1201j1503j2462j3211
37340A549704j3246j2625j1703j0681r385p361m236l8M568Q334R937Q758N426
$$ plain form
37327 1517452 1519027 1517909 1515954 1514396 1512993 1509951 1502543 1488007 1464490 1431811 1391924 1348918 1308467
37314 1308467 1276779 1259270 1259397 1278033 1313510 1362231 1419520 1480471 1540647 1596498 1645462 1685791
37302 1685791 1716317 1736435 1746374 1747469 1742081 1733065 1722985 1713575 1705716 1699952 1697293 1699807 1710557
37289 1710557 1732744 1768363 1816957 1875022 1936429 1993768 2040061 2070177 2081467 2073715 2048707
37278 2048707 2009657 1960510 1905186 1846971 1788199 1730212 1673577 1618582 1565973 1517680 1477047
37267 1477047 1448270 1435147 1439760 1461721 1498202 1544587 1595362 1645040 1688989 1724066 1748949
37256 1748949 1764243 1772477 1777957 1786167 1802485 1830455 1870422 1919417 1972564 2025363 2075565 2123620
37244 2123620 2171651 2221716 2274375 2328100 2379554 2424477 2458866 2480135 2487930 2484248 2472716 2457355
$$ packed form
37327A517452J575j118j955j558j403l042p408j4536k3517l2679l9887m3006m0451
37314A308467l1688j7509J27J8636L5477M8721N7289O0951O0176N5851M8964M0329
37302A685791L0526K0118R939J095n388r016j0080r410p859n764k659K514J0750
37289A710557K2187L5619M8594N8065O1407N7339M6293L0116J1290p752k5008
37278B048707l9050m9147n5324n8215n8772n7987n6635n4995n2609m8293m0633
37267A477047k8777j3123M613K1961L6481M6385N0775M9678M3949L5077K4883
37256A748949J5294Q234N480Q210J6318K7970L9967M8995N3147N2799N0202M8055
37244B123620M8031N0065N2659N3725N1454M4923L4389K1269P795l682j1532j5361
$$ plain form
37232 2457355 2441455 2427097 2415309 2406471 2400550 2397151 2395548 2394839 2394195 2393091 2391393 2389312 2387312 2386006
37218 2386006 2386029 2387834 2391486 2396600 2402494 2408460 2414082 2419555 2425910 2434879 2448236 2466876 2490283 2516880
37204 2516880 2545107 2574595 2606598 2643540 2687920 2741172 2802816 2870001 2937562 2998695 3046257
37193 3046257 3074380 3079900 3063102 3027525 2978944 2923889 2868275 2816569 2771625 2734999 2707356
37182 2707356 2688702 2678421 2675372 2678322 2686616 2700647 2721668 2750861 2788217 2831927 2878765 2925146
37170 2925146 2968171 3006024 3037788 3063073 3081817 3094229 3100840 3102688 3101576 3100085 3101027 3106471 3116902
37157 3116902 3131097 3146772 3161574 3173776 3182350 3186581 3185697 3178829 3165257 3144637 3117062 3083012
37145 3083012 3043212 2998375 2948833 2894313 2834154 2768044 2696918 2623449 2551662 2485796 2428995
$$ packed form
37232B457355j5900j4358j1788q838n921l399j603p09o44j104j698k081k000j306
37218B386006K3J805L652N114N894N966N622N473O355Q969J3357J8640K3407K6597
37204B516880K8227K9488L2003L6942M4380N3252O1644O7185O7561O1133M7562
37193C046257K8123N520j6798l5577m8581n5055n5614n1706m4944l6626k7643
37182B707356j8654j0281l049K950Q294J4031K1021K9193L7356M3710M6838M6381
37170B925146M3025L7853L1764K5285J8744J2412O611J848j112j491R42N444J0431
37157C116902J4195J5675J4802J2202Q574M231q84o868j3572k0620k7575l4050
37145C083012l9800m4837m9542n4520o0159o6110p1126p3469p1787o5866n6801
$$ plain form
37134 2428995 2382569 2346067 2317925 2296167 2278876 2264406 2251499 2239404 2227996 2217814 2209967
37123 2209967 2205950 2207476 2216341 2234302 2262961 2303693 2357598 2425423 2507360 2602776 2710066 2826651
37111 2826651 2949185 3073889 3197004 3315335 3426730 3530281 3626137 3715052 3797871 3875184
37101 3875184 3947134 4013344 4072995 4125239 4169926 4208435 4244130 4282049 4327807 4385970 4458355
37090 4458355 4542858 4633398 4721372 4798183 4857633 4896905 4915888 4915727 4897885 4864145 4817129 4760537
37078 4760537 4698820 4636554 4577898 4526347 4484607 4454425 4436330 4429486 4431900 4440954 4454088 4469311
37066 4469311 4485393 4501782 4518453 4535820 4554744 4576480 4602587 4634846 4675243 4725858 4788530
37055 4788530 4864315 4953092 5053623 5164243 5283831 5412416 5550772 5698994 5854816 6012748
$$ packed form
37134B428995m6426l6502k8142k1758j7291j4470j2907j2095j1408j0182p847
37123B209967m017J526Q865J7961K8659M0732N3905O7825Q1937R5416J07290J16585
37111B826651J22534J24704J23115J18331J11395J03551R5856Q8915Q2819P7313
37101C875184P1950O6210N9651N2244M4687L8509L5695L7919M5758N8163P2385
37090D458355Q4503R0540Q7974P6811N9450L9272J8983j61j7842l3740m7016n6592
37078D760537o1717o2266n8656n1551m1740l0182j8095o844K414R054J3134J5223
37066D469311J6082J6389J6671J7367J8924K1736K6107L2259M0397N0615O2672
37055D788530P5785Q8777J00531J10620J19588J28585J38356J48222J55822J57932
$$ plain form
37045 6012748 6164611 6301296 6414979 6500912 6558150 6589172 6598803 6593013 6577922 6558999 6540491
37034 6540491 6525166 6514426 6508640 6507472 6510188 6515869 6523604 6532702 6543049 6555494 6571959 6595121
37022 6595121 6627821 6672540 6731114 6804547 6892766 6994284 7105917 7222856 7339335 7449833
37012 7449833 7550358 7639172 7716671 7784736 7846046 7903662 7960801 8020607 8085817 8158500 8239905
37001 8239905 8330414 8429529 8535994 8648270 8765371 8887689 9017257 9157239 9310885 9480465
36991 9480465 9666556 9867890 10081685 10304272 10531775 10760723 10988527 11213726 11436049
36982 11436049 11656344 11876555 12099759 12330042 12571985 12829849 13106867 13405091 13725956
36973 13725956 14071246 14443912 14848258 15289378 15772204 16300717 16877545 17503951 18180057
$$ packed form
37045F012748J51863J36685J13683Q5933N7238L1022R631n790j5091j8923j8508
37034F540491j5325j0740n786j168K716N681P735R098J0347J2445J6465K3162
37022F595121L2700M4719N8574P3433Q8219J01518J11633J16939J16479J10498
37012G449833J00525Q8814P7499O8065O1310N7616N7139N9806O5210P2683Q1405
37001H239905R0509R9115J06465J12276J17101J22318J29568J39982J53646J69580
36991I480465J86091K01334K13795K22587K27503K28948K27804K25199K22323
36982A1436049K20295K20211K23204K30283K41943K57864K77018K98224L20865
36973A3725956L45290L72666M04346M41120M82826N28513N76828O26406O76106
$$ plain form
36964 18180057 18905385 19679673 20503773 21380295 22313911 23311439 24381769 25535444 26783846
36955 26783846 28138249 29609186 31206467 32939920 34820617 36862112 39081131 41497482
36947 41497482 44133483 47013482 50163813 53613226 57393640 61541022 66096254 71105804
36939 71105804 76622075 82703239 89412306 96815329 104978948 113967669 123841030 134650536
36931 134650536 146435889 159219737 172999754 187736802 203338385 219637552 236368615
36924 236368615 253142832 269429853 284554454 297721769 308084137 314853121 317439520
36917 317439520 315581140 309410198 299430925 286415348 271257811 254837175 237919736
36910 237919736 221111397 204850015 189422679 174994349 161638516 149364826 138141644
$$ packed form
36964A8180057P25328P74288Q24100Q76522R33616R97528J070330J153675J248402
36955B6783846J354403J470937J597281J733453J880697K041495K219019K416351
36947D1497482K636001K879999L150331L449413L780414M147382M555232N009550
36939G1105804N516271O081164O709067P403023Q163619Q988721R873361J0809506
36931A34650536J1785353J2783848J3780017J4737048J5601583J6299167J6731063
36924B36368615J6774217J6287021J5124601J3167315J0362368O768984K586399
36917C17439520j858380o170942r979273j3015577j5157537j6420636j6917439
36910B37919736j6808339j6261382j5427336j4428330j3355833j2273690j1223182
$$ plain form
36903 138141644 127913217 118611798 110165505 102502847 95555006 89256757 83546836 78368153
36895 78368153 73668028 69398364 65515799 61981827 58762735 55829057 53154510 50714668
36887 50714668 48485931 46445168 44570168 42840642 41239317 39752648 38370876 37087426
36879 37087426 35897756 34798000 33783933 32850650 31992957 31205962 30485344 29827167 29227507
36870 29227507 28682281 28187492 27739799 27337028 26978213 26663027 26390919 26160480 25969319
36861 25969319 25814376 25692354 25599990 25534068 25491193 25467502 25458410 25458575 25462178 25463495 25457596 25440881
36849 25440881 25411149 25367175 25307961 25232029 25137050 25019992 24877716 24707692 24508367 24278994
36839 24278994 24019196 23728755 23407854 23057512 22679920 22278607 21858578 21426336 20989516
$$ packed form
36903A38141644j0228427r301419q446293p662658o947841o298249n709921n178683
36895G8368153m700125m269664l882565l533972l219092k933678k674547k439842
36887E0714668k228737k040763j875000j729526j601325j486669j381772j283450
36879C7087426j189670j099756j014067r33283q57693p86995p20618o58177n99660
36870B9227507n45226m94789m47693m02771l58815l15186k72108k30439j91161
36861B5969319j54943j22022r2364o5922m2875k3691r092J65L603J317n899j6715
36849B5440881k9732m3974n9214p5932r4979j17058j42276j70024j99325k29373
36839B4278994k59798k90441l20901l50342l77592m01313m20029m32242m36820
$$ plain form
36830 20989516 20555985 20132680 19724595 19334209 18961438 18604167 18259149 17922851 17591544
36821 17591544 17260403 16922221 16567142 16184347 15765366 15307334 14814470 14297190 13769642
36812 13769642 13246878 12742486 12267012 11827301 11426756 11066255 10745169 10462030 10214800
36803 10214800 10001105 9818774 9666581 9544646 9454047 9395736 9369365 9372632 9401319 9449876
36793 9449876 9512194 9582403 9655612 9728641 9800609 9872978 9948661 10030211 10117682 10207028 10289847
36782 10289847 10355039 10392308 10396331 10369496 10321578 10266500 10218003 10186133 10175333 10183900 10204512
36771 10204512 10225735 10234412 10218411 10169109 10083043 9962420 9814395 9649356 9478686 9312770
36761 9312770 9159755 9025238 8912552 8823184 8757054 8712676 8687251 8676640 8675130 8675148 8667279 8640939
$$ packed form
36830B0989516m33531m23305m08085l90386l72771l57271l45018l36298l31307
36821A7591544l31141l38182l55079l82795m18981m58032m92864n17280n27548
36812A3769642n22764n04392m75474m39711m00545l60501l21086k83139k47230
36803A0214800k13695j82331j52193j21935r0599n8311k6371L267K8687M8557
36793I449876O2318P0209P3209P3029P1968P2369P5683Q1550Q7471Q9346Q2819
36782A0289847O5192L7269M023k6835m7918n5078m8497l1870j0800Q567K0612
36771A0204512K1223Q677j6001m9302q6066j20623j48025j65039j70670j65916
36761I312770j53015j34517j12686q9368o6130m4378k5425j0611j510J8p869k6340
$$ plain form
36749 8640939 8585813 8493730 8360428 8186499 7977172 7741108 7488811 7231235 6978670 6739694
36739 6739694 6520115 6322229 6144958 5984930 5838032 5700707 5570567 5446431 5327989
36730 5327989 5215299 5108306 5006657 4909993 4818425 4732607 4653122 4579531 4509866 4441045 4369988
36719 4369988 4294781 4215327 4133269 4051340 3972437 3898805 3831624 3771038 3716441 3666759 3620604
36708 3620604 3576273 3531641 3484069 3430608 3368704 3297241 3217394 3132634 3047756 2967390 2894870
36697 2894870 2832081 2780229 2740781 2715758 2707027 2714982 2737455 2769600 2804999 2837552 2863226 2880861
36685 2880861 2891828 2899022 2905770 2914906 2927977 2944760 2963337 2980774 2993944 2999993 2996466 2981495
36673 2981495 2954295 2915682 2868197 2815708 2762761 2713901 2672958 2642362 2622682 2612631 2609434
$$ packed form
36749H640939n5126r2083j33302j73929k09327k36064k52297k57576k52565k38976
36739F739694k19579j97886j77271j60028j46898j37325j30140j24136j18442
36730E327989j12690j06993j01649r6664r1568q5818p9485p3591o9665o8821p1057
36719D369988p5207p9454q2058q1929p8903p3632o7181o0586n4597m9682m6155
36708C620604m4331m4632m7572n3461o1904p1463p9847q4760q4878q0366p2520
36697B894870o2789n1852l9448k5023q731P955K2473L2145L5399L2553K5674J7635
36685B880861J0967P194O748R136J3071J6783J8577J7437J3170O049l527j4971
36673B981495k7200l8613m7485n2489n2947m8860m0943l0596j9680j0051l197
$$ plain form
36662 2609434 2609314 2607929 2600869 2584338 2555947 2515352 2464485 2407271 2348902 2294840 2249832 2217113
36650 2217113 2197973 2191667 2195637 2205936 2217822 2226512 2228075 2220153 2202289 2175725 2142938 2107187
36638 2107187 2072127 2041321 2017606 2002473 1995701 1995467 1999035 2003901 2008933 2014797 2023298 2035932 2052578
36625 2052578 2071055 2087731 2098755 2101347 2094700 2080233 2061213 2041921 2026668 2018934 2020769 2032607
36613 2032607 2053582 2082333 2117988 2160838 2212229 2273605 2345151 2424872 2508629 2591092 2666988
36602 2666988 2732100 2783864 2821676 2846840 2862026 2870205 2873421 2871958 2864322 2848061 2820989 2782220
36590 2782220 2732590 2674531 2611762 2548943 2491189 2443249 2408529 2388391 2381963 2386462 2397808 2411423
36578 2411423 2423018 2429216 2427841 2417916 2399542 2373821 2342694 2308600 2273908 2240355 2208739 2178959
$$ packed form
36662B609434j20j385p060j6531k8391m0595n0867n7214n8369n4062m5008l2719
36650B217113j9140o306L970J0299J1886Q690J563p922j7864k6564l2787l5751
36638B107187l5060l0806k3715j5133o772k34L568M866N032N864Q501J2634J6646
36625B052578J8477J6676J1024K592o647j4467j9020j9292j5253p734J835J1838
36613B032607K0975K8751L5655M2850N1391O1376P1546P9721Q3757Q2463P5896
36602B666988O5112N1764L7812K5164J5186Q179L216j463p636j6261k7072l8769
36590B782220m9630n8059o2769o2819n7754m7940l4720k0138o428M499J1346J3615
36578B411423J1595O198j375r925j8374k5721l1127l4094l4692l3553l1616k9780
$$ plain form
36566 2178959 2150291 2121735 2092344 2061517 2029240 1996228 1963913 1934210 1909040 1889731 1876582
36555 1876582 1868797 1864860 1863100 1862117 1860869 1858437 1853707 1845197 1831109 1809642 1779554 1740937 1695956
36542 1695956 1649120 1606748 1575630 1561290 1566506 1590688 1630357 1680502 1736232 1794085 1852559
36531 1852559 1911828 1972971 2037076 2104542 2174674 2245638 2314812 2379501 2437657 2488107 2530186
36520 2530186 2563155 2586061 2598222 2599917 2592669 2578828 2560705 2539765 2516188 2488899 2456032 2415756
36508 2415756 2367303 2311697 2251731 2191018 2132648 2078218 2027762 1980577 1936372 1896139 1862244
36497 1862244 1837725 1825168 1825724 1838683 1861673 1891366 1924357 1957933 1990458 2021429 2051250 2080910
36485 2080910 2111506 2143794 2177865 2213042 2247932 2280560 2308604 2329771 2342303 2345559 2340456 2329574
$$ packed form
36566B178959k8668k8556k9391l0827l2277l3012l2315k9703k5170j9309j3149
36555A876582p785l937j760r83j248k432m730q510j4088k1467l0088l8617m4981
36542A695956m6836m2372l1118j4340N216K4182L9669N0145N5730N7853N8474
36531A852559N9269O1143O4105O7466P0132P0964O9174O4689N8156N0450M2079
36520B530186L2969K2906J2161J695p248j3841j8123k0940k3577k7289l2867m0276
36508B415756m8453n5606n9966o0713n8370n4430n0456m7185m4205m0233l3895
36497A862244k4519j2557N56J2959K2990K9693L2991L3576L2525L0971K9821K9660
36485B080910L0596L2288L4071L5177L4890L2628K8044K1167J2532L256n103j0882
$$ plain form
36473 2329574 2316712 2306000 2300940 2303761 2315251 2334939 2361444 2392865 2427219 2462919 2499205 2536329
36461 2536329 2575404 2618019 2665898 2720723 2783956 2856489 2938216 3027816 3122881 3220256 3316387
36450 3316387 3407500 3489599 3558328 3608896 3636351 3636349 3606250 3546235 3459997 3354691 3239848 3125371
36438 3125371 3019325 2926390 2847523 2780615 2721602 2665619 2608178 2546293 2479217 2408384 2336493
36427 2336493 2266155 2198862 2134801 2073513 2014841 1959446 1908571 1863348 1824276 1791199 1763637
36416 1763637 1741095 1723152 1709284 1698535 1689206 1678837 1664573 1643772 1614502 1575780 1527564
36405 1527564 1470615 1406268 1336217 1262510 1187856 1116035 1051895 1000560 966070 950207 952274
36394 952274 969951 1000661 1042665 1095446 1159429 1235330 1323472 1423267 1532956 1649602 1769406
$$ packed form
36473B329574j2862j0712n060K821J1490J9688K6505L1421L4354L5700L6286L7124
36461B536329L9075M2615M7879N4825O3233P2533Q1727Q9600R5065R7375R6131
36450C316387R1113Q2099O8729N0568K7455kl0099o0015q6238j05306j14843j14477
36438C125371j06046r2935p8867o6908n9013n5983n7441o1885o7076p0833p1891
36427B336493p0338o7293o4061o1288n8672n5395n0875m5223l9072l3077k7562
36416A763637k2542j7943j3868j0749r329j0369j4264k0801k9270l8722m8216
36405A527564n6949o4347p0051p3707p4654p1821o4140n1335l4490j5863K067
36394I52274J7677L0710M2004N2781O3983P5901Q8142R9795J09689J16646J19804
$$ plain form
36383 1769406 1888361 2003167 2111946 2214368 2311120 2403130 2490982 2574740 2654061 2728453
36373 2728453 2797474 2860863 2918679 2971474 3020347 3066536 3110570 3151477 3186684 3212763 3226571
36362 3226571 3226172 3211210 3182764 3142878 3093983 3038391 2977994 2914294 2848786 2783404 2720611 2662861
36350 2662861 2611747 2567564 2529626 2497015 2469156 2445948 2427616 2414426 2406222 2401864 2398987 2394513
36338 2394513 2385871 2372211 2354837 2336653 2321148 2311632 2310968 2321504 2344794 2381150 2429362 2486855
36326 2486855 2550230 2615910 2680642 2741731 2797004 2844600 2882773 2909786 2923887 2923384 2906889 2873860
36314 2873860 2825245 2763829 2693934 2620524 2548139 2480063 2417853 2361181 2308009 2255248 2199995
36303 2199995 2140956 2079351 2018767 1963972 1919339 1887610 1869453 1863785 1868477 1881059 1899125 1920469
$$ packed form
36383A769406J18955J14806J08779J02422R6752R2010Q7852Q3758P9321P4392
36373B728453O9021O3389N7816N2795M8873M6189M4034M0907L5207K6079J3808
36362C226571l99j4962k8446l9886m8895n5592o0397o3700o5508o5382o2793n7750
36350B662861n1114m4183l7938l2611k7859k3208j8332j3190q204m358k877m474
36338B394513q642j3660j7374j8184j5505r516o64J0536K3290L6356M8212N7493
36326B486855O3375O5680O4732O1089N5273M7596L8173K7013J4101n03j6495l3029
36314B873860m8615o1416o9895p3410p2385o8076o2210n6672n3172n2761n5253
36303B199995n9039o1605o0584n4795m4633l1729j8157n668M692J2582J8066K1344
$$ plain form
36291 1920469 1943057 1965020 1984673 2000535 2011319 2016081 2014612 2007898 1998249 1988849 1982858 1982453 1988091
36278 1988091 1998168 2009120 2016061 2013891 1998510 1967681 1921183 1860330 1787422 1705685 1619725 1535736
36266 1535736 1460649 1400197 1356892 1329173 1312210 1299878 1286854 1270001 1248720 1224415 1199615
36255 1199615 1177181 1159831 1149860 1149002 1158388 1178581 1209625 1251068 1301966 1360915 1426182 1495868
36243 1495868 1568085 1641034 1712951 1781977 1846170 1903736 1953440 1994953 2028800 2055767 2076023
36232 2076023 2088529 2091297 2082414 2061242 2029110 1989193 1945736 1902981 1864193 1831131 1804088 1782357
36220 1782357 1764809 1750375 1738406 1728910 1722649 1720909 1724913 1735019 1750141 1767816 1784930 1798753
36208 1798753 1807790 1812174 1813609 1814931 1819336 1829497 1846787 1870947 1900336 1932718 1966203 1999896
$$ packed form
36291A920469K2588K1963J9653J5862J0784M762j469o714r649r400n991m05N638
36278A988091J0077J0952O941k170j5381l0829m6498o0853p2908q1737q5960q3989
36266A535736p5087o0452m3305k7719j6963j2332j3024j6853k1281k4305k4800
36255A199615k2434j7350r971q58R386K0193L1044M1443N0898N8949O5267O9686
36243A495868P2217P2949P1917O9026O4193N7566M9704M1513L3847K6967K0256
36232B076023J2506K768q883k1172l2132l9917m3457m2755l8788l3062k7043k1731
36220A782357j7548j4434j1969r496o261j740M004J0106J5122J7675J7114J3823
36208A798753R037M384J435J322M405J0161J7290K4160K9389L2382L3485L3693
$$ plain form
36196 1999896 2033870 2068644 2104528 2141190 2177423 2211180 2239905 2261283 2274185 2279313 2279100 2276872
36184 2276872 2275677 2277428 2282657 2290751 2300285 2309191 2314846 2314321 2304995 2285393 2255856 2218473 2176156
36171 2176156 2131370 2085297 2037877 1988415 1936174 1880716 1822082 1760957 1698723 1637232 1578347
36160 1578347 1523375 1472686 1425783 1381870 1340707 1303137 1270926 1245997 1229632 1222157 1223234 1232399
36148 1232399 1249351 1273841 1305404 1343248 1386437 1434082 1485316 1539051 1593738 1647304 1697317
36137 1697317 1741355 1777484 1804700 1823182 1834359 1840861 1846401 1855366 1872053 1899652 1939421 1990352
36125 1990352 2049458 2112474 2174807 2232455 2282710 2324473 2358181 2385410 2408307 2428922 2448574
36114 2448574 2467338 2483780 2495074 2497580 2487814 2463536 2424543 2372912 2312645 2248857 2186795 2130913
$$ packed form
36196A999896L3974L4774L5884L6662L6233L3757K8725K1378J2902N128k13k228
36184B276872j195J751N229Q094R534Q906N655n25r326j9602k9537l7383m2317
36171B176156m4786m6073m7420m9462n2241n5458n8634o1125o2234o1491n8885
36160A578347n4972n0689m6903m3913m1163l7570l2211k4929j6365p475J077R165
36148A232399J6952K4490L1563L7844M3189M7645N1234N3735N4687N3566N0013
36137A697317M4038L6129K7216J8482J1177O502N540Q965J6687K7599L9769N0931
36125A990352N9106O3016O2333N7648N0255M1763L3708K7229K2897K0615J9652
36114B448574J8764J6442J1294K506r766k4278l8993n1631o0267o3788o2062n5882
$$ plain form
36102 2130913 2084216 2048004 2022025 2005047 1995673 1993088 1997321 2008911 2028235 2054994 2088121 2126058
36090 2126058 2167123 2209761 2252549 2293950 2332039 2364388 2388263 2400910 2399793 2382855 2349039
36079 2349039 2298959 2235278 2162316 2084949 2007331 1932031 1859772 1789711 1720066 1648953 1575361
36068 1575361 1500025 1425899 1357920 1301935 1263064 1244144 1244950 1262521 1292179 1328567 1366155 1399300
36056 1399300 1422341 1430151 1419108 1388060 1338738 1275413 1203919 1130427 1060244 996833 941199
36045 941199 891842 845414 798037 746913 691691 635097 582564 540906 516401 512846 530232 564485
36033 564485 608327 652914 689732 712278 717135 704226 676334 638289 596280 557262 528157 514593
36021 514593 519607 542974 581548 630354 683967 737840 789317 838060 885660 934541 986747 1043175
$$ packed form
36102B130913m6697l6212k5979j6978r374k585M233J1590J9324K6759L3127L7937
36090B126058M1065M2638M2788M1401L8089L2349K3875J2647j117j6938l3816
36079B349039n0080o3681p2962p7367p7618p5300p2259p0061o9645p1113p3592
36068A575361p5336p4126o7979n5985l8871j8920Q06J7571K9658L6388L7588L3145
36056A399300K3041P810j1043l1048m9322o3325p1494p3492p0183o3411n5634
36045I41199m9357m6428m7377n1124n5222n6594n2533m1658k4505l555J7386L4253
36033E64485M3842M4587L6818K2546M857j2909k7892l8045m2009l9018k9105j3564
36021E14593N014K3367L8574M8806N3613N3873N1477M8743M7600M8881N2206N6428
$$ plain form
36009 1043175 1103498 1166534 1230640 1293905 1354179 1409176 1456740 1495295 1524143 1543474 1554060
35998 1554060 1556907 1553090 1543783 1530249 1513660 1494760 1473632 1449782 1422656 1392400 1360461 1329607
35986 1329607 1303300 1284687 1275651 1276231 1284520 1297093 1309895 1319378 1323484 1322103 1316843 1310172 1304364
35973 1304364 1300733 1299556 1300610 1303889 1309986 1319959 1334862 1355303 1381215 1411801 1445628 1480836
35961 1480836 1515530 1548278 1578499 1606437 1632651 1657208 1678993 1695632 1704235 1702676 1690783 1670699
35949 1670699 1646259 1621823 1601136 1586672 1579491 1579481 1585786 1597141 1611964 1628297 1643821 1656126
35937 1656126 1663149 1663621 1657304 1644981 1628220 1608957 1589018 1569660 1551224 1533042 1513757 1492062
35925 1492062 1467463 1440641 1413171 1386944 1363724 1345078 1332402 1326738 1328289 1335963 1347390 1359636
$$ packed form
36009A043175O0323O3036O4106O3265O0274N4997M7564L8555K8848J9331J0586
35998A554060K847l817r307j3534j6589j8900k1128k3850k7126l0256l1939l0854
35986A329607k6307j8613r036N80Q289J2573J2802R483M106j381n260o671n808
35973A304364l631j177J054L279O097R973J4903K0441K5912L0586L3827L5208
35961A480836L4694L2748L0221K7938K6214K4557K1785J6639Q603j559j1893k0084
35949A670699k4440k4436k0687j4464p181j0O305J1355J4823J6333J5524J2305
35937A656126P023M72o317j2323j6761j9263j9939j9358j8436j8182j9285k1695
35925A492062k4599k6822k7470k6227k3220j8646j2676n664J551P674J1427J2246
$$ plain form
35913 1359636 1370282 1378201 1383560 1387257 1390384 1394168 1400077 1409633 1423774 1442260 1463523 1484990 1503564
35900 1503564 1516104 1519937 1513428 1496346 1469828 1435888 1396835 1354979 1312693 1272600 1237577 1210548
35888 1210548 1194222 1190851 1201899 1227508 1265983 1313701 1365693 1416797 1462860 1501516 1532230
35877 1532230 1555657 1572774 1584265 1590444 1591523 1587844 1579899 1568334 1554089 1538648 1523953 1511860
35865 1511860 1503448 1498650 1496304 1494411 1490357 1481238 1464493 1438755 1404479 1363977 1320696 1277957
35853 1277957 1237619 1199370 1161124 1120442 1076176 1029282 982327 938098 898311 863238 832249
35842 832249 804693 780418 759704 742924 730314 722022 718282 719410 725529 736207 750427 767070
35830 767070 785660 806778 831772 861850 897155 936337 976839 1015699 1050443 1079739 1103672
$$ packed form
35913A359636J0646P919N359L697L127L784N909R556J4141J8486K1263K1467J8574
35900A503564J2540L833o509j7082k6518l3940l9053m1856m2286m0093l5023k7029
35888A210548j6326l371J1048K5609L8475M7718N1992N1104M6063L8656L0714
35877A532230K3427J7117J1491O179J079l679p945j1565j4245j5441j4695j2093
35865A511860q412m798k346j893m054r119j6745k5738l4276m0502m3281m2739
35853A277957m0338l8249l8246m0682m4266m6894m6955m4229l9787l5073l0989
35842H32249k7556k4275k0714j6780j2610q292l740J128O119J0678J4220J6643
35830G67070J8590K1118K4994L0078L5305L9182M0502L8860L4744K9296K3933
$$ plain form
35819 1103672 1123635 1141796 1160285 1180448 1202572 1226176 1250535 1275062 1299413 1323308 1346196
35808 1346196 1366832 1383132 1392440 1392131 1380160 1355371 1317663 1268063 1208567 1141703 1070097 996427
35796 996427 923753 855689 795944 747359 711123 686789 673090 668939 673952 688309 712272 745798
35784 745798 788486 839838 899632 968129 1045961 1133693 1231332 1338015 1451920 1570298 1689569
35773 1689569 1805592 1914158 2011565 2095003 2162568 2212980 2245353 2259248 2254960 2233698 2197430
35762 2197430 2148533 2089565 2023202 1952119 1878542 1803708 1727738 1650159 1570754 1490124 1409710
35751 1409710 1331463 1257563 1190330 1132205 1085614 1052666 1034773 1032294 1044351 1068907 1103142
35740 1103142 1143971 1188573 1234783 1281342 1327955 1375092 1423450 1473184 1523168 1570634 1611412
$$ packed form
35819A103672J9963J8161J8489K0163K2124K3604K4359K4527K4351K3895K2888
35808A346196K0636J6300R308l09j1971k4789l7708m9600n9496o6864p1606p3670
35796I96427p2674o8064n9745m8585l6236k4334j3699m151N013J4357K3963L3526
35784G45798M2688N1352N9794O8497P7832Q7732R7639J06683J13905J18378J19271
35773A689569J16023J08566R7407Q3438O7565N0412L2373J3895m288k1262l6268
35762B197430m8897n8968o6363p1083p3577p4834p5970p7579p9405q0630q0414
35751A409710p8247p3900o7233n8125m6591l2948j7893k479J2057K4556L4235
35740A103142M0829M4602M6210M6559M6613M7137M8358M9734M9984M7466M0778
$$ plain form
35729 1611412 1640728 1654320 1649544 1626049 1585711 1531813 1467956 1397365 1322962 1247845 1175417
35718 1175417 1108817 1049995 999234 955534 917563 884527 856484 834130 818379 810094 810037 818932
35706 818932 837397 865677 903280 948892 1000722 1057097 1116813 1179026 1242787 1306611 1368302
35695 1368302 1425062 1473842 1511928 1537532 1550102 1550218 1539329 1519645 1494230 1466890 1441587 1421565
35683 1421565 1408724 1403555 1405532 1413582 1426374 1442354 1459652 1476029 1488967 1495945 1494844 1484322
35671 1484322 1464030 1434555 1397076 1352927 1303340 1249536 1193071 1136063 1081056 1030466 985865
35660 985865 947540 914649 886006 861119 840884 827624 824495 834587 860051 901455 957567 1025552
35648 1025552 1101404 1180416 1257656 1328614 1389966 1440150 1479419 1509437 1532700 1551961 1569635
$$ packed form
35729A611412K9316J3592m776k3495m0338n3898o3857p0591p4403p5117p2428
35718A175417o6600n8822n0761m3700l7971l3036k8043k2354j5751q285n7Q895
35706H18932J8465K8280L7603M5612N1830N6375N9716O2213O3761O3824O1691
35695A368302N6760M8780L8086K5604J2570J16j0889j9684k5415k7340k5303k0022
35683A421565j2841n169J977Q050J2792J5980J7298J6377J2938O978j101j0522
35671A484322k0292k9475l7479m4149m9587n3804n6465n7008n5007n0590m4601
35660I85865l8325l2891k8643k4887k0235j3260l129J0092K5464M1404N6112O7985
35648A025552P5852P9012P7240P0958O1352N0184L9269L0018K3263J9261J7674
$$ plain form
35637 1569635 1587103 1604202 1619260 1629835 1633751 1629829 1617867 1598039 1570261 1534079 1489123 1435905
35625 1435905 1376548 1315226 1258015 1212009 1183770 1177720 1195192 1234501 1291684 1361322 1437145
35614 1437145 1512514 1581052 1637409 1678011 1701519 1708902 1702917 1687024 1663995 1634855 1598801 1554151
35602 1554151 1499748 1435929 1364531 1288101 1208916 1128459 1047588 967205 889016 815917 751783
35591 751783 700683 665813 648563 648064 661296 683706 710141 736008 758451 777187 794500 814181
35579 814181 839822 873212 913503 957365 999881 1035908 1061509 1075083 1077764 1072921 1064901 1057621
35567 1057621 1053592 1053683 1057518 1064066 1072129 1080659 1089065 1097525 1107040 1119027 1134520 1153338 1173742
35554 1173742 1192841 1207639 1216270 1218779 1217138 1214599 1214760 1220608 1233645 1253334 1277190 1301671 1323459
$$ packed form
35637A569635J7468J7099J5058J0575L916l922j1962j9828k7778l6182m4956n3218
35625A435905n9357o1322n7211m6006k8239o050J7472L9309N7183O9638P5823
35614A437145P5369O8538N6357M0602K3508P383n985j5893k3029k9140l6054m4650
35602A554151n4403o3819p1398p6430p9185q0457q0871q0383p8189p3099o4134
35591G51783n1100l4870j7250m99J3232K2410K6435K5867K2443J8736J7313J9681
35579H14181K5641L3390M0291M3862M2516L6027K5601J3574K681m843q020p280
35567A057621m029R1L835O548Q063Q530Q406Q460R515J1987J5493J8818K0404
35554A173742J9099J4798Q631K509j641k539J61N848J3037J9689K3856K4481K1788
$$ plain form
35541 1323459 1340451 1351996 1358538 1361134 1361204 1360535 1361305 1365854 1376180 1393291 1416761 1444726 1474352
35528 1474352 1502535 1526523 1544309 1554795 1557809 1553916 1544071 1529225 1510144 1487562 1462443 1436005
35516 1436005 1409346 1382944 1356440 1328934 1299565 1267957 1234214 1198523 1160756 1120437 1077146
35505 1077146 1031024 982952 934319 886621 841174 798932 760304 725002 692202 661014 630946
35494 630946 601935 573887 546200 517690 487024 453357 416818 378587 340547 304675 272437
35483 272437 244486 220751 200871 184840 173574 168993 173421 188444 213883 247522 285846 325363
35471 325363 363719 400048 434563 467948 501102 535226 571861 612514 657935 707529 759276
35460 759276 810326 858025 900878 938989 973737 1006948 1039914 1072760 1104359 1132851 1156476
$$ packed form
35541A323459J6992J1545O542K596P0o69P70M549J0326J7111K3470K7965K9626
35528A474352K8183K3988J7786J0486L014l893r845j4846j9081k2582k5119k6438
35516A436005k6659k6402k6504k7506k9369l1608l3743l5691l7767m0319m3291
35505A077146m6122m8072m8633m7698m5447m2242l8628l5302l2800l1188l0068
35494F30946k9011k8048k7687k8510l0666l3667l6539l8231l8040l5872l2238
35483B72437k7951k3735j9880j6031j1266m581M428J5023K5439L3639L8324L9517
35471C25363L8356L6329L4515L3385L3154L4124L6635M0653M5421M9594N1747
35460G59276N1050M7699M2853L8111L4748L3211L2966L2846L1599K8492K3625
$$ plain form
35449 1156476 1174258 1186213 1193091 1195921 1195557 1192424 1186498 1177641 1166104 1152860 1139507 1127842 1119418
35436 1119418 1115379 1116591 1123895 1138331 1161208 1193984 1237948 1293667 1360401 1435722 1515584 1594772
35424 1594772 1667512 1728032 1771142 1793017 1792156 1770168 1731882 1684461 1635699 1592126 1557739 1533846
35412 1533846 1519955 1515083 1518635 1530453 1550266 1577120 1609269 1644399 1679879 1712975 1741178 1762777
35400 1762777 1777309 1785507 1788690 1788057 1784217 1777051 1765777 1749177 1726052 1695781 1658719 1616220
35388 1616220 1570266 1522870 1475486 1428683 1382179 1335242 1287239 1238089 1188525 1140167 1095340
35377 1095340 1056622 1026070 1004405 990549 981769 974428 964946 950582 929866 902688 870298 835297
35365 835297 801630 774436 759461 761965 785389 830306 894149 971764 1056393 1140715 1217757 1281699
$$ packed form
35449A156476J7782J1955O878K830l64l133n926q857j1537j3244j3353j1665q424
35436A119418m039J212P304J4436K2877L2776M3964N5719O6734P5321P9862P9188
35424A594772P2740O0520M3110K1875q61k1988l8286m7421m8762m3573l4387k3893
35412A533846j3891m872L552J1818J9813K6854L2149L5130L5480L3096K8203K1599
35400A762777J4532Q198L183o33l840p166j1274j6600k3125l0271l7062m2499
35388A616220m5954m7396m7384m6803m6504m6937m8003m9150m9564m8358m4827
35377A095340l8718l0552k1665j3856q780p341r482j4364k0716k7178l2390l5001
35365H35297l3667k7194j4975K504K3424M4917O3843P7615Q4629Q4322P7042O3942
$$ plain form
35353 1281699 1328555 1356540 1366032 1359126 1339027 1309456 1274227 1236982 1200991 1168951 1142814 1123668
35341 1123668 1111779 1106822 1108266 1115705 1128859 1147137 1169053 1191968 1212485 1227318 1234136 1231921
35329 1231921 1220679 1200884 1173132 1138352 1098346 1056132 1015677 981007 955162 939399 933031
35318 933031 933933 939484 947601 957364 968971 983046 999687 1017856 1035486 1050183 1060089 1064453 1063761
35305 1063761 1059403 1052915 1045193 1036188 1025358 1012515 998283 983782 969875 956681 943809 931099
35293 931099 919219 909586 903614 901862 903764 908188 914393 922694 934397 951025 973423 1001329 1033679
35280 1033679 1069290 1107384 1147661 1190000 1234047 1278780 1322244 1361591 1393599 1415510 1425773
35269 1425773 1424295 1412081 1390517 1360809 1323927 1281020 1233896 1185126 1137705 1094508 1057824
$$ packed form
35353A281699M6856K7985R492o906k0099k9571l5229l7245l5991l2040k6137j9146
35341A123668j1889m957J444P439J3154J8278K1916K2915K0517J4833O818k215
35329A231921j1242j9795k7752l4780m0006m2214m0455l4670k5845j5763o368
35318I33031R02N551Q117R763J1607J4075J6641J8169J7630J4697R906M364o92
35305A063761m358o488p722r005j0830j2843j4232j4501j3907j3194j2872j2710
35293I31099j1880r633n972j752J902M424O205Q301J1703J6628K2398K7906L2350
35280A033679L5611L8094M0277M2339M4047M4733M3464L9347L2008K1911J0263
35269A425773j478j2214k1564k9708l6882m2907m7124m8770m7421m3197l6684
$$ plain form
35258 1057824 1029134 1009116 997814 994850 999565 1011076 1028244 1049704 1074015 1099917 1126538 1153412
35246 1153412 1180329 1207275 1234435 1262054 1289928 1316792 1340136 1356754 1363774 1359537 1343961 1318398
35234 1318398 1285281 1247783 1209508 1174117 1144686 1122910 1108509 1099290 1092102 1084311 1075093 1065782
35222 1065782 1059101 1057636 1062428 1072445 1085255 1098467 1111108 1124159 1140158 1162327 1193767 1236885
35210 1236885 1292845 1361014 1438612 1520875 1601818 1675360 1736488 1782114 1811358 1825195 1825688 1815257
35198 1815257 1796327 1771366 1743098 1714533 1688624 1667624 1652526 1642942 1637536 1634720 1633203 1632120
35186 1632120 1630819 1628477 1623827 1615150 1600706 1579339 1550891 1516048 1475718 1430426 1380128 1324602
35174 1324602 1264138 1200082 1134901 1071674 1013306 961880 918483 883450 856782 838431 828350
$$ packed form
35258A057824k8690k0018j1302k964M715J1511J7168K1460K4311K5902K6621K6874
35246A153412K6917K6946K7160K7619K7874K6864K3344J6618P020m237j5576k5563
35234A318398l3117l7498l8275l5391k9431k1776j4401r219p188p791r218r311
35222A065782o681j465M792J0017J2810J3212J2641J3051J5999K2169L1440M3118
35210A236885N5960O8169P7598Q2263Q0943P3542O1128M5626K9244J3837M93j0431
35198A815257j8930k4961k8268k8565k5909k1000j5098r584n406k816j517j083
35186A632120j301k342m650q677j4444k1367k8448l4843m0330m5292n0298n5526
35174A324602o0464o4056o5181o3227n8368n1426m3397l5033k6668j8351j0081
$$ plain form
35163 828350 826433 832507 846423 868117 897492 934195 977520 1026586 1080599 1139002 1201397 1267314
35151 1267314 1335804 1404932 1471436 1531036 1579583 1614580 1636161 1646827 1649969 1648034 1641348 1628249
35139 1628249 1606383 1574374 1532934 1484874 1434117 1384340 1337991 1296107 1258838 1226193 1198531
35128 1198531 1176643 1161465 1153685 1153380 1159848 1171735 1187437 1205588 1225355 1246358 1268369 1291044
35116 1291044 1313848 1336170 1357481 1377478 1396179 1413877 1430954 1447585 1463450 1477488 1487840
35105 1487840 1492041 1487587 1472716 1446974 1411273 1367459 1317706 1264179 1209072 1154844 1104290 1060152
35093 1060152 1024343 997229 977401 962246 949065 936171 923312 911263 901017 893141 887539 883417
35081 883417 879315 873301 863478 848638 828691 804625 778019 750388 722641 694807 666153 635643
$$ packed form
35163H28350j917O074J3916K1694K9375L6703M3325M9066N4013N8403O2395O5917
35151A267314O8490O9128O6504N9600M8547L4997K1581J0666L142j935o686j3099
35139A628249k1866l2009m1440m8060n0757m9777m6349m1884l7269l2645k7662
35128A198531k1888j5178p780l05O468J1887J5702J8151J9767K1003K2011K2675
35116A291044K2804K2322K1311J9997J8701J7698J7077J6631J5865J4038J0352
35105A487840M201m454j4871k5742l5701m3814m9753n3527n5107n4228n0554m4138
35093A060152l5809k7114j9828j5155j3181j2894j2859j2049j0246p876n602m122
35081H83417m102o014r823j4840j9947k4066k6606k7631k7747k7834k8654l0510
$$ plain form
35069 635643 602582 567218 531049 496671 467265 445902 434998 435996 449378 474912 512068 560358
35057 560358 619447 689008 768412 856370 950603 1047651 1143006 1231585 1308449 1369476 1411792
35046 1411792 1433914 1435685 1418154 1383438 1334537 1275046 1208880 1140070 1072589 1010098 955514
35035 955514 910617 875943 851055 834994 826506 823942 825029 826973 827081 823519 815709 804085 789444
35022 789444 772365 752980 731122 706814 680801 654893 631776 614288 604549 603484 610926 626058
35010 626058 647691 674112 702859 730798 754752 772343 782564 785760 783051 775555 763866 748069
34998 748069 728252 705181 680709 657620 638985 627301 623898 628895 641767 662129 690309 727285
34986 727285 774018 830487 894972 963962 1032729 1096279 1150378 1192382 1221737 1240049 1250681
$$ packed form
35069F35643l3061l5364l6169l4378k9406k1363j0904R98J3382K5534L7156M8290
35057E60358N9089O9561P9404Q7958R4233R7048R5355Q8579P6864O1027M2316
35046A411792K2122J771j7531l4716m8901n9491o6166o8810o7481o2491n4584
35035I55514m4897l4674k4888j6061q488k564J087J944J08l562p810j1624j4641
35022G89444j7079j9385k1858k4308k6013k5908k3117j7488r739j065P442J5132
35010F26058K1633K6421K8747K7939K3954J7591J0221L196k709p496j1689j5797
34998G48069j9817k3071k4472k3089j8635j1684l403M997J2872K0362K8180L6976
34986G27285M6733N6469O4485O8990O8767O3550N4099M2004K9355J8312J0632
$$ plain form
34975 1250681 1257975 1266224 1278580 1296250 1318238 1341698 1362647 1376748 1380113 1370059 1345656 1307814
34963 1307814 1258849 1201814 1139891 1076063 1013075 953429 899208 851664 810877 775828 744950
34952 744950 716732 690041 664186 639001 614962 593133 574671 560031 548262 536841 522234
34941 522234 501009 470959 431768 385084 334254 283874 239085 204484 182951 174947 178735 191441
34929 191441 210475 234694 264823 302990 351693 412730 486528 571855 665764 763704 859977
34918 859977 948695 1025040 1086443 1133136 1167709 1193747 1214163 1229991 1240172 1242324 1234124 1214792
34906 1214792 1186084 1152218 1118604 1089982 1069039 1056232 1050672 1051314 1057716 1070057 1088614 1113038
34894 1113038 1141912 1172817 1202888 1229638 1251727 1269443 1284658 1300105 1318227 1340183 1365628
$$ packed form
34975A250681P294Q249J2356J7670K1988K3460K0949J4101L365j0054k4403l7842
34963A307814m8965n7035o1923o3828o2988n9646n4221m7544m0787l5049l0878
34952G44950k8218k6691k5855k5185k4039k1829j8462j4640j1769j1421j4607
34941E22234k1225l0050l9191m6684n0830n0380m4789l4601k1533q004L788J2706
34929A91441J9034K4219L0129L8167M8703O1037P3798Q5327R3909R7940R6273
34918H59977Q8718P6345O1403M6693L4573K6038K0416J5828J0181K152q200j9332
34906A214792k8708l3866l3614k8622k0943j2807n560O42O402J2341J8557K4424
34894A113038K8874L0905L0071K6750K2089J7716J5215J5447J8122K1956K5445
$$ plain form
34883 1365628 1393248 1421626 1449857 1477741 1505606 1533772 1561769 1587719 1608421 1620346 1621049 1610254
34871 1610254 1590090 1564496 1538050 1514606 1496127 1482093 1469720 1454973 1434040 1404809 1367725
34860 1367725 1325651 1282743 1242797 1207839 1177554 1149815 1121925 1091975 1059658 1026334 994414
34849 994414 966425 944074 927648 915902 906485 896803 884999 870622 854596 838447 823401 810011
34837 810011 798512 789419 783697 782434 786404 795946 811188 832334 859733 893682 934158 980697
34825 980697 1032410 1087986 1145628 1203036 1257607 1306750 1348095 1379679 1400298 1410007 1410472 1404833
34813 1404833 1397096 1391260 1390313 1395257 1404506 1414012 1418215 1411397 1388980 1348445 1289674 1214757 1127401
34800 1127401 1032345 935018 841369 757571 689378 641255 615550 612019 627897 658500 698187
$$ packed form
34883A365628K7620K8378K8231K7884K7865K8166K7997K5950K0702J1925P03j0795
34871A610254k0164k5594k6446k3444j8479j4034j2373j4747k0933k9231l7084
34860A367725m2074m2908l9946l4958l0285k7739k7890k9950l2317l3324l1920
34849I94414k7989k2351j6426j1746r417r682j1804j4377j6026j6149j5046j3390
34837H10011j1499r093n722j263L970R542J5242K1146K7399L3949M0476M6539
34825I80697N1713N5576N7642N7408N4571M9143M1345L1584K0619R709M65n639
34813A404833p737n836r47M944R249R506M203o818k2417m0535n8771p4917q7356
34800A127401r5056r7327r3649q3798o8193m8123k5705l531J5878L0603L9687
$$ plain form
34789 698187 741337 783055 819463 847635 865368 871054 863773 843564 811633 770293 722643 672101
34777 672101 621981 575236 534289 500934 476191 460174 452032 450095 452218 456266 460554 464089 466516
34764 466516 467847 468100 467009 463966 458190 449040 436196 419630 399469 376100 350604 325354 304299
34751 304299 292589 295570 317445 360123 422615 501089 589458 680368 766383 841155 900128 940626
34739 940626 961498 962847 946172 914748 873737 829638 789148 757852 739319 734839 743763 764119
34727 764119 793242 828229 866201 904378 940066 970789 994673 1010862 1019632 1022036 1019420 1013239
34715 1013239 1005216 997445 992079 990727 994027 1001682 1012824 1026379 1041189 1055981 1069255 1079296
34703 1079296 1084358 1083013 1074436 1058469 1035486 1006323 972402 935937 899953 868028 843829 830535
$$ packed form
34789F98187M3150M1718L6408K8172J7733N686p281k0209l1931m1340m7650n0542
34777F72101n0120m6745m0947l3355k4743j6017q142j937K123M048M288L535K427
34764D66516J331K53j091l043n776r150j2844j6566k0161k3369k5496k5250k1055
34751C04299j1710K981K1875M2678O2492P8474Q8369R0910Q6015P4772N8973M0498
34739I40626K0872J349j6675l1424m1011m4099m0490l1296j8533m480Q924K0356
34727G64119K9123L4987L7972L8177L5688L0723K3884J6189Q770K404k616o181
34715A013239q023p771n366j352L300P655J1142J3555J4810J4792J3274J0041
34703A079296N062j345q577j5967k2983k9163l3921l6465l5984l1925k4199j3294
$$ plain form
34691 830535 830239 843412 868616 902639 941083 979302 1013393 1040884 1060939 1074106 1081941 1086676
34679 1086676 1090952 1097487 1108727 1126498 1151691 1183913 1221233 1260244 1296559 1325715 1344151 1350005
34667 1350005 1343552 1327158 1304802 1281170 1260574 1246110 1239414 1241071 1251214 1269820 1296502 1330095
34655 1330095 1368427 1408544 1447335 1482297 1512007 1535999 1554070 1565480 1568644 1561514 1542411 1510863
34643 1510863 1468074 1416831 1360846 1303830 1248747 1197573 1151533 1111460 1077975 1051425 1031757
34632 1031757 1018512 1011014 1008660 1011223 1019068 1033143 1054629 1084183 1121097 1162864 1205576 1244992
34620 1244992 1277695 1301826 1317234 1325292 1328524 1330086 1333097 1339924 1351673 1368008 1387246 1406710
34608 1406710 1423295 1434239 1437943 1434581 1426299 1416971 1411521 1414929 1431109 1461950 1506824 1562680
$$ packed form
34691H30535k96J3173K5204L4023L8444L8219L4091K7491K0055J3167P835M735
34679A086676M276O535J1240J7771K5193L2222L7320L9011L6315K9156J8436N854
34667A350005o453j6394k2356k3632k0596j4464o696J657J0143J8606K6682L3593
34655A330095L8332M0117L8791L4962K9710K3992J8071J1410L164p130j9103l1548
34643A510863m2789n1243n5985n7016n5083n1174m6040m0073l3485k6550j9668
34632A031757j3245p498k354K563P845J4075K1486K9554L6914M1767M2712L9416
34620A244992L2703K4131J5408Q058L232J562L011O827J1749J6335J9238J9464
34608A406710J6585J0944L704l362q282r328n450L408J6180L0841M4874N5856
$$ plain form
34596 1562680 1624621 1686625 1742221 1785137 1810123 1813956 1796167 1758981 1706426 1643140 1573517
34585 1573517 1501331 1429538 1360003 1293237 1228377 1163462 1095878 1022856 942005 851932 752924
34574 752924 647412 539942 436443 343045 264923 205612 166851 148823 150567 170441 206539
34563 206539 256941 319711 392660 473069 557677 643042 726081 804354 875871 938602 990146
34552 990146 1027991 1050351 1057242 1051137 1036816 1020401 1008051 1004821 1013938 1036405 1070921 1114225
34540 1114225 1161845 1209020 1251541 1286337 1311892 1328471 1337922 1342998 1346390 1349930 1354275 1359137
34528 1359137 1363780 1367566 1370276 1372114 1373456 1374557 1375490 1376314 1377261 1378649 1380436 1381683 1380296 1373346 1357980
34513 1357980 1332588 1297746 1256461 1213516 1174158 1142767 1122123 1113462 1116927 1131776 1156135 1186557
$$ packed form
34596A562680O1941O2004N5596M2916K4986L833j7789l7186n2555o3286o9623
34585A573517p2186p1793o9535o6766o4860o4915o7584p3022q0851r0073r9008
34574G52924j05512j07470j03499r3398p8122n9311l8761j8028J744J9874L6098
34563B06539N0402O2770P2949Q0409Q4608Q5365Q3039P8273P1517O2731N1544
34552I90146L7845K2360O891o105j4321j6415j2350l230R117K2467L4516M3304
34540A114225M7620M7175M2521L4796K5555J6579R451N076L392L540M345M862
34528A359137M643L786K710J838J342J101R33Q24R47J388J787J247j387o950j5366
34513A357980k5392l4842m1285m2945l9358l1391k0644q661L465J4849K4359L0422
$$ plain form
34501 1186557 1218066 1245060 1262937 1269653 1266419 1257073 1246504 1238861 1236272 1238351 1242521 1244950 1241824
34488 1241824 1230473 1210032 1181525 1147551 1111739 1078150 1050664 1032405 1025174 1029043 1042335 1062137
34476 1062137 1085257 1109203 1132786 1156107 1179999 1205209 1231725 1258546 1283948 1306103 1323742
34465 1323742 1336593 1345396 1351500 1356378 1361340 1367470 1375493 1385386 1395941 1404647 1408135 1403119 1387486
34452 1387486 1361097 1325916 1285409 1243550 1203974 1169601 1142634 1124659 1116619 1118726 1130442 1150562
34440 1150562 1177300 1208293 1240659 1271313 1297568 1317718 1331229 1338390 1339699 1335333 1325036 1308327
34428 1308327 1284795 1254199 1216377 1171134 1118294 1057915 990620 917906 842396 767790 698345
34417 698345 637903 588876 551630 524585 504998 490071 477928 467999 460727 456831 456619 459674 465000
$$ packed form
34501A186557L1509K6994J7877O716l234r346j0569p643k589K079M170K429l126
34488A241824j1351k0441k8507l3974l5812l3589k7486j8259p231L869J3292J9802
34476A062137K3120K3946K3583K3321K3892K5210K6516K6821K5402K2155J7639
34465A323742J2851Q803O104M878M962O130Q023R893J0555Q706L488n016j5633
34452A387486k6389l5181m0507m1859l9576l4373k6967j7975q040K107J1716K0120
34440A150562K6738L0993L2366L0654K6255K0150J3511P161J309m366j0297j6709
34428A308327k3532l0596l7822m5243n2840o0379o7295p2714p5510p4606o9445
34417F98345o0442m9027l7246k7045j9587j4927j2143r929p272l896k12L055N326
$$ plain form
34404 465000 471589 479167 488788 502846 524410 556301 600427 657570 727362 808231 897436 991325
34392 991325 1085773 1176559 1259708 1332006 1391559 1438055 1472414 1496086 1510464 1516722 1516050 1510061
34380 1510061 1501051 1491761 1484604 1480740 1479620 1479224 1476762 1469442 1455069 1432420 1401326 1362472 1317121
34367 1317121 1266946 1213988 1160539 1108804 1060398 1016008 975438 938120 903741 872614 845533
34356 845533 823234 805775 792193 780607 768730 754460 736194 712733 683026 646094 601259
34345 601259 548545 489048 425152 360450 299206 245399 201646 168519 144593 127143 113157
34334 113157 100226 87062 73609 60858 50491 44340 43706 48715 58005 69033 78963 85822 89412
34321 89412 91471 94990 102975 117326 138376 165268 196788 232224 271884 317131 369968 432272
$$ packed form
34404D65000O589P578R621J4058K1564L1891M4126N7143O9792Q0869Q9205R3889
34392I91325R4448R0786Q3149P2298N9553M6496L4359K3672J4378O258o72n989
34380A510061r010r290p157l864j120l96k462p320j4373k2649l1094l8854m5351
34367A317121n0175n2958n3449n1735m8406m4390m0570l7318l4379l1127k7081
34356H45533k2299j7459j3582j1586j1877j4270j8266k3461k9707l6932m4835
34345F01259n2714n9497o3896o4702o1244n3807m3753l3127k3926j7450j3986
34334A13157j2931j3164j3453j2751j0367o151o34N009R290J1028R930O859L590
34321H9412K059L519P985J4351K1050K6892L1520L5436L9660M5247N2837O2304
$$ plain form
34309 432272 504913 587125 676340 768486 858596 941581 1013130 1070615 1113636 1143922 1164525
34298 1164525 1178745 1189262 1197723 1204727 1210001 1212649 1211404 1204976 1192434 1173625 1149385 1121418
34286 1121418 1091848 1062750 1035880 1012635 994106 981114 974244 973791 979494 990111 1003143 1015114
34274 1015114 1022453 1022616 1014807 999937 979921 956739 931735 905374 877484 847805 816512 784408
34262 784408 752719 722766 695769 672875 655260 644203 641135 647656 665420 695803 739429 795672
34250 795672 862347 935706 1010810 1082197 1144645 1193838 1226948 1243132 1243843 1232699 1214722 1195145
34238 1195145 1178185 1166251 1159744 1157338 1156554 1154522 1148827 1138187 1122590 1102841 1079800 1053883
34226 1053883 1025124 993653 960152 925922 892531 861280 832861 807338 784409 763744 745347
$$ packed form
34309D32272P2641Q2212Q9215R2146R0110Q2985P1549N7485M3021L0286K0603
34298A164525J4220J0517Q461P004N274K648j245o428j2542j8809k4240k7967
34286A121418k9570k9098k6870k3245j8529j2992o870m53N703J0617J3032J1971
34274A015114P339J63p809j4870k0016k3182k5004k6361k7890k9679l1293l2104
34262G84408l1689k9953k6997k2894j7615j1057l068O521J7764L0383M3626N6243
34250G95672O6675P3359P5104P1387O2448M9193L3110J6184P11j1144j7977j9577
34238A195145j6960j1934o507k406p84k032n695j0640j5597j9749k3041k5917
34226A053883k8759l1471l3501l4230l3391l1251k8419k5523k2929k0665j8397
$$ plain form
34215 745347 729820 718364 712388 712776 719209 729911 742070 752694 759456 761073 757147 747832 733841
34202 733841 716850 699866 686874 681578 685738 697988 713860 727098 731722 723868 702685 670025
34190 670025 629342 584379 538102 492099 446454 400119 351703 300442 247024 193895 144942
34179 144942 104696 77537 67250 76896 108604 162933 238012 329116 429140 529941 623969
34168 623969 705568 771541 820892 853964 871555 874571 864285 842802 813130 778735 742948 708621
34156 708621 678105 653307 635638 625781 623349 626587 632384 636857 636463 629084 614468 593952 569847
34143 569847 544848 521501 501602 485683 472965 462028 451895 442934 436987 436637 444100 460420
34131 460420 485416 518284 558322 605235 658755 717815 779877 841066 897246 945472 984936
$$ packed form
34215G45347j5527j1456n976L88O433J0702J2159J0624O762J617l926r315j3991
34202G33841j6991j6984j2992n296M160J2250J5872J3238M624p854k1183l2660
34190F70025m0683m4963m6277m6003m5645m6335m8416n1261n3418n3129m8953
34179A44942m0246k7159j0287R646L1708N4329P5079R1104J00024J00801R4028
34168F23969Q1599O5973M9351L3072J7591L016j0286k1483k9672l4395l5787l4327
34156G08621l0516k4798j7669r857k432L238N797M473l94p379j4616k0516k4105
34143E69847k4999k3347j9899j5919j2718j0937j0133q961n947l50P463J6320
34131D60420K4996L2868M0038M6913N3520N9060O2062O1189N6180M8226L9464
$$ plain form
34120 984936 1016918 1043902 1068377 1091872 1114556 1135542 1153783 1169071 1182583 1196645 1213848
34109 1213848 1236039 1263729 1296128 1331556 1367852 1402541 1432943 1456359 1470418 1473490 1465123 1446422
34097 1446422 1420113 1390005 1359821 1331870 1306255 1281038 1253384 1221167 1184287 1145059 1107398
34086 1107398 1075292 1051376 1036374 1029471 1029213 1034401 1044643 1060487 1083147 1113916 1153532 1201710
34074 1201710 1257035 1317193 1379432 1441045 1499673 1553365 1600465 1639484 1669112 1688426 1697311
34063 1697311 1696903 1689790 1679739 1670932 1667006 1670184 1680822 1697473 1717416 1737429 1754524 1766477
34051 1766477 1772119 1771322 1764779 1753733 1739836 1725080 1711600 1701266 1695200 1693370 1694363 1695555 1693914
34038 1693914 1687284 1675534 1660795 1646566 1636198 1631617 1632947 1639151 1649242 1663314 1682835 1710191
$$ packed form
34120I84936L1982K6984K4475K3495K2684K0986J8241J5288J3512J4062J7203
34109A213848K2191K7690L2399L5428L6296L4689L0402K3416J4059L072q367j8701
34097A446422k6309l0108l0184k7951k5615k5217k7654l2217l6880l9228l7661
34086A107398l2106k3916j5002o903k58N188J0242J5844K2660L0769L9616M8178
34074A201710N5325O0158O2239O1613N8628N3692M7100L9019K9628J9314Q885
34063A697311m08p113j0051q807l926L178J0638J6651J9943K0013J7095J1953
34051A766477N642p97o543j1046j3897j4756j3480j0334o066j830R93J192j641
34038A693914o630j1750j4739j4229j0368m581J330O204J0091J4072J9521K7356
$$ plain form
34026 1710191 1747809 1797169 1857905 1927262 2000213 2070349 2131232 2177700 2206714 2217593 2211590
34015 2211590 2191090 2158902 2118017 2071774 2023928 1978262 1937891 1904677 1879084 1860444 1847388
34004 1847388 1838231 1831164 1824380 1816249 1805706 1792686 1778317 1764580 1753520 1746347 1742806 1741109 1738506
33991 1738506 1732328 1721027 1704688 1684858 1663979 1644896 1630520 1623406 1625134 1635700 1653324 1674825
33979 1674825 1696423 1714675 1727289 1733586 1734383 1731414 1726682 1722112 1719384 1719585 1722561 1726394 1727679 1722705
33965 1722705 1709045 1686707 1658274 1627982 1600194 1577967 1562393 1552936 1548317 1547320 1549121 1553289
33953 1553289 1559817 1569202 1582324 1599865 1621414 1644780 1665964 1679946 1681985 1668874 1639621 1595319
33941 1595319 1538500 1472472 1401001 1328127 1257784 1193124 1135914 1086407 1043725 1006471 973173
$$ packed form
34026A710191L7618M9360O0736O9357P2951P0136O0883M6468K9014J0879o003
34015B211590k0500l2188m0885m6243m7846m5666m0371l3214k5593j8640j3056
34004A847388r157p067o784q131j0543j3020j4369j3737j1060p173l541j697k603
33991A738506o178j1301j6339j9830k0879j9083j4376p114J728J0566J7624K1501
33979A674825K1598J8252J2614O297P97k969m732m570k728K01K976L833J285m974
33965A722705j3660k2338k8433l0292k7788k2227j5574r457m619r97J801M168
33953A553289O528R385J3122J7541K1549K3366K1184J3982K039j3111k9253m4302
33941A595319n6819o6028p1471p2874p0343o4660n7210m9507m2682l7254l3298
$$ plain form
33930 973173 942386 912528 881815 848571 811803 771586 728963 685541 643228 604255 571157
33919 571157 546383 531605 527097 531566 542489 556771 571423 584070 593240 598506 600414 600108 598732
33906 598732 596860 594353 590632 585117 577544 568021 556899 544543 531036 515964 498477 477782 453866
33893 453866 428085 403198 382742 369938 366501 371876 383247 396384 407028 412174 410720 403300
33881 403300 391554 377339 362313 347962 335798 327438 324380 327637 337385 352879 372783 395780
33869 395780 421099 448587 478470 511067 546644 585245 626363 668567 709446 745951 775076
33858 775076 794591 803584 802600 793394 778459 760551 742209 725272 710547 697892 686767 676951
33846 676951 669041 664446 664879 671508 684143 700841 718265 732779 741825 744835 743117 738865 734028
$$ packed form
33930I73173l0787k9858l0713l3244l6768m0217m2623m3422m2313l8973l3098
33919E71157k4774j4778m508M469J0923J4282J4652J2647R170N266J908l06j376
33906E98732j872k507l721n515p573r523j1122j2356j3507j5072j7487k0695k3916
33893D53866k5781k4887k0456j2804l437N375J1371J3137J0644N146j454p420
33881D03300j1746j4215j5026j4351j2164q360l058L257R748J5494J9904K2997
33869C95780K5319K7488K9883L2597L5577L8601M1118M2204M0879L6505K9125
33858G75076J9515Q993r84r206j4935j7908j8342j6937j4725j2655j1125r816
33846F76951p910m595M33O629J2635J6698J7424J4514R046L010j718m252m837
$$ plain form
33833 734028 729838 727093 726765 730317 739532 755952 780198 811485 847675 885977 924017 960671 996169
33820 996169 1031537 1067794 1105396 1144022 1182606 1219521 1252949 1281381 1303998 1320639 1331414
33809 1331414 1336291 1335091 1327929 1315729 1300349 1284076 1268800 1255391 1243590 1232283 1219792 1204092
33797 1204092 1183089 1155096 1119416 1076779 1029503 981302 936691 900055 874671 862064 861961 872780
33785 872780 892497 919568 953553 995035 1044722 1102222 1165146 1229091 1288451 1337683 1372542
33774 1372542 1390932 1393158 1381539 1359591 1331146 1299817 1268905 1241512 1220439 1207692 1203810 1207561
$$ packed form
33833G34028m190k745l28L552R215J6420K4246L1287L6190L8302L8040L6654L5498
33820I96169L5368L6257L7602L8626L8584L6915L3428K8432K2617J6641J0775
33809A331414M877j200p162j2200j5380j6273j5276j3409j1801j1307j2491j5700
33797A204092k1003k7993l5680m2637m7276m8201m4611l6636k5384j2607j03J0819
33785H72780J9717K7071L3985M1482M9687N7500O2924O3945N9360M9232L4859
33774A372542J8390K226j1619k1948k8445l1329l0912k7393k1073j2747l882L751
$$ [...]
##END NTUPLES=NMR SPECTRUM
##END=
