##TITLE=31Pdec_E3b0502-1
 CDCl3
 24 sc
 6.2.2024
##JCAMPDX= 6.0         $$ Bruker NMR JCAMP-DX V2.0
##DATA TYPE= NMR SPECTRUM
##DATA CLASS= NTUPLES
##ORIGIN= UXNMR, Bruker Analytische Messtechnik GmbH
##OWNER= root
$$ XWIN-NMR		Version 3.5
$$ Tue Feb  6 14:34:56 2024 Russian Standard Time (UT+4h)  she@DPX200
##.OBSERVE FREQUENCY= 81.013821
##.OBSERVE NUCLEUS= ^31P
##.ACQUISITION MODE= SIMULTANEOUS
##.ACQUISITION SCHEME= undefined
##.AVERAGES= 24
##.DIGITISER RES= 16
##SPECTROMETER/DATA SYSTEM= spect
##.PULSE SEQUENCE= zgpg30
##.SOLVENT NAME= CDCl3
##.SHIFT REFERENCE= (INTERNAL, CDCl3, 0, 248.564)
##AUDIT TRAIL= $$ (NUMBER, WHEN, WHO, WHERE, WHAT)
$$ ##TITLE= Audit trail, XWIN-NMR		Version 3.5
$$ ##JCAMPDX= 5.01
$$ ##ORIGIN= Bruker BioSpin GmbH
$$ ##OWNER= she
$$ F:/spectra/data/she/nmr/P31/1/pdata/1/auditp.txt
$$ ##AUDIT TRAIL=  $$ (NUMBER, WHEN, WHO, WHERE, WHAT)
(   1,<2024-02-06 14:32:36.20 +0400>,<she>,<DPX200>,
      <created by zg, POWCHK disabled, PULCHK disabled
       configuration hash MD5:
       00 E9 B6 7A A2 85 ED C7 34 08 36 98 17 FE 4E 26
       data hash MD5: 32K
       0B B9 02 B1 36 8A CC 78 E2 2C C2 E4 D6 77 3B F4>)
(   2,<2024-02-06 14:32:38.73 +0400>,<she>,<DPX200>,
      <Start of raw data processing
       efp BC_mod = 2 LB = 10 FT_mod = 6 PKNL = 1 PHC0 = -12871.12 PHC1 = 1535.685 SI = 64K 
       data hash MD5: 64K
       60 D9 74 27 52 1B 0E F2 19 23 E2 DE 51 BA E3 55>)
(   3,<2024-02-06 14:32:48.85 +0400>,<she>,<DPX200>,
      <pk PHC0 = 78.1605 PHC1 = 0 
       data hash MD5: 64K
       E3 2A 76 55 BF F6 5F 9C 6E 48 CD C3 83 62 5D AE>)
(   4,<2024-02-06 14:32:51.60 +0400>,<she>,<DPX200>,
      <abs ABSG = 5 
       data hash MD5: 64K
       BB 83 CD EB 7A E7 83 BC DB 20 78 83 E9 86 D0 D5>)
$$ ##END=
$$ 
$$ hash MD5
$$ 54 67 3D DC 38 3A 67 86 50 43 80 9B 1A CB 1F E1
##$RELAX= 
##$RELAX= 
##$RELAX= 
##$RELAX= 
##$RELAX= 
##$RELAX= 
##$RELAX= 
##$RELAX= 
##$RELAX= 
$$ Bruker specific parameters
$$ --------------------------
##$DU= <F:/spectra>
##$EXPNO= 1
##$NAME= <P31>
##$PROCNO= 1
##$TYPE= <nmr>
##$USER= <she>
##$AMP= (0..31)
100 100 100 100 100 100 100 100 100 100 100 100 100 100 100 100 100 100 
100 100 100 100 100 100 100 100 100 100 100 100 100 100 
##$AQSEQ= 0
##$AQ_mod= 1
##$AUNM= <au_zg>
##$AUTOPOS= <>
##$BF1= 81.014009
##$BF2= 200.13
##$BF3= 200.13
##$BF4= 200.13
##$BF5= 200.13
##$BF6= 200.13
##$BF7= 200.13
##$BF8= 200.13
##$BYTORDA= 1
##$CFDGTYP= 0
##$CFRGTYP= 5
##$CHEMSTR= <none>
##$CNST= (0..31)
1 1 145 1 1 1 1 1 1 1 1 1 1 1 1 1 1 1 1 1 1 1 1 1 1 1 1 1 1 1 1 1 
##$CPDPRG= <waltz16>
##$CPDPRG1= <>
##$CPDPRG2= <waltz16>
##$CPDPRG3= <>
##$CPDPRG4= <mlev>
##$CPDPRG5= <mlev>
##$CPDPRG6= <mlev>
##$CPDPRG7= <mlev>
##$CPDPRG8= <mlev>
##$CPDPRGB= <>
##$CPDPRGT= <>
##$D= (0..31)
0 1 0 0 0 0 0 0 0 0 0 0.03 2e-05 3e-06 0 0 0 0 0 0 0 0 0 0 0 0 0 0 0 0 
0 0 
##$DATE= 1707215555
##$DBL= (0..7)
120 120 120 11 120 120 24 19 
##$DBP= (0..7)
150 150 150 150 150 150 150 150 
##$DBP07= 0
##$DBPNAM0= <>
##$DBPNAM1= <>
$$ [...]
##$SUBNAM3= <"">
##$SUBNAM4= <"">
##$SUBNAM5= <"">
##$SUBNAM6= <"">
##$SUBNAM7= <"">
##$SUBNAM8= <"">
##$SUBNAM9= <"">
##$SW= 501.771253377433
##$SWIBOX= (0..15)
0 1 3 0 0 0 0 0 0 0 0 0 0 0 0 0 
##$SW_h= 40650.406504065
##$TD= 32768
##$TD0= 1
##$TE= 0
##$TE2= 300
##$TE3= 300
##$TEG= 300
##$TL= (0..7)
0 120 53 12 22 120 120 120 
##$TP= (0..7)
150 150 150 150 150 150 150 150 
##$TP07= 0
##$TPNAME0= <>
##$TPNAME1= <>
##$TPNAME2= <>
##$TPNAME3= <>
##$TPNAME4= <>
##$TPNAME5= <>
##$TPNAME6= <>
##$TPNAME7= <>
##$TPOAL= (0..7)
0.5 0.5 0.5 0.5 0.5 0.5 0.5 0.5 
##$TPOFFS= (0..7)
0 0 0 0 0 0 0 0 
##$TUNHIN= 0
##$TUNHOUT= 0
##$TUNXOUT= 0
##$USERA1= <user>
##$USERA2= <user>
##$USERA3= <user>
##$USERA4= <user>
##$USERA5= <user>
##$V9= 5
##$VALIST= <valist>
##$VCLIST= <CCCCCCCCCCCCCCC>
##$VD= 0
##$VDLIST= <DDDDDDDDDDDDDDD>
##$VPLIST= <PPPPPPPPPPPPPPP>
##$VTLIST= <TTTTTTTTTTTTTTT>
##$WBST= 1024
##$WBSW= 4
##$XGAIN= (0..3)
0 0 0 0 
##$XL= 0
##$YL= 0
##$YMAX_a= 2825
##$YMIN_a= -2779
##$ZGOPTNS= <>
##$ZL1= 120
##$ZL2= 120
##$ZL3= 120
##$ZL4= 120
##$ABSF1= 248.5645
##$ABSF2= -253.2056
##$ABSG= 5
##$ABSL= 3
##$ALPHA= 0
##$AQORDER= 0
##$ASSFAC= 0
##$ASSFACI= 0
##$ASSFACX= 0
##$ASSWID= 0
##$AUNMP= <proc_1d>
##$AZFE= 0.1
##$AZFW= 0.5
##$BCFW= 0
##$BC_mod= 2
##$BYTORDP= 0
##$COROFFS= 0
##$CY= -3
##$DATMOD= 1
##$DC= 0
##$DFILT= <>
##$DTYPP= 0
##$F1P= 0
##$F2P= 0
##$FCOR= 1
##$FTSIZE= 65536
##$FT_mod= 6
##$GAMMA= 0
##$GB= 0
##$INTBC= 1
##$INTSCL= 6.047779e-11
##$ISEN= 30
##$LB= 10
##$LEV0= 0
##$LPBIN= 0
##$MAXI= 10000
##$MC2= 0
##$MEAN= 0
##$ME_mod= 0
##$MI= 50
##$NCOEF= 0
##$NC_proc= -8
##$NLEV= 6
##$NOISF1= 182.463
##$NOISF2= 159.3651
##$NSP= 0
##$NTH_PI= 0
##$NZP= 0
##$OFFSET= 248.5645
##$PC= 4
##$PHC0= -12792.96
##$PHC1= 1535.685
##$PH_mod= 1
##$PKNL= yes
##$PPARMOD= 0
##$PSCAL= 0
##$PSIGN= 0
##$REVERSE= no
##$SF= 81.0140089999694
##$SI= 65536
##$SIGF1= 159.3651
##$SIGF2= -187.1042
##$SINO= 113.3802
##$SIOLD= 16384
##$SREGLST= <1H.CDCl3>
##$SSB= 0
##$STSI= 65536
##$STSR= 0
##$SW_p= 40650.406504065
##$SYMM= 0
##$S_DEV= 0
##$TDeff= 32768
##$TDoff= 0
##$TI= <>
##$TILT= no
##$TM1= 0
##$TM2= 0
##$TOPLEV= 0
##$USERP1= <user>
##$USERP2= <user>
##$USERP3= <user>
##$USERP4= <user>
##$USERP5= <user>
##$WDW= 1
##$XDIM= 65536
##$YMAX_p= 415571285
##$YMIN_p= -20898014
$$ End of Bruker specific parameters
$$ ---------------------------------
##NTUPLES= NMR SPECTRUM
##VAR_NAME=  FREQUENCY,     SPECTRUM/REAL,   SPECTRUM/IMAG
##SYMBOL=    X,             R,               I
##VAR_TYPE=  INDEPENDENT,   DEPENDENT,       DEPENDENT
##VAR_FORM=  AFFN,          ASDF,            ASDF
##VAR_DIM=   65536,         65536,           65536
##UNITS=     HZ,            ARBITRARY UNITS, ARBITRARY UNITS
##FACTOR=    0.620285442955139, 1,           1
##FIRST=     20137.2065510682, 0,            0
##LAST=      -20513.1999529968, 0,           0
##MIN=       -20513.1999529968, -20898014,   0
##MAX=       20137.2065510682, 415571285,    0
$$ Real data points
##PAGE= N=1
##DATA TABLE= (X++(R..R)), XYDATA
$$ [...]
39886I97290J26850J26737J14160Q6643M3105j4967q2896j53391k18083k68979
$$ 997290 1124140 1250877 1365037 1451680 1494785 1479818 1396922 1243531 1025448 756469
39876G56469k99297l04237k82248k36282j73708j04465l8344J7468N9890R0119
$$ 756469 457172 152935 -129313 -365595 -539303 -643768 -682112 -664644 -604754 -514635
39866e14635J12270J30735J47781J62937J74285J80335J81140J78264J74043J70779
$$ -514635 -402365 -271630 -123849 39088 213373 393708 574848 753112 927155 1097934
39856A097934J70260J73784J82211J95521K11851K27102K35908K33887K19978
$$ 1097934 1268194 1441978 1624189 1819710 2031561 2258663 2494571 2728458 2948436
39847B948436J97485J73206J54710J47062J50540J60452J68892J67341J49118
$$ 2948436 3145921 3319127 3473837 3620899 3771439 3931891 4100783 4268124 4417242
39838D417242J11156N4798j4448q8274j57697k15478k58035k86012l03191l14354
$$ 4417242 4528398 4583196 4568748 4480474 4322777 4107299 3849264 3563252 3260061 2945707
39828B945707l23382l32393l41656l49407l51629l42599l16805k71476k08117
$$ 2945707 2622325 2289932 1948276 1598869 1247240 904641 587836 316360 108243
39819A08243j32127n0942K7959R8405J56207J99423K28291K44706K51368K50949
$$ 108243 -23884 -74826 -46867 51538 207745 407168 635459 880165 1131533 1382482
39809A382482K45518K36500K25017K12288J99637J87953J77054J65483J51007
$$ 1382482 1628000 1864500 2089517 2301805 2501442 2689395 2866449 3031932 3182939
39800C182939J31530J05965P4625L9053J379l6494p3482j09299j43561j74439
$$ 3182939 3314469 3420434 3495059 3534112 3535491 3498997 3425515 3316216 3172655 2998216
39790B998216j97900k08576k02156j78009j40448r7831n9926l4614k5346l0380
$$ 2998216 2800316 2591740 2389584 2211575 2071127 1973296 1913370 1878756 1853410 1823030
39780A823030m3968n8544o6793o3080m4476j1685L0476P3572J07428J23000J15267
$$ 1823030 1779062 1720518 1653725 1590645 1546169 1534484 1564960 1638532 1745960 1868960 1984227
39769A984227Q4908L8123j5291o4785j01931j22589j27630j21845j11311j00269
$$ 1984227 2069135 2107258 2091967 2027182 1925251 1802662 1675032 1553187 1441876 1341607
39759A341607q9203p5186n4501k5727Q924M4976P8290J06545J28707J43898J51340
$$ 1341607 1252404 1177218 1122717 1096990 1105914 1150890 1229180 1335725 1464432 1608330 1759670
39748A759670J51424J46275J38712J30062J18552R9789O9412K6502k4718p6313
$$ 1759670 1911094 2057369 2196081 2326143 2444695 2544484 2613896 2640398 2615680 2539367
39738B539367j20499j53186j74831j88484j97209k02912k06914k10637k15037
$$ 2539367 2418868 2265682 2090851 1902367 1705158 1502246 1295332 1084695 869658
39729H69658k18777k16996k02499j69406j17197n2358J3456O7495R9869J05872
$$ 869658 650881 433885 231386 61980 -55217 -107575 -94119 -26624 73245 179117
39719A79117Q6436M7107l887n7761j06542j43511j63335j62592j40576r9889m6376
$$ 179117 265553 312660 308773 251012 144470 959 -162376 -324968 -465544 -565433 -611809
39708f11809J1510O4077J02415J20736J18062R8610P0556M3544K5870K2650L5646
$$ -611809 -600299 -536222 -433807 -313071 -195009 -96399 -25843 17701 43571 66221 101867
39697A01867O4006J04675J52168J98608K34937K53090K48429K21852J80573J36426
$$ 101867 165873 270548 422716 621324 856261 1109351 1357780 1579632 1760205 1896631
39687A896631J01629Q4064Q4743R8658J17970J35657J48112J55671J60911J65619
$$ 1896631 1998260 2082324 2167067 2265725 2383695 2519352 2667464 2823135 2984046 3149665
39677C149665J68412J64576J48239J15619O7607J0206m7598r7513j35242j61785
$$ 3149665 3318077 3482653 3630892 3746511 3814118 3824324 3776726 3679213 3543971 3382186
39667C382186j82409k03739k30224k61465k92069l14215l21229l09987k81507
$$ 3382186 3199777 2996038 2765814 2504349 2212280 1898065 1576836 1266849 985342
39658I85342k40530j94775j53411j24464j12140j15623j29973j48147j63075j69231
$$ 985342 744812 550037 396626 272162 160022 44399 -85574 -233721 -396796 -566027
39648e66027j63650j46229j19323q6849n3340k3060J105J8678L1847M4283N9032
$$ -566027 -729677 -875906 -995229 -1082078 -1135418 -1158478 -1157373 -1138695 -1106848 -1062565 -1003533
39637a003533P6911R6392J14610J28332J34418J30257J14883R0199O1046L3586
$$ -1003533 -926622 -830230 -715620 -587288 -452870 -322613 -207730 -117531 -56485 -22899
39627b2899J2969J906O29P386J8747L0060L6728L6142K9024J9233J2192J2866
$$ -22899 -9930 -8024 -7395 -9 18738 48798 85526 121668 150692 169925 182117 194983
39615A94983K4167M6169P6067J08843J38459J59454J68609J65891J54132J37591
$$ 194983 219150 265319 341386 450229 588688 748142 916751 1082642 1236774 1374365
39605A374365J20296J05060R3138Q4289P7066O9504N9992M7810L3022J6093k178
$$ 1374365 1494661 1599721 1692859 1777148 1854214 1923718 1983710 2031520 2064542 2080635 2078457
39594B078457k0249l5485m4586m4749l4839j5781R639L6925N9919P1779O7562
$$ 2078457 2058208 2022723 1978137 1933388 1898549 1882768 1892407 1929332 1989251 2061030 2128592
39583B128592M7311J7253j2487l2721l9821l7180l2701l3938m4082o1167q0178
$$ 2128592 2175903 2193156 2180669 2147948 2108127 2070947 2038246 2004308 1960226 1899059 1818881
39572A818881r5648j02994r8719q0842m9661p826M0800R2408J43126J87519K17500
$$ 1818881 1723233 1620239 1521520 1440678 1391017 1383191 1423991 1516399 1659525 1847044 2064544
39561B064544K23550J98457J41767O1947k5779j05141j64828k01447k18341k22037
$$ 2064544 2288094 2486551 2628318 2690265 2664486 2559345 2394517 2193070 1974729 1752692
39551A752692k18775k12456k04181j92914j76691j53745j23204q5569m3136P2
$$ 1752692 1533917 1321461 1117280 924366 747675 593930 470726 385157 342021 342093
39541C42093L9428P1619R5995J14214J28326J38729J43571J40140J27249J06671
$$ 342093 381521 453140 549135 663349 791675 930404 1073975 1214115 1341364 1448035
39531A448035Q2281N7528L3349Q107k0852n5508r6275j41730j88637k32443k68122
$$ 1448035 1530316 1587844 1621193 1629300 1608448 1552940 1456665 1314935 1126298 893855 625733
39520F25733k90997k97067k83332k48596j94433j25413m8094L0354J03070J63819
$$ 625733 334736 37669 -245663 -494259 -688692 -814105 -862199 -831845 -728775 -564956
39510e64956K07621K31921K37652K28999K11594J90274J67928J46120J26698J12630
$$ -564956 -357335 -125414 112238 341237 552831 743105 911033 1057153 1183851 1296481
39500A296481J07158J11757J24735J41647J57436J68828J75526J79488J82816
$$ 1296481 1403639 1515396 1640131 1781778 1939214 2108042 2283568 2463056 2645872
39491B645872J85777J86547J82873J74129J61620J46856J29549J07325P7384L8500
$$ 2645872 2831649 3018196 3201069 3375198 3536818 3683674 3813223 3920548 3997932 4036432
39481D036432q054n8937j09753j55943j93180k17460k25398k15213j88237j50120
$$ 4036432 4028378 3969441 3859688 3703745 3510565 3293105 3067707 2852494 2664257 2514137
39471B514137j10576q0990p0417q1686j09961j44730j74050j88324j81944j53412
$$ 2514137 2403561 2322571 2252154 2170468 2060507 1915777 1741727 1553403 1371459 1218047
39461A218047j05483m5682J4296O1529Q6218Q4915O0592K0069k9168q0921j30576
$$ 1218047 1112564 1066882 1081178 1142707 1228925 1313840 1374432 1394501 1365333 1284412 1153836
39450A153836j74355k08368k28168k29563k10514j72965j22884o8011j4665L4358
$$ 1153836 979481 771113 542945 313382 102868 -70097 -192981 -260992 -275657 -241299
39440b41299P9586J22951J65855K08475K49935K88313L20240L41339L48336L41243
$$ -241299 -161713 -38762 127093 335568 585503 873816 1194056 1535395 1883731 2224974
39430B224974L23076K96570K60852K11477J44256O0034l3336j23297j97840k50384
$$ 2224974 2548050 2844620 3105472 3316949 3461205 3521239 3487903 3364606 3166766 2916382
39420B916382k81258k95410k98455k93699k81139k58037k20596j66436r6842j7292
$$ 2916382 2635124 2339714 2041259 1747560 1466421 1208384 987788 821352 724510 707218
39410G07218O4149J39351K02149K49248K80022K95515K97318K87227K67689K41793
$$ 707218 771367 910718 1112867 1362115 1642137 1937652 2234970 2522197 2789886 3031679
39400C031679K12119J79374J42497J00397N3892O527l5903o6706q0176p3457m7645
$$ 3031679 3243798 3423172 3565669 3666066 3719958 3726485 3690582 3623876 3543700 3470243 3422598
39389C422598p684L8563Q1746J12908J25766J18430R3524N6589J3645l0988p5799
$$ 3422598 3414914 3453477 3535223 3648131 3773897 3892327 3985851 4042440 4056085 4025097 3949298
39378C949298j21702j70252k21405k72168l16885l48856l62520l55259l28266
$$ 3949298 3827596 3657344 3435939 3163771 2846886 2498030 2135510 1780251 1451985
39369A451985k86068k35223j83058j36645j01421p9106o6372n6063m1070j8402
$$ 1451985 1165917 930694 747636 610991 509570 430464 364092 308029 266959 248557
39359B48557R396L6359N7010O9529P6418Q2672R2819J08435J27296J44189J52951
$$ 248557 257953 294312 351322 420851 497269 579941 672760 781195 908491 1052680 1205631
39348A205631J48898J30608J00136O1609J9205k4255o7528j10206j51533j89453
$$ 1205631 1354529 1485137 1585273 1646882 1666087 1641832 1574304 1464098 1312565 1123112
39338A123112k20484k40755k47810k42273k28458k13285k03486k02307k07895
$$ 1123112 902628 661873 414063 171790 -56668 -269953 -473439 -675746 -883641
39329h83641k15025k19249k20006k19885k20723k20223k12324j90962j53868j03376
$$ -883641 -1098666 -1317915 -1537921 -1757806 -1978529 -2198752 -2411076 -2602038 -2755906 -2859282
39319b859282m4097J9962Q6416J53291K17078K71955L11129L29893L28490L12601
$$ -2859282 -2903379 -2883417 -2797001 -2643710 -2426632 -2154677 -1843548 -1513655 -1185165 -872564
39309h72564K90618K69592K52601K38861K25608K10042J90657J67747J43236J19841
$$ -872564 -581946 -312354 -59753 179108 404716 614758 805415 973162 1116398 1236239
39299A236239R9931Q4524P2649O1638M8576L2358J4730o23j0144j2082p274O68
$$ 1236239 1336170 1420694 1493343 1554981 1603557 1635915 1650645 1650022 1639878 1627796 1620522 1621190
39287A621190N765J367j7102m9916r2964j39786j84182k21662k49395k65556k69136
$$ 1621190 1626955 1628322 1611220 1561304 1468340 1328554 1144372 922710 673315 407759 138623
39276A38623k60408k41240k14477j82614j46804j07042o3463j8013K4752N8497
$$ 138623 -121785 -363025 -577502 -760116 -906920 -1013962 -1077425 -1095438 -1070686 -1012189
39266a012189P7476P9057O5204M2244J9023L806R89R540K4385L9610N1054N7132
$$ -1012189 -934713 -855656 -790452 -748208 -729185 -725379 -724390 -714850 -690465 -650855 -599801 -542669
39254e42669N8585N7819N7467N8106N6782M8146K7867l938m1428p4486r2182q6589
$$ -542669 -484084 -426265 -368798 -310692 -253910 -205764 -177897 -181835 -223263 -297749 -389931 -476520
39242d76520n5136n83P0310J47933K20543K75993L05021L04456K78172K35200
$$ -476520 -531656 -532239 -461929 -313996 -93453 182540 487561 792017 1070189 1305389
39232A305389J86439J41651J07332Q5510P3554O5554N5386M0236K2339P195p18
$$ 1305389 1491828 1633479 1740811 1826321 1899875 1965429 2020815 2061051 2083390 2090585 2089867
39221B089867j515J70j355r244k3199m1288o1965q4472j07875j30193j48259j58134
$$ 2089867 2088352 2088522 2087167 2077923 2054724 2013436 1951471 1866999 1759124 1628931 1480672 1322538
39209A322538j56042j40051j11832p6794m1815j2089J0503K6678L7852M4782M7486
$$ 1322538 1166496 1026445 914613 837819 796004 783915 794418 821096 858948 903730 951216
39198I51216M6249M2831M0621M3068N1406O3662P5787Q3670Q4302P5928N8143
$$ 951216 997465 1040296 1080917 1123985 1175391 1239053 1314840 1398510 1482812 1558740 1616883
39187A616883L2412K473k6148m7656n8028n6578m5969l0536j4234Q5R955J2587
$$ 1616883 1649295 1651768 1625620 1577964 1519936 1463358 1417389 1386853 1372619 1372704 1382659 1395246
39175A395246N466j2069l7792o6948r3710j12692j19952j13563r4206o5580l3757
$$ 1395246 1400712 1388643 1350851 1283903 1190193 1077501 957549 843986 749780 684200 650443
39164F50443n001J6934L2055M2951N2277O0946O7908P1273O9772O3956N6312N0002
$$ 650443 645442 662376 694431 737382 789659 850605 918513 989786 1059558 1123514 1179826 1229828
39152A229828M6999M7048M8307M8726M6750M1002L0126J3692o309k4840l4963
$$ 1229828 1276827 1323875 1372182 1420908 1467658 1508660 1538786 1552478 1546169 1521329 1486366
39141A486366l0330p703L1665Q2313J36369J86138K26514K56180K77172K93100
$$ 1486366 1456036 1448333 1479998 1562311 1698680 1884818 2111332 2367512 2644684 2937784
39131B937784L07112L20605L32990L42101L44790L37791L18951K88393K48588
$$ 2937784 3244896 3565501 3898491 4240592 4585382 4923173 5242124 5530517 5779105
39122E779105K03210J55671J08432O3128K0761j8376n4577q7971j17637j41370
$$ 5779105 5982315 6137986 6246418 6309546 6330307 6311931 6257354 6169383 6051746 5910376
39112E910376j56450j60965j55056j41580j25894j14654j13845j26695j52360
$$ 5910376 5753926 5592961 5437905 5296325 5170431 5055777 4941932 4815237 4662877
39103D662877j86280k22225k55057k82524l05049l23944l39488l50140l53261
$$ 4662877 4476597 4254372 3999315 3716791 3411742 3087798 2748310 2398170 2044909
39094B044909l46777l30526l06191k75827k40449k00276j56438j12392p3391m4289
$$ 2044909 1698132 1367606 1061415 785588 545139 344863 188425 76033 2642 -41647
39084d1647k7135j9965j7441j3240l237J2395K9680M3603N1242N3290N3560N7109
$$ -41647 -68782 -88747 -106188 -119428 -122665 -110270 -80590 -36987 14255 67545 121105 178214
39072A78214O7710Q5539J06317J22955J29157J22845J07187Q8809P4814P0554
$$ 178214 245924 331463 437780 560735 689892 812737 919924 1008733 1083547 1154101
39062A154101P8757R9376J29468J63538J94970K18255K30718K32658K26304K14756
$$ 1154101 1232858 1332234 1461702 1625240 1820210 2038465 2269183 2501841 2728145 2942901
39052B942901K01384J89268J80097J73161J65604J54304J38169J19056J00800
$$ 2942901 3144285 3333553 3513650 3686811 3852415 4006719 4144888 4263944 4364744
39043D364744Q7453Q2208Q7222J03276J28702J58358J83942J96093J87311J54478
$$ 4364744 4452197 4534405 4621627 4724903 4853605 5011963 5195905 5391998 5579309 5733787
39033E733787J00201L2526l7348r9018j46862j81607k08289k32021k54490k73393
$$ 5733787 5833988 5866514 5829166 5730148 5583286 5401679 5193390 4961369 4706879 4433486
39023D433486k84472k84191k71450k47933k17741j86620j60787j45126j41237
$$ 4433486 4149014 3864823 3593373 3345440 3127699 2941079 2780292 2635166 2493929
39014B493929j46215j53335j54720j44644j21381q6722m4090K846N0315R4061
$$ 2493929 2347714 2194379 2039659 1895015 1773634 1686912 1642822 1645668 1695983 1790044
39004A790044J29482J52636J61626J57679J45180J30150J17441J08127R8780Q3279
$$ 1790044 1919526 2072162 2233788 2391467 2536647 2666797 2784238 2892365 2991145 3074424
38994C074424N6198J5932l3763q4517j26236j51309j58157j51960j41729j35459
$$ 3074424 3130622 3146554 3112791 3028274 2902038 2750729 2592572 2440612 2298883 2163424
38984B163424j36520j43471j52835j62331j72142j83564j96667k09221k18011
$$ 2163424 2026904 1883433 1730598 1568267 1396125 1212561 1015894 806673 588662
38975E88662k21336k20279k17612k15477k13959k11527k06495j98293j87817j76804
$$ 588662 367326 147047 -70565 -286042 -500001 -711528 -918023 -1116316 -1304133 -1480937
38965a480937j66716j57715j48334j35839j16766q7583m5846Q153P0145J32227
$$ -1480937 -1647653 -1805368 -1953702 -2089541 -2206307 -2293890 -2339736 -2331583 -2261438 -2129211
38955b129211J85167K21777K39505K40652K29970K11436J86679J55861J19636
$$ -2129211 -1944044 -1722267 -1482762 -1242110 -1012140 -800704 -614025 -458164 -338528
38946c38528Q0325M1787Q775j3924k2591j5840M635L4350O7351R8068J23017J41351
$$ -338528 -258203 -216416 -207641 -221565 -244156 -259996 -255361 -221011 -153660 -55592 67425 208776
38934B08776J53927J61974J66527J68706J69504J68686J63789J50306J22966P7357
$$ 208776 362703 524677 691204 859910 1029414 1198100 1361889 1512195 1635161 1712518
38924A712518J1758p0999j62950k52870l29940l86748m19828m28260m12181l72344
$$ 1712518 1724276 1653277 1490327 1237457 907517 520769 100941 -327319 -739500 -1111844
38914a111844l10706k31201j39881m4284M7694J28729J92781K35862K56786K57208
$$ -1111844 -1422550 -1653751 -1793632 -1837916 -1790222 -1661493 -1468712 -1232850 -976064 -718856
38904g18856K40723K11710J74919J35604R9214P0069M9685L5960K3795O887k0149
$$ -718856 -478133 -266423 -91504 44100 143314 213383 263068 299028 322823 329710 309561
38893C09561o0104j12388j73007k35105k90085l29477l47149l40897l12651k67435
$$ 309561 249457 137069 -35938 -271043 -561128 -890605 -1237754 -1578651 -1891302 -2158737
38883b158737k12072j53897r9568n3853j9002M911J9056K5174K5443K2454J8784
$$ -2158737 -2370809 -2524706 -2624274 -2678127 -2697129 -2692218 -2673162 -2647988 -2622545 -2600091 -2581307
38872b581307J6485J6936K1136L0052M4689O6051R4997J31618J74076K17624K55061
$$ -2581307 -2564822 -2547886 -2526750 -2496698 -2452009 -2385958 -2290961 -2159343 -1985267 -1767643 -1512582
38861a512582K78940K84277K69830K37399J90496J34075P5158K2478j6071l6865
$$ -1512582 -1233642 -949365 -679535 -442136 -251640 -117565 -42407 -19929 -36000 -72865
38851g2865m1960l7145k8087j7403m411J2861L5235O1109Q6833J07892J19980
$$ -72865 -114825 -151970 -180057 -197460 -201871 -189010 -153775 -92666 -5833 102059 222039
38840B22039J19873J06451Q1579M9675J5645j7452m8845p8341j04308j23374j31960
$$ 222039 341912 448363 529942 579617 595262 577810 528965 450624 346316 222942 90982
38829I0982j28033j11919q6000n3968j9859J2992M2631O8304Q9483J04868J12331
$$ 90982 -37051 -148970 -234970 -288938 -308797 -295805 -253174 -184870 -95387 9481 121812
38818A21812J09941R7351P6588N1557K6400L687j6237l4081m9544o0246o2771
$$ 121812 231753 329104 405692 457249 483649 487336 471099 437018 387474 327228 264457
38807B64457n4877l6974j1903J6433M4460O9699R0926J07705J19647J25705J24074
$$ 264457 209580 172606 160703 177136 221596 291295 382221 489926 609573 735278 859352
38796H59352J12816R0985N9794K3261j2106l8718m9983m2220j5678K5880P6611
$$ 859352 972168 1063153 1122947 1146208 1134102 1095384 1045401 1003181 987503 1013383 1089994
38785A089994J29976J79054K16299K34177K27606J96760J47847R0849L5599j1099
$$ 1089994 1219970 1399024 1615323 1849500 2077106 2273866 2421713 2512562 2548161 2537062
38775B537062m5692o5990o9308n2847j6263L5978R5068J51179J96904K28301K43713
$$ 2537062 2491370 2425380 2356072 2303225 2286962 2322940 2418008 2569187 2766091 2994392 3238105
38764C238105K42502K24985J93254J51598J05964O2549K6158q09j8173k7069k9422
$$ 3238105 3480607 3705592 3898846 4050444 4156408 4218957 4245115 4244306 4226133 4199064 4169642
38753D169642k8320k8248l3866m7544o7584q8908j05956j15843j19725j21889
$$ 4169642 4141322 4113074 4079208 4031664 3964080 3875172 3769216 3653373 3533648 3411759
38743C411759j27294j39065j57015j77826j96609k08966k12606k07900j97249
$$ 3411759 3284465 3145400 2988385 2810559 2613950 2404984 2192378 1984478 1787229
38734A787229j83657j69245j54582j39179j22473j04373q5167o5408m6148k9016
$$ 1787229 1603572 1434327 1279745 1140566 1018093 913720 828553 763145 716997 687981
38724F87981j5704p321m306o805j4747k7463m3645o2023q2149j04400j29234j56255
$$ 687981 672277 664956 660650 653845 639098 611635 567990 505967 423818 319418 190184 33929
38712C3929j83421k06747k20983k21685k07473j80821j46683j10290p5841m6442
$$ 33929 -149492 -356239 -577222 -798907 -1006380 -1187201 -1333884 -1444174 -1520015 -1566457
38702a566457k4264j0115k783R98N635J5525L4368O4889J08105J61743K18957
$$ -1566457 -1590721 -1600836 -1603619 -1602621 -1596986 -1581461 -1547093 -1482204 -1374099 -1212356 -993399
38691i93399K69198L01959L11483K99266K72392K38792K02761J63788J19275O8714
$$ -993399 -724201 -422242 -110759 188507 460899 699691 902452 1066240 1185515 1254229
38681A254229J5990l1912o8591r1465j02440j05896j05726j03383r8066q8358
$$ 1254229 1270219 1238307 1169716 1078251 975811 869915 764189 660806 562740 474382
38671D74382p3828n5324l4265j1816J1232L4105N5698P4782R0672J03764J15050
$$ 474382 400554 345230 310965 299149 310381 344486 400184 474966 565638 669402 784452
38660G84452J24416J29140J24263J05328P1629K7568j8725n8610q6161j00053
$$ 784452 908868 1038008 1162271 1267599 1339228 1366796 1348071 1289461 1203300 1103247
38650A103247j03480j02268j02173j06613j15739j26948j36352j40573j37995
$$ 1103247 999767 897499 795326 688713 572974 446026 309674 169101 31106
38641C1106j28873j14240r4614p0105m2170j5524K270M054j2964m5568q6074j25320
$$ 31106 -97767 -212007 -306621 -376726 -418896 -434420 -432150 -428096 -441060 -486628 -572702 -698022
38629f98022j54987j68691j62511j35526r0141l1960L0976Q9712J36556J67142
$$ -698022 -853009 -1021700 -1184211 -1319737 -1409878 -1441838 -1410862 -1321150 -1184594 -1017452
38619a017452J81526J83986J81622J81944J89865K05496K24479K40968K51125
$$ -1017452 -835926 -651940 -470318 -288374 -98509 106987 331466 572434 823559
38610H23559K54376K52099K45553K35106K20887K03516J83921J62545J39040J12777
$$ 823559 1077935 1330034 1575587 1810693 2031580 2235096 2419017 2581562 2720602 2833379
38600B833379Q3586N1802J7783j8355n6239r4454j30190j59599j78592j83937
$$ 2833379 2916965 2968767 2986550 2968195 2911956 2817502 2687312 2527713 2349121 2165184
38590B165184j74500j52370j23039r3940p1425n7670m9483m0235k3755K331L5708
$$ 2165184 1990684 1838314 1715275 1621335 1549910 1492240 1442757 1402522 1378767 1381098 1416806
38579A416806P0756J00681J19177J21586J05698P2142K4222l2809r2766j49614
$$ 1416806 1487562 1588243 1707420 1829006 1934704 2006846 2031068 1998259 1905493 1755879
38569A755879j98274k35022k57796k66521k63085k50191k29474k00466j61550
$$ 1755879 1557605 1322583 1064787 798266 535181 284990 55516 -144950 -306500
38560c06500j12147n4214P980O9227J24831J71525K07708K32869K46628K48462
$$ -306500 -418647 -472861 -464881 -395654 -270823 -99298 108410 341279 587907 836369
38550H36369K38511K18675J92552J64087J36124J09722Q4218N7749K8549k951
$$ 836369 1074880 1293555 1486107 1650194 1786318 1896040 1980258 2038007 2066556 2063605
38540B063605l2713n4197o1851n4359l5143j0226J4421L4219M6188M8810M1936
$$ 2063605 2030892 1976695 1914844 1860485 1825342 1815116 1829537 1863756 1909944 1958754 2000690
38529B000690K6380L200k6861o3326j05328j50915j96759k38770k73466k99228
$$ 2000690 2027070 2030270 2003409 1940083 1834755 1683840 1487081 1248311 974845 675617
38519F75617l16396l25935l27869l20909l03637k76074k40291j99687j57589j15949
$$ 675617 359221 33286 -294583 -615492 -919129 -1195203 -1435494 -1635181 -1792770 -1908719
38509a908719p4537l0928J8523P6882J44575K17938K89418L49799L91628M11777
$$ -1908719 -1983256 -2014184 -1995661 -1918779 -1774204 -1556266 -1266848 -917049 -525421 -113644
38499a13644M11441L93866L61980L17731K62852J99658J31181O1009o563o6437
$$ -113644 297797 691663 1053643 1371374 1634226 1833884 1965065 2026074 2019511 1953074
38489A953074j13095j41654j49271j36379j07226o9214l0914L24K0052K7212K3809
$$ 1953074 1839979 1698325 1549054 1412675 1305449 1236235 1205321 1205645 1225697 1252909 1276718
38478A276718J4261M080k477m758o118j1556k4358m4451o9179r4548j15407j25222
$$ 1276718 1290979 1295059 1292582 1287824 1281706 1270150 1245792 1201341 1132162 1037614 922207 796985
38466G96985j17379q7995l8261K5521R4082J58119K10701K48422K71049K80182
$$ 796985 679606 591611 553350 578871 672953 831072 1041773 1290195 1561244 1841426
38456A841426K77967K66610K48335K25107J98232J68332J35803J01013O3904K3493
$$ 1841426 2119393 2386003 2634338 2859445 3057677 3226009 3361812 3462825 3526729 3550222
38446C550222k1838p2959j28333j83337k31269k65525k81498k77027k51804k06964
$$ 3550222 3528384 3455425 3327092 3143755 2912486 2646961 2365463 2088436 1836632 1629668
38436A629668j45652p3777L13O7549J20195J53203J64666J55904J31213R6885
$$ 1629668 1484016 1410239 1410552 1478101 1598296 1751499 1916165 2072069 2203282 2300167
38426B300167N9457K4160n551k7569m0856m5792m4656m1429m0874m7024o1380
$$ 2300167 2359624 2383784 2378233 2350664 2309808 2264016 2219360 2177931 2137057 2090033 2028653
38415B028653q1387j00573j11056j07307q8618n8806k3791J1034M2288O8655Q9784
$$ 2028653 1947266 1846693 1735637 1628330 1539712 1480906 1457115 1468149 1510437 1579092 1668876
38404A668876J04921J12106J08537R1872O1795K1197k3655o4558r4157j08643
$$ 1668876 1773797 1885903 1994440 2086312 2148107 2169304 2145649 2081091 1986934 1878291
38394A878291j08468r6677p6272m8738j4763K3670O1796R2817J10707J13035J01647
$$ 1878291 1769823 1673146 1596874 1548136 1533373 1557043 1618839 1711656 1822363 1935398 2037045
38383B037045Q0937N5538K9069M044j7923l6076n0166n9803o3967o1264n0618
$$ 2037045 2117982 2173520 2202589 2206633 2188710 2152634 2102468 2042665 1978698 1917434 1866816
38372A866816l1776n453K6610O1435R4802J21811J38200J41823J33444J16253
$$ 1866816 1835040 1829587 1856197 1917632 2012434 2134245 2272445 2414268 2547712 2663965
38362B663965R4482P2025N1727L5192K2639J2986M625l195r665j3377j4503j6161
$$ 2663965 2758447 2830472 2882199 2917391 2940030 2953016 2957641 2954446 2944781 2931404 2916901 2900740
38350B900740k3440m0556o8094j02142j35634j61131j73670j72322j59711j39919
$$ 2900740 2877300 2836744 2768650 2666508 2530874 2369743 2196073 2023751 1864040 1724121
38340A724121j16410r1301o5890m1228j8068L276K2519L8843N0942N7896O0011
$$ 1724121 1607711 1516410 1450520 1409292 1391224 1394500 1417019 1455862 1506804 1564700 1624711
38329A624711N8857N6619N5488N7595O5155P9889J01243J24378J40018J37517
$$ 1624711 1683568 1740187 1795675 1853270 1918425 1998314 2099557 2223935 2363953 2501470
38319B501470J09702N6234j6562r8394j77592k42526k83122k93125k72075k25035
$$ 2501470 2611172 2667406 2650844 2552450 2374858 2132332 1849210 1556085 1284010 1058975
38309A058975j60253q6632j2339N5984J14165J61052J97614K24865K42252K47707
$$ 1058975 898722 812090 799751 855735 969900 1130952 1328566 1553431 1795683 2043390
38299B043390K38958K15039J77355J30039P9436L2643m578k9840m5280n6781p0989
$$ 2043390 2282348 2497387 2674742 2804781 2884217 2916860 2912282 2882442 2837162 2780381 2709392
38288B709392r1353j16005j39282j55965j65133j70945j79996j96906k20682k44029
$$ 2709392 2618039 2502034 2362752 2206787 2041654 1870709 1690713 1493807 1273125 1029096
38278A029096k56377k49072k19604j72430j16397o0903j3199K2188M2719M7366
$$ 1029096 772719 523647 304043 131613 15216 -45687 -58886 -36698 6021 53387
38268E3387L7108J5581j1396l7514n7602o8146o7011n3506k9166J388L0452M8770
$$ 53387 90495 106076 94680 57166 -436 -68582 -135593 -189099 -218265 -216877 -186425 -137655
38256a37655M8425K6026j5667o8856j23893j72597k10098k34961k48221k51931
$$ -137655 -89230 -63204 -78871 -147727 -271620 -444217 -654315 -889276 -1137497 -1389428
38246a389428k47801k36391k17121j88989j51826j07689o1624k0846P790K0642
$$ -1389428 -1637229 -1873620 -2090741 -2279730 -2431556 -2539245 -2600869 -2621715 -2613925 -2593283
38236b593283J8634O354j0221k5918l7506m3660m4234l9433k9359j3901P228L4597
$$ -2593283 -2574649 -2568295 -2578516 -2604434 -2641940 -2685600 -2729834 -2769267 -2798626 -2812527 -2805299 -2770702
38224b770702O9014J11104J60353K14147K67436L13663L46939L64383L66965L58002
$$ -2770702 -2701688 -2590584 -2430231 -2216084 -1948648 -1634985 -1288046 -923663 -556698 -198696
38214a98696L40071L12756K72996K17873J47761O7925j2209q1522j30372j53288
$$ -198696 141375 454131 727127 945000 1092761 1160686 1148477 1066955 936583 783295
38204G83295j50472j27550r3653n8276k8127n505J0832K3033L1589L4390K7454
$$ 783295 632823 505273 411620 353344 325217 319712 330544 353577 385166 419556 447010
38193D47010O749k9325p7680j29982j74937k02441k06967j88491j51396j02664
$$ 447010 453759 424434 346754 216772 41835 -160606 -367573 -556064 -707460 -810124
38183h10124m9920N85M5446Q4021J17004J44937J67678J84559J94311J94686J82649
$$ -810124 -860044 -859459 -814013 -729992 -612988 -468051 -300373 -115814 78497 273183 455832
38172D55832J55890J15321O7041K1926p890j4137L824L9041Q0642J18573J46498
$$ 455832 611722 727043 794084 816010 808120 793983 797807 836848 917490 1036063 1182561
38161A182561J61780J63699J51999J26747Q9182M2330r070n9218j02250j33674
$$ 1182561 1344341 1508040 1660039 1786786 1875968 1918298 1909228 1850010 1747760 1614086
38151A614086j52024j59675j61779j63664j68386j76082j85211j94445k03740
$$ 1614086 1462062 1302387 1140608 976944 808558 632476 447265 252820 49080
38142D9080k13892k24919k34556k38348k31583k11792j80026j40357r8369n9632
$$ 49080 -164812 -389731 -624287 -862635 -1094218 -1306010 -1486036 -1626393 -1724762 -1784394
38132a784394k8402o661O313J3642K0072L0991N1126Q2979J25533J74098K21586
$$ -1784394 -1812796 -1819457 -1813144 -1799502 -1779430 -1748439 -1697313 -1614334 -1488801 -1314703 -1093117
38121a093117K60494K84809K91057K78514K48851K05752J54403J00447M8448J010
$$ -1093117 -832623 -547814 -256757 21757 270608 476360 630763 731210 779658 780668
38111G80668m0503p4201r6781j04729r6756p5451m6674j7064Q908L0597N0691
$$ 780668 740165 665964 569183 464454 367698 292247 245573 228509 237417 268014 318705
38100C18705P2922R9246J28000J54046J70948J73942J61954J37386J04150O5454
$$ 318705 391627 490873 618873 772919 943867 1117809 1279763 1417149 1521299 1586753
38090A586753K2849k3190p1577j18995j59543j86297j93981j80990j49591j04709
$$ 1586753 1609602 1586412 1514835 1395840 1236297 1050000 856019 675029 525438 420729
38080D20729n2515O25M8931Q7941J15024J29547J32866J28143J19853J12572J09227
$$ 420729 368214 368839 417770 505711 620735 750282 883148 1011291 1131144 1243716 1352943
38069A352943J09426J09106J02147Q3326N1016Q261l7980p8736j05453j12485
$$ 1352943 1462369 1571475 1673622 1756948 1807964 1816225 1778245 1699509 1594056 1481571
38059A481571r8878o8573k8873J2055M7311P2150Q3803Q1245O5864M2643K0158
$$ 1481571 1382693 1314120 1285247 1297302 1344613 1416763 1500566 1581811 1647675 1690318 1710476
38048A710476Q067J2795L4128O5019R4910J14562J19664J11352R3817P0926M4319
$$ 1710476 1718543 1731338 1765466 1830485 1925395 2039957 2159621 2270973 2364790 2435716 2480035
38037B480035J3885k0348n6752r2166j23144j47296j63841j73269j76831j76322
$$ 2480035 2493920 2473572 2416820 2324654 2201510 2054214 1890373 1717104 1540273 1363951
38027A363951j74148j73022j75098j80996j89347j97218k01179j98572j88415
$$ 1363951 1189803 1016781 841683 660687 471340 274122 72943 -125629 -314044
38018c14044j71569j50364j27872j07232r0773p9302p1935o7043o3997o4355p1284
$$ -314044 -485613 -635977 -763849 -871081 -961854 -1041156 -1113091 -1180134 -1244131 -1308486 -1379770
38007a379770q7291j11848j40903j68580j89539k00177j98177j81543j48315r7175
$$ -1379770 -1467061 -1578909 -1719812 -1888392 -2077931 -2278108 -2476285 -2657828 -2806143 -2903318
37997b903318k8524N4532J45752K36195L15655L74717M06937M10453L88490L48285
$$ -2903318 -2931842 -2877310 -2731558 -2495363 -2179708 -1804991 -1398054 -987601 -599111 -250826
37987b50826K98752K47758K00114J56811J15866P4453L1228j2551n3805q9367
$$ -250826 47926 295684 495798 652609 768475 842928 874156 861605 807800 718433
37977G18433j17295j37132j49460j55229j55049j48743j35597j15317q9007n9515
$$ 718433 601138 464006 314546 159317 4268 -144475 -280072 -395389 -484396 -543911
37967e43911l0985q004N353O571m282k3943m6375o4645p3538p1514o0721m5504
$$ -543911 -574896 -582900 -577547 -570976 -575258 -599201 -645576 -710221 -783759 -855273 -915994 -961498
37955i61498l0648k0075j5607j5801j5914r874O747L4941P2592J15770J59552
$$ -961498 -992146 -1012221 -1027828 -1043629 -1059543 -1069417 -1062670 -1027729 -955137 -839367 -679815
37944f79815J98253K26187K39201K36200K19507J93939J65165J38064J15630R8589
$$ -679815 -481562 -255375 -16174 220026 439533 633472 798637 936701 1052331 1150920
37934A150920Q5745P4653O2442M6578K5388j667l3980o9735j05931j38713j64136
$$ 1150920 1236665 1311318 1373760 1420338 1445726 1444059 1410079 1340344 1234413 1095700 931564
37923I31564j78970j81194j70331j47879j17635q5290n6833l6287k4001j6596
$$ 931564 752594 571400 401069 253190 135555 50265 -6568 -42855 -66856 -83452
37913h3452q618M929K6556N5421Q7432J16069J33943J35159J17688Q4522M2838
$$ -83452 -92070 -87141 -60585 -5164 82268 198337 332280 467439 585127 669649 712487
37902G12487J572l1537n2091n9493n5648m3047k3665R29K9001N8407Q6480J09664
$$ 712487 714059 682522 630431 570938 515290 472243 448578 449507 478508 536915 623395 733059
37890G33059J23503J23819J08844Q0821M5608J0342j9478m1774n7735p0102q1208
$$ 733059 856562 980381 1089225 1170046 1215654 1225996 1206518 1164744 1107009 1036907 955699
37879I55699r1930j01789j09626j14461j16203j15873j14845j13614j11283j06427
$$ 955699 863769 761980 652354 537893 421690 305817 190972 77358 -33925 -140352
37869a40352r8485q8123p6233o2811m7114k9120j1026K513N800n568l2552p1792
$$ -140352 -238837 -326960 -403193 -466004 -513118 -542238 -553264 -550751 -544951 -550519 -583071 -654863
37857f54863j16517j58749j91688k10982k14606k02101j74037j31862p7853j5083
$$ -654863 -771380 -930129 -1121817 -1332799 -1547405 -1749506 -1923543 -2055405 -2133258 -2148341
37847b148341N2397J19479J80576K30789K66742K86304K87802K70090K33815J82765
$$ -2148341 -2095944 -1976465 -1795889 -1565100 -1298358 -1012054 -724252 -454162 -220347 -37582
37837c7582J23878O5605J5508k1590m4112n2950n0100l7550j6828J0706M3009
$$ -37582 86296 151901 167409 145819 101707 48757 -1343 -38893 -55721 -45015 -2006
37826b006P6442J05833J26065J34372J31306J19440J01154P7691N0091K0524p526
$$ -2006 74436 180269 306334 440706 572012 691452 792606 870297 920388 940912 933386
37815I33386l0100m3746m6259l7505k0243j22J5862K1996J6137L80k0408m1294
$$ 933386 903286 859540 813281 775776 755533 755411 771273 793269 809406 809786 789378 748084
37803G48084n9553p5122q9181j02231j13101j19319j18400j09180r2621p1644
$$ 748084 688531 613409 524228 421997 308896 189577 71177 -38003 -130624 -202268
37793b02268n0126l1536j7781q370j04J2047L2464O1792R5620J26130J45654J49547
$$ -202268 -252394 -283930 -301711 -310081 -310185 -298138 -265674 -203882 -108262 17868 163522 313069
37781C13069J37127J11080P6272L8331K233k8700n3012p0960q4189r4999j04810
$$ 313069 450196 561276 637548 675879 678112 649412 596400 525440 441251 346252 241442
37770B41442j12414j13575j02723p5910l3139K1169P9314J32110J70555J87423
$$ 241442 129028 15453 -87270 -163180 -196319 -175150 -95836 36274 206829 394252
37760C94252J79101J47255R9253M6285m83l3881n2757o1053o4883o9372p6748
$$ 394252 573353 720608 819861 866146 865663 831782 779025 717972 653089 583717 506969
37749E06969q5931r3421r4844q6637o7051l6227M263N1445J00550J45115J78411
$$ 506969 421038 327617 232773 146136 79085 42858 47121 98566 199116 344231 522642
37738E22642J95545J94878J78006J48768J11960P2020L1853p608m6538q4409j18533
$$ 522642 718187 913065 1091071 1239839 1351799 1423819 1455672 1448064 1401526 1317117 1198584
37727A198584j44098j55963j51181j30793r9764o5123l3401q738P608J6688K0761
$$ 1198584 1054486 898523 747342 616549 516785 451662 418261 409523 417131 433819 454580
37716D54580K2061K1616J8420R836o502l0195n6849p9267r0267q5321o3805k9003
$$ 454580 476641 498257 516677 526513 520011 489816 432967 353700 263433 178112 114307 85304
37704H5304J2487N1861P9862Q9086P6086M2356o350o2226j18026j68620k10899
$$ 85304 97791 149652 229514 318600 394686 437042 430692 368466 250440 81820 -129079
37693a29079k42546k61038k63749k49221k18804j77297j31546q7554m8080j2384
$$ -129079 -371625 -632663 -896412 -1145633 -1364437 -1541734 -1673280 -1760834 -1808914 -1821298
37683a821298K1949N6655R1269J22930J47551J61807J64837J58296J44874J26529
$$ -1821298 -1799349 -1742694 -1651425 -1528495 -1380944 -1219137 -1054300 -896004 -751130 -624601
37673f24601J03879P6723M5025R692k7118o2425r3362j17768j33802j39216j31438
$$ -624601 -520722 -443999 -398974 -389282 -416400 -478825 -572187 -689955 -823757 -962973 -1094411
37662a094411j08973p3006k7805K0274O4156R6961J12824J08408Q4884M8773J0321
$$ -1094411 -1203384 -1276390 -1304195 -1283921 -1219765 -1122804 -1009980 -901572 -816688 -767915 -757594
37651g57594j9967l4682l1111j1111K0115N5788Q9604J17507J38474J54116J67264
$$ -757594 -777561 -812243 -843354 -854465 -834350 -778562 -688958 -571451 -432977 -278861 -111597
37640a11597J80071J92509K02229K05953K01341J88007J67440J42471J16653R3380
$$ -111597 68474 260983 463212 669165 870506 1058513 1225953 1368424 1485077 1578457
37630A578457P4640O0022M6847L1596J1943j1676l6210n8025p5764r1757j10613
$$ 1578457 1653097 1713119 1759966 1791562 1803505 1791829 1755619 1697594 1621830 1530073 1419460
37619A419460j35777j66589j97951k22866k36021k36287k26774k12880j99753
$$ 1419460 1283683 1117094 919143 696277 460256 223969 -2805 -215685 -415438
37610d15438j90439j85086j81009j73652j58485j33043r7991n6534j3132K7335
$$ -415438 -605877 -790963 -971972 -1145624 -1304109 -1437152 -1535143 -1591677 -1604809 -1577474
37600a577474N9895Q0377Q7156Q2355P1016N8505M8348M1860L8967L8809L9632
$$ -1577474 -1517579 -1437202 -1350046 -1267691 -1196675 -1138170 -1089822 -1047962 -1008995 -970186 -930554
37589i30554L9105L5752L0754K8408L4307N2213Q1685J17978J53829J81818J96223
$$ -930554 -891449 -855697 -824943 -796535 -762228 -710015 -628330 -510352 -356523 -174705 21518
37578B1518J94261J76771J47955J13702P8966M5575J1915k5130o7038j11298j51492
$$ 21518 215779 392550 540505 654207 733173 778748 790663 765533 698495 587197 435705
37567D35705j79815j90263j80527j51944j08315n4818K802N9019J09515J51888
$$ 435705 255890 65627 -114900 -266844 -375159 -429977 -427175 -368156 -258641 -106753
37557a06753J85644K11370K29691K40830K44729K41263K30106K10692J82663J46826
$$ -106753 78891 290261 519952 760782 1005511 1246774 1476880 1687572 1870235 2017061
37547B017061J05946O4872K9729O231k373L340J9150L8707N5492O4412O2852N1038
$$ 2017061 2123007 2187879 2217608 2223839 2221466 2224806 2243956 2282663 2338155 2402567 2465419 2516457
37535B516457L1473P690j6978m0038n9906p5545q5890q9546q5431p4454o0901
$$ 2516457 2547930 2555620 2538642 2498604 2438698 2363153 2277263 2187717 2102286 2027832 1966931
37524A966931n1990n5225p4968j10417j56230k05041k49760k84021l01424k95786
$$ 1966931 1914941 1859716 1784748 1674331 1518101 1313060 1063300 779279 477855 182069
37514A82069k63639k07454j36797o6038r585K3143L0946K0926N134m961l416Q305
$$ 182069 -81570 -289024 -425821 -491859 -501444 -478301 -447355 -426429 -421295 -426256 -429672 -421367
37502d21367K3196L2880L1679J8832j693k3050l7915m0598k8505k810L1828O8532
$$ -421367 -398171 -365291 -333612 -314780 -316473 -339523 -377438 -418036 -446541 -449351 -417523 -348991
37490c48991J00099J20923J28388J23388J10012R4428Q3036Q0454Q8025J03477
$$ -348991 -248892 -127969 419 123807 233819 328247 411283 491737 579762 683239
37480F83239J21827J37134J44639J42494J32136J16755R8927P9388N8095L6343
$$ 683239 805066 942200 1086839 1229333 1361469 1478224 1577151 1656539 1714634 1750977
37470A750977J7487N324J498M395J0499J7114K4294L4503N0434P2636R8607J23738
$$ 1750977 1768464 1773788 1775286 1779681 1790180 1807294 1831588 1866091 1916525 1989161 2087768 2211506
37458B211506J43292J54069J54940J46291J29393J06453Q1188N8676M3827L9314
$$ 2211506 2354798 2508867 2663807 2810098 2939491 3045944 3127132 3185808 3229635 3268949
37448C268949M4584N6460P0444Q1699Q5731P9364O1979L6168P029j9837m0651
$$ 3268949 3313533 3369993 3440437 3522136 3607867 3687231 3749210 3785378 3792407 3772570 3731919
37437C731919n4777o4286p2053p9659q6476r0408q9619q4031p5556o6971o0381
$$ 3731919 3677142 3612856 3540803 3461144 3374668 3284260 3194641 3110610 3035054 2968083 2907702
37426B907702n6456n4931n5560n8467o3677p0673p8678q7175r5666j02649j05168
$$ 2907702 2851246 2796315 2740755 2682288 2618611 2547938 2469260 2382085 2286419 2183770 2078602
37415B078602r9944q5612o4172m0399j9519m684M293J0180J6103K3440L1468L8799
$$ 2078602 1978658 1893046 1828874 1788475 1768956 1764272 1768565 1778745 1794848 1818288 1849756 1888555
37403A888555M5012N0857N7075O3187O7324O7220O1717N1844M0558L1122K5565
$$ 1888555 1933567 1984424 2041499 2104686 2172010 2239230 2300947 2352791 2393349 2424471 2450036
37392B450036K4680K9144L9898N6764P6938R5256J06156J05605R1989O6560L3785
$$ 2450036 2474716 2503860 2543758 2600522 2677460 2772716 2878872 2984477 3076466 3143026 3176811
37381C176811O95k5458m0351m4503m2852m2459m9504o6767r2530j21447j46993
$$ 3176811 3177506 3152048 3111697 3067194 3024342 2981883 2932379 2865612 2773082 2651635 2504642
37370B504642j64093j70745j68205j60085j50773j43627j39559j36704j31378
$$ 2504642 2340549 2169804 2001599 1841514 1690741 1547114 1407555 1270851 1139473
37361A139473j19828j00055p2769m0786p083K7243O3525J04327J51386K03653
$$ 1139473 1019645 919590 846821 806035 798952 826195 889720 994047 1145433 1349086
37351A349086K55934K98670L19920L09477K63286J85589Q7950j3819j03392j67595
$$ 1349086 1605020 1903690 2223610 2533087 2796373 2981962 3069912 3056093 2952701 2785106
37341B785106j99529k00198j77594j43464j08985q1362o2737n1549m4882m0060
$$ 2785106 2585577 2385379 2207785 2064321 1955336 1873974 1811237 1759688 1714806 1674746
37331A674746l4932k7893j8366p216M134J5659L0034N1573Q3030J22499J62870
$$ 1674746 1639814 1611921 1593555 1586339 1590473 1606132 1636166 1687739 1770769 1893268 2056138
37320B056138J94420K08818K01911J74130J29461P4449J7610l1555o4400p5323
$$ 2056138 2250558 2459376 2661287 2835417 2964878 3039327 3056937 3025382 2960982 2885659
37310B885659o3486l3348O306M4854P3095Q5865Q2964O8317M8362L0380K0772
$$ 2885659 2822173 2788825 2795131 2839985 2913080 2998945 3081909 3150226 3198588 3228968 3249740
37299C249740K3219L7197N8069P9236R5099J02785J01617R1338P1186M0731J662
$$ 3249740 3272959 3310156 3368225 3447461 3542560 3645345 3746962 3838300 3909486 3950217 3951879
37288C951879m1186q0728j10205j26189j30242j28134j26863j31107j40935j51959
$$ 3951879 3910693 3829965 3719760 3593571 3463329 3335195 3208332 3077225 2936290 2784331
37278B784331j57616j52403j34419j06144p3526m4053k4742k0346l2001n6493
$$ 2784331 2626715 2474312 2339893 2233749 2160223 2116170 2091428 2071082 2039081 1982588
37268A982588q6675j13097j26501j20452r3362m9503J403M6318P2607P2382M5791
$$ 1982588 1895913 1782816 1656315 1535863 1442501 1392998 1394401 1440719 1513326 1585708 1631499
37257A631499J515m6056q1962r5672q3482m7569P015P4765J50100K26354K95279
$$ 1631499 1633014 1586958 1504996 1409324 1325842 1278273 1285288 1360053 1510153 1736507 2031786
37246B031786L48394L79660L87714L76038L50957L18968K85067K52697K24510
$$ 2031786 2380180 2759840 3147554 3523592 3874549 4193517 4478584 4731281 4955791
37237D955791K02718J88626J81833J79805J78320J72753J59617J37457J06742
$$ 4955791 5158509 5347135 5528968 5708773 5887093 6059846 6219463 6356920 6463662
37228F463662O9316K8209j2245m6795p0566q0591p6515o0195l4627k857L2680
$$ 6463662 6532978 6561187 6548942 6502147 6431581 6350990 6274475 6214280 6179653 6176796 6209476
37217F209476P0108J07454J42092J71133J92636K06489K13984K16565K14956K09091
$$ 6209476 6279584 6387038 6529130 6700263 6892899 7099388 7313372 7529937 7744893 7953984
37207G953984J98078J79927J51820J11614N9713l63o3062j22375j72849k10274
$$ 7953984 8152062 8331989 8483809 8595423 8655136 8654773 8591711 8469336 8296487 8086213
37197H086213k32508k39994k35190k21141k00090j72854j38978r7669m9047M943
$$ 8086213 7853705 7613711 7378521 7157380 6957290 6784436 6645458 6547789 6498742 6503685
37187F503685O0755J14207J61311J98588K23393K34505K32670K20666K02969J84954
$$ 6503685 6564440 6678647 6839958 7038546 7261939 7496444 7729114 7949780 8152749 8337703
37177H337703J71560J65606J66779J72000J76751J76461J67481J47684J16605
$$ 8337703 8509263 8674869 8841648 9013648 9190399 9366860 9534341 9682025 9798630
37168I798630P5157K5493k8520q0956j24898j55058j69986j71850j63935j48024
$$ 9798630 9873787 9899280 9870760 9789804 9664906 9509848 9339862 9168012 9004077 8856053
37158H856053j23620q9249m4331J0051P2163J41526K19815L09479M10984N21111
$$ 8856053 8732433 8643184 8598853 8608904 8681067 8822593 9042408 9351887 9762871 10283982
37148A0283982O33859P43032Q44034R33718J009200J067265J104916J120481J114422
$$ 10283982 10917841 11660873 12504907 13438625 14447825 15515090 16620006 17740487 18854909
37139A8854909J089248J048369R94357R27503Q45320P42912O14258M55030K66907
$$ 18854909 19944157 20992526 21986883 22914386 23759706 24502618 25116876 25571906 25838813
37130B5838813O1263j41076l15050m38881m99728m95044m30392l15920j63208
$$ 25838813 25900076 25759000 25443950 25005069 24505341 24010297 23579905 23263985 23100777
37121B3100777J6740K14188M20299O26313Q23258J002616J157799J285201J383824
$$ 23100777 23117517 23331705 23752004 24378317 25201575 26204191 27361990 28647191 30031015
37112C0031015J453367J491628J492415J444379J331095J133410Q35517M34567
$$ 30031015 31484382 32976010 34468425 35912804 37243899 38377309 39212826 39647393
37104C9647393n0150n74802j079459j505047j810473j981590k029269j980054
$$ 39647393 39597243 39022441 37942982 36437935 34627462 32645872 30616603 28636549
37096B8636549j865488j714377j549275j386302j236441j106709j000482r17464
$$ 28636549 26771061 25056684 23507409 22121107 20884666 19777957 18777475 17860011
37088A7860011q53886q03215p57307p08125o49841n80611n03025m22906l47086
$$ 17860011 17006125 16202910 15445603 14737478 14087637 13507026 13004001 12581095 12234009
37079A2234009k81183k28246j88731j61575j45529j39843j43904j56243j73786
$$ 12234009 11952826 11724580 11535849 11374274 11228745 11088902 10944998 10788755 10614969
37070A0614969j91950k05715k11169k06724j93375j73851j51105j26978j01898
$$ 10614969 10423019 10217304 10006135 9799411 9606036 9432185 9281080 9154102 9052204
37061I052204p5850m9703k5501n308J0373K3202L6180N2385P4114J02420J36472
$$ 9052204 8976354 8926651 8901150 8895842 8906215 8929417 8965597 9017982 9092096 9194516 9330988
37050I330988J72589K03964K22307K21207J99263J60687J13261O5368K4010o224
$$ 9330988 9503577 9707541 9929848 10151055 10350318 10511005 10624266 10689634 10713644 10707420
37040A0707420k3869l0975l2241l2741l5391l9617m1925l7751k3412K835M0817
$$ 10707420 10683551 10652576 10620335 10587594 10552203 10512586 10470661 10432910 10409498 10412333 10453150
37029A0453150Q8739J43251J99806K54014L03530L48911L92667M37331M83986
$$ 10453150 10541889 10685140 10884946 11138960 11442490 11791401 12184068 12621399 13105385
37020A3105385N31935N79229O23589O63224O97061P24342P44204P55927P59646
$$ 13105385 13637320 14216549 14840138 15503362 16200423 16924765 17668969 18424896 19184542
37011A9184542P56758P49704P41536P35565P35084P42748P59862P85891Q18459
$$ 19184542 19941300 20691004 21432540 22168105 22903189 23645937 24405799 25191690 26010149
37002B6010149Q53984Q89033R22010R54394R90710J037348J100875J186222J294903
$$ 26010149 26864133 27753166 28675176 29629570 30620280 31657628 32758503 33944725 35239628
36993C5239628J423901J566374J714422J862496K009461K158607K316479K491427
$$ 35239628 36663529 38229903 39944325 41806821 43816282 45974889 48291368 50782795
36985E0782795K692125K926144L198920L513462L870566M269234M707283N182501
$$ 50782795 53474920 56401064 59599984 63113446 66984012 71253246 75960529 81143030
36977H1143030N694295O245486O843283P498568Q223507R029085R924287J0916543
$$ 81143030 86837325 93082811 99926094 107424662 115648169 124677254 134601541 145518084
36969A45518084J2011046J3207429J4495310J5851369J7238689J8606375J9887057
$$ 145518084 157529130 170736559 185231869 201083238 218321927 236928302 256815359
36962B56815359K0991605K1802358K2168205K1906312K0816135J8711053J5469677
$$ 256815359 277806964 299609322 321777527 343683839 364499974 383211027 398680704
36955C98680704J1099644N790937p5038n983945j1403830j5910781j9270474k1448440
$$ 398680704 409780348 415571285 415496247 409512302 398108472 382197691 362927217 341478777
36947C41478777k2561411k2805560k2394348k1520910k0343422j8984662j7537308
$$ 341478777 318917366 296111806 273717458 252196548 231853126 212868464 195331156
36940A95331156j6070038j4632516j3259168j1972375j0785628r706426q737883
$$ 195331156 179261118 164628602 151369434 139397059 128611431 118905005 110167122
36933A10167122p878547p121597o455203n864724n335738m856556m419389m019964
$$ 110167122 102288575 95166978 88711775 82847051 77511313 72654757 68235368 64215404
36925F4215404l656044l325806l027063k757399k514307k294990k096357j915620
$$ 64215404 60559360 57233554 54206491 51449092 48934785 46639795 44543438 42627818
36917D2627818j751061j602174j469000j351213j247279j154118j067610r84009
$$ 42627818 40876757 39274583 37805583 36454370 35207091 34052973 32985363 32001354
36909C2001354r01471q20416p42445o68850n99915n35387m75268m20053l70338
$$ 32001354 31099883 30279467 29537022 28868172 28268257 27732870 27257602 26837549 26467211
36900B6467211l26344k87834k54337k25308k00132j78176j58910j41756j25439
$$ 26467211 26140867 25853033 25598696 25373388 25173256 24995080 24836170 24694414 24568975
36891B4568975j07607q5591n8206k6999M854L5531O6850J03582J50008K06519
$$ 24568975 24461368 24375777 24317571 24290572 24295426 24330957 24397807 24501389 24651397 24857916
36881B4857916K68569L28113L76382M06809M17652M13333M03348L98443M05571
$$ 24857916 25126485 25454598 25830980 26237789 26655441 27068774 27472122 27870565 28276136
36872B8276136M24214M46341M60250M56089M29701L82879L20979K50453J77783
$$ 28276136 28700350 29146691 29606941 30063030 30492731 30875610 31196589 31447042 31624825
36863C1624825J09060M8894j250m3858q4154j27265j75560k27882k80930l31307
$$ 31624825 31733885 31782779 31781529 31737671 31653517 31526252 31350692 31122810 30841880 30510573
36853C0510573l76510m14290m41611m54603m50198m28743l96095l63424l44038
$$ 30510573 30134063 29719773 29278162 28823559 28373361 27944618 27548523 27185099 26841061
36844B6841061l48491l80649m36707n06977n78837o39586o78875o90637o74011
$$ 26841061 26492570 26111921 25675214 25168237 24589400 23949814 23270939 22580302 21906291
36835B1906291o33005n75043n09176m44408l88293l45792l18474l04291k98152
$$ 21906291 21273286 20698243 20189067 19744659 19356366 19010574 18692100 18387809 18089657
36826A8089657k93248k83207k64614k38927k12157j91951j83706j88584k04443
$$ 18089657 17796409 17513202 17248588 17009661 16797504 16605553 16421847 16233263 16028820
36817A6028820k28136k56877k88215l19925l50574l79951m08292m34689m56176
$$ 16028820 15800684 15543807 15255592 14935667 14585093 14205142 13796850 13362161 12905985
36808A2905985m68377m67181m50154m17072l69582l10708k44498j75919j10663
$$ 12905985 12437608 11970427 11520273 11103201 10733619 10422911 10178413 10002494 9891831
36799I891831n4738j3802P878Q812q453l7314o9268r7546j19971j39060j59384
$$ 9891831 9837093 9823291 9831169 9839981 9831528 9794214 9724946 9627400 9507429 9368369 9208985
36788I208985j84211k13706k45343k75660l01830l22022l34577l37185l27217
$$ 9208985 9024774 8811068 8565725 8290065 7988235 7666213 7331636 6994451 6667234
36779F667234l03395k67506k24770j82457j47441j23706j10792j04044r6785q3171
$$ 6667234 6363839 6096333 5871563 5689106 5541665 5417959 5307167 5203123 5106338 5023167
36769E023167o0072k7255J3246N7559J00280J35325J57459J63649J53508J28887
$$ 5023167 4963095 4935840 4949086 5006645 5106925 5242250 5399709 5563358 5716866 5845753
36759E845753R3313N1802J0736k3079m4484n2165m9289m1915l6276l6570m3992
$$ 5845753 5939066 5990868 6001604 5978525 5934041 5881876 5832587 5790672 5754396 5717826 5673834
36748E673834n6707p0521q0504q3252p8643o9677o0411n3692n0461n0680n4312
$$ 5673834 5617127 5546606 5466102 5382850 5304207 5234530 5174119 5120427 5069966 5019286 4964974
36737D964974o0914o8559p3746p2836o3714m6380k2670L952K8704M6675N4753
$$ 4964974 4904060 4835501 4761755 4688919 4625205 4578825 4556155 4560107 4588811 4635486 4690239
36726D690239N2874M3576L0472J6747M128p745k1205l9056o2039q7023j07555
$$ 4690239 4743113 4786689 4817161 4833908 4838036 4830291 4809086 4770030 4707991 4620968 4513413
36715D513413j16794j10928r0928o1906l0979n155J0031J1292j855k6868n8687
$$ 4513413 4396619 4285691 4194763 4132857 4101878 4096723 4106754 4118046 4116191 4089323 4030636
36704D030636r1091j18443j37112j46105j46824j42345j36505j32977j34291j40922
$$ 4030636 3939545 3821102 3683990 3537885 3391061 3248716 3112211 2979234 2844943 2704021
36694B704021j50714j59126j60541j50412j27298r3626n4685j6509J6032M0100
$$ 2704021 2553307 2394181 2233640 2083228 1955930 1862304 1807619 1791110 1807142 1847242
36684A847242N4768O0783O0736N9106O1376P2009R2512J20882J52723J82776K05933
$$ 1847242 1902010 1962793 2023529 2082635 2144011 2216020 2308532 2429414 2582137 2764913 2970846
36673B970846K17873K16138K01443J78167J52884J31184J14292R7676P3021L3017
$$ 2970846 3188719 3404857 3606300 3784467 3937351 4068535 4182827 4280503 4353524 4386541
36663D386541k3941r2168j61352k21402k66266k94740l08705l10779l03069k87211
$$ 4386541 4362600 4270432 4109080 3887678 3621412 3326672 3017967 2707188 2404119 2116908
36653B116908k64957k38360k09425j79665j49939j20785r3043o8186m7741l1950
$$ 2116908 1851951 1613591 1404166 1224501 1074562 953777 860734 792548 744807 712857
36643G12857j8875n062J2415L4100N7910Q0503R9139J12703J21317J25092J23313
$$ 712857 693982 688920 701335 735435 793345 873848 972987 1085690 1207007 1332099 1455412
36632A455412J14816R9039P6750N0219K3498K613n496M015L0370O5906R8444J16244
$$ 1455412 1570228 1669267 1746017 1796236 1819734 1822347 1816851 1820866 1851236 1917142 2015586 2131830
36620B131830J12742Q8755N1441J0894k3894m8101o2162p0488p8266q8050r8160
$$ 2131830 2244572 2333327 2384768 2395662 2371768 2323667 2261505 2191017 2112751 2024701 1926541
36609A926541j04081j01772r0434p3069n4985m1737l7560m4592o2434q8003j15905
$$ 1926541 1822460 1720688 1630254 1557185 1502200 1460463 1422903 1378311 1315877 1227874 1111969
36598A111969j39755j54198j56985j49990j38535j29084j26266j30760j39328
$$ 1111969 972214 818016 661031 511041 372506 243422 117156 -13604 -152932
36589a52932j47001j50069j47849j41993j33853j21999j02135o9980k5313K5889
$$ -152932 -299933 -450002 -597851 -739844 -873697 -995696 -1097831 -1167811 -1193124 -1167235
36579a167235P2998J04890J14094R8857O3109J5302l3327p1272r0015q6678o4277
$$ -1167235 -1094237 -989347 -875253 -776396 -713287 -697985 -731312 -802584 -892599 -979277 -1043554
36568a043554k9385J0976N1005Q6077J12380J27312J30189J22289J06141Q4544
$$ -1043554 -1072939 -1061963 -1010958 -924881 -812501 -685189 -555000 -432711 -326570 -242026
36558b42026N9647L2314K292l0474o4125r4390j16080j25440j21508j05717q0716
$$ -242026 -182379 -150065 -147773 -178247 -242372 -336762 -452842 -578282 -699790 -805507 -886223
36547h86223m9730j6784J3218L5327M6015M4041L0163O381k4222n7262q7383j09715
$$ -886223 -935953 -952737 -939519 -904192 -858177 -814136 -783973 -777592 -801814 -859076 -946459 -1056174
36535a056174j21707j23936j19279j11046j01364r0783p8894o5054m8688k9509
$$ -1056174 -1177881 -1301817 -1421096 -1532142 -1633506 -1724289 -1803183 -1868237 -1916925 -1946434
36525a946434p929J4672L6617N7194P7339R8936J23360J50569J79278K07648K33554
$$ -1946434 -1954363 -1939691 -1903074 -1845880 -1768541 -1669605 -1546245 -1395676 -1216398 -1008750 -775196
36514g75196K54206K65784K64020K46076K12791J69675J25528Q9186O6217N7438
$$ -775196 -520990 -255206 8814 254890 467681 637356 762884 852070 918287 975725
36504I75725N9912O9324Q2030R5688J08754J19797J27185J29135J24170J11900
$$ 975725 1035637 1104961 1186991 1282679 1391433 1511230 1638415 1767550 1891720 2003620
36494B003620R3687P2459N1675L4261K2305J7145J9090K6749L6742M4639M6984
$$ 2003620 2097307 2169766 2221441 2255702 2278007 2295152 2314242 2340991 2377733 2422372 2469356
36483B469356M3318L6767L2279L3253L8909M4491M4322L5272J8313k363k1462
$$ 2469356 2512674 2549441 2581720 2614973 2653882 2698373 2742695 2777967 2796280 2793917 2772455
36472B772455l4575l9490l6793k9569k2321j9480k4214l7971o0719r1238j26959
$$ 2772455 2737880 2698390 2661597 2632028 2609707 2590227 2566013 2528042 2467323 2376085 2249126
36461B249126j63300j93538k10450k09493j91565j63118j33329j10258r8185r7024
$$ 2249126 2085826 1892288 1681838 1472345 1280780 1117662 984333 874075 775890 678866
36451F78866j03398j12573j20469j24666j23936j16866j01180p4699l7344P583
$$ 678866 575468 462895 342426 217760 93824 -23042 -124222 -198921 -236265 -228682
36441b28682N4030R5503J27524J48794J60606J65432J65704J63078J57983J49402
$$ -228682 -174652 -79149 48375 197169 357775 523207 688911 851989 1009972 1159374
36431A159374J35285J13705Q4166M8402J0164k5873n5756p7763r2834j03638j12806
$$ 1159374 1294659 1408364 1492530 1540932 1551096 1525223 1469467 1391704 1298870 1195232 1082426
36420A082426j21393j28182j30074j23297j05181p5803l8839j169K8837M3937
$$ 1082426 961033 832851 702777 579480 474299 398496 359657 358488 387325 431262
36410D31262M0652K0554j0562m5015p5467r5976j02412r3165o9931l7209q6L8279
$$ 431262 471914 492468 481906 436891 361424 265448 163036 69871 -60 -37269 -37355 924
36398I24P7584J19419J65862K18532K78035L43291M11299M77800N38603N90703
$$ 924 78508 197927 363789 582321 860356 1203647 1614946 2092746 2631349 3222052
36388C222052O32864O65783O91702P13410P33172P52621P73739P99762Q34784
$$ 3222052 3854916 4520699 5212401 5925811 6658983 7411604 8185343 8985105 9819889
36379I819889Q81627R38944R98987J047314J064545J029335R22298P31729M60867
$$ 9819889 10701516 11640460 12639447 13686761 14751306 15780641 16702939 17434668 17895535
36370A7895535J32580k13982n35473p98517r87461j102917j155107j157583j123451
$$ 17895535 18028115 17814133 17278660 16480143 15492682 14389765 13234658 12077075 10953624
36361A0953624j063467r85068q92413p87740o73721n55809m42960l45748k72829
$$ 10953624 9890157 8905089 8012676 7224936 6551215 5995406 5552446 5206698 4933869
36352D933869k28071k10112k14064k33689k62797k95450l25414l45774l49952
$$ 4933869 4705798 4495686 4281622 4047933 3785136 3489686 3164272 2818498 2468546
36343B468546l34397l01359k59245k19368j90651j75525j69439j63867j50575
$$ 2468546 2134149 1832790 1573545 1354177 1163526 988001 818562 654695 504120
36334E04120j24751q6041l7909J4006O4065J08625J46810J79444K07090K28745
$$ 504120 379369 293328 255419 269425 333490 442115 588925 768369 975459 1204204
36324A204204K42406K46788K42526K31470K14511J89949J54251J05012M3924k2457
$$ 1204204 1446610 1693398 1935924 2167394 2381905 2571854 2726105 2831117 2875041 2852584
36314B852584q4702j33816j64180j74842j69065j52508j31213j10193r3012q1871
$$ 2852584 2767882 2634066 2469886 2295044 2125979 1973471 1842258 1732065 1639053 1557182
36304A557182p7650p9881q6936r6803j07847j18828j27987j32363j28566j14922
$$ 1557182 1479532 1399651 1312715 1215912 1108065 989237 861250 728887 600321 485399
36294D85399r3353o9343m9823m0108m1460n0682o2148p1196p6551q0004q3732
$$ 485399 392046 322703 272880 232772 191312 140630 78482 7286 -69265 -149269 -233001
36283b33001q7726q9220q4248o9769m4955j1269K8096O8782J05609J33174J46930
$$ -233001 -320727 -409947 -494195 -563964 -608919 -620188 -592092 -523310 -417701 -284527 -137597
36272a37597J44468J26316R5797N8147J9233j5588m2186n7894o1668n4406l9190
$$ -137597 6871 133187 228984 287131 306364 290776 248590 190696 129028 74622 35432
36261C5432k0777m211O746J0563Q081K134l366m902r99P003J5767K1928K3881
$$ 35432 14655 10444 17190 27753 35834 37968 34602 29700 28701 35704 51471 73399 97280
36248I7280K2397J9878J8776J9959K1901K1550J6517O904n077j7414l0056m4143
$$ 97280 119677 139555 158331 178290 200191 221741 238258 245162 240085 222671 192615 148472
36236A48472n9730p4586q5365q9621q6567p6429n9664l7020r930J9446M8523P4602
$$ 148472 88742 14156 -71209 -160830 -247397 -323826 -383490 -420510 -430440 -410994 -362471 -287869
36224b87869R5019J07390J09942J01842Q3582N7379K7273j585k4460l8704m4701
$$ -287869 -192850 -85460 24482 126324 209906 267285 294558 292973 268513 229809 185108
36213A85108m5415m4716m5425m8441n3452o0309o9368q0372r1286r8809j00273
$$ 185108 139693 94977 49552 1111 -52341 -112650 -182018 -262390 -353676 -452485 -552758
36202e52758r5032q3956o7867m6825k1013P874L6317O0119P6086Q2960Q1129P1768
$$ -552758 -647790 -731746 -799613 -846438 -867451 -859577 -823260 -763141 -687055 -604095 -522966 -451198
36190d51198N6445L7532J8896N808L654J6038M3296Q2164J26651J69447K03360
$$ -451198 -394753 -357221 -338325 -332517 -328863 -312825 -269529 -187365 -60714 108733 312093
36179C12093K22536K23519K06116J73651J32131Q8252M7043J0734k0391m5769
$$ 312093 534629 758148 964264 1137915 1270046 1358298 1405341 1416075 1395684 1349915
36169A349915o3141o9280o2145m2381j3162K0764N3537P8269Q7847P7059M5081
$$ 1349915 1286774 1217494 1155349 1112968 1099806 1120570 1174107 1252376 1340223 1417282 1462363
36158A462363l152n7765j06986j41155j55711j51625j33544j07087p6646m4149
$$ 1462363 1459211 1401446 1294460 1153305 997594 845969 712425 605338 528692 484543
36148D84543r141K9519P0995J10941J42781J61234J65198J57720J43175J23979
$$ 484543 475402 504921 575916 686857 829638 990872 1156070 1313790 1456965 1580944
36138A580944R9351O7036K6675j7712n8195q6108r5860q7191o5117l7999j4509
$$ 1580944 1680295 1747331 1774006 1756294 1698099 1611991 1516131 1428940 1363823 1325824 1311315
36127A311315l64L783K087Q49M986J5724L0381M3947N1238M8751L5571J3163j5532
$$ 1311315 1310951 1314734 1316821 1317670 1322656 1338380 1368761 1412708 1463946 1512697 1548268 1561431 1545899
36114A545899m6960p7414j03508j23159j36614j46221j54352j60975j63150j57048
$$ 1545899 1498939 1421525 1318017 1194858 1058244 912023 757671 596696 433546 276498
36104B76498j40488j13530p7136l2116K0029P5463J27982J71317K01860K19488
$$ 276498 136010 22480 -54656 -86772 -66743 8720 136702 308019 509879 729367
36094G29367K25996K22856K10193J87524J55287J15887P3520L3116q52k5117l8019
$$ 729367 955363 1178219 1388412 1575936 1731223 1847110 1920630 1953746 1952894 1927777 1889758
36083A889758l9792l2709k0691p991K596J1063J9961L2577N0675P3242R6703J15873
$$ 1889758 1849966 1817257 1796566 1788575 1791171 1802234 1822195 1854772 1905447 1978689 2075392 2191265
36071B191265J24795J17496Q9229L8197l2899j16266j99745k69037l11387l19742
$$ 2191265 2316060 2433556 2522785 2560982 2528083 2411817 2212072 1943035 1631648 1311906
36061A311906k95279k46457j84891j20453n8455M0N5810J08753J56268J93418
$$ 1311906 1016627 770170 585279 464826 406371 406411 462221 570974 727242 920660
36051I20660K14942K18086K04305J78357J45507J09181P0821L1308p772m3818
$$ 920660 1135602 1353688 1557993 1736350 1881857 1991038 2061859 2093167 2085395 2041577
36041B041577p3472r3198j00528r5697q2307o5867n0984l9225k9098j7845l777
$$ 2041577 1968105 1874907 1774379 1678682 1596375 1530508 1479524 1440299 1411201 1393356 1389579
36030A389579J2050K5498L0614K2322n44l3430o7001r0745r7457q6062o1428l1832
$$ 1389579 1401629 1427127 1457741 1480063 1479519 1446089 1379088 1288343 1190886 1104824 1043396 1011564
36018A011564n818J0196J3136L523j4914l6219n3841o2790o1408n1547l6902k0901
$$ 1011564 1005746 1015942 1029078 1032601 1017687 981468 927627 864837 803429 751882 714980 694079
36006F94079n743P105J6046J9130J4564J628j8526m2744o6959q8008j04948j18661
$$ 694079 688336 695441 711487 730617 745181 746809 728283 685539 618580 530572 425624 306963
35994C06963j30287j39725j45374j45074j37592j23711j06367q9828p8468p5819
$$ 306963 176676 36951 -108423 -253497 -391089 -514800 -621167 -710995 -789463 -865282
35984h65282q3937j02917j30418j61479j88982k05005k02899j79274j34790p3306
$$ -865282 -949219 -1052136 -1182554 -1344033 -1533015 -1738020 -1940919 -2120193 -2254983 -2328289
35974b328289j24P9287J59454K34348K97247L41549L62521L59131L34929K97097
$$ -2328289 -2328413 -2249126 -2089672 -1855324 -1558077 -1216528 -854007 -494876 -159947 137150
35964A37150K53830K11457J72990J38840J08826Q3730O5291N4860N1989N4157
$$ 137150 390980 602437 775427 914267 1023093 1106823 1172114 1226974 1278963 1333120
35954A333120N7797O0072O0474O1491O7676Q3241J09041J40659J69094J84118
$$ 1333120 1390917 1450989 1511463 1572954 1640630 1723871 1832912 1973571 2142665 2326783
35944B326783J78736J52127J09507N9347J0143l1478o1218p7142p9948p3051o1794
$$ 2326783 2505519 2657646 2767153 2826500 2836643 2805165 2743947 2666805 2586857 2513806 2452012
35933B452012n1763m6832m7847n2460n6360n5160m5926k7878k491K6381N2532
$$ 2452012 2400249 2353417 2305570 2253110 2196750 2141590 2095664 2067786 2065295 2091676 2144208
35922B144208O8270O6364M2615j909n9883j18870j64912j87611j84073j59306
$$ 2144208 2212478 2278842 2321457 2319548 2259665 2140795 1975883 1788272 1604199 1444893
35912A444893j22851q4136m9615k2768n708l82q482l0435o4473j06466j50471
$$ 1444893 1322042 1237906 1188291 1165523 1159815 1159433 1150951 1120516 1056043 949577 799106
35901G99106j89736k17741k29359k22274j98285j63550j27012r7391q0159p5947
$$ 799106 609370 391629 162270 -60004 -258289 -421839 -548851 -646242 -726401 -802348
35891h02348q1000q9300r5215r5427q9413p8849o6704n6363n0601n0325n3775
$$ -802348 -883348 -972648 -1067863 -1163290 -1252703 -1331552 -1398256 -1454619 -1505220 -1555545 -1609320
35880a609320n6860n4651m3397k2243O028L5727O0229P4189P4982O3203M2405
$$ -1609320 -1666180 -1720831 -1764228 -1786471 -1780443 -1744716 -1684487 -1610298 -1535316 -1472113 -1429708
35869a429708J8025m500k1659l2524l7913l9124l7221l2791k5586j4487J637K2421
$$ -1429708 -1411683 -1416183 -1437842 -1470366 -1508279 -1547403 -1584624 -1617415 -1643001 -1657488 -1655851 -1633430
35857a633430M5240O6035Q1176Q9058R0604Q8397Q4814Q0066P1490N5009K8069
$$ -1633430 -1588190 -1522155 -1440979 -1351921 -1261317 -1172920 -1088106 -1008040 -936550 -881541 -853472
35846h53472q116m8722q7588j19515j40905j48971j41221j16192p4816k1027L8902
$$ -853472 -861588 -910310 -997898 -1117413 -1258318 -1407289 -1548510 -1664702 -1739518 -1760545 -1721643
35835a721643R7864J49579J89935K17589K33639K40597K41327K38301K33017K25751
$$ -1721643 -1623779 -1474200 -1284265 -1066676 -833037 -592440 -351113 -112812 120205 345956
35825C45956K16061K04131J91727J81655J75800J73403J71041J64359J50426J29268
$$ 345956 562017 766148 957875 1139530 1315330 1488733 1659774 1824133 1974559 2103827
35815B103827J03579P6559M9383K0450j2493m8778q2848j05736j09378r1264n6811
$$ 2103827 2207406 2283965 2333348 2353798 2341305 2292527 2209679 2103943 1994565 1903301 1846490
35804A846490j8202R965J6161m106m7366j04210j62666k11658k43594k55562k48877
$$ 1846490 1828288 1838253 1854414 1850308 1802942 1698732 1536066 1324408 1080814 825252 576375
35793E76375k27483j96242j59725j21434q3079m4155k246M5737J01782J65330
$$ 576375 348892 152650 -7075 -128509 -211588 -255743 -257989 -212252 -110470 54860
35783E4860K32851K98676L56387L99835M23537M23396L98288L51534K90565K24342
$$ 54860 287711 586387 942774 1342609 1766146 2189542 2587830 2939364 3229929 3454271
35773C454271J60223J02468N2830J1968j9883m3267o0054p3347q6491j01781j19491
$$ 3454271 3614494 3716962 3769792 3781760 3761877 3718610 3658556 3585209 3498718 3396937 3277446
35762C277446j37787j53502j63632j66881j64495j59853j56961j58842j66576
$$ 3277446 3139659 2986157 2822525 2655644 2491149 2331296 2174335 2015493 1848917
35753A848917j79131j93719k06387k12914k09763j94632j66376j24661p0016m500
$$ 1848917 1669786 1476067 1269680 1056766 847003 652371 485995 361334 291318 286818
35743B86818O7419J38588J99939K42214K57962K43278J98747J29550M4708m4365
$$ 286818 354237 492825 692764 934978 1192940 1436218 1634965 1764515 1809223 1764858
35733A764858j25790j89378k28503k41148k29625j99198j56213j06684n5738p797
$$ 1764858 1639068 1449690 1221187 980039 750414 551216 395003 288319 232581 224784
35723B24784L3164O3868Q2358Q8381Q3040O7963M4811J5299j8702n5467r3825
$$ 224784 257948 321816 404174 492555 575595 643558 688369 703668 684966 629499 535674
35712E35674j32938j71400k06542k34890k53658k62043k61281k53594k41176k25902
$$ 535674 402736 231336 24794 -210096 -463754 -725797 -987078 -1240672 -1481848 -1707750
35702a707750k09336j92515j75501j57474j37462j14972q9904o2096l1239K632
$$ -1707750 -1917086 -2109601 -2285102 -2442576 -2580038 -2695010 -2784914 -2847010 -2878249 -2875617
35692b875617L8682P5562J12396J49678J89035K31623K76186L18389L52098L71817
$$ -2875617 -2836935 -2761373 -2648977 -2499299 -2310264 -2078641 -1802455 -1484066 -1131968 -760151
35682g60151L74797L61892L36854L04470K68463K30518J90972J50119J08590O6484
$$ -760151 -385354 -23462 313392 617862 886325 1116843 1307815 1457934 1566524 1633008
35672A633008K2576k4900p6041j27401j72444k04572k20632k21855k11336j90416
$$ 1633008 1655584 1630684 1554643 1427242 1254798 1050226 829594 607739 396403 205987
35662B05987j57626j11153n2305J3237P7251J32228J73760K00690K13401K11952
$$ 205987 48361 -62792 -115097 -101860 -24609 107619 281379 482069 695470 907422
35652I07422J95851J65771J25263Q0470L7711Q49k9632n5379p7935r7316j12453
$$ 907422 1103273 1269044 1394307 1474777 1512488 1513337 1483705 1428326 1350391 1253075 1140622
35641A140622j22932j30141j36604j44149j52605j59851j62709j57919j43107
$$ 1140622 1017690 887549 750945 606796 454191 294340 131631 -26288 -169395
35632a69395j17642q3047m2678r65L7531O9031R1230J03210J04735R5695P6414
$$ -169395 -287037 -370084 -412762 -413727 -376196 -307165 -215935 -112725 -7990 87705 164119
35621A64119M8406J4662k0821n3872q0836r9262j08659j10865j09480j08129j08359
$$ 164119 212525 227187 206366 152494 71658 -27604 -136263 -247128 -356608 -464737 -573096
35610e73096j08291j02916q6098n3535n439N2330J09708J56296J85935J99162
$$ -573096 -681387 -784303 -870401 -923936 -929375 -877045 -767337 -611041 -425106 -225944
35600b25944K02070K02320K04927K10128K14026K11355J98764J76909J50140J24033
$$ -225944 -23874 178446 383373 593501 807527 1018882 1217646 1394555 1544695 1668728
35590A668728J02390Q5565P0923N4708L4056Q090k2080n4139q5562j14319j38934
$$ 1668728 1771118 1856683 1927606 1982314 2016370 2024460 2002380 1948241 1862679 1748360 1609426
35579A609426j57961j69437j71355j63131j46806j26212j04212q0421n1936j7048
$$ 1609426 1451465 1282028 1110673 947542 800736 674524 570312 489891 437955 420907
35569D20907K1038N3664P0064O2346K9176k3609q5233j43532j88118k11911k11055
$$ 420907 441945 495609 565673 628019 657195 633586 548353 404821 216703 4792 -206263
35558b06263j84307j33141o2695J7767R6284J61521K06224K28739K32030K21376
$$ -206263 -390570 -523711 -586406 -568639 -472355 -310834 -104610 124129 356159 577535
35548E77535K02387J79943J57693J37782J20934J06966R5295Q5110P5340O4913
$$ 577535 779922 959865 1117558 1255340 1376274 1483240 1578535 1663645 1738985 1803898
35538A803898N3134L9537K3432M204j7137l6346m6399m0474j5680K5100P4370
$$ 1803898 1857032 1896569 1920001 1924205 1907068 1870722 1824323 1783849 1768169 1793269 1867639
35527A867639J23151J64047J92738K07710K09167J98036J75578J43280J02786
$$ 1867639 1990790 2154837 2347575 2555285 2764452 2962488 3138066 3281346 3384132
35518C384132N5810M226m9642j02877j52278j95098k29546k54631k69582k73609
$$ 3384132 3439942 3444168 3394526 3291649 3139371 2944273 2714727 2460096 2190514 1916905
35508A916905k66538k49698k26072j99109j70890j40872j06053o2577q061N6418
$$ 1916905 1650367 1400669 1174597 975488 804598 663726 557673 495096 487035 543453
35498E43453J25427J89885K39463K65996K66391K43362K03530J54224J01004M6970
$$ 543453 668880 858765 1098228 1364224 1630615 1873977 2077507 2231731 2332735 2379705
35488B379705o323n7284j02780j37503j54819j49072j18260o5654O10O9868J32177
$$ 2379705 2373382 2316098 2213318 2075815 1920996 1771924 1653664 1588010 1588620 1658488 1790665
35477A790665J80839K12935K28083K26803K09846J78536J35251Q3420K7240k8565
$$ 1790665 1971504 2184439 2412522 2639325 2849171 3027707 3162958 3246378 3273618 3245053
35467C245053p8992j19481j47410j63581j72245j78770j86289j94217k00056k02629
$$ 3245053 3166061 3046580 2899170 2735589 2563344 2384574 2198285 2004068 1804012 1601383
35457A601383k03576k05895k11522k20098k29212k35183k33715k20651j92630
$$ 1601383 1397807 1191912 980390 760292 531080 295897 62182 -158469 -351099
35448c51099j47733q6423j3106O3004J29527J75368J95496J92789J75780J54161
$$ -351099 -498832 -585255 -598361 -535357 -405830 -230462 -34966 157823 333603 487764
35438D87764J35156J22631J18325J22969J35715J52473J65458J65426J45594J04649
$$ 487764 622920 745551 863876 986845 1122560 1275033 1440491 1605917 1751511 1856160
35428A856160M7019j9350q5804j44864j90836k19917k30522k23782k03317j73892
$$ 1856160 1903179 1883829 1798025 1653161 1462325 1242408 1011886 788104 584787 410895
35418D10895j39595j02832o4802k6670R866M2989P1302R3524J07606J10482R9168
$$ 410895 271300 168468 103666 76996 86862 129851 201153 294677 402283 512765 611933
35407F11933P2580L2808j5011o4052j07675j41102j62290j71912j72696j68510
$$ 611933 684513 717321 702310 638258 530583 389481 227191 55279 -117417 -285927
35397b85927j63313j60050j59907j62261j65159j65688j60210j44930j17064p5864
$$ -285927 -449240 -609290 -769197 -931458 -1096617 -1262305 -1422515 -1567445 -1684509 -1760373
35387a760373k2772L9077J05195J69832K26484K69055K93159K97006K81801K51696
$$ -1760373 -1783145 -1744068 -1638873 -1469041 -1242557 -973502 -680343 -383337 -101536 150160
35377A50160K13050J72813J36935J09662R3900R1554J02874J25120J51952J74740
$$ 150160 363210 536023 672958 782620 876520 968074 1070948 1196068 1348020 1522760
35367A522760J85496J79902J58740J27172R2641O2476M1986L3304L5265M4405
$$ 1522760 1708256 1888158 2046898 2174070 2266711 2329187 2371173 2404477 2439742 2484147
35357B484147N6576O8381P7559Q2531Q1861P4344N9563L8252J2134j6568m5522
$$ 2484147 2540723 2609104 2686663 2769194 2851055 2925399 2984962 3023214 3035348 3018780 2973258
35346B973258p2537r5825j14212j26991j33461j32606j23288j04845p7828m4563
$$ 2973258 2900721 2804896 2690684 2563693 2430232 2297626 2174338 2069493 1991665 1947102
35336A947102q988K4658N3891P9228J03236J27789J51582J69700J75383J62838
$$ 1947102 1938114 1962772 2016663 2095891 2199127 2326916 2478498 2648198 2823581 2986419
35326B986419J29823P9195J8837m0340q7943j17614j28656j24943j12128r5234
$$ 2986419 3116242 3195437 3214274 3173934 3085991 2968377 2839721 2714778 2602650 2507416
35316B507416p7850o2555n1337m5482m5271m9933n7854o6922p4947q0086q0880
$$ 2507416 2429566 2367011 2315674 2270192 2224921 2174988 2117134 2050212 1975265 1895179 1814299
35305A814299p6025o4396m5770k1644M799K9610M9119O0443O1833N3494L8505
$$ 1814299 1738274 1673878 1628108 1606464 1611263 1640873 1689992 1750435 1812268 1865762 1904267
35294A904267K2478J1327Q302J2462J9487K3965K1404R494j1286l7634o4517q7102
$$ 1904267 1926745 1938072 1946374 1958836 1978323 2002288 2023692 2033186 2021900 1984266 1919749 1832647
35282A832647j02170j08027j03595q8243o2869l1090Q95K5913L7939L3744J3731
$$ 1832647 1730477 1622450 1518855 1430612 1367743 1336653 1337548 1363461 1401400 1435144 1448875
35271A448875j8094n5222r0770j19824j40563j53272j58093j53651j37958j10846
$$ 1448875 1430781 1375559 1284789 1164965 1024402 871130 713037 559386 421428 310582
35261C10582p5829l9778j0678N059M387j1917l9846p3262j05256j29444j40808
$$ 310582 234753 194975 184297 189356 193743 181826 141980 68718 -36538 -165982 -306790
35250c06790j35786j12046o8810p923O5151J41637K11214K64444K94895L00497
$$ -306790 -442576 -554622 -623432 -631355 -566204 -424567 -213353 51091 345986 646483
35240F46483K83966K52028K13522J76951J48417J30735J23926J26394J35553J47216
$$ 646483 930449 1182477 1395999 1572950 1721367 1852102 1976028 2102422 2237975 2385191
35230B385191J54844J50380J27021Q2136J8340n7618j36914k10522k70573l11282
$$ 2385191 2540035 2690415 2817436 2899572 2917912 2860294 2723380 2512858 2242285 1931003
35220A931003l29520l25242l01891k66222k26756j91077j63499j44568j32514
$$ 1931003 1601483 1276241 974350 708128 481372 290295 126796 -17772 -150286
35211a50286j25132j20623j16982j10896r7569p2143l2018K1391Q2463J42565
$$ -150286 -275418 -396041 -513023 -623919 -721488 -793631 -825649 -804258 -721795 -579230
35201e79230J91945K21741K25913K02722J55359R1534K1890m2657r3919j28334
$$ -579230 -387285 -165544 60369 263091 418450 509984 531874 489217 395298 266964
35191B66964j46644j51844j47297j36389j23051j11489j04583j02224j01236r7149
$$ 266964 120320 -31524 -178821 -315210 -438261 -549750 -654333 -756557 -857793 -954942
35181i54942q6555o8721m6003k3332p099l430j6047m4593q4533j28968j71264
$$ -954942 -1041497 -1110218 -1156221 -1179553 -1186652 -1190082 -1206129 -1250722 -1335255 -1464223 -1635487
35170a635487k06725k32256k44910k41219k18371j76474j19964n7039K472M9516
$$ -1635487 -1842212 -2074468 -2319378 -2560597 -2778968 -2955442 -3075406 -3132445 -3129973 -3080457
35160c080457P7701Q4493P1552M3844P708l1091o8153r9969j23225j34826j32533
$$ -3080457 -3002756 -2918263 -2846711 -2802867 -2795159 -2826250 -2894403 -2994372 -3117597 -3252423 -3384956
35149c384956j15697q5688m5978j639M1994Q0890J12889J36860J51482J55388
$$ -3384956 -3500653 -3586341 -3632319 -3633958 -3591964 -3511074 -3398185 -3261325 -3109843 -2954455
35139b954455J48918J35826J22911J17390J23886J43050J72253K07118K42552
$$ -2954455 -2805537 -2669711 -2546800 -2429410 -2305524 -2162474 -1990221 -1783103 -1540551
35130a540551K73123K93706L00937K94880K79492K60859K43775K28819K12048
$$ -1540551 -1267428 -973722 -672785 -377905 -98413 162446 406221 635040 847088
35121H47088J87852J52846J07942N7291N613m3691q8578j27424j58250j78620
$$ 847088 1034940 1187786 1295728 1353019 1358632 1314941 1226363 1098939 940689 762069
35111G62069j86154j79722j60883j34388j06787q3780o8185n9748n6186n4277
$$ 762069 575915 396193 235310 100922 -5865 -89645 -157830 -217578 -273764 -328041
35101c28041n0400m0995k3238M137M0287Q2289J26026J67631K04536K35189K57763
$$ -328041 -378441 -419436 -442674 -438537 -398250 -315961 -189935 -22304 182232 417421 675184
35090F75184K69367K66849K48807K17330J78298J39792J09031Q9026P6899O5331
$$ 675184 944551 1211400 1460207 1677537 1855835 1995627 2104658 2193684 2270583 2335914
35080B335914M6822J8462j5539m5044n8626m9428j9043K3064O4305R4848J10940
$$ 2335914 2382736 2401198 2385659 2340615 2281989 2232561 2213518 2236582 2300887 2395735 2506675
35069B506675J14348J09248R9067Q5170O7618M6968K5373N997q595j7505k1301
$$ 2506675 2621023 2730271 2829338 2914508 2982126 3029094 3054467 3060464 3051869 3034364 3013063
35058C013063k1359j9796j9783k5260l9602o4328r8759j40486j85764k29565k66172
$$ 3013063 2991704 2971908 2952125 2926865 2887263 2822935 2724176 2583690 2397926 2168361 1902189
35047A902189k90635l00354k95604k78898k53786k23712j90799j54928j13794
$$ 1902189 1611554 1311200 1015596 736698 482912 259200 68401 -86527 -200321
35038b00321o4375n158O2047J31508J94517K41756K66274K65685K42474K02767
$$ -200321 -264696 -269854 -207807 -76299 118218 359974 626248 891933 1134407 1337174
35028A337174J54491J05700O2930K9847O611r654k3592l9867o1386q8001j16529
$$ 1337174 1491665 1597365 1660295 1690142 1696753 1687099 1663507 1623640 1562254 1474253 1357724
35017A357724j42228j60871j70367j71424j67211j62038j59299j59681j60828
$$ 1357724 1215496 1054625 884258 712834 545623 383585 224286 64605 -96223
35008i6223j58618j49133j30080j01419o5499k6901Q410L4871M9465N3052M9890
$$ -96223 -254841 -403974 -534054 -635473 -700972 -727873 -719463 -684592 -635127 -582075 -532185
34997e32185M5460M3718M5267M7508M6717M0773L0710K0235J3818J4978K5559
$$ -532185 -486725 -443007 -397740 -350232 -303515 -262742 -232032 -211797 -197979 -183001 -157442
34986a57442M5816P4678J09950J48478J86370K19334K43210K54665K51837K34842
$$ -157442 -111626 -36948 73002 221480 407850 627184 870394 1125059 1376896 1611738
34976A611738K06172J70626J34213J02363P8571O4257N9258O1885O8510P3991
$$ 1611738 1817910 1988536 2122749 2225112 2303683 2367940 2427198 2489083 2557593 2631584
34966B631584P3422O4452M8413K9596J3106K611j058l4J425j667j3412l5396o5856
$$ 2631584 2705006 2769458 2817871 2847467 2860573 2863184 2862126 2862092 2863517 2861850 2848438 2813042 2747186
34953B747186j00227j32924j59334j77030j85959j87851j85042j79042j69520
$$ 2747186 2646959 2514035 2354701 2177671 1991712 1803861 1618819 1439777 1270257
34944A270257j54430j31160r8113n6046q741L7533P6177J03451J20605J32916
$$ 1270257 1115827 984667 886554 830508 821767 859300 935477 1038928 1159533 1292449
34934A292449J45772J60611J73892J79815J74329J57213J31022R8502O1120J9875
$$ 1292449 1438221 1598832 1772724 1952539 2126868 2284081 2415103 2513605 2574725 2594600
34924B594600k2641o1294q9910j04422j05219r6957q5979p7239p2633p1146o9987
$$ 2594600 2571959 2510665 2420755 2316333 2211114 2114157 2028178 1950939 1878306 1807160 1737173
34913A737173o5649n4739l5186p751K3288N1537P1345P9953P7512O5687M6752
$$ 1737173 1671524 1616785 1581599 1573848 1597136 1648673 1720018 1799971 1877483 1943170 1989922
34902A989922K3784R98j6923k6625k7786k3276j7029j0930l493Q022K3731L9136
$$ 1989922 2013706 2014704 1997781 1971156 1943370 1920094 1903065 1892135 1888642 1896664 1920395 1959531
34890A959531M6832M0450J7886j7642n8513r5153j19322j27185j20692j06723
$$ 1959531 2006363 2046813 2064699 2047057 1988544 1893391 1774069 1646884 1526192 1419469
34880A419469r4321r1252j01207j22943j51627j81315k06978k25325k34696k34622
$$ 1419469 1325148 1233896 1132689 1009746 858119 676804 469826 244501 9805 -224817
34870b24817k25470k08240j84420j55505j22299q4956m4184k602L5425O5643Q5921
$$ -224817 -450287 -658527 -842947 -998452 -1120751 -1205707 -1249891 -1252493 -1217068 -1151425 -1065504
34859a065504R6659R9628R6416Q7541P2605N1311K4744m088l0885n1336o2147
$$ -1065504 -968845 -869217 -772801 -685260 -612655 -561344 -536600 -540688 -571573 -622909 -685056
34848f85056o1360m8345k3949R188M6360Q1007J05634J13300R9235O2128M856
$$ -685056 -746416 -794761 -818710 -809522 -763162 -682155 -576521 -463221 -363986 -301858 -297002
34837b97002o5596j39346k05795k55959k83964k87469k67395k27332j72741j10101
$$ -297002 -362598 -501944 -707739 -963698 -1247662 -1535131 -1802526 -2029858 -2202599 -2312700
34827b312700m6322J1771N8312Q9816J06334J11414J10679J09950J13882J25276
$$ -2312700 -2359022 -2347251 -2288939 -2199123 -2092789 -1981375 -1870696 -1760746 -1646864 -1521588
34817a521588J44609J69663J95850K17746K31201K34551K28095K12713J89200
$$ -1521588 -1376979 -1207316 -1011466 -793720 -562519 -327968 -99873 112840 302040
34808C02040J58764J23864Q8273N6294L1764J7365J4207K1496L6170N2954O5497
$$ 302040 460804 584668 672941 729235 760999 778364 792571 814067 850237 903191 968688
34797I68688O8922O2470N0098L8079L1395L1843L8921N1733O9613R1233J13783
$$ 968688 1037610 1100080 1150178 1188257 1219652 1251495 1290416 1342149 1411762 1502995 1616778
34786A616778J33571J47664J55156J57030J54694J48433J37102J19627R7243P4375
$$ 1616778 1750349 1898013 2053169 2210199 2364893 2513326 2650428 2770055 2867298 2941673
34776B941673N7017M9420N1467N8626O4557O4542N7518M5568L1586J6877J63k1731
$$ 2941673 2998690 3048110 3099577 3158203 3222760 3287302 3344820 3390388 3421974 3438851 3439014 3417283
34764C417283n1993r1516j37173j81749k16241k33593k31700k13664j85518j53414
$$ 3417283 3365290 3273774 3136601 2954852 2738611 2505018 2273318 2059654 1874136 1720722
34754A720722j22178r5375p5788o5585o6433p9682j05881j42979j84268k18617
$$ 1720722 1598544 1503169 1427381 1361796 1295363 1215681 1109800 966821 782553 563936
34744E63936k34399k25409j94555j52442j11657q0829o2309n4043n2991n6956
$$ 563936 329537 104128 -90427 -242869 -354526 -435355 -497664 -551707 -604698 -661654
34734f61654o4112p1839p6764p6080o8922n6711m2314k8655j7549r294l023K676
$$ -661654 -725766 -797605 -874369 -950449 -1019371 -1076082 -1118396 -1147051 -1164600 -1173894 -1176917 -1174241
34722a174241R210J7606K8283M1398N7737P9082J06922J39994J73023J98505K10736
$$ -1174241 -1165031 -1147425 -1119142 -1077744 -1020007 -940925 -834003 -694009 -520986 -322481 -111745
34711a11745K09258J99460J89997J88598J98287K15924K33748K42908K36898K13156
$$ -111745 97513 296973 486970 675568 873855 1089779 1323527 1566435 1803333 2016489
34701B016489J72779J19299N7419p728p0776j26048j68047j92925k00157j92777
$$ 2016489 2189268 2308567 2365986 2358258 2287482 2161434 1993387 1800462 1600305 1407528
34691A407528j75626j52826j26371r6387o2262k3703J8593O2784J06224J46120
$$ 1407528 1231902 1079076 952705 856318 794056 770353 788946 851730 957954 1104074
34681A104074J79624K03293K12823K04170J75667J29688P2617J3166m0187q1664
$$ 1104074 1283698 1486991 1699814 1903984 2079651 2209339 2281956 2295122 2254935 2173271
34671B173271j09670j26806j38704j52332j74059k07297k50277k95286l30527
$$ 2173271 2063601 1936795 1798091 1645759 1471700 1264403 1014126 718840 388313
34662C88313l44210l29238k86538k25384j60097j04349o6162m6351m0429m1840
$$ 388313 44103 -285135 -571673 -797057 -957154 -1061503 -1127665 -1174016 -1214445 -1256285
34652a256285m4229m2194l1131p068L2747Q8321J55427K25754K89311L37798L67072
$$ -1256285 -1300514 -1342708 -1373839 -1380907 -1348160 -1259839 -1104412 -878658 -589347 -251549 115523
34641A15523L77860L74999L65870L58416L58959L70161L89326M08048M14481L98260
$$ 115523 493383 868382 1234252 1592668 1951627 2321788 2711114 3119162 3533643 3931903
34631C931903L55746K91990K18013J45320Q1356K8228j5554n2471q4559j13707
$$ 3931903 4287649 4579639 4797652 4942972 5024328 5052556 5037002 4984531 4899972 4786265
34621D786265j42367j72961k05881k37910k62803k73816k66507k40367j98996
$$ 4786265 4643898 4470937 4265056 4027146 3764343 3490527 3224020 2983653 2784657
34612B784657j49024r8035n2107j4115J6471M2339O6409Q9925J11318J26575J31281
$$ 2784657 2635633 2537598 2485491 2471376 2487847 2530186 2596595 2686520 2797838 2924413 3055694
34601C055694J23409J05001Q1558N9552M3817L6203L5711L9195M1996L8764K4993
$$ 3055694 3179103 3284104 3365662 3425214 3469031 3505234 3540945 3580140 3622136 3660900 3685893
34590C685893r73l6684p6241j12690j40767j58360j65818j63939j52373j29866
$$ 3685893 3684920 3648236 3571995 3459305 3318538 3160178 2994360 2830421 2678048 2548182
34580B548182r6018n2702l984M5024Q9028J22811J41768J43386J28844J03217
$$ 2548182 2452164 2399462 2395478 2440502 2529530 2652341 2794109 2937495 3066339 3169556
34570C169556P3474M5258K0316l580l0135o1171r4696j25497j47438j56031j50289
$$ 3169556 3243030 3288288 3308604 3305024 3274889 3213718 3119022 2993525 2846087 2690056 2539767
34559B539767j33366j11681r2439q0630p7109p8759q0300p6589o4371m3054j4666
$$ 2539767 2406401 2294720 2202281 2121651 2044542 1965783 1885483 1808894 1744523 1701469 1686803
34548A686803J6804M6292O8799Q0613Q0343O9220N0524K8573P903p296j3810j0281
$$ 1686803 1703607 1749899 1818698 1899311 1979654 2048874 2099398 2127971 2135874 2128578 2114768 2104487
34536B104487K097J9467L6166M6373M6202L5435J7657j688j8333l1235m2261n4194
$$ 2104487 2106584 2126051 2162217 2208590 2254792 2290227 2307884 2306196 2287863 2256628 2214367 2160173
34524B160173o8942q7123j08319j30809j50635j61403j55946j29548q2716k1705
$$ 2160173 2091231 2004108 1895789 1764980 1614345 1452942 1296996 1167448 1084732 1063027
34514A063027M3543J02827J48930J79517J97032K06388K11416K12300K05995J89450
$$ 1063027 1106570 1209397 1358327 1537844 1734876 1941264 2152680 2364980 2570975 2760425
34504B760425J62996J31225J00799P6853O0480M8768L7209K2819N815j1137k5182
$$ 2760425 2923421 3054646 3155445 3232298 3292778 3341546 3378755 3401574 3407389 3396252 3371070
34493C371070l5196m2181m8288n5377o4040p3657q3329r2870j03015j14945j29893
$$ 3371070 3335874 3293693 3245405 3190028 3125988 3052331 2969002 2876132 2773117 2658172 2528279
34482B528279j49195j74369k06645k46116k91080l37807l80744m13151m28352
$$ 2528279 2379084 2204715 1998070 1751954 1460874 1123067 742323 329172 -99180
34473i9180m21467l91122l40274k75623k05570j37588p6281k3082K2450O0806
$$ -99180 -520647 -911769 -1252043 -1527666 -1733236 -1870824 -1947105 -1970187 -1947737 -1886931
34463a886931R1414J12866J24033J25098J17687J04401Q8334P2648N9709M9912
$$ -1886931 -1795517 -1682651 -1558618 -1433520 -1315833 -1211432 -1123098 -1050450 -990741 -940829
34453i40829M1170L0053J4049o403k7351m2411m5161l1890l274L6134Q0165J23358
$$ -940829 -899659 -869606 -855557 -861960 -889311 -931722 -976883 -1008773 -1012047 -975913 -895748 -772390
34441g72390J61693J91995K11337K17435K09875J91170J66853J44232J30252J29379
$$ -772390 -610697 -418702 -207365 10070 219945 411115 577968 722200 852452 981831
34431I81831J42440J66687J96696K25333K44774K47986K30917J94528J45087R1929
$$ 981831 1124271 1290958 1487654 1712987 1957761 2205747 2436664 2631192 2776279 2868208
34421B868208M3877O646j7603k9269l0576k5272j7799j1315n767K030J5690L5777
$$ 2868208 2912085 2918731 2901128 2871859 2841283 2816011 2798212 2786897 2781130 2783160 2798850 2834627
34409B834627N8321P6708Q5567Q3693P4066O1427M9661M0659L4759L1738L1563
$$ 2834627 2892948 2969656 3055223 3138916 3212982 3274409 3324070 3364729 3399488 3431226 3462789
34398C462789L4546M0936N0180O0509O9324P4008P2325O2309M2560J3377k2414
$$ 3462789 3497335 3538271 3588451 3648960 3718284 3792292 3864617 3926926 3969486 3982863 3960449
34387C960449o0380r6816j30325j61198j89712k15359k37554k56468k72712k86158
$$ 3960449 3900069 3803253 3672928 3511730 3322018 3106659 2869105 2612637 2339925 2053767
34377B053767k95293k97615k90751k73445k46059k10624j70667j30816r5974p0059
$$ 2053767 1758474 1460859 1170108 896663 650604 439980 269313 138497 42523 -27536
34367b7536n4713m8575m7627m6395l9709k4611j682K4884M8763O3776O5848N3984
$$ -27536 -82249 -130824 -178451 -224846 -264555 -289166 -290848 -265964 -217201 -153425 -87577 -33593
34355c3593L0284q10l3954o4659r0606j11929j30639j49567j71061j95567k20700
$$ -33593 -3309 -4119 -38073 -102732 -193338 -305267 -435906 -585473 -756534 -952101 -1172801
34344a172801k41444k51532k45141k18205j69283j00216j6384P3773J59966K31849
$$ -1172801 -1414245 -1665777 -1910918 -2129123 -2298406 -2398622 -2415006 -2341233 -2181267 -1949418
34334a949418K81488L06088L09606L01480K92499K90187K96492L08727L22384
$$ -1949418 -1667930 -1361842 -1052236 -750756 -458257 -168070 128422 437149 759533
34325G59533L33725L40684L42020L35968L19864K91231K49250J95329J32762O6372
$$ 759533 1093258 1433942 1775962 2111930 2431794 2723025 2972275 3167604 3300366 3366738
34315C366738K350n2533r2878j16838j27187j30521j35108j48091j72971k08010
$$ 3366738 3369088 3316555 3223677 3106839 2979652 2849131 2714023 2565932 2392961 2184951
34305B184951k46098k76169k86299k67890k19278j46559o1125K4351R8947J54866
$$ 2184951 1938853 1662684 1376385 1108495 889217 742658 681533 705884 804831 959697
34295I59697J87905J97442J85797J56997J15801O7268J6143l4246q2765j29724
$$ 959697 1147602 1345044 1530841 1687838 1803639 1870907 1887050 1852804 1770039 1640315
34285A640315j74958k16068k48187k65413k63318k41192k02587j53520r9688m4723
$$ 1640315 1465357 1249289 1001102 735689 472371 231179 28592 -124928 -224616 -269339
34275b69339R461O1237J08353J47792J76052J89567J85738J64606J29981Q8683
$$ -269339 -259878 -198641 -90288 57504 233556 423123 608861 773467 903448 992131
34265I92131M7900J2189j7976m5489p4450j07662j44682j81280k10790k26948
$$ 992131 1040031 1052220 1034244 988755 914305 806643 661961 480681 269891 42943
34255D2943k26565k10548j83283j51312j21633r9477q5982p7584o8149n2642k9721
$$ 42943 -183622 -394170 -577453 -728765 -850398 -949875 -1035857 -1113441 -1181590 -1234232 -1263953
34244a263953j759K7177N3729P6643R6540J14253J29105J38695J40358J32654
$$ -1263953 -1265712 -1238535 -1184806 -1108163 -1011623 -897370 -768265 -629570 -489212 -356558
34234c56558J15260Q7788M9560J380n2264j02938j40688j57638j50631j21878
$$ -356558 -241298 -153510 -103950 -102570 -154834 -257772 -398460 -556098 -706729 -828607
34224h28607p7880k7338K1197O1361R0329J09175J22144J34874J52078J75588
$$ -828607 -906487 -933825 -912628 -851267 -760938 -651763 -529619 -394745 -242667 -67079
34214f7079K03634K31437K52733K61665K54526K30837J93361J47271R8971N4767
$$ -67079 136555 367992 620725 882390 1136916 1367753 1561114 1708385 1807356 1862123
34204A862123J9120p288k8228m9891p6697j07620j36051j53433j54080j37810
$$ 1862123 1881243 1873955 1845727 1795836 1719139 1611519 1475468 1322035 1167955 1030145
34194A030145j09290p5331m2477j5706K175J1140J4291J6902K4081L8155N7674
$$ 1030145 920855 845524 803047 787341 789516 800656 814947 831849 855930 894085 951759
34183I51759P8739R7671J12973J25396J36289J45834J52377J53285J46614J32461
$$ 951759 1030498 1128169 1241142 1366538 1502827 1648661 1801038 1954323 2100937 2233398
34173B233398J13131R2191P3059N7887M7116L9773L4213K8952K2918J5046L759
$$ 2233398 2346529 2438720 2511779 2569666 2616782 2656555 2690768 2719720 2742638 2757684 2761443
34162B761443j2781l5642o4005r4791j23342j44845j55922j55526j44683j25325
$$ 2761443 2748662 2713020 2649015 2554224 2430882 2286037 2130115 1974589 1829906 1704581
34152A704581r9452o9511l9600j5931n431j2850l8216p6443j19414j58950j88791
$$ 1704581 1605129 1535618 1496018 1480087 1474656 1461806 1423590 1347147 1227733 1068783 879992
34141H79992k04949k05374j89843j59817j17878o7204j1867M2269Q7583J16562
$$ 879992 675043 469669 279826 120009 2131 -65073 -76940 -34671 52912 169474
34131A69474J24562J11733Q2946M6044R352k0646m0805n1590n6119n8212o0283
$$ 169474 294036 405769 488715 534759 544111 523465 482660 431070 374951 316739 256456
34120B56456o2176o1843n7431m9141l9230l0094k2025j2506K392K5408N5960Q9572
$$ 256456 194280 132437 75006 25865 -13365 -43459 -65484 -77990 -75598 -50190 5770 95342
34108I5342J18923J35894J33962J10451O8150J5413l5755p3408q9887q4781o5067
$$ 95342 214265 350159 484121 594572 662722 678135 642380 568972 479085 394304 329237
34097C29237m1963k5777k1311k6340l3892l6700l0982j7525O3J8285L5958N4432
$$ 329237 287274 261497 240186 213846 179954 143254 112272 94747 94810 113095 149053 203485
34085B03485P5867J00740J26233J46710J55933J49420J25731Q6801L7832j3360
$$ 203485 279352 380092 506325 653035 808968 958388 1084119 1170920 1208752 1195392
34075A195392n8139q9531j03875j00821q2293n1647j3397K7055O4159R3398J12560
$$ 1195392 1137253 1047722 943847 843026 760733 709086 695689 722744 786903 880301 992861
34064I92861J22305J25409J24728J21144J12962R7270P2400L9969N135k5248m5549
$$ 992861 1115166 1240575 1365303 1486447 1599409 1696679 1769079 1809048 1814183 1788935 1743386
34053A743386n3469n0271l9664k6440j5391j0240j2622k1721l4769m8274n9541
$$ 1743386 1689917 1639646 1599982 1573542 1558151 1547911 1535289 1513568 1478799 1430525 1370984
34042A370984o8098p6258q8178j07658j35841j70008k03949k29974k42063k38620
$$ 1370984 1302886 1226628 1138450 1030792 894951 724943 520994 291020 48957 -189663
34032a89663k23035k01423j79102j58043j36670j11430p8728l6333J5747P4376
$$ -189663 -412698 -614121 -793223 -951266 -1087936 -1199366 -1278094 -1314427 -1298680 -1224304
34022a224304J32755J81520K12063K20493K09226J85060J55281J24782R5518O7718
$$ -1224304 -1091549 -910029 -697966 -477473 -268247 -83187 72094 196876 292394 360112
34012C60112M1438J7381l438k0689l5211m8343o0589p0793p6483p4977o4704m5977
$$ 360112 401550 418931 415493 394804 359593 311250 250661 179868 103385 28408 -36296 -82273
34000h2273k0678Q958M1398P5635J10094J41910J67378J83152J87345J80138J63717
$$ -82273 -102951 -93993 -52595 23040 133134 275044 442422 625574 812919 993057 1156774
$$ [...]
##END NTUPLES=NMR SPECTRUM
##END=
