##TITLE=31Pdec_E3C-NA
 DMSO-d6
 24 sc
 16.2.2024
##JCAMPDX= 6.0         $$ Bruker NMR JCAMP-DX V2.0
##DATA TYPE= NMR SPECTRUM
##DATA CLASS= NTUPLES
##ORIGIN= UXNMR, Bruker Analytische Messtechnik GmbH
##OWNER= root
$$ XWIN-NMR		Version 3.5
$$ Fri Feb 16 13:55:20 2024 Russian Standard Time (UT+4h)  she@DPX200
##.OBSERVE FREQUENCY= 81.013821
##.OBSERVE NUCLEUS= ^31P
##.ACQUISITION MODE= SIMULTANEOUS
##.ACQUISITION SCHEME= undefined
##.AVERAGES= 24
##.DIGITISER RES= 16
##SPECTROMETER/DATA SYSTEM= spect
##.PULSE SEQUENCE= zgpg30
##.SOLVENT NAME= DMSO
##.SHIFT REFERENCE= (INTERNAL, DMSO, 0, 248.564)
##AUDIT TRAIL= $$ (NUMBER, WHEN, WHO, WHERE, WHAT)
$$ ##TITLE= Audit trail, XWIN-NMR		Version 3.5
$$ ##JCAMPDX= 5.01
$$ ##ORIGIN= Bruker BioSpin GmbH
$$ ##OWNER= she
$$ F:/spectra/data/she/nmr/P31/1/pdata/1/auditp.txt
$$ ##AUDIT TRAIL=  $$ (NUMBER, WHEN, WHO, WHERE, WHAT)
(   1,<2024-02-16 13:54:09.96 +0400>,<she>,<DPX200>,
      <created by zg, POWCHK disabled, PULCHK disabled
       configuration hash MD5:
       00 E9 B6 7A A2 85 ED C7 34 08 36 98 17 FE 4E 26
       data hash MD5: 32K
       46 F8 6B 0C EF DE 75 F1 C3 95 F5 C7 56 9E 4A 3E>)
(   2,<2024-02-16 13:54:12.21 +0400>,<she>,<DPX200>,
      <Start of raw data processing
       efp BC_mod = 2 LB = 10 FT_mod = 6 PKNL = 1 PHC0 = -12778.9 PHC1 = -218.7166 SI = 64K 
       data hash MD5: 64K
       7A 46 77 EC 8A 0D 25 58 EA 8A E4 49 AE 1F 51 8E>)
(   3,<2024-02-16 13:54:28.23 +0400>,<she>,<DPX200>,
      <pk PHC0 = 22.19806 PHC1 = 0 
       data hash MD5: 64K
       AA 56 8E 9F BB E5 85 6E 3A 8F F0 4E DC 03 37 A0>)
(   4,<2024-02-16 13:54:46.26 +0400>,<she>,<DPX200>,
      <pk PHC0 = -39.87359 PHC1 = 91.00001 
       data hash MD5: 64K
       10 D1 1D 8A 03 23 61 A5 DC A8 E9 DF 18 D6 87 78>)
(   5,<2024-02-16 13:54:49.43 +0400>,<she>,<DPX200>,
      <abs ABSG = 5 
       data hash MD5: 64K
       8F 83 68 C0 12 67 5B 38 33 EF BD C1 F2 BE 38 9C>)
$$ ##END=
$$ 
$$ hash MD5
$$ 90 A8 1E 28 49 38 3A B8 FC BF EE B1 61 68 27 1D
##$RELAX= 
##$RELAX= 
##$RELAX= 
##$RELAX= 
##$RELAX= 
##$RELAX= 
##$RELAX= 
##$RELAX= 
##$RELAX= 
$$ Bruker specific parameters
$$ --------------------------
##$DU= <F:/spectra>
##$EXPNO= 1
##$NAME= <P31>
##$PROCNO= 1
##$TYPE= <nmr>
##$USER= <she>
##$AMP= (0..31)
100 100 100 100 100 100 100 100 100 100 100 100 100 100 100 100 100 100 
100 100 100 100 100 100 100 100 100 100 100 100 100 100 
##$AQSEQ= 0
##$AQ_mod= 1
##$AUNM= <au_zg>
##$AUTOPOS= <>
##$BF1= 81.014009
##$BF2= 200.13
##$BF3= 200.13
##$BF4= 200.13
##$BF5= 200.13
##$BF6= 200.13
##$BF7= 200.13
##$BF8= 200.13
##$BYTORDA= 1
##$CFDGTYP= 0
##$CFRGTYP= 5
##$CHEMSTR= <none>
##$CNST= (0..31)
1 1 145 1 1 1 1 1 1 1 1 1 1 1 1 1 1 1 1 1 1 1 1 1 1 1 1 1 1 1 1 1 
##$CPDPRG= <waltz16>
##$CPDPRG1= <>
##$CPDPRG2= <waltz16>
##$CPDPRG3= <>
##$CPDPRG4= <mlev>
##$CPDPRG5= <mlev>
##$CPDPRG6= <mlev>
##$CPDPRG7= <mlev>
##$CPDPRG8= <mlev>
##$CPDPRGB= <>
##$CPDPRGT= <>
##$D= (0..31)
$$ [...]
##$SUBNAM3= <"">
##$SUBNAM4= <"">
##$SUBNAM5= <"">
##$SUBNAM6= <"">
##$SUBNAM7= <"">
##$SUBNAM8= <"">
##$SUBNAM9= <"">
##$SW= 501.771253377433
##$SWIBOX= (0..15)
0 1 3 0 0 0 0 0 0 0 0 0 0 0 0 0 
##$SW_h= 40650.406504065
##$TD= 32768
##$TD0= 1
##$TE= 0
##$TE2= 300
##$TE3= 300
##$TEG= 300
##$TL= (0..7)
0 120 53 12 22 120 120 120 
##$TP= (0..7)
150 150 150 150 150 150 150 150 
##$TP07= 0
##$TPNAME0= <>
##$TPNAME1= <>
##$TPNAME2= <>
##$TPNAME3= <>
##$TPNAME4= <>
##$TPNAME5= <>
##$TPNAME6= <>
##$TPNAME7= <>
##$TPOAL= (0..7)
0.5 0.5 0.5 0.5 0.5 0.5 0.5 0.5 
##$TPOFFS= (0..7)
0 0 0 0 0 0 0 0 
##$TUNHIN= 0
##$TUNHOUT= 0
##$TUNXOUT= 0
##$USERA1= <user>
##$USERA2= <user>
##$USERA3= <user>
##$USERA4= <user>
##$USERA5= <user>
##$V9= 5
##$VALIST= <valist>
##$VCLIST= <CCCCCCCCCCCCCCC>
##$VD= 0
##$VDLIST= <DDDDDDDDDDDDDDD>
##$VPLIST= <PPPPPPPPPPPPPPP>
##$VTLIST= <TTTTTTTTTTTTTTT>
##$WBST= 1024
##$WBSW= 4
##$XGAIN= (0..3)
0 0 0 0 
##$XL= 0
##$YL= 0
##$YMAX_a= 10266
##$YMIN_a= -9710
##$ZGOPTNS= <>
##$ZL1= 120
##$ZL2= 120
##$ZL3= 120
##$ZL4= 120
##$ABSF1= 248.5645
##$ABSF2= -253.2056
##$ABSG= 5
##$ABSL= 3
##$ALPHA= 0
##$AQORDER= 0
##$ASSFAC= 0
##$ASSFACI= 0
##$ASSFACX= 0
##$ASSWID= 0
##$AUNMP= <proc_1d>
##$AZFE= 0.1
##$AZFW= 0.5
##$BCFW= 0
##$BC_mod= 2
##$BYTORDP= 0
##$COROFFS= 0
##$CY= -3
##$DATMOD= 1
##$DC= 0
##$DFILT= <>
##$DTYPP= 0
##$F1P= 0
##$F2P= 0
##$FCOR= 1
##$FTSIZE= 65536
##$FT_mod= 6
##$GAMMA= 0
##$GB= 0
##$INTBC= 1
##$INTSCL= 6.047779e-11
##$ISEN= 30
##$LB= 10
##$LEV0= 0
##$LPBIN= 0
##$MAXI= 10000
##$MC2= 0
##$MEAN= 0
##$ME_mod= 0
##$MI= 50
##$NCOEF= 0
##$NC_proc= -6
##$NLEV= 6
##$NOISF1= 182.463
##$NOISF2= 159.3651
##$NSP= 0
##$NTH_PI= 0
##$NZP= 0
##$OFFSET= 248.5645
##$PC= 4
##$PHC0= -12796.57
##$PHC1= -127.7166
##$PH_mod= 1
##$PKNL= yes
##$PPARMOD= 0
##$PSCAL= 0
##$PSIGN= 0
##$REVERSE= no
##$SF= 81.0140089999694
##$SI= 65536
##$SIGF1= 159.3651
##$SIGF2= -187.1042
##$SINO= 113.3802
##$SIOLD= 16384
##$SREGLST= <1H.CDCl3>
##$SSB= 0
##$STSI= 65536
##$STSR= 0
##$SW_p= 40650.406504065
##$SYMM= 0
##$S_DEV= 0
##$TDeff= 32768
##$TDoff= 0
##$TI= <>
##$TILT= no
##$TM1= 0
##$TM2= 0
##$TOPLEV= 0
##$USERP1= <user>
##$USERP2= <user>
##$USERP3= <user>
##$USERP4= <user>
##$USERP5= <user>
##$WDW= 1
##$XDIM= 65536
##$YMAX_p= 551985434
##$YMIN_p= -4775832
$$ End of Bruker specific parameters
$$ ---------------------------------
##NTUPLES= NMR SPECTRUM
##VAR_NAME=  FREQUENCY,     SPECTRUM/REAL,   SPECTRUM/IMAG
##SYMBOL=    X,             R,               I
##VAR_TYPE=  INDEPENDENT,   DEPENDENT,       DEPENDENT
##VAR_FORM=  AFFN,          ASDF,            ASDF
##VAR_DIM=   65536,         65536,           65536
##UNITS=     HZ,            ARBITRARY UNITS, ARBITRARY UNITS
##FACTOR=    0.620285442955139, 1,           1
##FIRST=     20137.2065510682, 0,            0
##LAST=      -20513.1999529968, 0,           0
##MIN=       -20513.1999529968, -4775832,    0
##MAX=       20137.2065510682, 551985434,    0
$$ Real data points
##PAGE= N=1
##DATA TABLE= (X++(R..R)), XYDATA
$$ [...]
40072C27417l8636m9186o2228p6562r0391j01705j08521j09162j02669q9219p0228
40061e71090m7999k5078l717J4516K8854L9327M6572N1529N5234N8666O2656O7660
40049b22870P3487P9229Q3621Q5653Q5106Q2672P9591P6987P5220P3614P0710
40038F43020O5024N5861M3595K9307J4056j661j7984l5343n3952p3334r2105j08239
40026D68245j19755j25483j25545j21300j14887j08539j03935j01743j01483j01820
40016f56245j01157r8251r2498q3849p2545n9104m4467l0002j7202p129o9M426
40004a258092P158Q814R739R990R685R214R139R762J0790J1424J0811Q592N162
39991a137812J683j62J359P305J7382K9814M1977N1580N7586O0522O2068O4149
$$ y = [327417, 288781, 239595, 177367, 100805, 10414, -91291, -199812, -308974, -411643, -500862, -571090, -619089, -644167, -647884, -633368, -604514, -565187, -518615, -467086, -411852, -353186, -290530, -222870, -149383, -70154, 13467, 99120, 184226, 266898, 346489, 423476, 498696, 572310, 643020, 708044, 763905, 807500, 836807, 850863, 849202, 831218, 795875, 741923, 668589, 576484, 468245, 348490, 223007, 97462, -23838, -138725, -247264, -351199, -452942, -554425, -656245, -757402, -855653, -948151, -1032000, -1104545, -1163649, -1208116, -1238118, -1255320, -1262449, -1262518, -1258092, -1250934, -1242120, -1232381, -1222391, -1212706, -1203492, -1194353, -1184591, -1173801, -1162377, -1151566, -1142974, -1137812, -1136129, -1136291, -1134932, -1127627, -1110245, -1080431, -1038454, -986874, -929288, -868766, -806698, -742549]
39979g42549O7914P3178P8696Q3155Q6103Q7999Q9609R1309R2905R3865R3621
39968A95805R1763Q8007Q2086P3624O2111M7144K8788P926j3606l3256m8376n7073
39956E24943n8818n4452m5585l3892k0816p773L504J1005J3042R113L95j0524
39944C30142k0630k7629l0688l0407k8174k5291k2336j9186j5502j1332p159l540
39932H8268p15J394K901L713L542J928j697p781j6231k6044l5447m2488m5730
39919g4387m4629l9555l1654k2557j3951p084k326Q14L313O056R369J2950J6151
39906a87490J8468J9893K0926K2233K4183K6581K8714K9658K8758K6107K2722
39895H0753K0151J9654K1512K4971K8789L1921L3864L4574L4188L2755L0153K6156
$$ y = [-742549, -674635, -601457, -522761, -439606, -353503, -265504, -175895, -84586, 8319, 102184, 195805, 287568, 375575, 457661, 531285, 593396, 640540, 669328, 677254, 663648, 630392, 582016, 524943, 466125, 411673, 366088, 332196, 311380, 303607, 307111, 318116, 331158, 340271, 340666, 330142, 309512, 281883, 251195, 220788, 192614, 167323, 144987, 125801, 110299, 98967, 91808, 88268, 87553, 88947, 91848, 95561, 99103, 101031, 99334, 91553, 75322, 49278, 13831, -28657, -74387, -119016, -158571, -190225, -212782, -226733, -233817, -236143, -235329, -232016, -225960, -216591, -203641, -187490, -169022, -149129, -128203, -105970, -81787, -55206, -26492, 3166, 31924, 58031, 80753, 100904, 120558, 142070, 167041, 195830, 227751, 261615, 296189, 330377, 363132, 393285, 419441]
39883D19441K0537J3095L606q150k2108l7553n2948o6202p5278p8864p6724o9595
39871c0743n8739m5525l1318j7542n694K885P435Q066N759J959j863m604n654
39858a75578m905k794k83J296O52k975r412j7510k5415l1105l2975l0239k3085
39845c54328j2530p5J2695K4487L4567M2729M9008N3377N5626N5642N3685N0340
39833F5223M6120M1177L5381K8637K0978J2358K446r156k2342l6039m8326n7077
39821G9380o0820n9294n3434m4867l5336k6338j9028j4130j1755j1402j2287j3797
39809b83108j5639j7608j9289k0086j9600j8038j6296j5678j7331k1686k8222
39798d92581l5612m2094m5840m5317l9725k9413j6025k029J0150J8971K4104K6196
$$ y = [419441, 439978, 453073, 456679, 448529, 426421, 388868, 335920, 269718, 194440, 115576, 38852, -30743, -89482, -135007, -166325, -183867, -189561, -186676, -179241, -171175, -165416, -163457, -165320, -169924, -175578, -180483, -183277, -183560, -182264, -181612, -184587, -193999, -211509, -236924, -268029, -301004, -331243, -354328, -366858, -366933, -354238, -329751, -295184, -252455, -203447, -150070, -94444, -38802, 14883, 65223, 111343, 152520, 187901, 216538, 237516, 249874, 252320, 243164, 220822, 184783, 136457, 79380, 18560, -40734, -94168, -139035, -174371, -200709, -219737, -233867, -245622, -257024, -269311, -283108, -298747, -316355, -335644, -355730, -375330, -393368, -409664, -425342, -442673, -464359, -492581, -528193, -570287, -616127, -661444, -701169, -730582, -746607, -748636, -738486, -719515, -695411, -669215]
39786f69215K6207K4794K2016J7539J1119L065n606j3540j9641k3584k5806k6993
39774f79645k7425k6729k4166j9201j1942l229N532J2821J7537J9510J9537J8941
39762f98459J8822J9553K0782K1800K2025K1274J9757J7943J6342J5339J5026
39751d89796J5204J5550J5987J6861J8728K1840K5826K9918L3482L6448L9262
39740b20690M2459M6278N0447N4332N7090N7773N5408M9175L8732K4483P656r813
39728B53330k5586l7377m3504m3365l7620k7904j6181l998P855J9141K9627L8733
39716A13151M5621M9561N0247M7919M3309L7538L1837K7182K3929K1652J9393
39705E11339J6284J2204P925M529K546J578P14p18k693m750o607q609j1653j6670
$$ y = [-669215, -643008, -618214, -596198, -578659, -567540, -564475, -570081, -583621, -603262, -626846, -652652, -679645, -707070, -733799, -757965, -777166, -789108, -792337, -786805, -773984, -756447, -736937, -717400, -698459, -679637, -660084, -639302, -617502, -595477, -574203, -554446, -536503, -520161, -504822, -489796, -474592, -459042, -443055, -426194, -407466, -385626, -359800, -329882, -296400, -259952, -220690, -178231, -131953, -81506, -27174, 29916, 87689, 143097, 192272, 231004, 255487, 263143, 253330, 227744, 190367, 146863, 103498, 65878, 37974, 21793, 17795, 25650, 44791, 74418, 113151, 158772, 208333, 258580, 306499, 349808, 387346, 419183, 446365, 470294, 491946, 511339, 527623, 539827, 547752, 552281, 554827, 556405, 557119, 556401, 553708, 548958, 542351, 533742, 522089, 505419]
39691E05419k4016l3194m2995n1921n8756o3047o5174o5902o5679o4370o1607
39680i1242n7410n2383m7331m2658l8062l2659k5478j6100n138N781J4614J9813
39668c68253K0938J8714J4529R753N199R47l427q358j3833j9319k4159k8160l1808
39655d27237l5858m0575m5345m8940n0187m8390m3321l5085k4240j2004j40R697
39643h01625J6703K1121K3813K5573K6768K7387K7273K6293K4440K1924J9124
39632e41206J6316J3402R943N563L59m989r523j2389j3187j2071r682o841m112
39619e68417j432J928P013J4592K4617L5961M6667N4519N7742N5405M7531L4908
39607a88966J8964J654j4672k7675l5672l8250l6386l2034k7269k3470k0908j8881
$$ y = [505419, 481403, 448209, 405214, 353293, 294537, 231490, 166316, 100414, 34735, -29635, -91242, -148652, -201035, -248366, -291024, -329086, -361745, -387223, -403323, -408461, -402680, -388066, -368253, -347315, -328601, -314072, -304319, -299120, -298173, -301600, -309958, -323791, -343110, -367269, -395429, -427237, -463095, -503670, -549015, -597955, -648142, -696532, -739853, -774938, -799178, -811182, -811322, -801625, -784922, -763801, -739988, -714415, -687647, -660260, -632987, -606694, -582254, -560330, -541206, -524890, -511488, -501545, -495982, -495623, -500612, -510135, -522524, -535711, -547782, -557464, -564305, -568417, -569849, -567921, -560908, -546316, -521699, -485738, -439071, -384552, -326810, -271405, -223874, -188966, -170002, -168348, -183020, -210695, -246367, -284617, -321003, -353037, -380306, -403776, -424684, -443565]
39595d43565j6321j2465p176q31N943J2434J7895K1618K3132K2392J9841J6222
39583c40881J2171P769K316n329j5918k8925m2172n2346n6220n1868l9344k0518
39571f31265J604K3597M2281N5334O1763O1965N7163M8723L7786K5457J3122K451
39559b00019n012q424p997m869o34L278N999P153O436L247l173j3124k5754l8863
39545b81756m9419n4512n2358m2777k7123p729J2714L1540M6373N5445N7901N3943
39533b57758M4706L2023J8246N980k471n795m191O96O412J0583J1653R158L592
39520a27166l912j1859j8735k3380k5337k4936k3019k0488j7943j5481j2689q830
39508c33775l207M504J4095K4923L6075M6508N5246O1640O5436O6575O4872O0069
$$ y = [-443565, -459886, -472351, -479527, -480358, -474415, -461981, -444086, -422468, -399336, -376944, -357103, -340881, -328710, -320941, -318625, -323954, -339872, -368797, -410969, -463315, -519535, -571403, -610747, -631265, -629661, -606064, -563783, -508449, -446686, -384721, -327558, -278835, -241049, -215592, -202470, -200019, -205031, -213455, -221452, -226321, -226955, -223677, -217678, -210525, -204089, -200842, -204015, -217139, -242893, -281756, -331175, -385687, -438045, -480822, -507945, -515674, -502960, -471420, -425047, -369602, -311701, -257758, -213052, -181029, -162783, -156803, -159274, -165069, -169260, -168564, -162152, -151569, -139916, -130758, -127166, -131078, -142937, -161672, -185052, -210389, -235325, -258344, -278832, -296775, -312256, -324945, -333775, -336982, -332478, -318383, -293460, -257385, -210877, -155631, -93991, -28555, 38020, 102892, 162961]
39496A62961N2260M2292L1622K1677J3177N911r33q085j5568k2505k7569k9776
39484B25464k9127k6710k4242k3348k4963k9076l4907m1262m6979n1253n3749
39473a60152n4425n3195m9747m3764l5330k5032j3816k716P343J5845K3024K9878
39461c62087L7571M6544N6062O4396O9477O9603O4004N3130L8536K2364O710o813
39449A59497j7194k3944k6995k6674k3696j9045j3709q340l147K042P581J3815
39437B0191K0862K8486L6062M2712M7457M9269M7173M0530K9530J5389L6j4692
39425C63005k7544l7762m4594m7251m5430l9845l1978k3171j3883l825P210J8536
39413G3468K8406L4621L5463L0493K0784Q678k803j0711j3028r376j088R513K0234
$$ y = [162961, 215221, 257513, 289135, 310812, 323989, 329900, 328967, 320882, 305314, 282809, 255240, 225464, 196337, 169627, 145385, 122037, 97074, 67998, 33091, -8171, -55150, -106403, -160152, -214577, -267772, -317519, -361283, -396613, -421645, -435461, -438177, -430834, -414989, -391965, -362087, -324516, -277972, -221910, -157514, -88037, -18434, 45570, 98700, 137236, 159600, 166310, 159497, 142303, 118359, 91364, 64690, 40994, 21949, 8240, -100, -3247, -1205, 6376, 20191, 41053, 69539, 105601, 148313, 195770, 245039, 292212, 332742, 362272, 377661, 377697, 363005, 335461, 297699, 253105, 205854, 160424, 120579, 88601, 65430, 51547, 47722, 54932, 73468, 101874, 136495, 171958, 202451, 223235, 231913, 229110, 218399, 205371, 195995, 194907, 204420, 224654]
39400B24654K9812L7881M4347M8742N0084M7306L9982K8860J5824L210p227j5086
39388E48389k1278k7101l3109l8568m1902m1747l7819l1119k3488j6874j2754
39377B22630j1904j4393j9594k6243l2684l7357l9257l8036l3798k6897j7877
39366g5410p563L006J2780K0966K7162L1266L3290L3236L1293K8152K5127K3821
39354A87126K5471L0290L7244M4399M9759N2134N1587M9178M6231M3534M1037
39343F57990L8124L4321K9793K5363K2007K0241J9874K0187K0270J9323J6776
39332I24269J2405O411n56p568j3685j8216k0826k1523k0684j9090j7885j8267
39320G84785k1053k6250l2865l9075m2774m2425l7903l0838k4079k0516k1905
$$ y = [224654, 254466, 292347, 336694, 385436, 435520, 482826, 522808, 551668, 567492, 570702, 563475, 548389, 527111, 500010, 466901, 428333, 386431, 344684, 306865, 275746, 252258, 235384, 222630, 210726, 196333, 176739, 150496, 117812, 80455, 41198, 3162, -30636, -57533, -75410, -82973, -79967, -67187, -46221, -19059, 12207, 45497, 78733, 110026, 138178, 163305, 187126, 212597, 242887, 280131, 324530, 374289, 426423, 478010, 527188, 573419, 616953, 657990, 696114, 730435, 760228, 785591, 807598, 827839, 847713, 867900, 888170, 907493, 924269, 936674, 943085, 942529, 934961, 921276, 903060, 882234, 860711, 840027, 820937, 803052, 784785, 763732, 737482, 704617, 665542, 622768, 580343, 542440, 511602, 487523, 467007, 445102]
39309D45102k8437l9128n2587o7549q2953r7785j10897j21006j26779j27157j21759
39298e30935j11243r7198q1543o5803n0762l6699k3757j2180k128O656J5057K4325
39286i66210L5405M8192O1300P2614Q0251Q3278Q1769P6417O8182N8142M7439
39275b53221L7068K7610J9178J1737N501J026j097o50K057O413J1777J7598K3222
39262i1781K7667K9630K7932K2194J3271L084o128j2563j5165j3450p154L734
39250a8729J8567L5555N1789O3885O9001O5713N4386L7077J6897k925k0003l3261
39238C37952m2847m9713n5150o0416o6465p3696q1858q9991r6575r9912r8668
39227d77339r2291q1040o5719m7484k7753q107R999K5590L8376M8722N7419O5340
$$ y = [445102, 416665, 377537, 324950, 257401, 174448, 76663, -34234, -155240, -282019, -409176, -530935, -642178, -739376, -820919, -886722, -937484, -974183, -997940, -1010120, -1012248, -1005592, -990535, -966210, -930805, -882613, -821313, -748699, -668448, -585170, -503401, -426984, -358802, -300660, -253221, -216153, -188543, -169365, -157628, -152127, -151101, -152198, -152848, -150791, -144378, -132601, -115003, -91781, -64114, -34484, -6552, 15642, 28913, 31997, 25869, 13306, -1859, -15309, -22463, -18729, -162, 35393, 87182, 151067, 220068, 285781, 340167, 377244, 394141, 391216, 371213, 337952, 295105, 245392, 190242, 129826, 63361, -10335, -92193, -182184, -278759, -378671, -477339, -569630, -650670, -716389, -763873, -791626, -799733, -789734, -764144, -725768, -677046, -619627, -554287]
39215e54287P3078Q0571Q6883R0405Q9420Q2889P0926N4845L6785J9177M170o911
39203A27951j3863j7468j8929j9255j8987j8331j7487j6862j7140j9048k3014
39192g2433k8747l5062m0187m2503m1311l7087l1123k4864j9429j5347j2478r935
39180d10506o360n21P903J7865K7236L3701L5895L4101L0165K6658K5696K7963
39168a50204L2402L6752L8745L7277L2894K7415K3017K1333K2928K7205L2753
39157A82517L7970M1693M3464M3410M1879L9142L5249L0036K3288J4986N544m168
39145E35010j3152k0659k6426l0539l3169l4363l4036l2080k8555k3750j8080
39134B40201j1855n135K092R618J6838K2871K6814K7900K5692K0284J2563M181
$$ y = [-554287, -481209, -400638, -313755, -223350, -133930, -51041, 19885, 74730, 111515, 130692, 134862, 127951, 114088, 96620, 77691, 58436, 39449, 21118, 3631, -13231, -30371, -49419, -72433, -101180, -136242, -176429, -218932, -260243, -297330, -328453, -353317, -372746, -388093, -400571, -410506, -416866, -417387, -409484, -391619, -364383, -330682, -294787, -260686, -230521, -203863, -178167, -150204, -117802, -81050, -42305, -5028, 27866, 55281, 78298, 99631, 122559, 149764, 182517, 220487, 262180, 305644, 349054, 390933, 430075, 465324, 495360, 518648, 533634, 539178, 535010, 521858, 501199, 474773, 444234, 411065, 376702, 342666, 310586, 282031, 258281, 240201, 228346, 223211, 225303, 234921, 251759, 274630, 301444, 329344, 355036, 375320, 387883, 392064]
39122C92064k870o979p591n469k332l5K25j710n109q816j1841j3819j5066j6120
39108B94532j7045j7128j5193j0396k830O397J5576K3045K7710K9262K8064K4918
39096C86912K0763J6418J2362Q659N070J342k564o414r836j2479j4126j4648j4022
39083C77437j2474j0657r526r898j1910j4822j7211j7394j3963o412M392J6257
39071B73819K6428L2639L3858L0365K3338J4323M839l758j0150j3090j1675n960
39059C94976K606J1419J7652J9404J6376R695J142p685j5731k2361k7059k9353
39047C71081k8991k6181k1654j6501j1773q119n678m426m674p192j2673k0881
39035B02338l0233l8091m1644l8807k8800j2363Q361L0259N0016O4989P3862P6812
$$ y = [392064, 389194, 382215, 374624, 369155, 366823, 366788, 367013, 365303, 360194, 351378, 339537, 325718, 310652, 294532, 277487, 260359, 245166, 234770, 231940, 238337, 253913, 276958, 304668, 333930, 361994, 386912, 407675, 424093, 436455, 445114, 450184, 451526, 448962, 442548, 432712, 420233, 406107, 391459, 377437, 364963, 354306, 344780, 334882, 322972, 308150, 290939, 273545, 259582, 253170, 257562, 273819, 300247, 332886, 366744, 397109, 420447, 434770, 439609, 435851, 425701, 412611, 400936, 394976, 397582, 409001, 426653, 446057, 462433, 472128, 473270, 465585, 449854, 427493, 400434, 371081, 342090, 315909, 294255, 277754, 265981, 257862, 252184, 247758, 243084, 235892, 223219, 202338, 172105, 134014, 92370, 53563, 24763, 12400, 20761, 51020, 101036, 166025, 239887, 316699]
39023C16699P5128P0539O4558N8131N1507M4303L5719K4990J1915k861j8024l2050
39011G00554m3684n2132n7126n8863n7927n5149n1548m8334m6715m7451n0414
39000A31211n4464n7872n8876n6048m8390l5457j7537M202K7839N1017P1438Q7244
38988D4307R7321J01368R9719R3028Q2023O7460N0190L1141J1229q667k7573m4203
38976E97343n6978o4440o5907o1948n4220m4734l5138k6549j9873j6097j6014
38965A35445j9687k6128l3563m0037m3924m4219m0499l2824k1661p956O753K0362
38953a47938L0674L6106L6300L2273K5990J9617J4860J2567J2630J4132J5755
38942A02966J6287J5134J2591R666P552O812O899O222K922m206j5172k8910m3744
$$ y = [316699, 391827, 462366, 526924, 585055, 636562, 680865, 716584, 741574, 753489, 750628, 732604, 700554, 656870, 604738, 547612, 488749, 430822, 375673, 324125, 275791, 229076, 181625, 131211, 76747, 18875, -40001, -96049, -144439, -179896, -197433, -193231, -165392, -114375, -42937, 44307, 141628, 242996, 342715, 435743, 517766, 585226, 635416, 666557, 677786, 669119, 641546, 597343, 540365, 475925, 410018, 348070, 293850, 249116, 213978, 187429, 167556, 151459, 135445, 115758, 89630, 56067, 16030, -27894, -72113, -112612, -145436, -167097, -175053, -168300, -147938, -117264, -81158, -44858, -12585, 13405, 33022, 47882, 60449, 73079, 87211, 102966, 119253, 134387, 146978, 156644, 164196, 171008, 177907, 184129, 187051, 182845, 167673, 138763, 95019]
38929I5019n7960p0182p9564q5709q8449q7688q3468p6199o6716n6202m5968l7193
38917g40279l0513k5560k1020j5401q112Q1P729J3932J9091K4539L1367L9491
38905g04655M7682N4441N8923O1146O1479O0052N6628N0948M3042L3237K2069
38894a55008J0217j616j2949k3692l3917m3327n0894n5049n4313m8010l6642k1801
38882e27001n528J0446K5068L7663M7415N3233N4153M9859M0906K8482J4019j145
38870a72430j5883k9216m0144m7604n0619m8509m1121k8916j3027M899K3044L9748
38858d19778N3663O3814O9730P1640P0384O6960O1802N4420M3645K8506R338j1654
38846A62470l0827m4539n0729m9673m3511l5004k6528j9637j5094j2898j2273
$$ y = [95019, 37059, -33123, -112687, -198396, -286845, -374533, -458001, -534200, -600916, -657118, -703086, -740279, -770792, -796352, -817372, -832773, -840885, -840804, -833075, -819143, -800052, -775513, -744146, -704655, -656973, -602532, -543609, -482463, -420984, -360932, -304304, -253356, -210314, -177077, -155008, -144791, -146407, -159356, -183048, -216965, -260292, -311186, -366235, -420548, -468558, -505200, -527001, -532529, -522083, -497015, -459352, -411937, -358704, -304551, -254692, -213786, -185304, -171285, -172430, -188313, -217529, -257673, -305277, -355896, -404405, -445526, -474442, -487469, -482570, -459526, -419778, -366115, -302301, -232571, -160931, -90547, -23587, 38215, 92635, 136280, 164786, 174124, 162470, 131643, 87104, 36375, -13298, -56809, -91813, -118341, -137978, -153072, -165970, -178243]
38835a78243j1954j0806q483n473k588k26J940M693Q568J3225J7423J9765J9794
38822a32365J8608J8438K1474K8733L9607N2080O3405P0877P2612O8004N7724
38811C79197M3350K6880J0379m366j6153k4659l0314l3863l5804l6265l5238l2871
38799B10273k9483k5390k0759j5666j0090l899L053J0628J8138K4444K8353K9164
38787B18766K6865K1886J4622N228o073j8401l0025l8821m3007m1666l4896k3729
38775E0749r901M607J8105K9482L8279M4601M9065N2455N5175N6853N6549N3409
38763D99428M7239L8551K8222J7053N549o026j7404k8148l7591m4974m9663n1452
38751D00784n0731m8397m5258m1478l6506k9766k1396j2479m626O24K174m15o816
$$ y = [-178243, -190197, -201003, -209486, -214959, -217547, -217773, -215833, -211140, -202572, -189347, -171924, -152159, -132365, -113757, -95319, -73845, -45112, -5505, 46575, 109980, 180857, 253469, 321473, 379197, 422547, 449427, 459806, 455440, 439287, 414628, 384314, 350451, 314647, 278382, 243144, 210273, 180790, 155400, 134641, 118975, 108885, 104986, 108039, 118667, 136805, 161249, 189602, 218766, 245631, 267517, 282139, 287367, 281294, 262893, 232868, 194047, 151040, 109374, 74478, 50749, 40848, 45455, 63560, 93042, 131321, 175922, 224987, 277442, 332617, 389470, 446019, 499428, 546667, 585218, 613440, 630493, 636042, 630016, 612612, 584464, 546873, 501899, 452236, 400784, 350053, 301656, 256398, 214920, 178414, 148648, 127252, 114773, 110147, 110771, 112945, 112530, 105714]
38738A05714j5928k6173l5921m3884m9211n1516n0845m7661m2625l6272k8671
38727c22993j9401p889O055K1820L8028N2908O4802P2467P5202P2938O6277N6378
38715A76592M4720L2760K1758J2608N676O20l495p654j2210j6550j9349j9297
38703B16179j5741q981k59Q535J5378J8760J8237J4543R201L819m71l295m851
38690B71054n657o336p582j0081j4280k0088k6806l3396l8823m2242m2925m0307
38678a7469l4262k5572j6098q251l991l974p462j2896j8583k3010k4917k3425
38666b19910j8259r920M57J1430K1623L0018L6033L9491M0445L9110L5809L0890
38654C7217K4615J7166Q960R88n223q138o968j926O093J6040K6947L7834M7711
$$ y = [105714, 89786, 63613, 27692, -16192, -65403, -116919, -167764, -215425, -258050, -294322, -322993, -342394, -350283, -344228, -322408, -284380, -231472, -166670, -94203, -19001, 53937, 120214, 176592, 221312, 254072, 275830, 288438, 294114, 294734, 291239, 283585, 271375, 254825, 235476, 216179, 200438, 191457, 191198, 199733, 215111, 233871, 252108, 266651, 275852, 279671, 279200, 275905, 271054, 265397, 259061, 251479, 241398, 227118, 207030, 180224, 146828, 108005, 65763, 22838, -17469, -51731, -77303, -93401, -101652, -105643, -109617, -117079, -129975, -148558, -171568, -196485, -219910, -238169, -248089, -247632, -236202, -214579, -184561, -148528, -109037, -68592, -29482, 6327, 37217, 61832, 78998, 87958, 88946, 83723, 75585, 68617, 66691, 72784, 88824, 115771, 153605, 201316]
38641B01316N5790O1647O5052O5649O2993N6917M7929L7120K5623J4013K058j0882
38629F85225k5132m0084n4183o5478p2383p4132p0914o3716n4124m3901l4444
38618H6734k6302j9099j2011m580K786Q988J2983J4561J4509J4046J3851J3424
38606A19890J1351O333j737j1446k0505k6748k8856k6585k0637j2432l829L290
38594a1911P430P840M607j545r531j8133k5962l1574l3829l2435k8220k2921j8613
38581b14797j7037j8973k3793k9452l3109l2259k5708j3845J900J9933L9029N8239
38569b89872P6510R2559J05257J14061J19022J20332J17895J11325J00332Q5073
38559G52494O6244M4961K2613Q10j8729l4432m5252n0901n1718m8348m1579l2478
$$ y = [201316, 257106, 318753, 383805, 449454, 512447, 569364, 617293, 654413, 680036, 694049, 696107, 685225, 660093, 620009, 565826, 500348, 427965, 353833, 282919, 219203, 165079, 121178, 86734, 60432, 41333, 29322, 24742, 27528, 36516, 49499, 64060, 78569, 92615, 106466, 119890, 131241, 137574, 135837, 124391, 103886, 77138, 48282, 21697, 1060, -11372, -15201, -11911, -4481, 3359, 7966, 6421, -3110, -21243, -47205, -78779, -112608, -145043, -173263, -196184, -214797, -231834, -250807, -274600, -304052, -337161, -369420, -395128, -408973, -407073, -387140, -348111, -289872, -213362, -120803, -15546, 98515, 217537, 337869, 455764, 567089, 667421, 752494, 818738, 863699, 886312, 887122, 868393, 833961, 788709, 737808, 686090, 637742, 596163, 563685]
38547E63685k2456j2937m800J827P190J1358J4028J4697J2792P590j714j5581
38535E75679l3476n3468p2512q7353r5656r6854r2198q4028p4775o6190n9142
38524b39973n3783m9901m7232m5657m5104m5184m4830m2415l6362k5918j1616
38513f87975M908K1419L5666M5706N0143M8297M0360K7393J1025o942k4897m1545
38501d76442n5888o7245p5228p9558p9785p5204o5190m9752k9989q119J2896L0052
38489a019452M1174M5681M4894M1476L8240L6902L7562L9210M0834M2231M3957
38478e67291M6679N0634N5510O0488O4279O5276O2111N4351M2743K8824J4223
38467b2173J44j2762k4218l3898m0967m4048m1854l4270k3003j1307k837n06n834
$$ y = [563685, 541229, 528292, 523492, 525319, 532509, 543867, 557895, 572592, 585384, 592974, 591260, 575679, 542203, 488735, 416223, 328870, 233214, 136360, 44162, -39866, -114641, -180831, -239973, -293756, -343657, -390889, -436546, -481650, -526834, -571664, -614079, -650441, -676359, -687975, -683067, -661648, -625982, -580276, -530133, -481836, -441476, -414083, -403058, -410000, -434897, -476442, -532330, -599575, -674803, -754361, -834146, -909350, -974540, -1024292, -1054281, -1062400, -1049504, -1019452, -978278, -932597, -887703, -846227, -807987, -771085, -733523, -694313, -653479, -611248, -567291, -520612, -469978, -414468, -353980, -289701, -224425, -162314, -107963, -65220, -36396, -22173, -22029, -34791, -59009, -92907, -133874, -177922, -219776, -254046, -277049, -288356, -291193, -291699, -297533]
38454b97533j8850l8186o1172q4039j02487j12676j12329j01509q2602n9519l6424
38443a107326j6624j949P279J1908J3435J3586J4117J6774K3106L4050M9505O8186
38431h73953Q7787J05332J17693J22364J18301J06399Q9207P0030N1925L6932
38421C2017K5829J8299J3477J0466Q543P089N496L297M55k453m401m489k566M81
38407A11540L122M091L227J617R49K474O356J1655J6907K0813K2664K2476K0751
38394B48642J8057J4652J0459N438j20n759j1346j7329k4403l2872m2244n1319
38382A11856n8621o2902o3526o0563n4709m7018l8733l1038k4790k0183j6748
38371c66975j3762j0866q328o745o454p109p768p334n013n43N732J2998K0195
$$ y = [-297533, -316383, -354569, -415741, -499780, -602267, -714943, -827272, -928781, -1011383, -1070902, -1107326, -1123950, -1125899, -1118620, -1106712, -1093277, -1079691, -1065574, -1048800, -1025694, -991644, -942139, -873953, -786166, -680834, -563141, -440777, -322476, -216077, -126870, -56840, -4915, 32017, 57846, 76145, 89622, 100088, 108631, 115720, 121216, 124513, 124968, 122515, 118114, 113625, 111059, 111540, 114662, 118753, 121980, 123597, 124546, 127020, 133376, 145031, 161938, 182751, 205415, 227891, 248642, 266699, 281351, 291810, 297248, 297128, 291369, 280023, 262694, 238291, 205419, 163175, 111856, 53235, -9667, -73193, -133756, -188465, -235483, -274216, -305254, -330044, -350227, -366975, -380737, -391603, -399931, -406676, -413130, -420239, -428007, -435341, -440354, -440897, -435165, -422167, -401972]
38358d01972K6352L0883L3663L4946L5267L5355L5959L7445L9442M0893M0638
38347a1129L8261L4479L0862K8907K9176L0997L2926L3563L2230K9194K5475K2350
38335C57291K0739K0681K1234K1020J9067J5350J0617N614M45n484j2928k2114
38323D51532l2379m2353n0497n5680n7448n5939n1633m5186l7405k9191k1373
38312b7552j4587r329o072n186o704j0170j4706j9189k2425k3300k0968j5103
38300a95291n922N999K0042L5713N2437O9126Q3863R4090R7333R2187P8991N9878
38288D88446L8228J7746J466r123j4499j6767j8500k1275k4806k7388k7239k3840
38276C62449j8270j2534q486p072q106j0587j3306j5399j6569j6932j6741j6226
$$ y = [-401972, -375620, -344737, -311074, -276128, -240861, -205506, -169547, -132102, -92660, -51767, -11129, 27132, 61611, 92473, 121380, 150556, 181553, 214479, 248042, 280272, 309466, 334941, 357291, 378030, 398711, 419945, 440965, 460032, 475382, 485999, 491613, 492058, 486574, 473646, 451532, 419153, 376800, 326303, 270623, 213175, 157236, 105603, 60417, 23012, -6179, -27552, -42139, -51468, -57540, -62726, -69430, -79600, -94306, -113495, -135920, -159220, -180188, -195291, -201213, -195214, -175172, -139459, -87022, -17896, 65967, 160057, 257390, 349577, 428568, 488446, 526674, 544420, 545886, 536763, 522264, 505497, 486997, 465722, 440916, 413528, 386289, 362449, 344179, 331645, 323159, 316087, 307981, 297394, 284088, 268689, 252120, 235188, 218447, 202221]
38264B02221j5695j5616j6573j8984k2693k6758k9590k9517k5580j8069q542Q19
38252b4577Q100J2338J3470J1782P429N24q491j8639k8632l7185m3270m6345m6690
38239b00186m5469m4243m4065m4878m5785m5941m5306m4581m4518m5082m5161
38228f95215m2967l6898k6393j2335L154J7479K8558L5558L9064M0643M1949M3866
38216e63537M6165M7763M7376M4145L7960K9496K0061J1197M164m00k436k200
38204b80246j27L160O993J1087J5900K2380L1303M2677N5676O8999Q1334R1621
38192A50757R9074J03065J03048R8776R0706Q0133O8793N8004M8087L8432K8165
38181I67040J6824M551q163k0878l3331m5287n6313o5764p3010p7785q0369q1437
$$ y = [202221, 186526, 170910, 154337, 135353, 112660, 85902, 56312, 26795, 1215, -16854, -25396, -24577, -16477, -4139, 9331, 21113, 28542, 29066, 20575, 1936, -26696, -63881, -107151, -153496, -200186, -245655, -289898, -333963, -378841, -424626, -470567, -515873, -560454, -604972, -650054, -695215, -738182, -775080, -801473, -813808, -810654, -793175, -764617, -729059, -689995, -649352, -607403, -563537, -517372, -469609, -422233, -378088, -340128, -310632, -290571, -279374, -275210, -275610, -278046, -280246, -280373, -277213, -270220, -259133, -243233, -220853, -189550, -146873, -91197, -22198, 59136, 150757, 249831, 352896, 455944, 554720, 645426, 725559, 794352, 852356, 900443, 938875, 967040, 983864, 988415, 980252, 959374, 926043, 880756, 824443, 758679, 685669, 607884, 527515, 446078]
38169D46078q1698q1598q1362q1253q1734q3321q6178q9746r2645r2908q8575
38158d94940p8423o2514m2214j9754K346K1755L6717M6421N1217N2419N1644N0041
38146c85285M7950M5204M1819L8426L6147L5996L8327M2538M7122M9976M9092
38135H7312M3429L3597K1807J0985L589P37K085O324J1867J7288K1383K2970K0793
38122C04166J3684J074j6449l6723n6251p1168p8626p7944p0843o0624n0701m3296
38110b43701l8864l6392l4273l1263k7086k2362j7983j4439j1715r814r222j0781
38098e07895j4982k1339k8357l4015l6330l3865k6029j3177L546K2531M2071O0624
38086e87217P6963R0177R9595J04797J05770J03020R7445R0058Q1779P3444O5689
$$ y = [446078, 364380, 282782, 201420, 120167, 38433, -44888, -131066, -220812, -313457, -406365, -494940, -573363, -635877, -678091, -697845, -695499, -673744, -637027, -590606, -539389, -486970, -435326, -385285, -337335, -292131, -250312, -211886, -175739, -139743, -101416, -58878, -11756, 38220, 87312, 130741, 164338, 186145, 197130, 200719, 201456, 203541, 209865, 221732, 239020, 260403, 283373, 304166, 317850, 318924, 302475, 265752, 209501, 138333, 59707, -18237, -89080, -149704, -200405, -243701, -282565, -318957, -353230, -384493, -411579, -433941, -451924, -466363, -478078, -487892, -497114, -507895, -522877, -544216, -572573, -606588, -642918, -676783, -702812, -715989, -712443, -689912, -647841, -587217, -510254, -420077, -320482, -215685, -109915, -6895, 90550, 180608, 262387, 335831, 401520]
38075D01520N8758N2348M5821L8603L0456K1370J1415Q14r869j9655k7432l2464
38063E71685l4733l4954l4206l3448l3159l3320l3703l4298l5430l7458m0166
38052A86810m2517m3063m0790l5671k8481k0221j1752l960J935M433K232n127
38040c6172j6912l1219m5288n5980o0443n6795m4686k5426j656K3218M5600O2211
38028b43548P0695P0108O1136M5792K6839P123j0914k5577l5979m1938m3725m2021
38016a62009l7870l2611k7492k3190j9438j5178r176q96R008J8857K6673L1038
38004b42284L1623K9207K5231K1037J7254J3689R757N018n58o742j3291j9980
37992a30039k6431l1974l5798l7231l5928l1866k5262j6616o787L197J2526K0953
$$ y = [401520, 460278, 512626, 558447, 597050, 627506, 648876, 660291, 661105, 651236, 631581, 604149, 571685, 536952, 501998, 467792, 434344, 401185, 367865, 334162, 299864, 264434, 226976, 186810, 144293, 101230, 60440, 24769, -3712, -23933, -35685, -39645, -37710, -33277, -31045, -36172, -53084, -84303, -129591, -185571, -246014, -302809, -347495, -372921, -374577, -351359, -305759, -243548, -172853, -102745, -41609, 4183, 31022, 38145, 27231, 1654, -34325, -76263, -119988, -162009, -199879, -232490, -259982, -283172, -302610, -317788, -326964, -327860, -318852, -299995, -273322, -242284, -210661, -181454, -156223, -135186, -117932, -104243, -94486, -89468, -90026, -96768, -110059, -130039, -156470, -188444, -224242, -261473, -297401, -329267, -354529, -371145, -377932, -374735, -362209, -341256]
37980c41256K8848L6916M5749N5390O5057P3323P8741Q0635P9491P6748P4081
37969C53723P2694P2856P3827P4090P1797O5374N4147L8697K0708K350j4445k8427
37957H57391l9101m6525n0975n2705n1858m8523m2720l4397k3493j0206M685J9674
37945D81247L2682M1421M3963L9462K8654J3785k163j6418k7144l3644l6142l5391
37933E30312l2299k7769k2715j8056j4613j2941j3361j6048k1048k8061l6128
37922B87273m3461m7708m6708l9483k6981j2084J282R525J0698N032n401j7628
37910G4356k8718l6432l9576l8194l3448k7087k0704j5182j0680o996l973j634
37898a88268j0J187K753N781J1114J8734K7541L5737M1684M4747M5622M5904M7237
$$ y = [-341256, -312408, -275492, -229743, -174353, -109296, -35973, 42768, 123403, 202894, 279642, 353723, 426417, 499273, 573100, 647190, 718987, 784361, 838508, 877205, 897913, 900263, 885818, 857391, 818290, 771765, 720790, 668085, 616227, 567704, 524984, 490587, 467094, 456888, 461573, 481247, 513929, 555350, 599313, 638775, 667429, 681214, 679051, 662633, 635489, 601845, 565703, 530312, 498013, 470244, 447529, 429473, 414860, 401919, 388558, 372510, 351462, 323401, 287273, 243812, 196104, 149396, 109913, 82932, 70848, 72130, 81655, 92353, 97385, 91984, 74356, 45638, 9206, -30370, -68564, -102012, -129099, -149803, -164985, -175665, -182661, -186634, -188268, -188278, -187091, -184338, -178557, -167443, -148709, -121168, -85431, -43747, 1000, 46622, 92526, 139763]
37885A39763N0518N5585O1314O6014O7873O5450N8100M6237L1309J5469Q80j0963
37873F47549j9665k5751l0173l3747l6883l9567m1534m2403m1942m0254l7884
37862B57746l5572l3831l2660l1753l1063l1177l3127l7829m5533n5544o6307
37851a76650p5667q1385q1691p5819o4257m8668l1386j4619L85J3712K6434L9787
37839e69824N4299O9308Q2991R2882R6812R3799Q4368P0182N3314L5740J9116
37828A82987M680o872j5393k0990k3716k3423k0001j3802n923J857P711J0471
37816G7586J0029P203L305l21k585k895j251J863N787R936J3923J7591K0939K3906
37802A85016K6222K7400K7012K4918K1270J6310J0363M093j229l766j663O317
$$ y = [139763, 190281, 245866, 307180, 373194, 441067, 506517, 564617, 610854, 642163, 657632, 658512, 647549, 627884, 602133, 571960, 538213, 501330, 461763, 420229, 377826, 335884, 295630, 257746, 222174, 188343, 155683, 123930, 92867, 61690, 28563, -9266, -54799, -110343, -176650, -252317, -333702, -415393, -491212, -555469, -604137, -635523, -650142, -649757, -636045, -609611, -569824, -515525, -446217, -363226, -270344, -173532, -79733, 4635, 74817, 128131, 163871, 182987, 187667, 180795, 165402, 144412, 120696, 97273, 77272, 63470, 57547, 59404, 67115, 77586, 87615, 94818, 98123, 97802, 95217, 92322, 91071, 92934, 98721, 108657, 122580, 140171, 161110, 185016, 211238, 238638, 265650, 290568, 311838, 328148, 338511, 342604, 341375, 337609, 335946, 342263]
37790C42263K0290L9141O0552Q1317R7846J06979J06776R6933P8765N4791K8034
37779A113687J233k3728m5770o4213p8406q7869r2582r3002q9648q2641p1670
37768C85391n6421l7248j5488O755K7216M4009N5787O1751O1692N6011M5538L1271
37756F66264J4291l994k1773l7243m9296n7767o3140o5895o6183o3974n9415n3081
37744A38794m5868l8737l2568k8134k6111k6862l0113l4795l9253m1762m1148
37733b46557l7107l0224k1625j2494l667M484J1791J7952K2371K4413K3882K1369
37721b25412J8157J5785J5428J7446K1295K5750K9385L0998K9893K5917J9328
37710B3970J0659O41r678j8899k5366k7522k4444j6250m238R403K2227L2229L8457
$$ y = [342263, 362553, 401694, 462246, 543563, 641409, 748388, 855164, 952097, 1030862, 1085653, 1113687, 1114920, 1091192, 1045422, 981209, 902803, 814934, 722352, 629350, 539702, 457061, 385391, 328970, 291722, 276234, 282989, 310205, 354214, 410001, 471752, 533444, 589455, 634993, 666264, 680555, 676561, 654788, 617545, 568249, 510482, 447342, 381447, 315264, 251290, 191875, 138794, 92926, 54189, 21621, -6513, -32624, -59486, -89599, -124394, -163647, -205409, -246557, -283664, -313888, -335513, -348007, -351674, -347190, -335399, -317447, -295076, -270663, -246781, -225412, -207255, -191470, -176042, -158596, -137301, -111551, -82166, -51168, -21275, 4642, 23970, 34629, 35270, 25592, 6693, -18673, -46195, -70639, -86889, -91127, -81724, -59497, -27268, 11189]
37697A1189M1186M1625M1163M0549L9484L6893L1783K4045J4638N097l254r828
37685C14570j4798j8648k1682k3814k4680k3919k1235j6373r255m21Q743J6384
37673A64872K1113K2718K2069K0337J8273J6113J4023J2562J2705J5367K0804
37662C60956K8259L6036M1875M3544L9487K9340J4124m146k3181m1199n7374p1813
37650C95908q4975r6916j06762j12869j13568j07870r5841p8497n7549l5020j2847
37639e06806P527K5312M0265N2386O1690O8175P1937P3275P2573P0097O5866N9821
37627A62118N2139M3348L4187K5402J7689J1800Q446P936R605J1627J1518P239
37615D03054j877j4961l0203m5574n9320p0103p7179q0367p9946p6429p0481o2926
$$ y = [11189, 52375, 94000, 135163, 175712, 215196, 252089, 283872, 307917, 322555, 327652, 324398, 314570, 299772, 281124, 259442, 235628, 210948, 187029, 165794, 149421, 140166, 139745, 148488, 164872, 185985, 208703, 230772, 251109, 269382, 285495, 299518, 312080, 324785, 340152, 360956, 389215, 425251, 467126, 510670, 550157, 579497, 593621, 589475, 566294, 525095, 467721, 395908, 310933, 214017, 107255, -5614, -119182, -227052, -322893, -401390, -458939, -493959, -506806, -499279, -473967, -433702, -381316, -319626, -251451, -179514, -106239, -33666, 36431, 102297, 162118, 214257, 257605, 291792, 317194, 334883, 346683, 355129, 363065, 372670, 384297, 395815, 403054, 401177, 386216, 356013, 310439, 251119, 181016, 103837, 23470, -56476, -132905, -203386, -266312]
37603b66312n4724m6734l9488l3131k7588k2856j9115j6543j4919j3404j0825
37592e65639o287L88Q746J8110K7967L7938M7574N6215O3170O7959P0407P0384
37580a03068O7546O1376N1664L8887K4260R404l938j4069j9522j9443j3990m344
37568G4763P710K0365L2094M1657M7973N0164M7772M1068L1210K0017R437R11
37556D25141n058q874j1343j3019j3663j2366q180r50Q396J8237K6951L3445L7279
37543D75996L8578L7816L5472L1746K6564K0043J2904O479K151P36K180N655R847
37530G06167J3194J4188J1678N240m665j6847k9703m1555n0824n6214n6975n3138
37518D40546m5450l5100k3487j2016j953N870J1178J4069J4676J3001R099L373
$$ y = [-266312, -321036, -367770, -407258, -440389, -467977, -490833, -509948, -526491, -541410, -554814, -565639, -571926, -571538, -562792, -544682, -516715, -478777, -431203, -374988, -311818, -243859, -173452, -103068, -35522, 25854, 77518, 116405, 140665, 150069, 146131, 132062, 112540, 93097, 79107, 74763, 82473, 102838, 134932, 176589, 224562, 274726, 322498, 363566, 394776, 414793, 424230, 425141, 420083, 411209, 399866, 386847, 373184, 360818, 352638, 351688, 360084, 378321, 405272, 438717, 475996, 514574, 552390, 587862, 619608, 646172, 666215, 679119, 685598, 687749, 688485, 690665, 696320, 706167, 719361, 733549, 745227, 750467, 745802, 728955, 699252, 657697, 606873, 550659, 493684, 440546, 395096, 359996, 336509, 324493, 322540, 328410, 339588, 353657, 368333, 381334, 390433, 393806]
37506C93806l365j0133j6223k1391k5700k9082l1072l0974k8308k3142j6095q051
37494A50270J76Q015J5084K1012K5362K7790K8398K7805K6867K6248K6095K6109
37482D09231K5782K4728K2957K0941J9495J9412K1059K4107K7595L0343L1498
37471F77148L0730K8066K3566J7308R642J367o346j2296j5600j5869j3260q424
37459G16032k380L645Q483J1303J1797J0109O619J671m495j1612j9159k6222l1626
37446F74165l4324l3753k9981k3561j5223n717M178J3481K0898K4930K4328J8599
37434F38020Q329m830j8528l0236l7919m0577l8470l2923k5862j9199j4256j1344
37422C72205r874r007q303p847p900q593r973j2141j5149j8756k2401k5430k7348
$$ y = [393806, 390441, 380308, 364085, 342694, 316994, 287912, 256840, 225866, 197558, 174416, 158321, 150270, 150446, 158461, 173545, 194557, 219919, 247709, 276107, 303912, 330779, 357027, 383122, 409231, 435013, 459741, 482698, 503639, 523134, 542546, 563605, 587712, 615307, 645650, 677148, 707878, 735944, 759510, 776818, 786460, 787827, 781481, 769185, 753585, 737716, 724456, 716032, 713652, 717297, 725780, 737083, 748880, 758989, 765608, 767279, 762784, 751172, 732013, 705791, 674165, 639841, 606088, 576107, 552546, 537323, 531606, 535784, 549265, 570163, 595093, 619421, 638020, 646349, 641519, 622991, 592755, 554836, 514259, 475789, 442866, 417004, 397805, 383549, 372205, 362331, 353324, 345021, 337174, 329274, 320681, 310708, 298567, 283418, 264662, 242261, 216831, 189483]
37409A89483k7914k7271k6106k5561k6824l0591l6767m4570n2740n9748o4072
37398b32681o4477o0267n1398l8507k2837o055J0128K4298L5502M3093M6498M5249
37386b71454L9355K9836J8922R539M236M204Q953J6694K5149L2354L7272L9928
37374e012M1162M2201M4266M8346N4754O2628O9816P3649P2274O5681N5753M5433
37362F70951L7647L4404L6257M2239N0200N7528O1909O1779N6410M5766L0366
37351A185456J1261r984l1379n0813o6549p7769q4716q8366q9851q9997q9401
37340E17892q8685q8620q9686r1478r2498r0747q4831p4723o1685m7471l3451
37329c25983k0203p639M597J6752K8746M0213N0732O0048O8097P4717P9409Q1396
$$ y = [189483, 161569, 134298, 108192, 82631, 55807, 25216, -11551, -56121, -108861, -168609, -232681, -297158, -357425, -408823, -447330, -470167, -476222, -466094, -441796, -406294, -363201, -316703, -271454, -232099, -202263, -183341, -173802, -169566, -165362, -156409, -139715, -114566, -82212, -44940, -5012, 36150, 78351, 122617, 170963, 225717, 288345, 358161, 431810, 504084, 569765, 625518, 670951, 708598, 743002, 779259, 821498, 871698, 929226, 991135, 1052914, 1109324, 1155090, 1185456, 1196717, 1186733, 1155354, 1104541, 1037992, 960223, 875507, 787141, 697290, 607293, 517892, 429207, 340587, 250901, 159423, 66925, -23822, -108653, -183376, -245061, -292532, -325983, -346186, -353825, -349228, -332476, -303730, -263517, -212785, -152737, -84640, -9923, 69486, 150882]
37317A50882P9999P5088O7174N7130M5819L3989K2485J2358M633k24k703m048
37305E42582n617q261j2126j6836k1702k5807k8208k8398k6784k4632k3376k3772
37293B97063k5515k7423k7935k5594j9493r720K423J4776K5171L2412L6743L9506
37281C12414M2299M6187N1343N7159O2488O5883O5912O1526N2402L9174K3432
37270H80219P483o158j5493j9592j8608j3318m779N635J6086K4519K9364L0090
37258I15448K7099K1152J2874K639r250k2349l5873m8578n8841o5090o6371o2792
37246F10068n5443m5861l5266k4127j2336J03J2451K3204L0761L4193L3554K9516
37234F00817K2800J3895L393p487j6724k2035k1872j6174o441M957J5698K4214
$$ y = [150882, 230881, 305969, 373143, 430273, 476092, 510081, 532566, 544924, 549557, 549333, 546630, 542582, 536965, 528704, 516578, 499742, 478040, 452233, 424025, 395627, 368843, 344211, 320835, 297063, 271548, 244125, 216190, 190596, 171103, 161383, 163806, 178582, 203753, 236165, 272908, 312414, 354713, 400900, 452243, 509402, 571890, 637773, 703685, 765211, 817613, 856787, 880219, 887702, 881544, 866051, 846459, 827851, 814533, 809754, 815389, 831475, 855994, 885358, 915448, 942547, 963699, 976573, 979212, 969962, 947613, 911740, 863162, 804321, 739231, 672860, 610068, 554625, 508764, 473498, 449371, 437035, 437138, 449589, 472793, 503554, 537747, 571301, 600817, 623617, 637512, 640905, 633418, 616694, 594659, 572787, 556613, 550172, 555129, 570827, 595041]
37222E95041K9950L3243L5026L6507L8894M3154M9777N8616O8985Q0001R1006
37211A160200J01781J12443J23172J33989J44676J54820J63941J71687J78116
37202B444825J83749J89390J95603K02177K07755K09676K04036J86139J51798
37193D175148R9334L1436m4729j19597j84484k34083k66961k84434k89025k83448
37183B599157k70178k51337k28709k03866j78296j53398j30343j09918r2538p8340
37173I02234o7165n8452n1210m4254l6680k8233j9310j0648k925L455Q411J2108
37161F07331J4840J6824J7988J7891J6022J2266P184J787l063p134j0778j4431
37149F76727j8019k0709k1185j8354j2065l338O071J4478K0885K5072K7181K7282
$$ y = [595041, 624991, 658234, 693260, 729767, 768661, 811815, 861592, 920208, 989193, 1069194, 1160200, 1261981, 1374424, 1497596, 1631585, 1776261, 1931081, 2095022, 2266709, 2444825, 2628574, 2817964, 3013567, 3215744, 3423499, 3633175, 3837211, 4023350, 4175148, 4274482, 4305918, 4261189, 4141592, 3957108, 3723025, 3456064, 3171630, 2882605, 2599157, 2328979, 2077642, 1848933, 1645067, 1466771, 1313373, 1183030, 1073112, 980574, 902234, 835069, 776617, 725407, 681153, 644473, 616240, 596930, 586282, 583357, 586812, 595223, 607331, 622171, 638995, 656983, 674874, 690896, 703162, 710346, 712133, 709070, 701936, 691158, 676727, 658708, 637999, 616814, 598460, 586395, 583057, 589128, 603606, 624491, 649563, 676744, 704026]
37137G04026K5227K0874J4433O570j780r798j6989k3168k8275l2212l4843l6132
37125E87933l6259l5649l4803l4021l3164l1544k8056k1501j0997L599K1395M0393
37113C87326N7874P1271P9185Q1842Q0685P7333P2770O7127O0085N1378M1155
37102A128031L0094J9315J0067L233j034l253m164m245l653k401m53K416O583
37089A180536J2138J8302K3392K5622K4200J9909J4735J0853R681J1510J5627
37078A366505K0586K4382K4740J9677Q174r393l1252n4591p6078r2531j01538
37067A098681j01884r3707p8427n8437l6468j4851M954K2310L7031M9154N8895
37056H87251O6536P2117P5245P5322P2173O6387N9013N0840M1917L1760J9966
$$ y = [704026, 729253, 750127, 764560, 771130, 769350, 759552, 742563, 719395, 691120, 658908, 624065, 587933, 551674, 516025, 481222, 447201, 414037, 382493, 354437, 332936, 321939, 325538, 346933, 387326, 445200, 516471, 595656, 677498, 758183, 835516, 908286, 975413, 1035498, 1086876, 1128031, 1158125, 1177440, 1187507, 1190740, 1189706, 1186453, 1182289, 1178044, 1174391, 1171990, 1171537, 1173953, 1180536, 1192674, 1210976, 1234368, 1259990, 1284190, 1304099, 1318834, 1329687, 1339368, 1350878, 1366505, 1387091, 1411473, 1436213, 1455890, 1464064, 1454671, 1423419, 1368828, 1292750, 1200219, 1098681, 996797, 903090, 824663, 766226, 729758, 714907, 719861, 742171, 779202, 828356, 887251, 953787, 1025904, 1101149, 1176471, 1248644, 1315031, 1374044, 1424884, 1466801, 1498561, 1518527]
37045A518527O818o470j7969k5625k8118k5415j8584r069J886J3251K3914L2663
37033A465809L8607M1685M2833M3665M5792N0104N6388O3472O9698P3385P3089
37022B064527O7825N7258M1847K2828K077j8040l4938m6339n0808m8130l9231
37011B018876k5797r811O854K2733L7010M9551O0601P0325P8564Q5057Q9784R3034
36999B576781R5065R5725R4414R0345Q2929P2070N8405M3364K8972J7330R931
36988C265331P088P870J0592J3820J7109K1017K6299L3025M0323M6796N1067N1910
36976C592247M8130L8756K3670M229j6802l6082n0745n9010o0117n3992m1054
36965C389230k2208J155K7431N5159Q3143J10280J35465J57886J77492J95044
$$ y = [1518527, 1525345, 1518875, 1500906, 1475281, 1447163, 1421748, 1403164, 1394095, 1395981, 1409232, 1433146, 1465809, 1504416, 1546101, 1588934, 1632599, 1678391, 1728495, 1784883, 1848355, 1918053, 1991438, 2064527, 2132352, 2189610, 2231457, 2254285, 2256362, 2238322, 2203384, 2157045, 2106237, 2058107, 2018876, 1993079, 1983268, 1990122, 2012855, 2049865, 2099416, 2160017, 2230342, 2308906, 2393963, 2483747, 2576781, 2671846, 2767571, 2861985, 2952330, 3035259, 3107329, 3165734, 3209098, 3238070, 3255400, 3265331, 3272419, 3280289, 3290881, 3304701, 3321810, 3342827, 3369126, 3402151, 3442474, 3489270, 3540337, 3592247, 3640377, 3679133, 3702803, 3707032, 3690230, 3654148, 3603403, 3544393, 3484276, 3430284, 3389230, 3367022, 3368177, 3395608, 3450767, 3533910, 3644190, 3779655, 3937541, 4115033, 4310077]
36955D310077K11420K26775K40299K50944K58395K63400K67050K69477K68934
36946F566771K61977K44810K15119J73470J23429P0464K0240k2774n5902p8114
36936G519490q9523r0983q3914p0310n2649l3581j5493j05J1666J9615K4031K5453
36924G163697K4619K2491K0194J8718J8549J9590K1479K4002K7195L1207L6209
36913G427950M2685N1752O4985Q3661J07791J35757J64707J91472K13371K28656
36903H712787K36733K38126K34389K27875K21481K18228K20640K30118K46617
36894A0786994K68800K94480L21103L46243L68021L85353L97951M06228M11356
36885A3986529M15347M20774M30007M44245M62928M83900N04275N21676N35210
$$ y = [4310077, 4521497, 4748272, 4988571, 5239515, 5497910, 5761310, 6028360, 6297837, 6566771, 6828748, 7073558, 7288677, 7462147, 7585576, 7656040, 7676280, 7653506, 7597604, 7519490, 7429967, 7338984, 7255070, 7184760, 7132111, 7098530, 7083037, 7082932, 7094598, 7114213, 7138244, 7163697, 7188316, 7210807, 7231001, 7249719, 7268268, 7287858, 7309337, 7333339, 7360534, 7391741, 7427950, 7470635, 7522387, 7587372, 7671033, 7778824, 7914581, 8079288, 8270760, 8484131, 8712787, 8949520, 9187646, 9422035, 9649910, 9871391, 10089619, 10310259, 10540377, 10786994, 11055794, 11350274, 11671377, 12017620, 12385641, 12770994, 13168945, 13575173, 13986529, 14401876, 14822650, 15252657, 15696902, 16159830, 16643730, 17148005, 17669681, 18204891]
36876A8204891N45853N56120N69278N88435O15713O51769O95864P46556Q02593
36867B3977072Q63459R29171R99700J074570J153127J235214J321698J414413
36859C2968424J515607J627331J751224J888793K041859K212624K403380K616112
36851D9025354K852679L115489L408341L736930M108772M532654N017662N572375
36843H1370256O204682O922476P734676Q651885R686393J0851625J2161179J3627270
36835A57210442J5258597J7057741J9018398K1122626K3338201K5615468K7881364
36828C06502837L0027223L1888578L3220320L3678712L2830722L0215463K5471206
36821E23835061J8506179R644194l46182j0392562j9393602k6508908l1334621
$$ y = [18204891, 18750744, 19306864, 19876142, 20464577, 21080290, 21732059, 22427923, 23174479, 23977072, 24840531, 25769702, 26769402, 27843972, 28997099, 30232313, 31554011, 32968424, 34484031, 36111362, 37862586, 39751379, 41793238, 44005862, 46409242, 49025354, 51878033, 54993522, 58401863, 62138793, 66247565, 70780219, 75797881, 81370256, 87574938, 94497414, 102232090, 110883975, 120570368, 131421993, 143583172, 157210442, 172469039, 189526780, 208545178, 229667804, 253006005, 278621473, 306502837, 336530060, 368418638, 401638958, 435317670, 468148392, 498363855, 523835061, 542341240, 551985434, 551639252, 541246690, 521853088, 495344180, 464009559]
36814D64009559l3906496l4569060l3802095l2081855k9805843k7270606k4679384
36807B47894220k2161301j9791624j7608612j5625932j3841554j2244066j0817000
36800A35804131r541801q399968p374410o449852n612628m850395m152204l508813
36792H5914060k913115k360524j849182j379782r55424n81822k67979k6815J25184
36783G5704601J69901R1494j18258m54587q96541j407540j940046k443330k872343
36774F5833351l195291l397716l482074l463560l364138l207126l013613k800777
36766C9909056k581500k364693k156096j959302j776744j610298j461380j330637
36758B4668406j217517j120096j035544r61055q94690q35564p83359p37743o98027
$$ y = [464009559, 430103063, 395534003, 361731908, 329650053, 299844210, 272573604, 247894220, 225732919, 205941295, 188332683, 172706751, 158865197, 146621131, 135804131, 126262330, 117862362, 110487952, 104038100, 98425472, 93575077, 89422873, 85914060, 83000945, 80640421, 78791239, 77411457, 76456033, 75874211, 75606232, 75579417, 75704601, 75874502, 75965996, 75847738, 75393151, 74496610, 73089070, 71149024, 68705694, 65833351, 62638060, 59240344, 55758270, 52294710, 48930572, 45723446, 42709833, 39909056, 37327556, 34962863, 32806767, 30847465, 29070721, 27460423, 25999043, 24668406, 23450889, 22330793, 21295249, 20334194, 19439504, 18603940, 17820581, 17082838, 16384811]
36749A6384811o63203o32159o03833n77256n51437n25310m97995m69210m39483
36740A1424925m09954l81909l56280l33405l12997k94316k76402k58341k39467
36731H561854k19501j98675j77678j57526j39291j23676j10619r9257q8394p7223
36721G170014o5730n4356m3375l2486k1056q654M438J7162K7966L5266L8002L6116
36709G103307L0775K4221J9087J7598K0973K9201M1127N4600O6725P4256P4145
36698G556015O4306M4554J7251j2884m0077n9357o8054o6171n5768l9772k0919
36687G319124j318J7299L3073M3923M8261M5931L8553K8724J8586Q701k080j5744
36675G583033l3851n6531q2164j07820j30124j46125j53874j52770j43745j29085
$$ y = [16384811, 15721608, 15089449, 14485616, 13908360, 13356923, 12831613, 12333618, 11864408, 11424925, 11014971, 10633062, 10276782, 9943377, 9630380, 9336064, 9059662, 8801321, 8561854, 8342353, 8143678, 7966000, 7808474, 7669183, 7545507, 7434888, 7335631, 7247237, 7170014, 7104284, 7049928, 7006553, 6974067, 6953011, 6944357, 6948795, 6965957, 6993923, 7029189, 7067191, 7103307, 7134082, 7158303, 7177390, 7194988, 7215961, 7245162, 7286289, 7340889, 7407614, 7481870, 7556015, 7620321, 7664875, 7682126, 7669242, 7629165, 7569808, 7501754, 7435583, 7379815, 7340043, 7319124, 7317806, 7335105, 7368178, 7412101, 7460362, 7506293, 7544846, 7573570, 7592156, 7600857, 7598777, 7583033, 7549182, 7492651, 7410487, 7302667, 7172543, 7026418, 6872544, 6719774, 6576029, 6446944]
36665F446944j11636r3654p5944n7973l8801j8148L071K2932L9046M9075N1053
36654F215965M3668K6603P29l2065o9365j08567j46841j81063k08159k25953k33887
36643E081065k33212k26496k16752k06537j97291j89145j81248j72412j61805
36634C296167j49381j35911j22581j10314r9094q7762p4521n7959l8030j6256
36624B404358M939K3273L7312M6530N0950N0773M6287L7989K6741J3654l11j4759
36612B727736k9817m5749o2459p9338r5353j09105j18905j23075j20565j11638
36602A831732r8139q3129o9928o0949n6891n6629n7845n8098n5729n0279m2273
36591A141843l2629k2033j0627J901J5866L1042M6227N9293O7773O9865O5200
$$ y = [6446944, 6335308, 6241654, 6165710, 6107737, 6068936, 6050788, 6053859, 6076791, 6115837, 6164912, 6215965, 6259633, 6286236, 6286965, 6254900, 6185535, 6076968, 5930127, 5749064, 5540905, 5314952, 5081065, 4847853, 4621357, 4404605, 4198068, 4000777, 3811632, 3630384, 3457972, 3296167, 3146786, 3010875, 2888294, 2777980, 2678886, 2591124, 2516603, 2458644, 2420614, 2404358, 2409297, 2432570, 2469882, 2516412, 2567362, 2618135, 2664422, 2702411, 2729152, 2742806, 2742495, 2727736, 2697919, 2652170, 2589711, 2510373, 2415020, 2305915, 2187010, 2063935, 1943370, 1831732, 1733593, 1650464, 1580536, 1519587, 1462696, 1406067, 1348222, 1290124, 1234395, 1184116, 1141843, 1109214, 1087181, 1076554, 1078455, 1094321, 1125363, 1171590, 1230883, 1298656, 1368521, 1433721]
36580A433721N5049M1620K7034J2401k295j7621l3739m9748o3639p2843p5114
36569A254826o9382n6279l8008j7661J742J7891K9477L6255L8958L8959L7592
36558A274370L5519L2562K8192K2101J4475N802l402j2690k1533k9182l4728l7353
36546A274133l6506l1971k3787j2372J242J5260K7426L5654L8645L6067K8492
36535A352283J7199M051q826j9595k7186l1458l2965l2686l1765l1215l1393l1697
36523A094747l0789k7447k1327j3161m257M164J1400J7391K2575K7662L3268L9632
36511A153858M6582N3707O0578O6734P1514P4026P3469O9527O2565N3389M2872
36500A828821L1706K0270Q673l178j5308k7502l9274n0018n9160o6185p0699p2551
$$ y = [1433721, 1488770, 1530390, 1557424, 1569825, 1567530, 1549909, 1516170, 1466422, 1402783, 1329940, 1254826, 1185444, 1129165, 1091157, 1073496, 1075238, 1093129, 1122606, 1158861, 1197819, 1236778, 1274370, 1309889, 1342451, 1370643, 1392744, 1407219, 1413021, 1409619, 1396929, 1375396, 1346214, 1311486, 1274133, 1237627, 1205656, 1181869, 1169497, 1170739, 1185999, 1213425, 1249079, 1287724, 1323791, 1352283, 1369482, 1373533, 1364707, 1345112, 1317926, 1286468, 1253503, 1220817, 1189052, 1157837, 1126444, 1094747, 1063958, 1036511, 1015184, 1002023, 997766, 1001930, 1013330, 1030721, 1053296, 1080958, 1114226, 1153858, 1200440, 1254147, 1314725, 1381459, 1452973, 1526999, 1600468, 1669995, 1732560, 1785949, 1828821, 1860527, 1880797, 1889470, 1886292, 1870984, 1843482, 1804208, 1754190, 1695030, 1628845, 1558146, 1485595]
36488A485595p1874o8945o3924n6801m7552l6377k3690r934M605J9813L5450N0847
36476A217213O4814P6003Q3461Q7002Q7182Q4884Q0886P5525O8592N9480M7543
36465B032585L2536J4918m247k3659m2156n8854p3159q4833r4059j01223j06387
36454A491462j08894j07619j01767r1610p8614o4929n2623m3051l6560l2668l0531
36443G42596k9442k8975k8796k8401k7063k4012j8734j1157j680Q873J9406K8753
36431F01368L5928M0283M1435L9090L3019K3328J0807l059j6559k8326l7632m4288
36419F95394m8291m9490m7301m0728k8922j2057Q128K8649M6323N8838O5120O5077
36407G40740N9159M8082L2946J5401k328j7758k8734l4069l3871k9531k3239j7281
$$ y = [1485595, 1413721, 1344776, 1280852, 1224051, 1176499, 1140122, 1116432, 1106498, 1111103, 1130916, 1166366, 1217213, 1282027, 1358030, 1441491, 1528493, 1615675, 1700559, 1781445, 1856970, 1925562, 1985042, 2032585, 2065121, 2080039, 2075792, 2052133, 2009977, 1951123, 1877964, 1793131, 1699072, 1597849, 1491462, 1382568, 1274949, 1173182, 1081572, 1002958, 938029, 885406, 842355, 805795, 773127, 742596, 713154, 684179, 655383, 626982, 599919, 575907, 557173, 546016, 544336, 553209, 572615, 601368, 637296, 677579, 719014, 758104, 791123, 814451, 825258, 822199, 805640, 777314, 739682, 695394, 647103, 597613, 550312, 509584, 480662, 468605, 476733, 505382, 551705, 610543, 675663, 740740, 799899, 847981, 880927, 896328, 894000, 876242, 847508, 813439, 779568, 750037, 726798, 709517]
36395G09517j3276j1684j1885j2769j3577j4338j5590j7732k0515k3207k5204
36384E29740k6473k7479k8653k9912l0538k9539k6198k0433j2795m214M270J1699
36372C09475J7440K1469K4482K7646L2099L8526M6938N6655O6407P4535P9379
36361G95051P9703P5147O6428N5186M3447L2808K3843J6032Q385L65p531j3882
36349A174982j7083j6002j0275l13J2683K6781L9671M9339N4622N5408N2384M6571
36337A468768L8964L0388K1620J3518O971K684R23J477L696O516Q665R043P161
36324A620394L184k403r248j7281k6479l6491m6289n4020n7152n3234m1047k1513
36312A258421K374K6690M7896O3549P2238P3263O6606N3081L4409J3063q109k6340
$$ y = [709517, 696241, 684557, 672672, 659903, 646326, 631988, 616398, 598666, 578151, 554944, 529740, 503267, 475788, 447135, 417223, 386685, 357146, 330948, 310515, 297720, 293506, 297776, 309475, 326915, 348384, 372866, 400512, 432611, 471137, 518075, 574730, 641137, 715672, 795051, 874754, 949901, 1016329, 1071515, 1114962, 1147770, 1171613, 1187645, 1196030, 1196395, 1188864, 1174982, 1157899, 1141897, 1131622, 1131309, 1143992, 1170773, 1210444, 1259783, 1314405, 1369813, 1422197, 1468768, 1507732, 1538120, 1559740, 1573258, 1580229, 1582913, 1583836, 1585313, 1589009, 1595525, 1604190, 1613233, 1620394, 1623578, 1621175, 1611927, 1594646, 1568167, 1531676, 1485387, 1431367, 1374215, 1320981, 1279934, 1258421, 1260795, 1287485, 1335381, 1398930, 1471168, 1544431, 1611037, 1664118, 1698527, 1711590, 1703481, 1677141]
36300A677141l9442m6185m6439m1093l1773k0477r090R26Q583J3172J4217J1612
36288A491152N898j628r148j4878j7799j8051j6818j5662j5825j7827k1426k5774
36276A322214k9668l1903l1604k8406k2493j4566n763K593R430J4205J6820J7225
36264A218084J5233J0680L755m868j4120k2700k9131l1999l0370k4233j4657l483
36252A072191P312J6337K3125K7864L0702L1288K8931K3219J4448L648p635j7538
36240A253892k4112k5811k2038j3487j942J0357K1453L0135L5960L8929L9169
36229A342505L6855L2405K6786K1532J8388J8649K2629K9554L7908M6057N2930
36218A686198N8347O2898O7331P1885P5954P8241P7305P2244O3181N1461L9356
$$ y = [1677141, 1637699, 1591514, 1545075, 1503982, 1472209, 1451732, 1442642, 1443568, 1452151, 1465323, 1479540, 1491152, 1497050, 1495422, 1486274, 1471396, 1453597, 1435546, 1418728, 1403066, 1387241, 1369414, 1347988, 1322214, 1292546, 1260643, 1229039, 1200633, 1178140, 1163574, 1157811, 1160404, 1169834, 1184039, 1200859, 1218084, 1233317, 1243997, 1247752, 1242884, 1228764, 1206064, 1176933, 1144934, 1114564, 1090331, 1075674, 1072191, 1079503, 1095840, 1118965, 1146829, 1177531, 1208819, 1237750, 1260969, 1275417, 1279065, 1271430, 1253892, 1229780, 1203969, 1181931, 1168444, 1166502, 1176859, 1198312, 1228447, 1264407, 1303336, 1342505, 1379360, 1411765, 1438551, 1460083, 1478471, 1497120, 1519749, 1549303, 1587211, 1633268, 1686198, 1744545, 1807443, 1874774, 1946659, 2022613, 2100854, 2178159, 2250403, 2313584, 2365045, 2404401]
36207B404401K9445K3878K3920K9960M1965N9892Q3583J12324J44744J79374K15402
36196C348888K52877K92183L33499L76725M21972M70126N22987N82707O50890
36187G252854P27986Q13407R06026J004491J107134J211593J314128J408531J484946
36178A7231096J529063J522325J444065J276664J013119O63244K54079j76465
36170B4757190n88810r48895j232012j424707j525688j544666j498648j407068
36162A4586696j288024j156483j023910q98399p85020o86102o01760n30645m71028
36153G145325m21652l82007l51924l30810l16986l07500k98779k87641k72167
36144D175859k51930k27927k02235j77464j55929j38951j26607j17903j11078
$$ y = [2404401, 2433846, 2457724, 2481644, 2511604, 2553569, 2613461, 2697044, 2809368, 2954112, 3133486, 3348888, 3601765, 3893948, 4227447, 4604172, 5026144, 5496270, 6019257, 6601964, 7252854, 7980840, 8794247, 9700273, 10704764, 11811898, 13023491, 14337619, 15746150, 17231096, 18760159, 20282484, 21726549, 23003213, 24016332, 24679576, 24933655, 24757190, 24168380, 23219485, 21987473, 20562766, 19037078, 17492412, 15993764, 14586696, 13298672, 12142189, 11118279, 10219880, 9434860, 8748758, 8146998, 7616353, 7145325, 6723673, 6341666, 5989742, 5658932, 5341946, 5034446, 4735667, 4448026, 4175859, 3923929, 3696002, 3493767, 3316303, 3160374, 3021423, 2894816, 2776913, 2665835]
36135B665835j04133r5521q4699p2118n8776m5680l3570k2842j3694o428j650
36124B126724q6k226q087j7292k9165m2718n6650o9569q0384q8483r3655r5955
36112A542454r5631r3198q9391q4884p9974p4571o8584o2320n6470n1643m7889
36101G37899m4583m0673l5034k6723j5152k45J7311L5875N2987O6032P3231P4361
36089H95286P0704O4194N6330M7571L7503K5484J1180n285k3356m2047n9906p5212
36077A002446q6355r2344r3102q9574q3331p5852o7845n9139m9291l8369k7294
36066B39950j7491j0205n971m530n063o489p615p210m161K264J2141K4769L8807
36053B49196N2612O4655P3889P9943Q3143Q4294Q4286Q3671Q2466Q0306P6710
$$ y = [2665835, 2561702, 2466181, 2381482, 2309364, 2250588, 2204908, 2171338, 2148496, 2134802, 2128374, 2126724, 2126638, 2124412, 2116325, 2099033, 2069868, 2027150, 1970500, 1900931, 1820547, 1732064, 1638409, 1542454, 1446823, 1353625, 1264234, 1179350, 1099376, 1024805, 956221, 893901, 837431, 785788, 737899, 693316, 652643, 617609, 590886, 575734, 575489, 592800, 628675, 681662, 747694, 820925, 895286, 965990, 1030184, 1086514, 1134085, 1171588, 1197072, 1208252, 1202967, 1179611, 1137564, 1077658, 1002446, 916091, 823747, 730645, 641071, 557740, 481888, 414043, 354904, 305613, 267244, 239950, 222459, 212254, 206283, 201753, 196690, 190201, 182586, 175376, 171215, 173479, 185620, 210389, 249196, 301808, 366463, 440352, 520295, 603438, 687732, 772018, 855689, 938155, 1018461, 1095171]
36042A095171P1335O4059N5057M4788L3814K2422J0343l140j8641l6030n4168
36031A285010p1309q5944r7374j05524j10210j10615j05589r4513p7962n7545
36021C68425l5119j1914J1769L6185O1442Q6933J11277J32725J49907J62455J71180
36010A245265J77654J83559J90252J98689K09559K23350K40330K60465K83358
36001C212481L08257L34178L60070L84965M07997M28416M45554M58720M66923
35992F807561M68587M61403M42515M08988L58513K90230K05600J09031P845q8858
35982I471415j72338k36525k79352l02438l09534l04638k90890k70461k45051
35973G060188k16233j85343j53045j19105q2762m3483j704M0990Q2325J20143
$$ y = [1095171, 1166506, 1230565, 1285622, 1330410, 1364224, 1386646, 1396989, 1393849, 1375208, 1339178, 1285010, 1213701, 1127757, 1030383, 924859, 814649, 704034, 598445, 503932, 425970, 368425, 333306, 321392, 333161, 369346, 430788, 517721, 628998, 761723, 911630, 1074085, 1245265, 1422919, 1606478, 1796730, 1995419, 2204978, 2428328, 2668658, 2929123, 3212481, 3520738, 3854916, 4214986, 4599951, 5007948, 5436364, 5881918, 6340638, 6807561, 7276148, 7737551, 8180066, 8589054, 8947567, 9237797, 9443397, 9552428, 9560273, 9471415, 9299077, 9062552, 8783200, 8480762, 8171228, 7866590, 7575700, 7305239, 7060188, 6843955, 6658612, 6505567, 6386462, 6303700, 6260217, 6258513, 6299503, 6381828, 6501971]
35963F501971J52964J80029K00812K14500K19551K13571J93543J56647J01620
35954H135208L0189n2292j37632k16889k82857l31629l62667l77842l80292l73610
35944E649687l61172l45528l28042l09046k88416k66177k42825k19301j96662
35935C092518j75629j56286j38123j20483j03014q5967p0131n6522m6056l9331
35925B100976l6636l7964m2917n0581n9573o8336p5611q0750q3714q4868q4737
35914A395289q3922q3058q2772q3542q5570q8634r1989r4401r4519r1498q5491
35903D29893p7518o8826o0158n1534m2660l3569k5039j8450j5319j6672k2462
35892b314l1324m0872m8667n3310n4915n4650n3824n3199n2844n2302n0824m7539
$$ y = [6501971, 6654935, 6834964, 7035776, 7250276, 7469827, 7683398, 7876941, 8033588, 8135208, 8165397, 8113105, 7975473, 7758584, 7475727, 7144098, 6781431, 6403589, 6023297, 5649687, 5288515, 4942987, 4614945, 4305899, 4017483, 3751306, 3508481, 3289180, 3092518, 2916889, 2760603, 2622480, 2501997, 2398983, 2313016, 2242885, 2186363, 2140307, 2100976, 2064340, 2026376, 1983459, 1932878, 1873305, 1804969, 1729358, 1648608, 1564894, 1480026, 1395289, 1311367, 1228309, 1145537, 1061995, 976425, 887791, 795802, 701401, 606882, 515384, 429893, 352375, 283549, 223391, 171857, 129197, 95628, 70589, 52139, 36820, 20148, -2314, -33638, -74510, -123177, -176487, -231402, -286052, -339876, -393075, -445919, -498221, -549045, -596584]
35880e96584m1575l2280j9550m110J2632K9205M4755N9194P2652Q4821R4785J01448
35868a94607J04168J03080R9004R3092Q6401P9613P2917O6118N8976N1481M4000
35857F64243L7130L1407K7010K3602K0499J7113J3360R614O199L065R1k308l065
35844H47960j095L933J1352J9762K7393L2389L3177K8977K0123P875o173k0742
35832A004931l5196m9478o3688p7559r0022r9232j03136j00348r0740p5523n6803
35821A63206l6932j7851n98J4641K7962L8969M6551M9386M6755L9040K7597J4243
35809D12969P32j1532k1669k9410l5221m0167m5461n1845n9133o6300p1949p4826
35797i3812p4061o9144n9767m5882k7937p085J4982L6480N5844P1800Q3287Q9625
$$ y = [-596584, -638159, -670439, -689989, -694099, -681467, -652262, -607507, -548313, -475661, -390840, -296055, -194607, -90439, 12641, 111645, 204737, 291138, 370751, 443668, 509786, 568762, 620243, 664243, 701373, 732780, 759790, 783392, 803891, 821004, 834364, 843978, 850177, 853242, 853333, 851025, 847960, 846865, 850798, 862150, 881912, 909305, 941694, 974871, 1003848, 1023971, 1031846, 1025673, 1004931, 969735, 920257, 856569, 779010, 688988, 589756, 486620, 386272, 295532, 220009, 163206, 126274, 108423, 107825, 122466, 150428, 189397, 235948, 285334, 332089, 371129, 398726, 412969, 413701, 402169, 380500, 351090, 315869, 275702, 230241, 178396, 119263, 52963, -18986, -93812, -167873, -237017, -296784, -342666, -370603, -377688, -362706, -326226, -270382, -198582, -115295, -25670]
35785b5670R0808Q7633Q1413P3523O4999N6296M7234L7266K6070J4114K724o488
35773E49922j2511j5463j6566j7593k0204k5292l2561m0466m6736m9410m7914
35762B25206m3495l8697l6076l6961m0908m6045n0017n1011m8447m3107l6635
35751b46193l0661k5923k1902j7162j0150k6J2980K7781M2994N7547P0995Q3459
35739e6261R5189J05997J14955J20553J21193J15658J03406Q4776O1237L5402
35729I02105J0524j0477k5959l6017m2251m6973n2130n8418o5047p0267p2356
35718D32734p0519o5339n8581n2357m8201m6582m7090m8916n1127n2680n2589
35707a61247n0212m5502l8717l0010j9238o245Q637K4417L9745N3532O5393P5609
$$ y = [-25670, 65138, 152771, 234184, 307707, 372706, 429002, 476236, 513502, 539572, 553686, 556410, 549922, 537411, 521948, 505382, 487789, 467585, 442293, 409732, 369266, 322530, 273120, 225206, 181711, 143014, 106938, 69977, 29069, -16976, -66993, -118004, -166451, -209558, -246193, -276854, -302777, -324679, -341841, -351991, -352017, -339037, -311256, -268262, -210715, -139720, -56261, 38928, 144925, 259880, 380433, 501626, 617284, 720690, 805466, 866703, 902105, 912629, 902152, 876193, 840176, 797925, 750952, 698822, 640404, 575357, 505090, 432734, 362215, 296876, 238295, 185938, 137737, 91155, 44065, -4851, -55978, -108658, -161247, -211459, -256961, -295678, -325688, -344926, -351171, -342534, -318117, -278372, -224840, -159447, -83838]
35695h3838Q4655R2640R8994J02554J01906R5890Q4019O6734M5459K2469O59j7054
35683F95087k8578l3412l2720k8564k2891j6916j1294o625l784l827p573j5041
35671D83862k4999l4984m2067m4253m1641l6632l2898l3695m0474n2414o7044
35660C2761q1380r2997j00438j03111j00887r3834q2171o6427m7660k7559q360
35649g72063P521J7987K1726J8476Q960n283k2065l8643n2012n9579o0074n4031
35637i89080m3467l0841j8047o006N017J4824K2951K8748L1808L2300L0976K8791
35625h92026K6479K4342K2438K0842J9781J9598K0667K3370K8035L4780M3383
35614f08311N3276O3728P3970Q3335R1219R7021R9965R9011R3095Q1627O4982
$$ y = [-83838, 817, 93457, 192451, 295005, 396911, 492801, 576820, 643554, 689013, 711482, 712141, 695087, 666509, 633097, 600377, 571813, 548922, 532006, 520712, 514087, 510303, 506476, 498903, 483862, 458863, 423879, 381812, 337559, 295918, 259286, 226388, 192693, 152219, 99805, 32761, -48619, -141616, -242054, -345165, -446052, -539886, -622057, -688484, -736144, -763703, -772063, -764542, -746555, -724829, -706353, -697393, -702676, -724741, -763384, -815396, -874975, -935049, -989080, -1032547, -1063388, -1081435, -1087441, -1082424, -1067600, -1044649, -1015901, -984093, -951793, -920817, -892026, -865547, -841205, -818767, -797925, -778144, -758546, -737879, -714509, -686474, -651694, -608311, -555035, -491307, -417337, -334002, -242783, -145762, -45797, 53214, 146309, 227936, 292918]
35603B92918M4684K3150L199j2659k2860k7182k6638k2971j8006j3228r544p286
35591B03577o264o076o431p288q561r708r788q141n070j744O41J664J632J034
35577A39477J5j583l887o678r363j1198j1664j0756r010p234o169o200p150q265
35563D0335q406o548k231M267J2007J9628K5557K8329K7017K1603J3107L368n400
35550A72633j1254j3151j1412p610l903k021k428m159n297l884J267J0053K1058
35537A39892L2051M0782M5764M6532M3432L7152K8574J8948J0026L799J822M465
35525D53239J0577J7633K2551K2821J7463P289n750j9399l1709m1136m6582m7631
35513C59366m4795l9508l3719k9282k7411k8342l1424l5499l9298m1626m1365
$$ y = [292918, 337602, 360752, 363951, 351292, 328432, 301250, 274612, 251641, 233635, 220407, 210863, 203577, 197313, 191237, 184806, 177518, 168957, 159249, 149461, 141320, 136250, 134506, 135147, 136811, 138443, 139477, 139492, 137909, 134022, 127344, 117981, 106783, 95119, 84363, 75353, 68119, 61950, 55750, 48600, 40335, 31929, 25381, 23150, 27417, 39424, 59052, 84609, 112938, 139955, 161558, 174665, 178033, 172633, 161379, 148228, 136816, 129206, 125303, 123282, 120854, 116695, 111398, 107514, 108781, 118834, 139892, 171943, 212725, 258489, 305021, 348453, 385605, 414179, 433127, 443153, 446952, 448774, 453239, 463816, 481449, 504000, 526821, 544284, 551573, 545823, 526424, 494715, 453579, 406997, 359366, 314571, 275063, 241344, 212062, 184651, 156309, 124885, 89386, 50088, 8462, -32903]
35502c2903l7525k9391j6715J83K0399M2447O4322Q3699R8234J06082J06459R9947
35490E05238Q8215P3272N6713L9598K2798P386n388j4527j9624k0925j9141j5275
35478F98340j0572o528m641n972j0773j8550k8515m0030n2690o5974p8835q9584
35466B85676r6196r6988r1455q0810o7784n5590m6712m2194m1700m3999m7479
35455d25231n0567n2152n1743m9245m4652l7994k9549j9983j0185r81O937J3001
35443g52344J6777J8135J7390J5347J3141J1842J1976J3273J4833J5537J4514
35432e89579J1456O793J640k638n066n504m588l267k235j554n78J694O065J2462
35418e74899J9671K5584K7964K5401J7915O958n211j6308k4626k9191k9694k6404
$$ y = [-32903, -70428, -99819, -116534, -116351, -95952, -53505, 10817, 94516, 192750, 298832, 405291, 505238, 593453, 666725, 723438, 763036, 785834, 793220, 787832, 773305, 753681, 732756, 713615, 698340, 687768, 681240, 676599, 670627, 659854, 641304, 612789, 572759, 520069, 454095, 375260, 285676, 189480, 92492, 1037, -79773, -147557, -203147, -249859, -292053, -333753, -377752, -425231, -475798, -527950, -579693, -628938, -673590, -711584, -741133, -761116, -771301, -772282, -765345, -752344, -735567, -717432, -700042, -684695, -671554, -659712, -647736, -634463, -619630, -604093, -589579, -578123, -571330, -569690, -572328, -577394, -582898, -587486, -590753, -592988, -594542, -595120, -593426, -587361, -574899, -555228, -529644, -501680, -476279, -458364, -451406, -456617, -472925, -497551, -526742, -556436, -582840]
35406e82840k0185j2514n263j41J946J205j180l469l861r06O146J7192L1288M6798
35392e25784O1614P3532Q0728Q2277P8396P0313N9822M8693L8217K8944K0664
35381A17416J2700M400m355j2997k0612k6575l0998l4631l8293m2208m5631m6976
35369a68760m4436l6797k4139q018Q931K3858L4591M0138M0635L6996L0637K3400
35357d2964J7347J4305J5246J9936K6987L4255L9393M0421L6250K7054J4239k3
35345B42446j3611k5168l4390m1784m8137n3909n8794o1696o1180n6298m7193
35334b59714l5059k1574q276L823J4249K2942K9985L5340L8776M0120L9568L7798
35322f2022L5706L4027L3115L3006L3650L5024L7066L9444M1358M1631L9132L3346
$$ y = [-582840, -603025, -615539, -620802, -620943, -618997, -617792, -618972, -622441, -626302, -627208, -621062, -603870, -572582, -525784, -464170, -390638, -309910, -227633, -149237, -78924, -19102, 29591, 67808, 96752, 117416, 130116, 134516, 130161, 117164, 96552, 69977, 38979, 4348, -33945, -76153, -121784, -168760, -213196, -249993, -274132, -282150, -273219, -249361, -214770, -174632, -133997, -97001, -66364, -42964, -25617, -11312, 3934, 23870, 50857, 85112, 124505, 164926, 201176, 228230, 242469, 242446, 228835, 203667, 169277, 127493, 79356, 25447, -33347, -95043, -156223, -212521, -259714, -294773, -316347, -324623, -320800, -306551, -283609, -253624, -218284, -179508, -139388, -99820, -62022, -26316, 7711, 40826, 73832, 107482, 142506, 179572, 219016, 260374, 302005, 341137, 374483]
35310C74483K4670J4267L560o348j5051k2961l1009l9955m9599n8436o4088o4281
35298F5252n7816m5029k7613p959J1568K9124M3484N3918O0013O1580N8681N1789
35286B96992M1927L0678J9856J1074N333K817K852M091N024M618K712j88l498
35273D24288p111j1426j6936k3720l1286l8764m5174m9540n0917m8516m1963l1569
35261B7366j8435m310Q780J9027K5217K6919K4512J9187J2747P068L404J961K086
35248A55529K783L203K909J960Q07q3o34j413l468p959j5711k6914m0958n6500
35234A3551p1749q4886r4440r9460r9490r4466q4769p1341n5649l9298k3445q408
35222h13850O196K0807L5245M8424N8803O5211O7604O7146O5681O4889O5646O7857
$$ y = [374483, 399153, 413420, 416980, 410632, 395581, 372620, 341611, 301656, 252057, 193621, 129533, 65252, 7436, -37593, -65206, -73165, -61597, -32473, 11011, 64929, 124942, 186522, 245203, 296992, 338919, 369597, 389453, 400527, 405860, 408677, 411529, 415620, 420644, 425262, 427974, 427786, 424288, 417177, 405751, 388815, 365095, 333809, 295045, 249871, 200331, 149414, 100898, 58935, 27366, 8931, 4621, 13401, 32428, 57645, 84564, 109076, 128263, 141010, 148078, 151482, 153443, 155529, 158312, 161515, 164424, 166384, 167191, 167108, 166474, 165061, 161593, 153634, 137923, 111009, 70051, 13551, -58198, -143084, -237524, -336984, -436474, -530940, -615709, -687050, -742699, -781997, -805442, -813850, -807654, -786847, -751602, -703178, -644375, -579164, -511560, -444414, -378733, -313844, -248198, -180341]
35210a80341P0730P3241P4524P4027P1514O7042O1076N4583M8859M5055M3577
35199E03887M3792M4227M3195L9535L3137K4960J6442Q672J807m845j2139k0444
35187G22226k9337l7791m4599m8815n0072m8654m5440m1789l9312l9360m2358
35176B54699m7397n2621n6182n7099n5482n2198m8318m4681m1660l9132l6650
35165b76721l3789l0501k7235k4755k3638k3784k4212k3348j9685j2490k237R446
35153e12949K0308K8352L2610L3393L1862K9218K6063K2293J7410J0932K660p188
35141b65036j7851k8000l5893l9895l9133l3949k5795j6595q000r50M294P861
35129d98942R969J0688R846P074K148m626j2245j9271k4402k6915k6760k4330
$$ y = [-180341, -109611, -36370, 38154, 112181, 183695, 250737, 311813, 366396, 415255, 460310, 503887, 547679, 591906, 635101, 674636, 707773, 732733, 749175, 757847, 759654, 754809, 742670, 722226, 692889, 655098, 610499, 561684, 511612, 462958, 417518, 375729, 336417, 297057, 254699, 207302, 154681, 98499, 41400, -14082, -66280, -114598, -159279, -200939, -240071, -276721, -310510, -341011, -368246, -393001, -416639, -440423, -464635, -487983, -507668, -520158, -522395, -512949, -492641, -464289, -431679, -398286, -366424, -337206, -311143, -288850, -271440, -260508, -257848, -265036, -282887, -310887, -346780, -386675, -425808, -459757, -485552, -502147, -510147, -511097, -506803, -498942, -488973, -478285, -468439, -461365, -459217, -463843, -476088, -495359, -519761, -546676, -573436, -597766]
35117e97766k0110j4499p839o46O313J2232J6649J9678K1775K3276K4065K3738
35105d93134K2085J9459J6774J5145J5366J7543K1004K4583K7026K7311K4787
35094b62051J9303J1365K250o174j1982j3864j1625o188Q45P881J3859J8445K1851
35081b16085K4573K7106K9770L2615L5423L7709L8764L7723L3759K6324J5461
35070A23142K030j2266k5272l5042m0445m1277l7969l1190k1658j0089K784J6145
35058a11107K8990M0099M8208N2258N1591M6157L6744K5062J3340L521l515q207
35046B23141j2015j6780k3882l3538m4603n5091o3171o7915o9422o8489o6128
35035b97893o3063n9339n4310m7182l7786k6777j5214l913O780J6747K5850L3848
$$ y = [-597766, -617876, -632375, -640214, -640860, -634547, -622315, -605666, -585988, -564213, -540937, -516872, -493134, -471049, -451590, -434816, -419671, -404305, -386762, -365758, -341175, -314149, -286838, -262051, -242748, -231383, -229133, -235307, -247289, -261153, -272778, -278966, -278121, -270240, -256381, -237936, -216085, -191512, -164406, -134636, -102021, -66598, -28889, 9875, 47598, 81357, 107681, 123142, 125172, 112906, 87634, 52592, 12147, -29130, -67099, -98289, -119947, -130036, -127252, -111107, -82117, -42018, 6190, 58448, 110039, 156196, 192940, 218002, 231342, 234863, 231348, 223141, 211126, 194346, 170464, 136926, 92323, 37232, -25939, -93854, -163276, -231765, -297893, -360956, -420295, -474605, -521787, -559573, -586350, -601564, -605477, -598697, -581950, -556100, -522252]
35023e22252M0406M5043M7076M5837M1164L3823K5426J7753J1989Q441O917P267
35011a91110R597J4034K0407K8097L6080M3053M7636M8708M5815L9488L1267K3339
34999A96411J7847J6120J8090K2267K6378K8436K7690K4946K1935K0276K0566
34988D40962K2172K3662K3498K0718J5274P930j93q136j5311k1438k6425l0369
34976D52344l3556l6235l8476m0279m1943m4145m7489n1917n6579o0307o2286
34965f0868o2381o1100n9340n8143n8455o0975o6007p3261q1723q9728r5440r7359
34953i24780r4590q6722p3685n5797l3930r569J5369L8878N9273P5489Q7243R5006
34941i07815R9777J02654J04305J04612J02793R8061R0290Q0270O9312N8582M8658
$$ y = [-522252, -481846, -436803, -389727, -343890, -302726, -268903, -243477, -225724, -213735, -205294, -198377, -191110, -181513, -167479, -147072, -118975, -82895, -39842, 7794, 56502, 102317, 141805, 173072, 196411, 214258, 230378, 248468, 270735, 297113, 325549, 353239, 378185, 400120, 420396, 440962, 463134, 486796, 510294, 531012, 546286, 554216, 554023, 545887, 530576, 509138, 482713, 452344, 418788, 382553, 344077, 303798, 261855, 217710, 170221, 118304, 61725, 1418, -60868, -123249, -184349, -243689, -301832, -360287, -421262, -487269, -560530, -642253, -731981, -827421, -924780, -1019370, -1106092, -1179777, -1235574, -1269504, -1279073, -1263704, -1224826, -1165553, -1090064, -1002821, -907815, -808038, -705384, -601079, -496467, -393674, -295613, -205323, -125053, -55741, 2841, 51499]
34930E1499L9515L0957K3043J6203J0951P346M774K151j464o349j1977j7291k1146
34917A28212k2693k1719j8955j6022j4824j6578k1287k8006l5501m2674m8408
34906a58455n1389n0312m4443l4108k0667n974Q271K0841L0842L7489M0158L8776
34894a88971L4010K7103J9611J3189R206Q149R261J0940J1727J1096R431P477
34882a7771N829M795M547N309P356J0845J5588K1127K6940L2562L7332M0101L9383
34869B33943L4075K4243J1359k201j4021k2325k6117k5020j9260r814J500J2364
34857A98726K0654K5082K5472K2732J8597J5149J4172J6509K1717K8186L3643
34846D40639L5816L3088K5028J2679j591j4792k4231k8247k6301j8643o002J0422
$$ y = [51499, 91014, 121971, 145014, 161217, 172168, 179514, 184288, 186439, 184975, 178626, 166649, 149358, 128212, 105519, 83800, 64845, 48823, 33999, 17421, -3866, -31872, -67373, -110047, -158455, -209844, -260156, -304599, -338707, -359374, -365348, -357077, -336236, -305394, -267905, -227747, -188971, -154961, -127858, -108247, -95058, -85852, -77703, -68442, -57502, -45775, -34679, -25248, -17771, -11942, -7147, -2600, 2709, 10065, 20910, 36498, 57625, 84565, 117127, 154459, 194560, 233943, 268018, 292261, 303620, 301419, 287398, 265073, 238956, 213936, 194676, 184862, 186362, 198726, 219380, 244462, 269934, 292666, 311263, 326412, 340584, 357093, 378810, 406996, 440639, 476455, 509543, 534571, 547250, 545659, 530867, 506636, 478389, 452088, 433445, 427443, 437865]
34834D37865K8841M6957O2320P2864P7304P5368O7699N5530M0267K3139N007j3592
34822I79569l2234n0319o6975q1292r2603j00585j05102j05962j02912r5769q4624
34811F1192o9898n2366l3161j3808L791J7541K5499K6339J9755O644j1027l0558
34799e0057m9007o3672p2600p4930p1042o2387n0971l8812k7535j8228j1568p915
34787e98724p351r491j3328j7190j8947j6579q877L810J9372L4477M5778N1106
34775e35944M9910M2977L1847J8573N676m022q110n503K971J4797K6689L5748
34763c24391M0329M0363L7144L2712K9076K7521K8230L0403L2686L3821L3025
34752D0919L0069K5111J8635J1480M911L39j123Q41N551J1440J6445J8612J6735
$$ y = [437865, 466706, 513663, 575983, 648847, 726151, 801519, 869218, 924748, 965015, 988154, 993161, 979569, 947335, 897016, 830041, 748749, 656146, 555561, 450459, 344497, 241585, 145816, 61192, -8706, -61072, -94233, -108041, -104250, -86709, -61210, -34871, -15116, -8472, -19499, -50057, -99064, -162736, -235336, -310266, -381308, -443695, -494666, -533478, -561013, -579241, -590809, -598724, -606075, -615566, -628894, -646084, -665031, -681610, -690487, -686677, -667305, -632828, -587050, -535944, -486034, -443057, -411210, -392637, -386961, -390983, -399093, -404596, -401625, -386828, -360139, -324391, -284062, -243699, -206555, -173843, -144767, -117246, -89016, -58613, -25927, 7894, 40919, 70988, 96099, 114734, 126214, 131125, 131464, 130341, 131182, 136733, 148173, 164618, 183230, 199965]
34739A99965J0802J977p866j6901k3896k8325l0197k9945k8461k7066k7146k9650
34727c6709l4709m1595m8823n4399n6296n3164m4927l2963j9698p821O26M976
34715d25502O099N864O161Q024J1409J5491J9225K1868K3338K4296K5855K8844
34703b29028L3138L7602M0744M1542L9739L5488K8854J9669P831o242k1370l5765
34691g798m7565n5474n9207n9334n6683n1695m4246l4041k1247o899P280J9489
34679d17420K8478L3940L6502L7396L7903L8756L9763L9872L7805L2876K5464
34668b8665J6782P981n62r367j9166l0084m1181n0578n6073n5968m9832l8725
34656c55438k4818j0513K404J3151K1820K8843L4519L8884M1963M4028M5618M7310
$$ y = [199965, 210767, 212744, 204878, 187977, 164081, 135756, 105559, 75614, 47153, 20087, -7059, -36709, -71418, -113013, -161836, -216235, -272531, -325695, -370622, -403585, -423283, -431104, -430478, -425502, -419403, -413539, -407378, -399354, -387945, -372454, -353229, -331361, -308023, -283727, -257872, -229028, -195890, -158288, -117544, -76002, -36263, -775, 28079, 47748, 55579, 49337, 27967, -7798, -55363, -110837, -170044, -229378, -286061, -337756, -382002, -416043, -437290, -444189, -436909, -417420, -388942, -355002, -318500, -281104, -243201, -204445, -164682, -124810, -87005, -54129, -28665, -11883, -3902, -4464, -13831, -32997, -63081, -104262, -154840, -210913, -266881, -316713, -355438, -380256, -390769, -388365, -375214, -353394, -324551, -290032, -251148, -209185, -165157, -119539, -72229]
34644g2229M9497N2341N5868N9993O4572O9246P3244P5226P3429O6249N3045L4753
34632F55234J3860o437k3393l5664m3445m7881n0283n1534n1993n1667n0551m8845
34620B07401m6928m5155m3696m2614m2151m2924m5755n1200n9072o8363p7511
34609c57968q4855q8995q9045q4736p6323o4314m9190l1335j1131J0797L3356
34598h93739N4854P3242Q6674R4089R5384R1203Q2665P1233N8656M6723L6978
34587a02038L0473K7511K7399K8423K8369K5429J8944R516j380j1986k0730k6497
34575C3433k8743k7436k3020j6351q600r97N485J0363J3631J5510J6076J5040
34563D391J1917O585M8n387o935k930N918J6557K4930K7693K3269J2079l699k0710
$$ y = [-72229, -22732, 29609, 85477, 145470, 210042, 279288, 352532, 427758, 501187, 567436, 620481, 655234, 669094, 662657, 639264, 603600, 560155, 512274, 461991, 410457, 358464, 306797, 256246, 207401, 160473, 115318, 71622, 29008, -13143, -56067, -101822, -153022, -212094, -280457, -357968, -442823, -531818, -620863, -705599, -781922, -846236, -895426, -926761, -937892, -927095, -893739, -838885, -765643, -678969, -584880, -489496, -398293, -315628, -244395, -185739, -139016, -102038, -71565, -44054, -16655, 11768, 40137, 65566, 84510, 94026, 92646, 80660, 59930, 33433, 4690, -22746, -45766, -62117, -70717, -71714, -66229, -55866, -42235, -26725, -10649, 4391, 16308, 22893, 22941, 17554, 10619, 7689, 13607, 30164, 55094, 82787, 106056, 118135, 114436, 93726]
34549I3726l5393m5180m9215m8204m3556l6686k8863k1351j5382j1859j1002j2199
34537b65164j4152j5265j4083r658j732R269K2263L5670M7717N6820O1844O2087
34525b4384N7225M7464L3796J8005K275j1424k1729k8037l0432k9607k6723k3168
34513c6739k0213j8742j9180k1509k5279k9488l2618l3099l0069k3999j6651j0376
34501c17962p222q240j3134k0313k7433l2347l4037l2829k9854k6135k2066j7413
34489e88985j1671m394M636J5309K7088L8882M9092N5955N8231N5866N0185M3451
34477b06355L7948L5138L5172L7023L9012L9598L7958L4108K8643K2321J5839
34466A56405R808M679O11k687n900r834j5035k1450k8396l4791l9559m1974m1782
$$ y = [93726, 58333, 13153, -36062, -84266, -127822, -164508, -193371, -214722, -230104, -241963, -252965, -265164, -279316, -294581, -308664, -318322, -320054, -310785, -288522, -252852, -205135, -148315, -86471, -24384, 32841, 80305, 114101, 132106, 134381, 122957, 101228, 73191, 42759, 13152, -13571, -36739, -56952, -75694, -94874, -116383, -141662, -171150, -203768, -236867, -266936, -290935, -307586, -317962, -325184, -333424, -346558, -366871, -394304, -426651, -460688, -493517, -523371, -549506, -571572, -588985, -600656, -605050, -600414, -585105, -558017, -519135, -470043, -414088, -355857, -299991, -249806, -206355, -168407, -133269, -98097, -61074, -22062, 17536, 55494, 89602, 118245, 140566, 156405, 166213, 170892, 171503, 168816, 162916, 153082, 138047, 116597, 88201, 53410, 13851, -28123, -69905]
34453f9905l9181l4747k9253k3434j7856j2902q894o096m549l894l299j724J648
34440b54086O939J3435K0004K5839L0957L6097M2230N0035N9602P0301Q0824Q9563
34428B71740R5136R6763R4228Q7703P7632O4812N0393L5634K1482Q241m502j7569
34416H81693l1685m7029o3088p8850r3161j05099j14198j20455j24131j25461
34406b1464j24480j21032j14987j06489r5974q3902p0375n4949l6906j5891P598
34395h38851L2153N5869P6906R3938J06346J14120J17556J16961J12425J03909
34385I1332R1532P5873N8073L9657K2228P287l874j0395j2217j0371o777l538
34373C38810k190l365o967j2601j9934k8813l9173n0747o2770p3887q2417q6826
$$ y = [-69905, -109086, -143833, -173086, -196520, -214376, -227278, -236172, -242268, -246817, -250711, -254010, -255734, -254086, -247147, -233712, -213708, -187869, -156912, -120815, -78585, -28550, 31052, 101353, 182177, 271740, 366876, 463639, 557867, 645570, 723202, 788014, 838407, 874041, 895523, 903764, 899262, 881693, 850008, 802979, 739891, 661041, 567880, 462781, 348583, 228128, 103997, -21464, -145944, -266976, -381963, -488452, -584426, -668328, -738703, -793652, -830558, -846449, -838851, -806698, -750829, -673923, -579985, -473639, -359519, -241963, -125002, -12577, 91332, 182864, 258737, 316810, 356467, 378695, 385982, 382108, 371713, 359496, 349125, 342348, 338810, 336620, 333255, 326288, 313687, 293753, 264940, 225767, 175020, 112250, 38363, -44054, -130880]
34361a30880q6122q0055o9095n4383l7627k0905o294M655J1386J4383J4667J3025
34349d27245R511L652m929j5943k8466m1326n3401o3586p0598p3197p0840o4250
34337i00618n5301m6217l8627l3086k9183k6058k3020k0002j7429j5658j4478
34326a219677j3143j0901p414k756K880R406J6901K5539L5387M6138N6933O6530
34314i94177P3683P7531P7757P4512O8225N9417M8629L6384K3168R395m437j7444
34302d67357k8158l4765l5840l1108k1799j0346M93Q743J3939J6997J9269K1456
34290e48476K3152K3202K0662J5620R398L842K39j435k273l526n827r084j2813
34277d87319j6401j9199k0518j9704j6236r835o29J0698K2896L4375M3496M8877
$$ y = [-130880, -217002, -297057, -366152, -420535, -458162, -479067, -485361, -480706, -469320, -454937, -440270, -427245, -417734, -414082, -419011, -434954, -463420, -504746, -558147, -621733, -692331, -765528, -836368, -900618, -955919, -1002136, -1040763, -1073849, -1103032, -1129090, -1152110, -1172112, -1189541, -1205199, -1219677, -1232820, -1243721, -1251135, -1253891, -1251011, -1241605, -1224704, -1199165, -1163778, -1117640, -1060707, -994177, -920494, -842963, -765206, -690694, -622469, -563052, -514423, -478039, -454871, -445476, -449913, -467357, -495515, -530280, -566120, -597228, -619027, -629373, -628880, -620137, -606198, -589201, -569932, -548476, -525324, -502122, -481460, -465840, -456442, -452600, -452361, -453796, -456069, -459595, -465422, -474506, -487319, -503720, -522919, -543437, -563141, -579377, -589212, -589841, -579143, -556247, -521872, -478376, -429499]
34265d29499M9693M5997L8927L0485K2912J7927J6338J8219K3414L1765M2770
34254i1052N5062O6270P3612P4784O8729N5876L8040J7996j046j6081k4882k6541
34242B90767k1763j2635j832Q322J6399K1767K4253K3982K1568J8307J6041J6496
34230D21672K0448K7229L4881M0891M3127M0534L3537K3798J3514M486k380o851
34218F94886q768p711l291M168J3239K1579K6683K6683K0926J0107m012j9232
34206G75257l3605m5813n5132o1229o4228o4854o4283o3623o3434o3719o4167
34195A31170o4289o3420o0867n6265m9872m2440l4756k7126j9345j1133k724N027
34183b96040J1127J5136J7388J8665J9748K1204K3274K5711K7759K8585K7950
$$ y = [-429499, -379806, -333809, -294882, -264397, -241485, -223558, -207220, -189001, -165587, -133822, -91052, -35990, 30280, 103892, 178676, 247405, 303281, 341321, 359317, 358271, 342190, 317308, 290767, 269004, 256369, 254537, 262859, 279258, 301025, 325278, 349260, 370828, 389135, 405176, 421672, 442120, 469349, 504230, 545121, 588248, 628782, 662319, 686117, 699631, 704117, 701737, 694886, 686118, 678407, 675116, 679284, 692523, 714102, 740785, 767468, 788394, 798501, 794489, 775257, 741652, 695839, 640707, 579478, 515250, 450396, 386113, 322490, 259056, 195337, 131170, 66881, 3461, -57406, -113671, -163543, -205983, -240739, -267865, -287210, -298343, -301067, -296040, -284913, -269777, -252389, -233724, -213976, -192772, -169498, -143787, -116028, -87443, -59493]
34172e9493K6495K5316K5170K5989K7055K7620K7531K7375K8045L0052L3085L6157
34160B80397L8105L8015L5405L0340K3591J6510J0479O174L264Q03j986n235q456
34147D67406j1100j3051j4757j6888j9846k3503k7297l0543l2767l3988l4693
34136B08973l5449l6373l6931l6284l3794k9166k2254j3000j561J1463K5123L8434
34124C9181N0596O1044O9292P4723P6480P3651O5757N3208L7340J9925K539j3811
34112F09925k8555m1232n1319n8298o1903o2261n9778n4859m7646l8021k5897
34101H0156j1681L460J7711K9104L6130L8263L6121L1197K5308K0069J6474J4650
34089C36962J3652J1616O482k892j5920l0331m3088n1557n4438n2016m5837l7994
$$ y = [-59493, -32998, -7682, 17488, 43477, 70532, 98152, 125683, 153058, 181103, 211155, 244240, 280397, 318502, 356517, 391922, 422262, 445853, 462363, 472842, 479016, 482280, 483083, 481097, 475862, 467406, 456306, 443255, 428498, 411610, 391764, 368261, 340964, 310421, 277654, 243666, 208973, 173524, 137151, 100220, 63936, 30142, 976, -21278, -34278, -35839, -24376, 747, 39181, 89777, 150821, 220113, 294836, 371316, 444967, 510724, 563932, 601272, 621197, 623736, 609925, 581370, 540138, 488819, 430521, 368618, 306357, 246579, 191720, 144074, 106053, 80156, 68475, 71935, 89646, 118750, 154880, 193143, 229264, 260461, 285769, 305838, 322312, 336962, 350614, 362230, 368712, 365820, 349900, 319569, 276481, 224924, 170486, 118470, 72633, 34639]
34077C4639l0485k4780k1691k1264k2850k5371k7780k9429l0085k9673k8089k5274
34065b82132k1454j7208j3295j0394q993r409j1716j5618k0407k5162k9174l2236
34053d97198l4667l6894l9040m0821m1858m2130m2024m1900m1500l9663l4618
34042i32313k4803r833Q898K8582M6121N9429O8062P2971P5686P7445P8709P9185
34030c71861P8221P5180O9564O0954M9214L4889J9417M775p316j5952k1053k2955
34018d6923k2023j8500j2612m818M019J2678K0098K5995L1089L6548M3060N0242
34006A18853N6841O1500O3395O2388N8712N2583M3999L2891J9551M873r721k2852
33994E43013l3814m2757n0300n6739o1558o3578o1677n5478m5606l3424k0506
$$ y = [34639, 4154, -20626, -42317, -63581, -86431, -111802, -139582, -169011, -199096, -228769, -256858, -282132, -303586, -320794, -334089, -344483, -353476, -362885, -374601, -390219, -410626, -435788, -464962, -497198, -531865, -568759, -607799, -648620, -690478, -732608, -774632, -816532, -858032, -897695, -932313, -957116, -966949, -958051, -929469, -883348, -823919, -755857, -682886, -607200, -529755, -451046, -371861, -293640, -218460, -148896, -87942, -38728, -3839, 15578, 20353, 13037, -2915, -23968, -46923, -68946, -87446, -100058, -104876, -100857, -88179, -68081, -42086, -10997, 25551, 68611, 118853, 175694, 237194, 300589, 362977, 421689, 474272, 518271, 551162, 570713, 575586, 565865, 543013, 509199, 466442, 416142, 359403, 297845, 234267, 172590, 117112, 71506, 38082, 17576]
33983A7576q190K787J2373K1028K9279L7335M4924N1419N6059N8147N7164N2944
33971D32845M5836L6745K6876J7204Q219J34o579j0957j1972r249l334M528J2776
33958E43072J9672K3362K2331J6135N905n988j6869k4806k9171l0572l0403l0115
33946D62553l0586l1757l2755l2455l0105k5894k1097j7772j7946k2592l1001
33935A68593m0962m9693n4890n5462n1662m4685l6000k6766j7745r644l457l27
33923b22700j042n620j3236k2488l1764l9593m4803m6462m3675l5739k2737o162
33911e36021J1210K6277L6764M1831M1862L7952L1447K3806J6489J0795P555O995
33899b43038Q901J2912J8611K5293L1647L5827L5953L0830K0447O121r800k4574
$$ y = [17576, 9386, 12173, 24546, 45574, 74853, 112188, 157112, 208531, 264590, 322737, 379901, 432845, 478681, 515426, 542302, 559506, 567725, 567859, 561280, 550323, 538351, 529102, 525768, 530296, 543072, 562744, 586106, 608437, 624572, 630477, 624489, 607620, 582814, 553643, 523071, 492668, 462553, 431967, 400210, 367455, 335000, 304895, 279001, 257904, 240132, 222186, 199594, 168593, 127631, 77938, 23048, -32414, -84076, -128761, -164761, -191527, -209272, -218916, -222373, -222700, -223742, -229362, -242598, -265086, -296850, -336443, -381246, -427708, -471383, -507122, -529859, -536021, -524811, -498534, -461770, -419939, -378077, -340125, -308678, -284872, -268383, -257588, -250033, -243038, -234137, -221225, -202614, -177321, -145674, -109847, -73894, -43064, -22617, -16496, -26296, -50870]
33887e0870l5846m2284m3747m1029l5392k8218k0802j4174q723l994J096P457
33875c16526J5058K2799K9183L3228L4949L5142L4798L4523L4348L3939L3092
33864B4533L2151L2020L3748L7903M4134N1222N7552O1727O2917O0798N5291M6375
33852F00371L4181J9247K661j4116k9630m2876n3433o1323o6737o9839p0732o9490
33840A78284o6329o1760n6715n2356m9685m9143n0471n2802n4807n4889n1494
33829d22167m3572l0914j4134N708K7503N0219P2786R3788J11372J23324J27525
33818A01438J22671J08946Q8328O4072L9684J7872K6j3652k3726l1025l6255l9726
33806C98653m1337m0782l7794l2342k4639j5164m686N747J4871K1411K4383K3512
$$ y = [-50870, -86716, -129000, -172747, -213776, -249168, -277386, -298188, -312362, -321085, -325079, -323983, -316526, -301468, -278669, -249486, -216258, -181309, -146167, -111369, -76846, -42498, -8559, 24533, 56684, 88704, 122452, 160355, 204489, 255711, 313263, 374990, 437907, 498705, 553996, 600371, 634552, 653799, 656460, 642344, 612714, 569838, 516405, 455082, 388345, 318506, 247774, 178284, 111955, 50195, -6520, -58876, -108561, -157704, -208175, -260977, -315784, -370673, -422167, -465739, -496653, -510787, -505079, -477576, -427357, -354571, -260783, -149411, -26087, 101438, 224109, 333055, 421383, 485455, 525139, 543011, 543037, 529385, 505659, 474634, 438379, 398653, 357316, 316534, 278740, 246398, 221759, 206595, 201909, 207656, 222527, 243938, 268321, 291833]
33794B91833J9526J4041R097O467P258J1798J9654K9655M0004M8675N4143N5965
33782F08116N4806N1854M8027M3537L7995L0908K2186J2350K312p141j5784k3894
33770H65272l1790l9409m6312n2162n7022o1196o4637o6538o5645o1227n4010
33759B65324m6252m0719l9238m1791m6612n1088n2827n0438m3905l4493k4265
33748b06304j5318r030n620m150l055r02K966Q243J3954J8959K2332K3483K2117
33735a32325J8232J2179M775k714q796j2189j2342r740n789k381j365m090j1115
33722a67660k1965l5100m8228n9051o6031o8774o7871o4465n9871n5233n1094
33711g65343m7001m1633l3582k2394r125L966J4426K0697K2753K1837J9555J6846
$$ y = [291833, 311359, 325400, 334497, 340964, 348222, 360020, 379674, 409329, 449333, 498008, 552151, 608116, 662922, 714776, 762803, 806340, 844335, 875243, 897429, 909779, 912091, 904950, 889166, 865272, 833482, 794073, 747761, 695599, 638577, 577381, 512744, 446206, 380561, 319334, 265324, 219072, 178353, 139115, 97324, 50712, -376, -53203, -103641, -147546, -182039, -206304, -221622, -230652, -236272, -240422, -243477, -244379, -241413, -233170, -219216, -200257, -177925, -154442, -132325, -114093, -101914, -97139, -99853, -108649, -120838, -133180, -142920, -148709, -151090, -152455, -156545, -167660, -189625, -224725, -272953, -332004, -398035, -466809, -534680, -599145, -659016, -714249, -765343, -812344, -853977, -887559, -909953, -919078, -915112, -900686, -879989, -857236, -835399, -815844, -798998]
33699g98998J3653R365L587l298j0101j5170j7035j5102r996l338K977P499R684
33686h26273R998R695J0236J2621J6954K2528K8193L2814L5551L6073L4551L1507
33674e45552K7524K3122J8842J5452J3916J5073J9152K5457L2542L8777M3042
33663b72653M5077M5272M4164M1916L8270L2995K6486K0004J5158J3018J3594
33652F3301J6075J9473K2997K5851K6916K4870J8627P820p098k4989m4251o3008
33640H6584p9286r1185r6984r5280q5208o6806m1414j1809J8195M4657O4549P6345
33628b77642Q0066P6870O8685N7824M6631L7056L0465K7600K8681L3397M0869
$$ y = [-798998, -785345, -775980, -772393, -775691, -785792, -800962, -817997, -833099, -843095, -846433, -843456, -835957, -826273, -816275, -806580, -796344, -783723, -766769, -744241, -716048, -683234, -647683, -611610, -577059, -545552, -518028, -494906, -476064, -460612, -446696, -431623, -412471, -387014, -354472, -315695, -272653, -227576, -182304, -138140, -96224, -57954, -24959, 1527, 21531, 36689, 49707, 63301, 79376, 98849, 121846, 147697, 174613, 199483, 218110, 225930, 218832, 193843, 149592, 86584, 7298, -83887, -180871, -276151, -361359, -428165, -469579, -481388, -463193, -418536, -353987, -277642, -197576, -120706, -52021, 5803, 52434, 89490, 119955, 147555, 176236, 209633, 250502]
$$ [...]
##END NTUPLES=NMR SPECTRUM
##END=
