##TITLE=31Pdec_E362612
 aceton-d6
  24 sc
 27.12.2023
##JCAMPDX= 6.0         $$ Bruker NMR JCAMP-DX V2.0
##DATA TYPE= NMR SPECTRUM
##DATA CLASS= NTUPLES
##ORIGIN= UXNMR, Bruker Analytische Messtechnik GmbH
##OWNER= root
$$ XWIN-NMR		Version 3.5
$$ Wed Dec 27 13:51:24 2023 Russian Standard Time (UT+4h)  she@DPX200
##.OBSERVE FREQUENCY= 81.013821
##.OBSERVE NUCLEUS= ^31P
##.ACQUISITION MODE= SIMULTANEOUS
##.ACQUISITION SCHEME= undefined
##.AVERAGES= 24
##.DIGITISER RES= 16
##SPECTROMETER/DATA SYSTEM= spect
##.PULSE SEQUENCE= zgpg30
##.SOLVENT NAME= CD2Cl2
##.SHIFT REFERENCE= (INTERNAL, CD2Cl2, 0, 248.564)
##AUDIT TRAIL= $$ (NUMBER, WHEN, WHO, WHERE, WHAT)
$$ ##TITLE= Audit trail, XWIN-NMR		Version 3.5
$$ ##JCAMPDX= 5.01
$$ ##ORIGIN= Bruker BioSpin GmbH
$$ ##OWNER= she
$$ F:/spectra/data/she/nmr/P31/1/pdata/1/auditp.txt
$$ ##AUDIT TRAIL=  $$ (NUMBER, WHEN, WHO, WHERE, WHAT)
(   1,<2023-12-27 13:50:13.92 +0400>,<she>,<DPX200>,
      <created by zg, POWCHK disabled, PULCHK disabled
       configuration hash MD5:
       00 E9 B6 7A A2 85 ED C7 34 08 36 98 17 FE 4E 26
       data hash MD5: 32K
       C1 77 A4 B9 C6 10 B0 97 61 CF C5 C1 D3 DE 31 E6>)
(   2,<2023-12-27 13:50:19.79 +0400>,<she>,<DPX200>,
      <Start of raw data processing
       efp BC_mod = 2 LB = 10 FT_mod = 6 PKNL = 1 PHC0 = -12720.67 PHC1 = 1381.694 SI = 64K 
       data hash MD5: 64K
       D4 74 4F 84 FA 04 96 CF 27 2D 98 C9 EB 5A 02 F0>)
(   3,<2023-12-27 13:50:41.34 +0400>,<she>,<DPX200>,
      <pk PHC0 = 386.1075 PHC1 = -903.4001 
       data hash MD5: 64K
       8A 7D 19 DA 07 F5 BD 59 64 B4 0E 8D 93 86 03 42>)
$$ ##END=
$$ 
$$ hash MD5
$$ 40 CE AC FB 2B 25 8A 17 2A 93 A7 40 BA E1 53 D1
##$RELAX= 
##$RELAX= 
##$RELAX= 
##$RELAX= 
##$RELAX= 
##$RELAX= 
##$RELAX= 
##$RELAX= 
##$RELAX= 
$$ Bruker specific parameters
$$ --------------------------
##$DU= <F:/spectra>
##$EXPNO= 1
##$NAME= <P31>
##$PROCNO= 1
##$TYPE= <nmr>
##$USER= <she>
##$AMP= (0..31)
100 100 100 100 100 100 100 100 100 100 100 100 100 100 100 100 100 100 
100 100 100 100 100 100 100 100 100 100 100 100 100 100 
##$AQSEQ= 0
##$AQ_mod= 1
##$AUNM= <au_zg>
##$AUTOPOS= <>
##$BF1= 81.014009
##$BF2= 200.13
##$BF3= 200.13
##$BF4= 200.13
##$BF5= 200.13
##$BF6= 200.13
##$BF7= 200.13
##$BF8= 200.13
##$BYTORDA= 1
##$CFDGTYP= 0
##$CFRGTYP= 5
##$CHEMSTR= <none>
##$CNST= (0..31)
1 1 145 1 1 1 1 1 1 1 1 1 1 1 1 1 1 1 1 1 1 1 1 1 1 1 1 1 1 1 1 1 
##$CPDPRG= <waltz16>
##$CPDPRG1= <>
##$CPDPRG2= <waltz16>
##$CPDPRG3= <>
##$CPDPRG4= <mlev>
##$CPDPRG5= <mlev>
##$CPDPRG6= <mlev>
##$CPDPRG7= <mlev>
##$CPDPRG8= <mlev>
##$CPDPRGB= <>
##$CPDPRGT= <>
##$D= (0..31)
0 1 0 0 0 0 0 0 0 0 0 0.03 2e-05 3e-06 0 0 0 0 0 0 0 0 0 0 0 0 0 0 0 0 
0 0 
##$DATE= 1703670613
##$DBL= (0..7)
120 120 120 11 120 120 24 19 
##$DBP= (0..7)
150 150 150 150 150 150 150 150 
##$DBP07= 0
##$DBPNAM0= <>
##$DBPNAM1= <>
##$DBPNAM2= <>
##$DBPNAM3= <>
##$DBPNAM4= <>
##$DBPNAM5= <>
##$DBPNAM6= <>
##$DBPNAM7= <>
##$DBPOAL= (0..7)
0.5 0.5 0.5 0.5 0.5 0.5 0.5 0.5 
$$ [...]
##$SUBNAM2= <"">
##$SUBNAM3= <"">
##$SUBNAM4= <"">
##$SUBNAM5= <"">
##$SUBNAM6= <"">
##$SUBNAM7= <"">
##$SUBNAM8= <"">
##$SUBNAM9= <"">
##$SW= 501.771253377433
##$SWIBOX= (0..15)
0 1 3 0 0 0 0 0 0 0 0 0 0 0 0 0 
##$SW_h= 40650.406504065
##$TD= 32768
##$TD0= 1
##$TE= 0
##$TE2= 300
##$TE3= 300
##$TEG= 300
##$TL= (0..7)
0 120 53 12 22 120 120 120 
##$TP= (0..7)
150 150 150 150 150 150 150 150 
##$TP07= 0
##$TPNAME0= <>
##$TPNAME1= <>
##$TPNAME2= <>
##$TPNAME3= <>
##$TPNAME4= <>
##$TPNAME5= <>
##$TPNAME6= <>
##$TPNAME7= <>
##$TPOAL= (0..7)
0.5 0.5 0.5 0.5 0.5 0.5 0.5 0.5 
##$TPOFFS= (0..7)
0 0 0 0 0 0 0 0 
##$TUNHIN= 0
##$TUNHOUT= 0
##$TUNXOUT= 0
##$USERA1= <user>
##$USERA2= <user>
##$USERA3= <user>
##$USERA4= <user>
##$USERA5= <user>
##$V9= 5
##$VALIST= <valist>
##$VCLIST= <CCCCCCCCCCCCCCC>
##$VD= 0
##$VDLIST= <DDDDDDDDDDDDDDD>
##$VPLIST= <PPPPPPPPPPPPPPP>
##$VTLIST= <TTTTTTTTTTTTTTT>
##$WBST= 1024
##$WBSW= 4
##$XGAIN= (0..3)
0 0 0 0 
##$XL= 0
##$YL= 0
##$YMAX_a= 4999
##$YMIN_a= -4950
##$ZGOPTNS= <>
##$ZL1= 120
##$ZL2= 120
##$ZL3= 120
##$ZL4= 120
##$ABSF1= 0
##$ABSF2= 0
##$ABSG= 0
##$ABSL= 0
##$ALPHA= 0
##$AQORDER= 0
##$ASSFAC= 0
##$ASSFACI= 0
##$ASSFACX= 0
##$ASSWID= 0
##$AUNMP= <proc_1d>
##$AZFE= 0.1
##$AZFW= 0.5
##$BCFW= 0
##$BC_mod= 2
##$BYTORDP= 0
##$COROFFS= 0
##$CY= -3
##$DATMOD= 1
##$DC= 0
##$DFILT= <>
##$DTYPP= 0
##$F1P= 0
##$F2P= 0
##$FCOR= 1
##$FTSIZE= 65536
##$FT_mod= 6
##$GAMMA= 0
##$GB= 0
##$INTBC= 1
##$INTSCL= 6.047779e-11
##$ISEN= 30
##$LB= 10
##$LEV0= 0
##$LPBIN= 0
##$MAXI= 10000
##$MC2= 0
##$MEAN= 0
##$ME_mod= 0
##$MI= 50
##$NCOEF= 0
##$NC_proc= -8
##$NLEV= 6
##$NOISF1= 182.463
##$NOISF2= 159.3651
##$NSP= 0
##$NTH_PI= 0
##$NZP= 0
##$OFFSET= 248.5645
##$PC= 4
##$PHC0= -12334.56
##$PHC1= 478.2939
##$PH_mod= 1
##$PKNL= yes
##$PPARMOD= 0
##$PSCAL= 0
##$PSIGN= 0
##$REVERSE= no
##$SF= 81.0140089999694
##$SI= 65536
##$SIGF1= 159.3651
##$SIGF2= -187.1042
##$SINO= 113.3802
##$SIOLD= 16384
##$SREGLST= <1H.CDCl3>
##$SSB= 0
##$STSI= 65536
##$STSR= 0
##$SW_p= 40650.406504065
##$SYMM= 0
##$S_DEV= 0
##$TDeff= 32768
##$TDoff= 0
##$TI= <>
##$TILT= no
##$TM1= 0
##$TM2= 0
##$TOPLEV= 0
##$USERP1= <user>
##$USERP2= <user>
##$USERP3= <user>
##$USERP4= <user>
##$USERP5= <user>
##$WDW= 1
##$XDIM= 65536
##$YMAX_p= 518181919
##$YMIN_p= -5852250
$$ End of Bruker specific parameters
$$ ---------------------------------
##NTUPLES= NMR SPECTRUM
##VAR_NAME=  FREQUENCY,     SPECTRUM/REAL,   SPECTRUM/IMAG
##SYMBOL=    X,             R,               I
##VAR_TYPE=  INDEPENDENT,   DEPENDENT,       DEPENDENT
##VAR_FORM=  AFFN,          ASDF,            ASDF
##VAR_DIM=   65536,         65536,           65536
##UNITS=     HZ,            ARBITRARY UNITS, ARBITRARY UNITS
##FACTOR=    0.620285442955139, 1,           1
##FIRST=     20137.2065510682, 0,            0
##LAST=      -20513.1999529968, 0,           0
##MIN=       -20513.1999529968, -5852250,    0
##MAX=       20137.2065510682, 518181919,    0
$$ Real data points
##PAGE= N=1
##DATA TABLE= (X++(R..R)), XYDATA
$$ [...]
39908A919166Q1789Q0006P0160N7690M7343M2397M4399N2788O4712P5873Q2304
39897B618627Q1952P4972O2708M6236K5534j52l0973o5215r9179j28256j48329
39886B437925j56736j52853j38492j17547r4402p1856n0305k9004q054J0805K5176
39875A654657L3532L5998L4171L0381K6734K4180K2141J9081J3606N188n792j8135
39863A875742k9751l7777l9430l3221j9485K28K4396N2329Q3947J18722J54639
39852B150339J87844K13281K25929K22181K01174J65738J22264P9059M3828K1605
39842C633242J3855J8335K9275L8404L7421K1187j0330n2596r8969j43261j81099
39831C305464k09935k28432k35973k32514k18744j96286j67661j35956j04201
$$ y = [1919166, 2000955, 2080961, 2151121, 2208811, 2256154, 2298551, 2342950, 2395738, 2460450, 2536323, 2618627, 2700579, 2775551, 2838259, 2884495, 2910029, 2909877, 2878904, 2813689, 2714510, 2586254, 2437925, 2281189, 2128336, 1989844, 1872297, 1777895, 1706039, 1655734, 1626730, 1618676, 1629481, 1654657, 1688189, 1724187, 1758358, 1788739, 1815473, 1839653, 1861794, 1880875, 1894481, 1899669, 1893877, 1875742, 1845991, 1808214, 1768784, 1735563, 1716078, 1716306, 1740702, 1793031, 1876978, 1995700, 2150339, 2338183, 2551464, 2777393, 2999574, 3200748, 3366486, 3488750, 3567809, 3611637, 3633242, 3647097, 3665432, 3694707, 3733111, 3770532, 3791719, 3781389, 3728793, 3629824, 3486563, 3305464, 3095529, 2867097, 2631124, 2398610, 2179866, 1983580, 1815919, 1679963, 1575762]
39822A575762p4890n0061l1767k2095k2093l0205m1765n0490n1181m1900k4508
39811A134807l736J4578K5513K6874J9933Q603k638j0749j5067j7014j9187k4315
39799A137602l4225m8883o5868q0880q9412q8844p9671o5004m8781l4163k2944
39788D78927j5735j2153j0889j0137q430n096J89Q244K0496L7986O0035Q3800
39776F27237J05247J21000J29800J32553J31039J26341J18086J04758Q4608N6571
39766A737240K0928k0500o4649j07714j45322j72532j84549j78620j56220j23490
39756F04572q8959n9881l9723k8156k2806k0937k0186j8666j5109r215j812N322
39744B84444R987J0212M845n874j9940l3815m3782m7990m7670m6367m7740n3843
$$ y = [1575762, 1500872, 1450811, 1419044, 1396949, 1374856, 1344651, 1302886, 1252396, 1201215, 1159315, 1134807, 1131071, 1145649, 1171162, 1198036, 1217969, 1226572, 1223934, 1213185, 1198118, 1181104, 1161917, 1137602, 1103377, 1054494, 988626, 907746, 818334, 729490, 649819, 584815, 536034, 501871, 478927, 463192, 451039, 440150, 430013, 421583, 416487, 416676, 424920, 445416, 483402, 543437, 627237, 732484, 853484, 983284, 1115837, 1246876, 1373217, 1491303, 1596061, 1680669, 1737240, 1758168, 1737668, 1673019, 1565305, 1419983, 1247451, 1062902, 884282, 728062, 604572, 515613, 455732, 416009, 387853, 365047, 344110, 323924, 305258, 290149, 280934, 279122, 284444, 294431, 304643, 309488, 303614, 283674, 249859, 206077, 158087, 110417, 64050, 16310, -37533]
39732c7533o4968q0187r7444j13325j23600j24939j16738j01614q4050o7810n3763
39721a065971l9583k1522L216L5183P2779J13006J52233J87050K15099K35333
39711a13177K47592K51997K48644K37656K19416J95041J66589J36496J06430P6678
39701A773362M6808J6679j3194m1773o7211q6373r5355r1584p6201n4854l6046
39690A274258k7787l4292n4337q2027j09182j27920j32490j20405r3059n5575
39680D37184j5393K0189M6456O2427P0138P2765P3023P2630P2516P2760P2413
39669A057108O9980O4905N8740N4595N5052O0318O8191P5723Q1099Q4488Q7448
39658A817647R1559R7032J02046J03244R7257Q2427N9687L2114L694k1692m0833
$$ y = [-37533, -102501, -182688, -280132, -393457, -517057, -641996, -758734, -860348, -944398, -1012208, -1065971, -1105554, -1127076, -1123860, -1088677, -1015898, -902892, -750659, -563609, -348510, -113177, 134415, 386412, 635056, 872712, 1092128, 1287169, 1453758, 1590254, 1696684, 1773362, 1820170, 1836849, 1823655, 1781882, 1714671, 1628298, 1532943, 1441359, 1365158, 1310304, 1274258, 1246471, 1212179, 1157842, 1075815, 966633, 838713, 706223, 585818, 492759, 437184, 421791, 441980, 488436, 550863, 621001, 693766, 766789, 839419, 911935, 984695, 1057108, 1127088, 1191993, 1250733, 1305328, 1360380, 1420698, 1488889, 1564612, 1645711, 1730199, 1817647, 1909206, 2006238, 2108284, 2211528, 2308785, 2391212, 2450899, 2483013, 2486707, 2465015, 2424182]
39647B424182n1596n3465m7794l7325k5197j3943n085P54L409K895o28o849j5581
39634B173777k7170m2370o1521q3634j06318j26655j42375j52688j58752j63559
39624A108735j70983j83857k01942k21221k35193k37529k24421j95413j52603
39615g14427r9222l8587K6088R1344J53275K07842K51572K82029K97744K97949
39605G55607K82787K54076K15923J74343J35845J05638Q6086P5978P0932O5117
39595B222332N3798L5536J2909q590k3031k6693j9456m322J4394L2737M7733N7198
39583B394545N9544N3964M0698K1220j657k3962m1411n0775n0955m3012k9337
39572B328862j2690M350J9713L2051M0757M5705M6894M4175L7037K4259L796k6492
$$ y = [2424182, 2372586, 2319121, 2271327, 2234002, 2208805, 2194862, 2189777, 2190531, 2193940, 2196835, 2196207, 2189358, 2173777, 2146607, 2104237, 2042716, 1959082, 1852764, 1726109, 1583734, 1431046, 1272294, 1108735, 937752, 753895, 551953, 330732, 95539, -141990, -366411, -561824, -714427, -813649, -852236, -826148, -734804, -581529, -373687, -122115, 159914, 457658, 755607, 1038394, 1292470, 1508393, 1682736, 1818581, 1924219, 2010305, 2086283, 2157215, 2222332, 2276130, 2311666, 2324575, 2315985, 2292954, 2266261, 2246805, 2242483, 2256877, 2289614, 2337347, 2394545, 2454089, 2508053, 2548751, 2569971, 2568314, 2544352, 2502941, 2452166, 2401211, 2358199, 2328862, 2316172, 2320522, 2340235, 2372286, 2413043, 2458748, 2505642, 2549817, 2586854, 2611113, 2614909, 2588417]
39560B588417o7160j15268j63641k02283k21710k16698j88649j45361r8331n8649
39550A110667l3136k2416k1918k5278k7954k8783k8883k9400k9890k8171k1296
39539H13542p196J3637L7449N8383P1204P3793O7766N7144M6417L9352L8572M5263
39527A355326N8522P4821Q8321R2377Q1772N4649J3251l6818q8372j34526j70023
39516A389300j91852j99597j95612j84585j72030j62183j56427j53117j48673
39507a74776j39273j22480r8009o7248l1940O567M6622Q4906J16297J35699J40560
39496a03075J32220J15374R6294Q0714P2043P0587P4135P9450Q3563Q4256Q0154
39485H65715P1184N9217M8114M2549M5947N8559P6791R4384J05095J05519R6405
$$ y = [2588417, 2521257, 2405989, 2242348, 2040065, 1818355, 1601657, 1413008, 1267647, 1169316, 1110667, 1077531, 1055115, 1033197, 1007919, 979965, 951182, 922299, 892899, 863009, 834838, 813542, 806346, 819983, 857432, 915815, 987019, 1060812, 1128578, 1185722, 1232139, 1271491, 1310063, 1355326, 1413848, 1488669, 1576990, 1669367, 1751139, 1805788, 1819039, 1782221, 1693849, 1559323, 1389300, 1197448, 997851, 802239, 617654, 445624, 283441, 127014, -26103, -174776, -314049, -436529, -534538, -601786, -633726, -627159, -580537, -495631, -379334, -243635, -103075, 29145, 144519, 240813, 321527, 393570, 464157, 538292, 617742, 701305, 785561, 865715, 936899, 996116, 1044230, 1086779, 1132726, 1191285, 1268076, 1362460, 1467555, 1573074, 1669479]
39474A669479Q1717O6081N2319M0441K8666J5685K689o339o462N263K7491N4285
39462B031315P7150Q8437Q4463O6684M0320J1583j4608l5184m8077n1293m2876
39451B207914k1736J1318N3068R8248J40515J73752J93406J97670J87999J68289
39441C410443J42813J14224Q3059M8801J1171k9408p1801j14031j53182j86194
39431C255895k11335k28988k40888k48386k51272k48040k37172k18363j92776
39422A178675j62295j28569r2755n5974j9719J4366M4853P0362Q9143R9355J00318
39411A137760R3674Q3334P4238P0935P6576R2190J16080J43719J68676J84470
39401B241652J86463J72962J45312J07462O5363K6148l214j7652j5416J630K8921
$$ y = [1669479, 1751196, 1817277, 1869596, 1910037, 1938703, 1954388, 1957077, 1950738, 1944276, 1949539, 1977030, 2031315, 2108465, 2196902, 2281365, 2348049, 2388369, 2399952, 2385344, 2350160, 2302083, 2250790, 2207914, 2186178, 2197496, 2250564, 2348812, 2489327, 2663079, 2856485, 3054155, 3242154, 3410443, 3553256, 3667480, 3750539, 3799340, 3810511, 3781103, 3709302, 3595271, 3442089, 3255895, 3044560, 2815572, 2574684, 2326298, 2075026, 1826986, 1589814, 1371451, 1178675, 1016380, 887811, 795056, 739082, 719363, 733729, 778582, 848944, 938087, 1037442, 1137760, 1231434, 1314768, 1389006, 1459941, 1536517, 1628707, 1744787, 1888506, 2057182, 2241652, 2428115, 2601077, 2746389, 2853851, 2919214, 2945362, 2942148, 2924496, 2909080, 2910710, 2939631]
39390B939631O0568R0454J12844J23073J18559R9651O9475L2612o405m3626p5145
39379C521691r6604j03858r4867p1474l9683p876J6031K7101K4456J1186o478
39368C179625k0615k4016j3191R500L6061N5699N9002M1665O361l8020p9514j07359
39356C105198j15629j04879q1555n5652l7324l3406m5074o7682r2807j11570j17932
39345B241688j10724r3677p3312n5682m3642l6196l0129k2787j4133o729l904
39334A750773p604j7613l2231m9219o5855p8487q2867p5758n6845k9262J738L1030
39322A287800N5237P3037Q4545R0519R1688Q8118P8828O2204L7425N969k8123
39311A927247n9693q4606j01074j09634j12333j11835j10583j09944j09678j08341
$$ y = [2939631, 3000199, 3090653, 3203497, 3326570, 3445129, 3544780, 3614255, 3646867, 3640462, 3596836, 3521691, 3425087, 3321229, 3226362, 3154888, 3115205, 3107329, 3123360, 3150461, 3174917, 3186103, 3179625, 3159010, 3134994, 3121803, 3131303, 3167364, 3223063, 3282065, 3323730, 3330091, 3292071, 3212557, 3105198, 2989569, 2884690, 2803135, 2747483, 2710159, 2676753, 2631679, 2563997, 2471190, 2359620, 2241688, 2130964, 2037287, 1963975, 1908293, 1864651, 1828455, 1798326, 1775539, 1761406, 1754677, 1750773, 1743169, 1725556, 1693325, 1644106, 1578251, 1499764, 1416897, 1341139, 1284294, 1255032, 1256770, 1287800, 1343037, 1416074, 1500619, 1591138, 1682826, 1770944, 1849772, 1911976, 1949401, 1955370, 1927247, 1867554, 1782948, 1681874, 1572240, 1459907, 1348072, 1237489, 1127545, 1017867, 909526]
39301I09526j04608r8528r1641q5715q1049p5613o5711m7832k0697J3671N0468
39290C02271Q4031J10223J28032J39574J48556J58111J69332J81255J91974J99822
39280A813181K03804K03169J96732J82484J58034J22024P5984K5198k2562o0131
39270B897917q3933r4897r6983r4727r1466q8918q7788q8461r1219r5861j01166
39259A882498j04879j04448r8132q5663o8114m7357k5796o386P619J3650J1042
39248A374034J760r884j8371j8592p403J5529M8037Q6616J27560J67438K02978
39237A969702K30844K47729K51088K40366K18084J89759J62225J40973J27778
39228C778548J19823J11000R5191O9915L8100O877j5682k3972j7224m00J7005
$$ y = [909526, 804918, 706390, 614749, 529034, 447985, 372372, 306661, 258829, 238132, 251803, 302271, 386302, 496525, 624557, 764131, 912687, 1070798, 1240130, 1421385, 1613359, 1813181, 2016985, 2220154, 2416886, 2599370, 2757404, 2879428, 2955412, 2980610, 2958048, 2897917, 2813984, 2719087, 2622104, 2527377, 2435911, 2346993, 2259205, 2170744, 2079525, 1983664, 1882498, 1777619, 1673171, 1575039, 1489376, 1421262, 1373905, 1348109, 1341723, 1349342, 1362992, 1374034, 1375794, 1365910, 1347539, 1328947, 1321544, 1337073, 1385110, 1471726, 1599286, 1766724, 1969702, 2200546, 2448275, 2699363, 2939729, 3157813, 3347572, 3509797, 3650770, 3778548, 3898371, 4009371, 4104562, 4174477, 4212577, 4219454, 4203772, 4179800, 4162576, 4162176, 4179181]
39217D179181K4586J5836q695m1965p4119r6653j04898r8291p9317n2026k0847
39206C642792J0217L8019O0377P5768Q2736P9477O4023L5185o214n6410j08880
39195C917090j55936j91086k10967k15927k09266j95755j80136j66026j55530
39186B236461j49474j47687j49007j51271j51995j49659j44730j39529j36835
39177I16274j38181j42893j48464j51808j50350j42404j27192j05096p7994m8967
39167c17075k1176L258K3540L9739N2283O1901O9752P7328Q5913R5823J05992
39156B77278J14432J19584J21670J22926J26319J33601J44167J55421J64019J66960
39146A646377J62136J48879J28650J05088Q2505O3410M6971K9794Q396j8372m8325
$$ y = [4179181, 4203767, 4219603, 4210908, 4168943, 4094824, 3998171, 3893273, 3794982, 3715665, 3663639, 3642792, 3653009, 3691028, 3751405, 3827173, 3909909, 3989386, 4053409, 4088594, 4082380, 4025970, 3917090, 3761154, 3570068, 3359101, 3143174, 2933908, 2738153, 2558017, 2391991, 2236461, 2086987, 1939300, 1790293, 1639022, 1487027, 1337368, 1192638, 1053109, 916274, 778093, 635200, 486736, 334928, 184578, 42174, -85018, -190114, -268108, -317075, -338251, -334993, -311453, -271714, -219431, -157530, -87778, -10450, 75463, 171286, 277278, 391710, 511294, 632964, 755890, 882209, 1015810, 1159977, 1315398, 1479417, 1646377, 1808513, 1957392, 2086042, 2191130, 2273635, 2337045, 2384016, 2413810, 2422206, 2403834, 2355509]
39135B355509p6638r7748j07771j06223r6032q1827o7779n6522m9473m7589n1546
39124A516361o1072p4232q7500r6837r9125r2947p8434n6698k9667l24K7327M8919
39112I15771O0694O0284M7444K4928j102k2371l1569k5445n667K2964N5228Q7230
39100A188389J16684J42418J63603J79000J86624J84450J71823J50239J22578
39091B605808R1433N8157K3294j2463m7844q0994j09143j28117j32970j20464
39081B146697r1966n4391j8138O603J2957j178l3123p6380j22477j63313j93168
39070A412123k09560k13041k06415j93700j78769j63886j48964j32040j10772
39061a45024q3835n1518j5519K1333N5145Q1289R5718R7121Q8530P6806O9829
$$ y = [2355509, 2278871, 2181123, 2073352, 1967129, 1871097, 1789270, 1721491, 1664969, 1615496, 1567907, 1516361, 1455289, 1381057, 1293557, 1196720, 1097595, 1004648, 926214, 869516, 839849, 839525, 866852, 915771, 976465, 1036749, 1084193, 1109121, 1108019, 1085648, 1054079, 1028634, 1022967, 1045931, 1101159, 1188389, 1305073, 1447491, 1611094, 1790094, 1976718, 2161168, 2332991, 2483230, 2605808, 2697241, 2755398, 2778692, 2766229, 2718385, 2637391, 2528248, 2400131, 2267161, 2146697, 2054731, 2000340, 1982202, 1988805, 2001762, 2000584, 1967461, 1891081, 1768604, 1605291, 1412123, 1202563, 989522, 783107, 589407, 410638, 246752, 97788, -34252, -145024, -228859, -280377, -295896, -274563, -219418, -138129, -42411, 54710, 143240, 220046, 289875]
39050B89875P2898Q6460J06373J26233J40284J45351J41230J29827J14059R7185
39040A449775Q2815P4999P7672R3039J19497J50586J76395J87203J77377J47191
39030B736549J01844M8961l613m8972q1736r8816j00238q9335p1748n3464l8848
39019B300584k9616k5094k3353k2477k1305j9424j6658j2652p071k25O611J1633
39007B140953J3348J1011M361o914k3306m5022p1191r9208j24740j42734j49262
38996A507296j43155j26479j03463p8617n4998l3402j2781Q377L0435N1798O9419
38985A114430Q0294Q3029P8565O9751O0036N2105M7350M6297M9318N6768O8477
38974A806420Q3312R9265J14026J25711J33334J36722J35797J29801J17364R7378
$$ y = [289875, 362773, 449233, 555606, 681839, 822123, 967474, 1108704, 1238531, 1352590, 1449775, 1532590, 1607589, 1685261, 1778300, 1897797, 2048383, 2224778, 2411981, 2589358, 2736549, 2838393, 2887354, 2883741, 2834769, 2753033, 2654217, 2553979, 2464644, 2392896, 2339432, 2300584, 2270968, 2245874, 2222521, 2200044, 2178739, 2159315, 2142657, 2130005, 2122934, 2122709, 2129320, 2140953, 2154301, 2165312, 2169673, 2162759, 2139453, 2094431, 2023240, 1924032, 1799292, 1656558, 1507296, 1364141, 1237662, 1134199, 1055582, 1000584, 967182, 954401, 962778, 993213, 1045011, 1114430, 1194724, 1277753, 1356318, 1426069, 1486105, 1538210, 1585560, 1631857, 1681175, 1737943, 1806420, 1889732, 1988997, 2103023, 2228734, 2362068, 2498790, 2634587, 2764388, 2881752, 2979130]
38964B979130O9797L5661l110m3486q1139j11356j30952j39732j40313j36801
38954B297699j33288j32495j34564j36679j34366j24153j05782q2530n9686m2349
38944A211807l3546l3152l7819m2283m1668l3728j9594k454J4924L2071N0792
38933A065350P3438J00793J31027J60234J84028J99185K04312J99503J85568J63560
38923B666998J34770J00761O3372K4827j2011m3698o6968q0017q3303p9148p0247
38912B555336n8173m3180k5381n990J2927L0186M6884O5968R0399J21735J59902
38901B950613K03348K48555K89361L17488L24954L07341K66061K08110J43312
38892E259143Q0458K4601k3075o3361r7112j24852j47601j67463j86936k07341
$$ y = [2979130, 3048927, 3084588, 3081478, 3037992, 2956853, 2845497, 2714545, 2574813, 2434500, 2297699, 2164411, 2031916, 1897352, 1760673, 1626307, 1502154, 1396372, 1313842, 1254156, 1211807, 1178261, 1145109, 1107290, 1065007, 1023339, 989611, 970017, 967563, 982487, 1014558, 1065350, 1138788, 1239581, 1370608, 1530842, 1714870, 1914055, 2118367, 2317870, 2503438, 2666998, 2801768, 2902529, 2965901, 2990728, 2978717, 2935019, 2868051, 2788034, 2704731, 2625583, 2555336, 2497163, 2453983, 2428602, 2422612, 2435539, 2465725, 2512609, 2578577, 2668976, 2790711, 2950613, 3153961, 3402516, 3691877, 4009365, 4334319, 4641660, 4907721, 5115831, 5259143, 5339601, 5364202, 5341127, 5277766, 5180654, 5055802, 4908201, 4740738, 4553802, 4346461]
38882D346461k27513k43760k51370k47038k30809k06203j78305j51161j26362
38873B483940j03698q2857o4417m9260l7307k7314j8226j0647o628p842j3918
38862B061826k2499l0661l6235l8274l6875l2880k7505k2134j8397j8291k3623
38851A754452l4817n0206o6954q3298j00073j19988j44991j73885k02137k23879
38841E54224k34334k30881k12645j79891j34246p9513k1852L1367P3573J00653
38831c33545J11368J06842R0026O5587L9585J8187N817L990J1542K5602M2421
38820A87422N7949O8732P2932P0686O3387N2444L8591K2225M431j2191k3578k5290
38808E77740j4129J0463M5801Q6436J25493J56468J74655J77705J65556J40270
$$ y = [4346461, 4118948, 3875188, 3623818, 3376780, 3145971, 2939768, 2761463, 2610302, 2483940, 2380242, 2297385, 2232968, 2183708, 2146401, 2119087, 2100861, 2090214, 2083586, 2075744, 2061826, 2039327, 2008666, 1972431, 1934157, 1897282, 1864402, 1836897, 1814763, 1796366, 1778075, 1754452, 1719635, 1669429, 1602475, 1519177, 1419104, 1299116, 1154125, 980240, 778103, 554224, 319890, 89009, -123636, -303527, -437773, -517286, -539138, -507771, -434198, -333545, -222177, -115335, -25309, 40278, 79863, 98050, 103867, 107857, 119399, 145001, 187422, 245371, 314103, 387035, 457721, 521108, 573552, 612143, 634368, 638799, 626608, 603030, 577740, 563611, 574074, 619875, 706311, 831804, 988272, 1162927, 1340632, 1506188, 1646458]
38798A646458J05952O8476L4661J0942J939R246L0895O1755R4737J22483J39120
38787B326664J41648J30402J08112P8035M2498K894l9203q1174j19648j51641
38777B438587j75484j90745j97354j94809j82428j60561j31668j00236p1439m9474
38767I84389l6339l1314l1221l1669k9136k2797j4809q743p302j0935j7957k5513
38755G16654l0332k9035j8626K426L3107O9733J07115J40165J65055J79518J82491
38744A518271J73549J52616J20289P8581L1416j5698n6678q6066j00183r7963
38734A718134q1172n3615j9829J5892M9667P7809R6718J03152R4895P1752L6302
38723B109705o465n0834r2172j27421j54193j69690j70787j55179j22676p5684
$$ y = [1646458, 1752410, 1820886, 1855547, 1866489, 1868428, 1877674, 1908569, 1970324, 2065061, 2187544, 2326664, 2468312, 2598714, 2706826, 2784861, 2827359, 2830253, 2791050, 2709876, 2590228, 2438587, 2263103, 2072358, 1875004, 1680195, 1497767, 1337206, 1205538, 1105302, 1033863, 984389, 948050, 916736, 885515, 853846, 824710, 801913, 787104, 778361, 771059, 760124, 742167, 716654, 686322, 657287, 638661, 641087, 674194, 743927, 851042, 991207, 1156262, 1335780, 1518271, 1691820, 1844436, 1964725, 2043306, 2074722, 2059024, 2002346, 1916280, 1816097, 1718134, 1636962, 1583347, 1563518, 1579410, 1629077, 1706886, 1803604, 1906756, 2001651, 2073403, 2109705, 2103240, 2052406, 1960234, 1832813, 1678620, 1508930, 1338143, 1182964, 1060288, 984604]
38713I84604j8753M2359J01548J53048J92259K16666K26268K23006K09565J88440
38703B519010J61602J30387R5379N6485J3498l3191q1970j29678j71847k03813
38693B355862k22448k27275k19997k02835j77118j43173j01365n3475l426M3137
38683A047887Q0285J03331J09340R6547O3688J0448o0810j43162k24907k91929
38673G90718l32020l38979l14385k66276k05727j43012q4940l4209R314M6351
38663h73165P6368R7182J06156J02180Q7227O6300M5821L1480K6760L2305M5704
38652a55682O1653P3241P4460O2748L9857J0589j9333m4634o0593o2914m8598
38641f9206j7625K5924P4739J20708J57410J81364J91979J90898J81073J65736
$$ y = [984604, 965851, 1008210, 1109758, 1262806, 1455065, 1671731, 1897999, 2121005, 2330570, 2519010, 2680612, 2810999, 2906378, 2962863, 2976361, 2943170, 2861200, 2731522, 2559675, 2355862, 2133414, 1906139, 1686142, 1483307, 1306189, 1163016, 1061651, 1008176, 1004750, 1047887, 1128172, 1231503, 1340843, 1437390, 1501078, 1511526, 1450716, 1307554, 1082647, 790718, 458698, 119719, -194666, -460942, -666669, -809681, -894621, -928830, -919516, -873165, -796797, -699615, -593459, -491279, -404052, -337752, -291931, -260451, -233691, -201386, -155682, -94029, -20788, 53672, 116420, 156277, 166866, 147533, 102899, 42306, -20608, -69206, -86831, -60907, 13832, 134540, 291950, 473314, 665293, 856191, 1037264, 1203000]
38631A203000J47440J27501J06006Q2298N5830K7037k270k9307n1286o6436p4669
38620A525144p7865p9615q4344r5675j14653j38885j63446j83232j95086j98234
38610A94109j93241j81092j63289j42133j19987r7731p4107m6783j4468K1495
38600h17227N6958Q6418J05610J14132J16470J20304J32735J56599J89025K22838
38590D83862K49549K62051K55876K29346J83378J21452M9415k5105r3629j48067
38580A568128j82226j93295j82405j53788j13152o6328j8681K5241O2194R0603
38570H36291J10405J22512J28226J28889J25780J20359J14527J10356J09027J09870
38560B016242J10725J09654J06501J02835J00405R9561R8888R6233R0111Q0516
$$ y = [1203000, 1350440, 1477941, 1583947, 1666245, 1722075, 1749112, 1746842, 1717535, 1666249, 1599813, 1525144, 1447279, 1367664, 1283320, 1187645, 1072992, 934107, 770661, 587429, 392343, 194109, 868, -180224, -343513, -485646, -605633, -703364, -777471, -824254, -838722, -817227, -760269, -673851, -568241, -454109, -337639, -217335, -84600, 71999, 261024, 483862, 733411, 995462, 1251338, 1480684, 1664062, 1785514, 1834929, 1809824, 1716195, 1568128, 1385902, 1192607, 1010202, 856414, 743262, 676934, 658253, 683494, 745688, 836291, 946696, 1069208, 1197434, 1326323, 1452103, 1572462, 1686989, 1797345, 1906372, 2016242, 2126967, 2236621, 2343122, 2445957, 2546362, 2645923, 2744811, 2841044, 2931155, 3011671]
38550C011671O8687N6313M4986L6154L0989K9765L1214L2744L1621K6039J5281
38539C415464o43k0980m3627o4945q0734q7886q5423p4342n6953l6732j8391p112
38527B837696o490j6450l2950m9921o2204o7627o7324o4444o2265o2774o6338
38516B278909p2307p9734q7705r5278j01375j04726j04052r8511q8460p5898o4015
38505A306848n5660n1639n0056m7396m0713k9269j4492J405J6805L1154M4726
38494A111713N8239P2467Q7926J04710J22490J40292J56113J66975J70033J63998
38484B354956J49783J29881J07361Q5347O6888N4575M9698N1479N7078O2576O4381
38473C234003O0322N0212L6027K1748J2230J0888J7255K6369L0763K3987L607
$$ y = [3011671, 3080358, 3136671, 3181657, 3217811, 3248800, 3278565, 3309779, 3342523, 3374144, 3400183, 3415464, 3414821, 3393841, 3350214, 3285269, 3204535, 3116649, 3031226, 2956884, 2899931, 2863199, 2844808, 2837696, 2831206, 2814756, 2781806, 2731885, 2669681, 2602054, 2534730, 2470286, 2408021, 2345247, 2278909, 2206602, 2126868, 2039163, 1943885, 1842510, 1737784, 1633732, 1535221, 1446761, 1370863, 1306848, 1251188, 1199549, 1149493, 1102097, 1061384, 1032115, 1017623, 1019028, 1035833, 1066987, 1111713, 1169952, 1242419, 1330345, 1435055, 1557545, 1697837, 1853950, 2020925, 2190958, 2354956, 2504739, 2634620, 2741981, 2827328, 2894216, 2948791, 2998489, 3049968, 3107046, 3169622, 3234003, 3294325, 3344537, 3380564, 3402312, 3414542, 3425430, 3442685, 3469054, 3499817, 3523804, 3527411]
38462C527411k7768o3560r5759j17864j27025j24541j14660j02481r2033q5261
38452B576459q1964q0340p7768p1704o0691m5079k7025r670M013J1938J2972O682
38440B157823o787k6440n0047p4039r3989j05464j04888r0253o1701k1998K3478
38429A545695O7548J02818J23472J26625J12731Q5163M9301J1473k2354m8129
38419B154343o5012p5524q4152r5089j10377j29307j48924j65046j73336j70468
38409I37108j55310j29584r7250o2770k9414J118K7828M9441O4384P1712P2198
38398G49461O8727O5525O6420P3120Q4553R7729J09425J17612J21995J23644J23995
38387A802206J23748J22181J17220J06371Q8164O3562L6411J2415k910o028L889
$$ y = [3527411, 3499643, 3436083, 3340324, 3222460, 3095435, 2970894, 2856234, 2753753, 2661720, 2576459, 2494495, 2414155, 2336387, 2264683, 2203992, 2158913, 2131888, 2122218, 2126231, 2138169, 2151141, 2157823, 2151036, 2124596, 2074549, 2000510, 1906521, 1801057, 1696169, 1605916, 1544215, 1522217, 1545695, 1613243, 1716061, 1839533, 1966158, 2078889, 2164052, 2213353, 2224826, 2202472, 2154343, 2089331, 2013807, 1929655, 1834566, 1724189, 1594882, 1445958, 1280912, 1107576, 937108, 781798, 652214, 554964, 492194, 462780, 463898, 491726, 541167, 605551, 677263, 749461, 818188, 883713, 950133, 1023253, 1107806, 1205535, 1314960, 1432572, 1554567, 1678211, 1802206, 1925954, 2048135, 2165355, 2271726, 2359890, 2423452, 2459863, 2472278, 2469368, 2463340, 2467229]
38376B467229K5185N4294Q6479J16823J41187J56792J62281J57622J43953J23366
38366C635211R8585P2559M7843K5996P478p708j9263k6671l0016l0447k9553k8177
38354C715837k5829k1155j3273l267N146O574l577k6654o0245r9992j42217j85227
38342C146121k28578k71326l11016l44210l68019l81384l85371l82555l75878
38333I7784l67175l55707l37494l06409k57078j88163j04164j4512O9486J38252
38323a625180J86463K13686K23469K21541K13916K05381J98803J95415J95630
38314B29124J99551K06669K15163K21778K22638K14497J95603J66016J27486Q2953
38304B081478L5637j1818n7357r8629j32108j53248j57728j43143j10172o2805
$$ y = [2467229, 2492414, 2546708, 2633187, 2750010, 2891197, 3047989, 3210270, 3367892, 3511845, 3635211, 3733796, 3806355, 3854198, 3880194, 3887672, 3879964, 3860701, 3834030, 3804014, 3773567, 3744014, 3715837, 3690008, 3668853, 3655580, 3652313, 3657459, 3664033, 3660456, 3633802, 3573557, 3473565, 3331348, 3146121, 2917543, 2646217, 2335201, 1990991, 1622972, 1241588, 856217, 473662, 97784, -269391, -625098, -962592, -1269001, -1526079, -1714242, -1818406, -1832918, -1763432, -1625180, -1438717, -1225031, -1001562, -780021, -566105, -360724, -161921, 33494, 229124, 428675, 635344, 850507, 1072285, 1294923, 1509420, 1705023, 1871039, 1998525, 2081478, 2117115, 2105297, 2047940, 1949311, 1817203, 1663955, 1506227, 1363084, 1252912, 1190107]
38294A190107p553M7911R5988J30049J45306J39936J16052P9718L9819O097j3253
38283A970177j4025K468K9906N9675Q4385J00328J07822J09671J08771J06228
38273B665406J01017R1101P4953N2410K4869m750l2300n3481o5638o9114o7111
38262B717362o4143o4125o9020p8388q9648r9005j02958r9993r1732q2774p8978
38251A796598q4795j00993j24058j47669j65499j73783j72336j63704j51200j37139
38241C75422j22138j05617q6903o6247m5306k6757j3025m460J825J1256K9327
38230e2623N8915R9195J46460J95727K41801K79652L04718L13512L04280K77278
38220B168915K34466J78973J14765M6695j9433p7371j21555j48409j57129j49733
$$ y = [1190107, 1182554, 1230465, 1326453, 1456502, 1601808, 1741744, 1857796, 1937514, 1977333, 1983430, 1970177, 1956152, 1958620, 1988526, 2048201, 2132586, 2232914, 2340736, 2450407, 2559178, 2665406, 2766423, 2857524, 2932477, 2984887, 3009756, 3005006, 2972706, 2919225, 2853587, 2784473, 2717362, 2653219, 2589094, 2520074, 2441686, 2352038, 2253033, 2150075, 2050082, 1958350, 1875576, 1796598, 1711803, 1610810, 1486752, 1339083, 1173584, 999801, 827465, 663761, 512561, 375422, 253284, 147667, 60764, -5483, -50789, -77546, -90571, -95031, -93206, -81950, -52623, 6292, 105487, 251947, 447674, 689475, 969127, 1273845, 1587357, 1891637, 2168915, 2403381, 2582354, 2697119, 2743814, 2724381, 2647010, 2525455, 2377046, 2219917, 2070184]
38210B070184j30497j04892p8146n3894l3439j6167q92J2476K1814K2936J1078
38199A720561j6778n9807j12482j65519k08404k32410k32871k09981j68249j14993
38189A99067n8247m440M3131Q4085J18974J46960J64887J68585J55635J27717
38179A146354R0903N3612K3559N627J639J1308L3078O4207J00694J37771J70906
38168A839658J96505K12000K15759K07553J89288J65034J39746J17335R9290Q4637
38158C466805P0814N4742L3569N308l0240p0448j09678j40885j58567j61144j51069
38147B809207j32693j09746q4038n5730k4418R622M4497P6282R9437J08081R7680
38136B838181O6682J7578m3085j05988j61547k02706k26688k34708k30002k15778
$$ y = [2070184, 1939687, 1834795, 1756649, 1702755, 1669316, 1653149, 1652257, 1664733, 1686547, 1709483, 1720561, 1703783, 1643976, 1531494, 1365975, 1157571, 925161, 692290, 482309, 314060, 199067, 140820, 136380, 179511, 263596, 382570, 529530, 694417, 863002, 1018637, 1146354, 1237257, 1290869, 1314428, 1320055, 1321694, 1333002, 1366080, 1430287, 1530981, 1668752, 1839658, 2036163, 2248163, 2463922, 2671475, 2860763, 3025797, 3165543, 3282878, 3382168, 3466805, 3537619, 3592361, 3625930, 3631238, 3600998, 3530550, 3420872, 3279987, 3121420, 2960276, 2809207, 2676514, 2566768, 2482730, 2427000, 2402582, 2412204, 2456701, 2532983, 2632420, 2740501, 2838181, 2904863, 2922441, 2879356, 2773368, 2611821, 2409115, 2182427, 1947719, 1717717, 1501939]
38126A501939j94544j68917j42450j19369j03046r4311r0647q6860p6967n6429
38116C68399k3747J9108O7192J13769J52016J76838J85928J79632J60231J31643
38106A531009R9389O9710M7580L4796K9676K8471K7242K3146J4876K629j2239
38095A896285k7753m1840n2654n8619n8450n1448l8180k1191n038M723L310j1681
38083A537464l9423p5898j14612j47870j68418j71241j55200j23944q5220m8076
38073D07562j9012M68J3067K2413L0054L4837L4372K6819J1893q809l1786n2097
38061D69781o4610o5709n4616l3720p784J7393L6278M4591M0143K3678p18k6441
38049C78266m6587n6420n4523m2175k1872L725L1968O0032Q4848J03206J12050
$$ y = [1501939, 1307395, 1138478, 996028, 876659, 773613, 679302, 588655, 501795, 424828, 368399, 344652, 363760, 430952, 544721, 696737, 873575, 1059503, 1239135, 1399366, 1531009, 1630398, 1700108, 1747688, 1782484, 1812160, 1840631, 1867873, 1891019, 1905895, 1908524, 1896285, 1868532, 1826692, 1774038, 1715419, 1656969, 1605521, 1567341, 1546150, 1541112, 1545835, 1549145, 1537464, 1498041, 1422143, 1307531, 1159661, 991243, 820002, 664802, 540858, 455638, 407562, 388550, 389018, 402085, 424498, 454552, 489389, 523761, 550580, 562473, 553664, 521878, 469781, 405171, 339462, 284846, 251126, 243342, 260735, 297013, 341604, 381747, 405425, 404707, 378266, 331679, 275259, 220736, 178561, 156689, 160414, 192382, 252414, 337262, 440468, 552518]
38038E52518J08983R3076O5737L0954n530l8134o3427q0933r2072r7881r7137
38027C76154q6204o0843j8964L7028R9733J58508K02808K25430K24152K01381
38017A359183J62598J14718O5139K1380r333k1193j1652J7200N8893J04583J45668
38006B007184J75802J92053J95262J89281J78773J66355J50982J28868R6374N2864
37996C533798J667n1093r8811j36501j61909j75777j81450j83831j87507j94732
37986B163854k04510k13567k18516k17510k10435j98058j81237j60913j38482
37977D20626j15769r4178p3447n1134k3652J1475N3674R9083J42167J77939K03313
37966G50097K17174K19691K11590J93788J67408J34170R6954N9880K7409K908
$$ y = [552518, 661501, 754577, 820314, 851268, 845738, 807604, 744177, 663244, 571172, 473291, 376154, 289950, 229107, 210143, 247171, 346904, 505412, 708220, 933650, 1157802, 1359183, 1521781, 1636499, 1701638, 1723018, 1713685, 1692492, 1680840, 1698040, 1756933, 1861516, 2007184, 2182986, 2375039, 2570301, 2759582, 2938355, 3104710, 3255692, 3384560, 3480934, 3533798, 3535465, 3484372, 3385561, 3249060, 3087151, 2911374, 2729924, 2546093, 2358586, 2163854, 1959344, 1745777, 1527261, 1309751, 1099316, 901258, 720021, 559108, 420626, 304857, 210679, 137232, 86098, 62446, 73921, 127595, 226678, 368845, 546784, 750097, 967271, 1186962, 1398552, 1592340, 1759748, 1893918, 1990872, 2050752, 2078161, 2081069]
37956B081069j2128j7529j3461m34J9624M2767O4270Q0914R2203R9443J03765
37945B540503J04972J01768R2539P5983N1797K1666j0109l7375n4245n7293m6624
37934B783582k5639R9K4585M3259N4098N7213N3425M3278K7216O339j7229m0497
37922C009729n9977p2163p4223o4686m3758j3269K3386O1464R5605J21243J35956
37911C119307J40095J36260J27827J17130J04296Q7597O5097L6395L313l0611
37901C906706o1199q4902r9952j07144j09721j12251j18828j31329j48551j66697
37891B766132j80982j87422j84013j71179j51621j29357j07904q8452o9620m9293
37881A446289k7140n573J1759K2613K7573K9069K9024K7329K2484J3611K014q987
$$ y = [2081069, 2068941, 2051412, 2037951, 2037517, 2057141, 2099908, 2164178, 2245092, 2337295, 2436738, 2540503, 2645475, 2747243, 2839782, 2915765, 2967562, 2989228, 2979119, 2941744, 2887499, 2830206, 2783582, 2757943, 2758042, 2782627, 2825886, 2879984, 2937197, 2990622, 3033900, 3061116, 3067455, 3050226, 3009729, 2949752, 2877589, 2803366, 2738680, 2694922, 2681653, 2705039, 2766503, 2862108, 2983351, 3119307, 3259402, 3395662, 3523489, 3640619, 3744915, 3832512, 3897609, 3934004, 3937317, 3906706, 3845507, 3760605, 3660653, 3553509, 3443788, 3331537, 3212709, 3081380, 2932829, 2766132, 2585150, 2397728, 2213715, 2042536, 1890915, 1761558, 1653654, 1565202, 1495582, 1446289, 1419149, 1413576, 1425335, 1447948, 1475521, 1504590, 1533614, 1560943, 1583427, 1597038, 1599052, 1590065]
37869A590065j5810j6831j3841j1635j5654k8868m9924p3578r2936j01919r6935
37858A072134p7521m6014o575L6108P7911J15777J47610J71808J87022J92522
37848A870782J88944J78458J63870J47165J28637J07285Q2199N4137K6379M028
37838B951884q251q937r89R284J5224J2907K675j1614k5024l4199l8770m0979
37826B823211m4083n0719o1808p6036q9795r7758r4541p7207m7380j1426K1857
37815B194315M4670N2780M6129K8013L690k1185m2190n7411o7702p5805q4957
37804B020347r7542j14164j33164j50764j62015j62477j50097j26365r5906o4524
37794G63329l6758j4437L074J7593L1103M5679O3839Q8251J20449J59203J99835
$$ y = [1590065, 1574255, 1557424, 1543583, 1531948, 1516294, 1487426, 1437502, 1363924, 1270988, 1169069, 1072134, 994613, 948599, 942024, 978132, 1056043, 1171820, 1319430, 1491238, 1678260, 1870782, 2059726, 2238184, 2402054, 2549219, 2677856, 2785141, 2867340, 2921477, 2947856, 2951884, 2943633, 2934696, 2933707, 2942991, 2958215, 2971122, 2973797, 2962183, 2937159, 2902960, 2864190, 2823211, 2779128, 2728409, 2666601, 2590565, 2500770, 2403012, 2308471, 2231264, 2183884, 2172458, 2194315, 2238985, 2291765, 2337894, 2365907, 2369597, 2348412, 2306222, 2248811, 2181109, 2105304, 2020347, 1922805, 1808641, 1675477, 1524713, 1362698, 1200221, 1050124, 923759, 827853, 763329, 726571, 712134, 715208, 732801, 763904, 809583, 873422, 961673, 1082122, 1241325, 1441160]
37783A441160K35204K58143K64343K54149K32166K04744J76956J50978J26486
37774C344329J02095P6585M9589K1904m701k8345m8081o4223p7794q9759j00784
37763C180815j11557j23188j37214j54926j76005j97401k13732k19617k12506
37754A634669j93939j68422j41218j16707r7937q6579q2473q3180q4472q2162
37744D97580p4126o1017m5327k9848j6746p282j646J421M736J2058K6776N0493
37732C57072Q2011J17295J50389J75053J86548J83112J66560J41592J13872Q8093
37722A761597O7327N3691M9052N4689P0272R3383J20058J45897J67225J81982
37712B765173J90067J92814J91758J87672J80398J69231J53177J31270J03337
$$ y = [1441160, 1676364, 1934507, 2198850, 2452999, 2685165, 2889909, 3066865, 3217843, 3344329, 3446424, 3523009, 3572598, 3594502, 3589801, 3561456, 3513375, 3449152, 3371358, 3281599, 3180815, 3069258, 2946070, 2808856, 2653930, 2477925, 2280524, 2066792, 1847175, 1634669, 1440730, 1272308, 1131090, 1014383, 916446, 829867, 747394, 664214, 579742, 497580, 423454, 362437, 317110, 287262, 270516, 263234, 261588, 263009, 267745, 279803, 306579, 357072, 439083, 556378, 706767, 881820, 1068368, 1251480, 1418040, 1559632, 1673504, 1761597, 1828924, 1882615, 1931667, 1986356, 2056628, 2150011, 2270069, 2415966, 2583191, 2765173, 2955240, 3148054, 3339812, 3527484, 3707882, 3877113, 4030290, 4161560, 4264897]
37703D264897P1099L8370R699j1846k6011l4885m1252m7044n2761n7810o1347
37692D051109o3129o3778o4175o4415o3302n8935m9842l5734j7485L071K3033
37681C596418L8235M3788L5827J3744j8695n4612q7131j12137j28780j37906j40199
37670C048552j35493j22997j01771p1319l2604J0973N3677Q9003J11851J20100
37660B969972J14917R9915P9508N7219L4848J2962p824k6028l9576m7004m8447
37649C200462m5619m0589l4165k5153j1322Q503L2755N7150P6401Q6595Q6970
37638C391988Q0199P0876O2823N6906N0996M1970K8019R440j2015l3938n3383
37627C693881o6750p0171o0458l6187J517M8757R9392J46155J81920K00872J99844
$$ y = [4264897, 4335996, 4374366, 4384065, 4372219, 4346208, 4311323, 4270071, 4223027, 4170266, 4112456, 4051109, 3987980, 3924202, 3860027, 3795612, 3732310, 3673375, 3623533, 3587799, 3570314, 3573385, 3596418, 3634653, 3678441, 3714268, 3728012, 3709317, 3654705, 3567574, 3455437, 3326657, 3188751, 3048552, 2913059, 2790062, 2688291, 2616972, 2584368, 2595341, 2649018, 2738021, 2849872, 2969972, 3084889, 3184804, 3264312, 3321531, 3356379, 3369341, 3361517, 3335489, 3295913, 3248909, 3200462, 3154843, 3114254, 3080089, 3054936, 3043614, 3052117, 3084872, 3142022, 3218423, 3305018, 3391988, 3472187, 3543063, 3605886, 3662792, 3713788, 3755758, 3783777, 3793217, 3781202, 3747264, 3693881, 3627131, 3556960, 3496502, 3460315, 3461832, 3510589, 3609981, 3756136, 3938056, 4138928, 4338772]
37616D338772J79687J45789J06776P1781M7742L7910M1676N5471P4569R5160J15336
37605E310669J34220J50297J60999J64186J59998J51093J41093J32743J27073
37596F632371J23575J20465J14757J02533P9912M4410m029o2813j27255j91504
37586F832422k49601k96536l28994l45548l46196l31771l03710k64266k16545
37577D149255j63995j09679n6120n804L8504P4303J00273J16493J23798J23262
37567D390290J16601J07013R9397R9414J11880J39236J80575K31541K85326L34628
37557F095901L73932M01148M17806M27575M33570M35834M30617M12202L76310
37548I804895L22856K56127J82306J06139K9089n0004j32499k17549l01050l76296
$$ y = [4338772, 4518459, 4664248, 4771024, 4842805, 4890547, 4928457, 4970133, 5025604, 5100173, 5195333, 5310669, 5444889, 5595186, 5756185, 5920371, 6080369, 6231462, 6372555, 6505298, 6632371, 6755946, 6876411, 6991168, 7093701, 7173613, 7218023, 7213994, 7151181, 7023926, 6832422, 6582821, 6286285, 5957291, 5611743, 5265547, 4933776, 4630066, 4365800, 4149255, 3985260, 3875581, 3819461, 3813657, 3852161, 3926464, 4026737, 4143230, 4267028, 4390290, 4506891, 4613904, 4713301, 4812715, 4924595, 5063831, 5244406, 5475947, 5761273, 6095901, 6469833, 6870981, 7288787, 7716362, 8149932, 8585766, 9016383, 9428585, 9804895, 10127751, 10383878, 10566184, 10672323, 10701412, 10651408, 10518909, 10301360, 10000310, 9624014]
37538I624014m35879m74063m88658m81533m57416m21595l77978l28670k75047
37529E883175k19142j64056j13257o9489l4078o721J4449L2512N0989P2785R9410
37518E546577J30927J66703K06382K50377K99268L52454M07090M58306N00464
37509H318548N28459N38131N25996M89160M26029L37560K28222J05771k0278j40852
37499A1336746k49084l40955m14809m70263n07171n25308n25042n08599m80605
37490G314910m47003m12772l80161l48773l17188k84657k51592k18930j87204
37481D466630j56249j25821r6885p2558n7678n6613p0497r5776j25294j51341
37471C457918j68788j76468j76320j71278j63662j54931j46319j39042j33687
$$ y = [9624014, 9188135, 8714072, 8225414, 7743881, 7286465, 6864870, 6486892, 6158222, 5883175, 5664033, 5499977, 5386720, 5317231, 5283153, 5276432, 5290881, 5323393, 5374382, 5447167, 5546577, 5677504, 5844207, 6050589, 6300966, 6600234, 6952688, 7359778, 7818084, 8318548, 8847007, 9385138, 9911134, 10400294, 10826323, 11163883, 11392105, 11497876, 11477598, 11336746, 11087662, 10746707, 10331898, 9861635, 9354464, 8829156, 8304114, 7795515, 7314910, 6867907, 6455135, 6074974, 5726201, 5409013, 5124356, 4872764, 4653834, 4466630, 4310381, 4184560, 4087675, 4015117, 3957439, 3900826, 3830329, 3734553, 3609259, 3457918, 3289130, 3112662, 2936342, 2765064, 2601402, 2446471, 2300152, 2161110, 2027423]
37462B027423j29467j24255j15209r9388p4341l9179L993M9526Q9660J17369J28939
37451A835071J24844J09015Q7451O6803N2852M8960N5280O9491Q8642J10657J34289
37440B783355J57960J78711J92235J93969J80830J52868J13966P0960L1478J735
37430D058067j4716j7171p420J0714L1863M9715N8125N2709L2389jl8403p4905
37418D140966j01303j10814r9887o9497k5161K4327O8809R9073J09358R9399P4826
37407D210096M5323K1296J0457J5517L3582N7458P8265Q8253Q2851O1810K9667
37396D734575m770l0534l8210k3663J0380N5842J02864J43278J72371J88856J93725
37385E504714J88899J76410J58540J38486J20284J07176R9241R2414Q0025N5984
$$ y = [2027423, 1897956, 1773701, 1658492, 1559104, 1484763, 1445584, 1449577, 1499103, 1588763, 1706132, 1835071, 1959915, 2068930, 2156381, 2223184, 2276036, 2324996, 2380276, 2449767, 2538409, 2649066, 2783355, 2941315, 3120026, 3312261, 3506230, 3687060, 3839928, 3953894, 4024854, 4056332, 4058067, 4043351, 4026180, 4018760, 4029474, 4061337, 4111052, 4169177, 4221886, 4254275, 4254274, 4215871, 4140966, 4039663, 3928849, 3828962, 3759465, 3734304, 3758631, 3827440, 3926513, 4035871, 4135270, 4210096, 4255419, 4276715, 4287172, 4302689, 4336271, 4393729, 4471994, 4560247, 4643098, 4704908, 4734575, 4729805, 4699271, 4661061, 4637398, 4647778, 4703620, 4806484, 4949762, 5122133, 5310989, 5504714, 5693613, 5870023, 6028563, 6167049, 6287333, 6394509, 6493750, 6586164, 6666189, 6722173]
37375F722173J7471l4194r4370j56613k14123k60816k92148l05800l02184k84525
37365D794871k58170k29223k02865j82026j66822j55009j43256j28730j10315
37356C218455q9008o7376m8573l5520l0417l4241m6003o2379p8710r1248r9097
37345B535883j04206j09440j16319j23945j29435j29197j20273j01264p2597l6253
37335A492954M722M6614Q5619J18684J44497J63825J78696J90622J98941K00475
37325B825649J90855J66737J27407P4888J3077n3039j17520j73587k14631k36214
37315B603622k38142k25119k05129j85958j71543j60332j46705j24569r0869m6957
37305A008299K552N2222R7767J36732J68250J92753K11865K27896K42356K54249
$$ y = [6722173, 6739644, 6705450, 6611080, 6454467, 6240344, 5979528, 5687380, 5381580, 5079396, 4794871, 4536701, 4307478, 4104613, 3922587, 3755765, 3600756, 3457500, 3328770, 3218455, 3129447, 3062071, 3013498, 2977978, 2947561, 2913320, 2867317, 2804938, 2726228, 2634980, 2535883, 2431677, 2322237, 2205918, 2081973, 1952538, 1823341, 1703068, 1601804, 1529207, 1492954, 1497676, 1544290, 1629909, 1748593, 1893090, 2056915, 2235611, 2426233, 2625174, 2825649, 3016504, 3183241, 3310648, 3385536, 3398613, 3345574, 3228054, 3054467, 2839836, 2603622, 2365480, 2140361, 1935232, 1749274, 1577731, 1417399, 1270694, 1146125, 1055256, 1008299, 1010851, 1063073, 1160840, 1297572, 1465822, 1658575, 1870440, 2098336, 2340692, 2594941]
37295B594941K59772K54270K35260K04314J66511J28232R4852O9232N1014L6773
37285D095171K1420P32k6323n6979q6023j08016j19133j18114j06315q6801o2745
37274C346874l6324r020J7078L8629N2047N5346M9305L7101K2913J0381J593l016
37262C582907l914j427M800J5362L0208M8117O6938Q4236R7637J04732J03111
37251D132707R1162O9372M1156J2227j1344k5631l0619l0206l0145l4992m6084
37240D137603o1695p8661r3870j04851j09914j08222r9678q4530o3078l5917m375
37229C292812K9389O2925R4370J22869J47968J68106J79661J77870J59556J25620
37219D561146Q1515L5418m609l3005m7664m9255l9835k2121K5K1179L5419L8572
$$ y = [2594941, 2854713, 3108983, 3344243, 3548557, 3715068, 3843300, 3938152, 4007384, 4058398, 4095171, 4116591, 4117323, 4091000, 4034021, 3947998, 3839982, 3720849, 3602735, 3496420, 3409619, 3346874, 3310550, 3301530, 3318608, 3357237, 3409284, 3464630, 3513935, 3551036, 3573949, 3584330, 3585923, 3582907, 3578993, 3577566, 3582366, 3597728, 3627936, 3676053, 3742991, 3827227, 3924864, 4029596, 4132707, 4223869, 4293241, 4334397, 4346624, 4335280, 4309649, 4279030, 4248824, 4218679, 4183687, 4137603, 4075908, 3997247, 3903377, 3798526, 3688612, 3580390, 3480712, 3396182, 3333104, 3297187, 3292812, 3322201, 3385126, 3479496, 3602365, 3750333, 3918439, 4098100, 4275970, 4435526, 4561146, 4642661, 4678079, 4673470, 4640465, 4592801, 4543546, 4503711, 4481590, 4481615, 4502794, 4538213, 4576785]
37207D576785K9854J1619j2031l6411n6679o8135o7233n3030k8073K430L2931
37196D332027N9758Q1679R8862J11681J20343J25160J26735J25990J24253J23188
37186E429676J24108J26854J29136J27168J17264R7320O7234K8352j7061o5770
37176F164281j13142j53190j79435j86323j70657j32704p6453q925O1260J25354
37166E330066J75708K06752K15746K03168J72604J30230Q3677M0122M136k3229
37156F538980m3367n7869o6823o8677o1469m4552j9816Q278L4212N3704O5529
37145F338130P1793P6565Q3486R3560J04283J10649J07452R1681O3810K7552j1581
37134G157380m7976p6944r4844r9018q8225o3442k8246J1643M9408P8585R4653
$$ y = [4576785, 4606639, 4618258, 4606227, 4569816, 4513137, 4445002, 4377769, 4324739, 4296666, 4299096, 4332027, 4391785, 4473464, 4572326, 4684007, 4804350, 4929510, 5056245, 5182235, 5306488, 5429676, 5553784, 5680638, 5809774, 5936942, 6054206, 6151526, 6218760, 6247112, 6230051, 6164281, 6051139, 5897949, 5718514, 5532191, 5361534, 5228830, 5152377, 5143452, 5204712, 5330066, 5505774, 5712526, 5928272, 6131440, 6304044, 6434274, 6517951, 6558073, 6562209, 6538980, 6495613, 6437744, 6370921, 6302244, 6240775, 6196223, 6176407, 6184685, 6218897, 6272601, 6338130, 6409923, 6486488, 6569974, 6663534, 6767817, 6878466, 6985918, 7077599, 7141409, 7168961, 7157380, 7109404, 7032460, 6937616, 6838598, 6750373, 6686931, 6658685, 6670328, 6719736, 6798321, 6892974]
37123F892974R6249Q5159O5077M0174J4424q500k5547l5057l7219l3661k6359
37112G027714j6581m428J0748K9261M9896O9640Q4782R2968R4777R3656R4101
37101G626534R9324J09914J24091J38839J50788J56470J52678J37612J12239Q0744
37091H889233M9414K4738J1640J2088K4119M1905N7806O5802O4321N6676M9362
37080I347104M9605O3125R2078J33630J80356K23107K55231K75447K87454K96453
37070A1203590L04894L10248L06187K86279K47851J93714J30908O7365Q866m1655
37060A3018247q2247j09760j19846j09432p9487l5734J3035N7755R1673J12038
37050A2756242J20414J21254J19195J16450J12045J03362Q8844O9716M9593L2689
$$ y = [6892974, 6989223, 7074382, 7139459, 7179633, 7194057, 7185557, 7160010, 7124953, 7087734, 7054073, 7027714, 7011133, 7006705, 7017453, 7046714, 7096610, 7166250, 7251032, 7344000, 7438777, 7532433, 7626534, 7725858, 7835772, 7959863, 8098702, 8249490, 8405960, 8558638, 8696250, 8808489, 8889233, 8938647, 8963385, 8975025, 8987113, 9011232, 9053137, 9110943, 9176745, 9241066, 9297742, 9347104, 9396709, 9459834, 9551912, 9685542, 9865898, 10089005, 10344236, 10619683, 10907137, 11203590, 11508484, 11818732, 12124919, 12411198, 12659049, 12852763, 12983671, 13051036, 13059902, 13018247, 12936000, 12826240, 12706394, 12596962, 12517475, 12481741, 12494776, 12552531, 12644204, 12756242, 12876656, 12997910, 13117105, 13233555, 13345600, 13448962, 13537806, 13607522, 13657115, 13689804]
37040A3689804K2524K2034L4333O2571J08530J70774K43709L18390L85012M36058
37030A5493739M68509M83791M85785M78437M64544M45888M23870L99665L73883
37021A9518111L46484L17504K88279K62087K43539K37065K45479K69310L06941
37012B2034799L55227M10334M68513N26675N82748O35985O87069P37913P91110
37003B7230373Q49232R14085R85940J062844J140470J212835J273898J319537
36995C5989214J349245J366740J379144J394830J420791J460383J512293J570957
36987D7443597J628161J675226J705215J714877J705935J685077J662313J648281
36979F0868682J651961J679758J735757J822261J940157K089430K270065K482915
$$ y = [13689804, 13712328, 13734362, 13768695, 13831266, 13939796, 14110570, 14354279, 14672669, 15057681, 15493739, 15962248, 16446039, 16931824, 17410261, 17874805, 18320693, 18744563, 19144228, 19518111, 19864595, 20182099, 20470378, 20732465, 20976004, 21213069, 21458548, 21727858, 22034799, 22390026, 22800360, 23268873, 23795548, 24378296, 25014281, 25701350, 26439263, 27230373, 28079605, 28993690, 29979630, 31042474, 32182944, 33395779, 34669677, 35989214, 37338459, 38705199, 40084343, 41479173, 42899964, 44360347, 45872640, 47443597, 49071758, 50746984, 52452199, 54167076, 55873011, 57558088, 59220401, 60868682, 62520643, 64200401, 65936158, 67758419, 69698576, 71788006, 74058071, 76540986]
36971G6540986K729680L011803L329198L680108M062574M476644M926063N418702
36963A08175758N965812O580498P275943Q064025Q954562R954872J1069126J2297404
36955A78338000J3634969J5071971J6593163J8176831J9792574K1398017K2934886
36948C05940411K4324684K5463944K6219683K6427353K5895509K4421673K1822907
36941D80516164J7982238J2906227O777290k7678o978150j3491041j9057692k3344954
36933D55282404k6233664k7792973k8217005k7755823k6661389k5155068k3414306
36926B70052176k1572284j9723926j7933331j6240608j4667926j3224902j1912931
36919A54776268j0728160r663365q709283p855791p092808o410672n800407n254369
$$ y = [76540986, 79270666, 82282469, 85611667, 89291775, 93354349, 97830993, 102757056, 108175758, 114141570, 120722068, 127998011, 136062036, 145016598, 154971470, 166040596, 178338000, 191972969, 207044940, 223638103, 241814934, 261607508, 283005525, 305940411, 330265095, 355729039, 381948722, 408376075, 434271584, 458693257, 480516164, 498498402, 511404629, 518181919, 518154241, 511176091, 497685050, 478627358, 455282404, 429048740, 401255767, 373038762, 345282939, 318621550, 293466482, 270052176, 248479892, 228755966, 210822635, 194582027, 179914101, 166689199, 154776268, 144048108, 134384743, 125675460, 117819669, 110726861, 104316189, 98515782, 93261413]
36911I3261413m767064m334976l954880l621522l326517l059235k808975k567067
36903F4821177k328013k089325j850299j610550j369483j127102q85197o47685
36895E2913523m19819k07060j4224J55044K98567M15572N06154N70623O09004
36886E4827384O20650O03904N56365M76419L65648K30717Q3214o2672j93545k99828
36876E7208256l77534m28623m60168m82512n06633n41191n90262o52675p23075
36867E2445583p93879q57247r06747r38528r51550r46380r23317q81489q19823
36858D4426623p38961o42127n34050m18937k99065j74809m5736Q8082K25195L62917
36848D2249132M98528O30911P61277Q92165J025322J160259J294897J428002J561578
$$ y = [93261413, 88494349, 84159373, 80204493, 76582971, 73256454, 70197219, 67388244, 64821177, 62493164, 60403839, 58553540, 56942990, 55573507, 54446405, 53561208, 52913523, 52493704, 52286644, 52272420, 52427464, 52726031, 53141603, 53647757, 54218380, 54827384, 55448034, 56051938, 56608303, 57084722, 57450370, 57681087, 57764301, 57701629, 57508084, 57208256, 56830722, 56402099, 55941931, 55459419, 54952786, 54411595, 53821333, 53168658, 52445583, 51651704, 50794457, 49887710, 48949182, 47997632, 47051252, 46127935, 45246446, 44426623, 43687662, 43045535, 42511485, 42092548, 41793483, 41618674, 41572938, 41661020, 41886215, 42249132, 42747660, 43378571, 44139848, 45032013, 46057335, 47217594, 48512491, 49940493, 51502071]
36839E1502071J701289J854346K025897K215986K418627K623317K817875K991015
36831G0150423L133564L238289L298919L309170L262285L151183K969038K710173
36823I5223044K371243J952535J459037R00954K93802l41723r80324j594019k155683
36814I7128866k643427l044029l353951l577730l724731l805666l830049l805016
36806F9344267l735396l624749l476923l297517l094569k878056k658354k444400
36798D4134303k242236k054553j881261j720612j570167j427240j289129j153707
36790C0795398j020347q90374p66286o49915n40788m35693l29757k18207r8089
36781B5845942L0540J64150K96285M19235N26236O13277O79652P27098P57924
$$ y = [51502071, 53203360, 55057706, 57083603, 59299589, 61718216, 64341533, 67159408, 70150423, 73283987, 76522276, 79821195, 83130365, 86392650, 89543833, 92512871, 95223044, 97594287, 99546822, 101005859, 101906813, 102200615, 101858892, 100878568, 99284549, 97128866, 94485439, 91441410, 88087459, 84509729, 80784998, 76979332, 73149283, 69344267, 65608871, 61984122, 58507199, 55209682, 52115113, 49237057, 46578703, 44134303, 41892067, 39837514, 37956253, 36235641, 34665474, 33238234, 31949105, 30795398, 29775051, 28884677, 28118391, 27468476, 26927688, 26491995, 26162238, 25944031, 25845942, 25876482, 26040632, 26336917, 26756152, 27282388, 27895665, 28575317, 29302415, 30060339]
36772C0060339P72702P68631P39667O78742N81094M46785K81143R3376j05293
36763C4317186l02999m88042o49799p79997q73843r30387r52152r44665r16200
36754B7479102q77197q38651q09727p95854p98416q15852q45057q81973r21451
36745A9894924r57193r82508r91665r81113r50073r00677q37779p68086o98259
36736A1827571o32631n72209n15718m61867m10803l63696l21302k82950k46714
36727H019681k10118j70567j25562p3529j5524M3227R3690J25868J32800J13467
36717G933433P3182K1720k9639p1089r6531j04497r7412p9719n6088l0703p398
36706G455259J0408K0615K3438K1203J6650J0959L266p724k1392l4301m1695m0414
$$ y = [30060339, 30833041, 31601672, 32341339, 33020081, 33601175, 34047960, 34329103, 34422479, 34317186, 34014187, 33526145, 32876346, 32096349, 31222506, 30292119, 29339967, 28395302, 27479102, 26601905, 25763254, 24953527, 24157673, 23359257, 22543405, 21698348, 20816375, 19894924, 18937731, 17955223, 16963558, 15982445, 15032372, 14131695, 13293916, 12525830, 11827571, 11194940, 10622731, 10107013, 9645146, 9234343, 8870647, 8549345, 8266395, 8019681, 7809563, 7638996, 7513434, 7439905, 7424381, 7467608, 7561298, 7687166, 7819966, 7933433, 8006615, 8028335, 7998696, 7927607, 7831076, 7726579, 7629167, 7549448, 7493360, 7462657, 7455259, 7465667, 7486282, 7509720, 7530923, 7547573, 7558532, 7561798, 7554074, 7532682, 7498381, 7456686, 7416272]
36694G416272l0925j7096l973M863R007J1296J6403K8661N0110P9645J13363J45705
36682G823331J70847J84134J83354J69598J47269J23102J04333R6537J01827J18287
36672I222619J41051J64723J85935K04511K22473K41778K62699K84107L04882
36663A1234778L24495L41869L53701L54312L37689L00490K43899J73063R4563
36654A3758859J3694o6620j44827k18814k84654l36771l69185l77241l59267l17550
36644A1297624k58046j88964j18998n6159p191K2862L1232J7824j5033o3477j22884
36633A0538790j87868k51707l06380l44053l59456l51658l24232k83924k38464
36624G891048j94124j54031j18172q5307n5270k9967j2649o397j2804l1032n7317
$$ y = [7416272, 7385347, 7368251, 7364278, 7369141, 7378148, 7389444, 7405847, 7434508, 7484618, 7564263, 7677626, 7823331, 7994178, 8178312, 8361666, 8531264, 8678533, 8801635, 8905968, 9002505, 9104332, 9222619, 9363670, 9528393, 9714328, 9918839, 10141312, 10383090, 10645789, 10929896, 11234778, 11559273, 11901142, 12254843, 12609155, 12946844, 13247334, 13491233, 13664296, 13758859, 13772553, 13705933, 13561106, 13342292, 13057638, 12720867, 12351682, 11974441, 11615174, 11297624, 11039578, 10850614, 10731616, 10675457, 10668266, 10691128, 10722360, 10740184, 10725151, 10661674, 10538790, 10350922, 10099215, 9792835, 9448782, 9089326, 8737668, 8413436, 8129512, 7891048, 7696924, 7542893, 7424721, 7339414, 7284144, 7254177, 7241528, 7235131, 7222327, 7191295, 7133978]
36613G133978q5448j08581j21701j23247j14875r9793q1173o1679m3889l0395
36603F263197k2975k1484k3643k6065k5829k1707j4672p613m244p481j7920l3209
36591F036355m8537n8158n7413m4619k1887N632L1719N1143O0951O0692N2032
36580F067910L7979K1810N873r264k4648m1772o1146q1555j00325j14147j19852
36569E580863j14932r7898o8711k9362J5623N9487R4953J16842J24096J19913
36559E800874J10134J01215R8579J05341J21194J41985J60690J69876J64572J44217
36549G118677J12730P6815M3471J7904K672k014K810J6083L7468O6979J03483
36538G597078J42819J76987J95603J89416J54204R2862J4521o8491j43945k01920
$$ y = [7133978, 7048530, 6939949, 6818248, 6695001, 6580126, 6480333, 6399160, 6337481, 6293592, 6263197, 6240222, 6218738, 6195095, 6169030, 6143201, 6121494, 6106822, 6099209, 6094965, 6087484, 6069564, 6036355, 5987818, 5929660, 5872247, 5827628, 5805741, 5811373, 5843092, 5894235, 5955186, 6015878, 6067910, 6105889, 6127699, 6133572, 6124308, 6099660, 6057888, 5996742, 5915187, 5814862, 5700715, 5580863, 5465931, 5368033, 5299322, 5269960, 5285583, 5345070, 5440023, 5556865, 5680961, 5800874, 5911008, 6012223, 6110802, 6216143, 6337337, 6479322, 6640012, 6809888, 6974460, 7118677, 7231407, 7308222, 7351693, 7369597, 7372269, 7370255, 7373065, 7389148, 7426616, 7493595, 7597078, 7739897, 7916884, 8112487, 8301903, 8456107, 8548969, 8563490, 8494999, 8351054, 8149134]
36528H149134k35827k42957k24678j85927j33772p5705j8416L2482P2315R7468
36518G234117J06103R9107Q0496N6652L4393J8744J1713J2883K1224L6572N9483
36507G771487Q9995J26685J67077K08741K49849K88699L23023L50253L68837L79536
36497A0324182L85340L89687L94168L97449L96175L87069L68634L41499L07713
36488A3691916K69817K30271J91264J54869J23454R9921Q7290Q7518J00363J23335
36478A5160018J52923J86251K22064K60598L02614L48064L94848M38106M70538
36469A7936024M83937M71647M31067L65114K81791J91883J05830L1242k8028p1335
36459B0199172j00023j16216j22093j19668j10863r7675q2315o7453n6234n1691
$$ y = [8149134, 7913307, 7670350, 7445672, 7259745, 7125973, 7050268, 7031852, 7064334, 7136649, 7234117, 7340220, 7439327, 7519823, 7576475, 7610868, 7629612, 7641325, 7654208, 7675432, 7712004, 7771487, 7861482, 7988167, 8155244, 8363985, 8613834, 8902533, 9225556, 9575809, 9944646, 10324182, 10709522, 11099209, 11493377, 11890826, 12287001, 12674070, 13042704, 13384203, 13691916, 13961733, 14192004, 14383268, 14538137, 14661591, 14761512, 14848802, 14936320, 15036683, 15160018, 15312941, 15499192, 15721256, 15981854, 16284468, 16632532, 17027380, 17465486, 17936024, 18419961, 18891608, 19322675, 19687789, 19969580, 20161463, 20267293, 20298535, 20270507, 20199172, 20099149, 19982933, 19860840, 19741172, 19630309, 19532634, 19450319, 19382866, 19326632, 19274941]
36449A9274941n5508o6903q2512r7559j07738j10906j07910j02106r7789r8380
36439A8347630j05419j18798j37626j60802j86855k13487k37510k55538k65087
36430A6666508k65193k56085k38237k11880j77511j36990r3908n2734j7240J0546
36420A5227276L0334M2868M9281N0683M7762M0350K7425P821j8715n0871q5734
36409A5368480j19209j46775j64705j71362j67572j55596j37417j13865q5098
36400A4106881n1611j4670K4119O3519J02965J42173J80347K15537K44875K65765
36390A5279900K77261K80620K78639K74283K69477K64734K59670K53770K46490
36381A7684844K36497K20954J95998J58472J07463M4323k8627j09283j95638k84520
$$ y = [19274941, 19219433, 19152530, 19070018, 18972459, 18864721, 18753815, 18645905, 18543799, 18446010, 18347630, 18242211, 18123413, 17985787, 17824985, 17638130, 17424643, 17187133, 16931595, 16666508, 16401315, 16145230, 15906993, 15695113, 15517602, 15380612, 15286704, 15233970, 15216730, 15227276, 15257610, 15300478, 15349759, 15400442, 15448204, 15488554, 15515979, 15523800, 15505085, 15454214, 15368480, 15249271, 15102496, 14937791, 14766429, 14598857, 14443261, 14305844, 14191979, 14106881, 14055270, 14040600, 14064719, 14128238, 14231203, 14373376, 14553723, 14769260, 15014135, 15279900, 15557161, 15837781, 16116420, 16390703, 16660180, 16924914, 17184584, 17438354, 17684844, 17921341, 18142295, 18338293, 18496765, 18604228, 18648551, 18619924, 18510641, 18315003, 18030483]
36371A8030483l70557m46550n05349n41987n54721n44619n14628m68889m12368
36362A3670815l50215k86896k25519j67664j13658o3280j6773K4303N7158P8926
36352A2607197Q8204Q6094P6200O3584N2890M6498M3785M1927L7667K8866J5365
36341A3188277r23j6704k8779l5683l8437l9834m2670m8175n5681o3630p0909
36330A2746852p7388q3546q9995r7378j06128j15599j23426j26334j22208j11597
36320A1693253r7480q3919p4870p3391q0617r4805j11522j25438j32534j31084
36310A0687593j21009j02662p6350m2974n059L3002O6087R0444J05194J12011
36300A0746277J13363J11107J06761J02764J02708J09822J24972J45923J68018
$$ y = [18030483, 17659926, 17213376, 16708027, 16166040, 15611319, 15066700, 14552072, 14083183, 13670815, 13320600, 13033704, 12808185, 12640521, 12526863, 12463583, 12446810, 12471113, 12528271, 12607197, 12695401, 12781495, 12857695, 12921279, 12974169, 13020667, 13064452, 13106379, 13144046, 13172912, 13188277, 13187354, 13170650, 13141871, 13106188, 13067751, 13027917, 12985247, 12937072, 12881391, 12817761, 12746852, 12669464, 12585918, 12495923, 12398545, 12292417, 12176818, 12053392, 11927058, 11804850, 11693253, 11595773, 11511854, 11436984, 11363593, 11282976, 11188171, 11076649, 10951211, 10818677, 10687593, 10566584, 10463922, 10387572, 10344598, 10339539, 10372541, 10438628, 10529072, 10634266, 10746277, 10859640, 10970747, 11077508, 11180272, 11282980, 11392802, 11517774, 11663697, 11831715]
36291A1831715J85319J91758J82686J56751J16966P0053K4518j1381l1073l0658
36281A2686654r498K9762Q1992J41033K01535K60655L18908L79602M46865N23334
36271A5060842O08714O99897P92168Q80328R58977J022141J063064J074493J049256
36262B3209880R80857Q64338O97664M83448K30335m6525l26506n86381q04696
36253B4702414r66266j065075j104459j094798j049696r82199r02245q15752p24995
36244A5996929o29845n29600m24980l19220k17669j26441n1190L807L6826M9904
36234A3788521M8942M2080L7387M1280N7941Q9021J33344J87132K45162L02514
36224A4973324L56250M06401M55861N09013N69639O38977P14652P90074Q53922
$$ y = [11831715, 12017034, 12208792, 12391478, 12548229, 12665195, 12735248, 12759766, 12748385, 12717312, 12686654, 12677156, 12706918, 12788910, 12929943, 13131478, 13392133, 13711041, 14090643, 14537508, 15060842, 15669556, 16369453, 17161621, 18041949, 19000926, 20023067, 21086131, 22160624, 23209880, 24190737, 25055075, 25752739, 26236187, 26466522, 26419997, 26093491, 25507110, 24702414, 23736148, 22671073, 21566614, 20471816, 19422120, 18439921, 17537676, 16721924, 15996929, 15367084, 14837484, 14412504, 14093284, 13875615, 13749174, 13697984, 13701791, 13738617, 13788521, 13837463, 13879543, 13916930, 13958210, 14016151, 14105172, 14238516, 14425648, 14670810, 14973324, 15329574, 15735975, 16191836, 16700849, 17270488, 17909465, 18624117, 19414191, 20268113]
36215B0268113Q90149Q79910Q06083O59161M41780J69702j31049m29549o96195
36206B2858105r08250j053471j130839j148438j119531j058458r77489q85348
36198A4576281p87444o87221n87704m92471m06011l33371k79084k45616k32211
36189A0525148k34879k47432k62800k74202k76448k67290k48065k22706j95449
36180H295877j68637j42176j14712q5503n5437k6548n17K2795M5680P1284J01232
36169G943338J33830J64587J89022K05668K16686K25663K34647K42787K47158
36160I803386K44653K33561K14299J89294J62115J36148J13370R3738P5412N5664
36150A1321640L2165M136k7323n9944r1382j19589j42369j57259j62607j59011
$$ y = [20268113, 21158262, 22038172, 22844255, 23503416, 23945196, 24114898, 23983849, 23554300, 22858105, 21949855, 20896384, 19765545, 18617107, 17497576, 16439118, 15461629, 14576281, 13788837, 13101616, 12513912, 12021441, 11615430, 11282059, 11002975, 10757359, 10525148, 10290269, 10042837, 9780037, 9505835, 9229387, 8962097, 8714032, 8491326, 8295877, 8127240, 7985064, 7870352, 7784849, 7729412, 7702864, 7702347, 7725142, 7770822, 7842106, 7943338, 8077168, 8241755, 8430777, 8636445, 8853131, 9078794, 9313441, 9556228, 9803386, 10048039, 10281600, 10495899, 10685193, 10847308, 10983456, 11096826, 11190564, 11265976, 11321640, 11353805, 11357941, 11330618, 11270674, 11179292, 11059703, 10917334, 10760075, 10597468, 10438457]
36140A0438457j49252j36292j21034j02043p7440m7172j3873J7975M3713O0014
36130I913053O5704O1922N1794L9747L0310K6599K9186L6173M4445N0984N3324
36119A0403241M9166L6016J1543k5315p3196j27958j83780k35362k79882l17305
36109I257168l48784l74354l91528l95842l82849l50349k99625k35432j65238
36100F313167r8210m3839j0073j142j5945m7792q5888j18384j36006j34745j16359
36089E504784q6681n2864k1101M370K1136K8084K5340J4769L83j2300j8223j5046
36077E392651m334R200J9937K3707J8904O069j3158l6645o1662q4602j01270j07759
36065E061038j01770q3804n7597k9260n476Q196Q122p146l6464p5745j18504j57533
$$ y = [10438457, 10289205, 10152913, 10031879, 9929836, 9852396, 9805224, 9791351, 9809326, 9853039, 9913053, 9978757, 10040679, 10092473, 10132220, 10162530, 10189129, 10218315, 10254488, 10298933, 10349917, 10403241, 10452407, 10488423, 10499966, 10474651, 10401455, 10273497, 10089717, 9854355, 9574473, 9257168, 8908384, 8534030, 8142502, 7746660, 7363811, 7013462, 6713837, 6478405, 6313167, 6214957, 6171118, 6161045, 6159903, 6143958, 6096166, 6010278, 5891894, 5755888, 5621143, 5504784, 5418103, 5365239, 5344138, 5348508, 5369644, 5397728, 5423068, 5437837, 5438220, 5425920, 5407697, 5392651, 5388317, 5397517, 5417454, 5441161, 5460065, 5466134, 5452976, 5416331, 5354669, 5270067, 5168797, 5061038, 4959268, 4875464, 4817867, 4788607, 4783131, 4791327, 4799449, 4792303, 4755839, 4680094, 4561590, 4404057]
36053D404057j86904k03191k05689j96019j77471j54127j29750j06818q6020o6500
36043B891568m6732k5483k450K1646M5366O7070Q5412R9459J08137J09402J00095
36032C453490P7188L9930q425o0729j08069j42968j61941j66158j60174j49627
36022B612517j38936j29713j20470j07995q9850o6266l9974j4333Q295K6511L8624
36011A978410M1927L3647J3084j6635m8795p5626r1747r6225r1855q2294o9357
36000A494534n2490l0513l875K4520N0524P0893Q4854R4246J02394J12223J24369
35989B071679J36269J43093J40161J25455J00678P0415M0222J4582m561j8375
35979B819618l0621m6131o8715r9312j35388j71912k03462k26079k37683k37056
$$ y = [4404057, 4217153, 4013962, 3808273, 3612254, 3434783, 3280656, 3150906, 3044088, 2958068, 2891568, 2844836, 2819353, 2816903, 2838549, 2883915, 2950985, 3036397, 3135856, 3243993, 3353395, 3453490, 3530678, 3570608, 3562183, 3501454, 3393385, 3250417, 3088476, 2922318, 2762144, 2612517, 2473581, 2343868, 2223398, 2115403, 2025553, 1959287, 1919313, 1904980, 1913275, 1939786, 1978410, 2020337, 2053984, 2067068, 2050433, 2001638, 1926012, 1834265, 1738040, 1646185, 1563891, 1494534, 1442044, 1411531, 1407656, 1432176, 1482700, 1553593, 1638447, 1732693, 1835087, 1947310, 2071679, 2207948, 2351041, 2491202, 2616657, 2717335, 2787750, 2827972, 2842554, 2837993, 2819618, 2788997, 2742866, 2674151, 2574839, 2439451, 2267539, 2064077, 1837998, 1600315, 1363259]
35969A363259k22519j91722j43122p8277l260P1951J35958J79114J96373J89115
35959A496870J65120J35762J11143R5719Q7216P9169O4976M1058Q295k8274o1212
35948B195842q3502r1074q3802o4778l8900j1704J1340K5416K7114J5441p227
35937A894166l5025o0081p5426p7725o8043n0048k7232j506K5739N1263O8974
35926A645056P1857N5900K3230j7885n6280q2393r1523q4412o5458m0077j2773
35915A345242J3320L5884N2910O2866O5274O0940N1468L8534K3529P756p215j9372
35903A731136k6367k5968j6866N69K4087N0139P4863R4910J08064J13648J12564
35892B240779J06737R8114Q7816P5963O2199M6479K9435J2110m408j8717k8369
$$ y = [1363259, 1140740, 949018, 805896, 727619, 724359, 796310, 932268, 1111382, 1307755, 1496870, 1661990, 1797752, 1908895, 2004614, 2091830, 2170999, 2235975, 2277033, 2285328, 2257054, 2195842, 2112340, 2021266, 1937464, 1872686, 1833786, 1822082, 1833422, 1858838, 1885952, 1901393, 1894166, 1859141, 1799060, 1723634, 1645909, 1577866, 1527818, 1500586, 1499080, 1524819, 1576082, 1645056, 1716913, 1772813, 1796043, 1778158, 1721878, 1639485, 1547962, 1463550, 1398092, 1358015, 1345242, 1358562, 1394446, 1447356, 1510222, 1575496, 1636436, 1687904, 1726438, 1749967, 1757723, 1750508, 1731136, 1704769, 1678801, 1661935, 1662504, 1686591, 1736730, 1811593, 1906503, 2014567, 2128215, 2240779, 2347516, 2445630, 2533446, 2609409, 2671608, 2718087, 2747522, 2759632, 2755224, 2736507, 2708138]
35881B708138l0000k1085k207K2160M5237O0607O4330N5759L7366J3641j0579
35870B943367l1680m7782n8124o2126n9098m8824l2699j4641r15J572j1935m1556
35858B535559q2150j25067j61434j85185j94362j90548j77235j58109j35746j11173
35848A014550q4731n7761l3496j5839o842n192p031q052n045L873J9685M2746
35836H56865P2640J07720J44730J78913K04885K17836K14501J93809J57395J09811
35826B459105N7925R318k9794n6262p0648p6367p7693p7504p6093p1398o0389
35815A930200m0822j2714K1232N6701Q9829J18786J43748J65704J85189K01769
35805B859622K14150K20697K20354K13668K03443J94503J92399K01133K20532
$$ y = [2708138, 2678138, 2657053, 2654846, 2677006, 2722243, 2782850, 2847180, 2902939, 2940305, 2953946, 2943367, 2911687, 2863905, 2805781, 2743655, 2684557, 2635733, 2603034, 2588393, 2587478, 2589050, 2577115, 2535559, 2453409, 2328342, 2166908, 1981723, 1787361, 1596813, 1419578, 1261469, 1125723, 1014550, 929819, 872058, 838562, 822723, 815881, 810689, 803658, 795606, 790561, 794434, 814119, 856865, 929505, 1037225, 1181955, 1360868, 1565753, 1783589, 1998090, 2191899, 2349294, 2459105, 2517030, 2526348, 2496554, 2440292, 2369644, 2293277, 2215584, 2138080, 2061987, 1990589, 1930200, 1889378, 1876664, 1897896, 1954597, 2044426, 2163212, 2306960, 2472664, 2657853, 2859622, 3073772, 3294469, 3514823, 3728491, 3931934, 4126437, 4318836, 4519969, 4740501]
35796D740501K44745K63458K65878K45252K01347J39858P0069K342n3927r2300
35786F027223j11030j13700j07888j02112j02395j09832j20223j25996j19846
35777E014201r8309o3262k0403K4078O6299J05370J42047J76747K08323K34181
35767E789272K51448K58387K55356K45147K32678K23925K24022K35186K55536
35758G970957K79436K98955L05642K92300K54652J92618J10633J6785p8941j66917
35748I476120k40046k95115l32634l55286l65955l66543l57966l40908l16674
35739F504993k87457k55776k23315j90029j54373j14668p0719k4588J9959N8941
35729E262968Q9817J12492J29120J42833J56265J70874J87292K05889K26738K49110
$$ y = [4740501, 4985246, 5248704, 5514582, 5759834, 5961181, 6101039, 6171108, 6173450, 6119523, 6027223, 5916193, 5802493, 5694605, 5592493, 5490098, 5380266, 5260043, 5134047, 5014201, 4915892, 4852630, 4832227, 4856305, 4922604, 5027974, 5170021, 5346768, 5555091, 5789272, 6040720, 6299107, 6554463, 6799610, 7032288, 7256213, 7480235, 7715421, 7970957, 8250393, 8549348, 8854990, 9147290, 9401942, 9594560, 9705193, 9721978, 9643037, 9476120, 9236074, 8940959, 8608325, 8253039, 7887084, 7520541, 7162575, 6821667, 6504993, 6217536, 5961760, 5738445, 5548416, 5394043, 5279375, 5208656, 5184068, 5204027, 5262968, 5352785, 5465277, 5594397, 5737230, 5893495, 6064369, 6251661, 6457550, 6684288, 6933398]
35719F933398K71216K90463L03910L08620L02261K84010K55305K19507J80404
35710I349094J40356R9313N5289O043m9210j09212j71369k32853k91075l43399
35700H452977l86855m18300m35080m35803m20906l92567l53775l07169k54661
35691E047861j98161j40595q6180l9819o231J0731Q780j2001m8454r4319j41252
35680D300360j80784k06480k15497k08867j90529j65449j37475j07980p6269m1586
35670B769444n182K9325N7525P6167Q3923Q0843O7632M5567J6993j4403m3952
35659C163882o6790p8647p6423n8760k6739J5753O2615J07226J44461J71757J88654
35648C546989J95435J92170J78908J56702J28471R8987P3958N8568N5927O5978
$$ y = [6933398, 7204614, 7495077, 7798987, 8107607, 8409868, 8693878, 8949183, 9168690, 9349094, 9489450, 9588763, 9644052, 9650095, 9600885, 9491673, 9320304, 9087451, 8796376, 8452977, 8066122, 7647822, 7212742, 6776939, 6356033, 5963466, 5609691, 5302522, 5047861, 4849700, 4709105, 4622925, 4583106, 4576875, 4587606, 4596386, 4584385, 4535931, 4441612, 4300360, 4119576, 3913096, 3697599, 3488732, 3298203, 3132754, 2995279, 2887299, 2811030, 2769444, 2764262, 2793587, 2851112, 2927279, 3011202, 3092045, 3159677, 3205244, 3222237, 3207834, 3163882, 3097092, 3018445, 2942022, 2883262, 2856523, 2872276, 2934891, 3042117, 3186578, 3358335, 3546989, 3742424, 3934594, 4113502, 4270204, 4398675, 4497662, 4571620, 4630188, 4686115, 4752093]
35638D752093Q5451J09108J31718J49781J62048J68712J70118J66265J57635J46321
35628F199250J35867J29538J28558J31942J37761J44409J50987J57041J62226
35619G477579J66040J67619J65956J60600J52123J41681J29608J14045R0730N4808
35609H820789M030n8577j24740j83737k26025k45644k41180k15897j76969j33296
35599G218754r2489n8859l3461j5511l795K511L654l01q449j8058k4597k3172
35587F946227j0825J1492L8480O2198P5227P3472N7068K9284n316m2406p8851
35576G156050j13084j44589j72392j93634k03758j98768j78023j45346j07612
35567E698844p1913m3339k4287j4962j4169j9907k9766m1327n2525o1992o9280
$$ y = [4752093, 4837544, 4946652, 5078370, 5228151, 5390199, 5558911, 5729029, 5895294, 6052929, 6199250, 6335117, 6464655, 6593213, 6725155, 6862916, 7007325, 7158312, 7315353, 7477579, 7643619, 7811238, 7977194, 8137794, 8289917, 8431598, 8561206, 8675251, 8765981, 8820789, 8824819, 8766242, 8641502, 8457765, 8231740, 7986096, 7744916, 7529019, 7352050, 7218754, 7126265, 7067406, 7033945, 7018434, 7014639, 7017150, 7020804, 7020503, 7012054, 6993996, 6969399, 6946227, 6935402, 6946894, 6985374, 7047572, 7122799, 7196271, 7253339, 7282623, 7277307, 7234901, 7156050, 7042966, 6898377, 6725985, 6532351, 6328593, 6129825, 5951802, 5806456, 5698844, 5626931, 5583592, 5559305, 5544343, 5530174, 5510267, 5480501, 5439174, 5386649, 5324657, 5255377]
35556E255377p4938q0266q6615r4498j03251j11603j18747j24709j29645j32841
35546D198264j32841j28655j20815j11192j01791r3610q6352p9041p1366o5142
35536C207459o4700p5187r9271j34287j71974k01038k11182j96616j57926j01740
35526A793538l8296K2275P3292J12751J41999J63015J76377J81119J76335J63264
35516B965669J46289J31957J26136J30893J43151J56226J63311J60674J48649
35507D272955J30288J08978Q6805O4497M2530K2174N443n830j0871r958l873O440
35495D709578J9587L3431M5426N3619N7507N8088N7000N5193N1799M3898K7770
35484E212896J387l3405p0814j03577j26351j37825j40471j38668j36389j35420
$$ y = [5255377, 5180439, 5100173, 5013558, 4919060, 4815809, 4704206, 4585459, 4460750, 4331105, 4198264, 4065423, 3936768, 3815953, 3704761, 3602970, 3509360, 3423008, 3343967, 3272601, 3207459, 3142759, 3067572, 2968301, 2834014, 2662040, 2461002, 2249820, 2053204, 1895278, 1793538, 1755242, 1777517, 1850809, 1963560, 2105559, 2268574, 2444951, 2626070, 2802405, 2965669, 3111958, 3243915, 3370051, 3500944, 3644095, 3800321, 3963632, 4124306, 4272955, 4403243, 4512221, 4599026, 4663523, 4706053, 4728227, 4733670, 4727840, 4716969, 4707011, 4703138, 4709578, 4729165, 4762596, 4808022, 4861641, 4919148, 4977236, 5034236, 5089429, 5141228, 5185126, 5212896, 5214283, 5180878, 5110064, 5006487, 4880136, 4742311, 4601840, 4463172, 4326783, 4191363]
35474D191363j34643j30808j20596j02910p9924n6251l6890k5325k2641k7656
35464C453719l7668m9478o0232o7474o8339n8935l5296M093N6239J14043J69008
35453C419680K14006K44158K56156K47823K18847J71824J12072M5908k1189q4901
35443D824384j40895j83768k07731k08950j88050j51109j08571p2391n2488n3773
35433C456658p4850j08761j45194j73508j85751j78891j55292j21215q4144n0396
35423B178656k3828n637N248J1427J6048K1595K8807L6179M0515L8369K7798R452
35411B384629j3413l6078n4036o4382o6217o0013m6723k7485l948K1520M6307
35400B080161O8529Q7593J04023J18659J31859J42869J49547J48575J36463J11005
$$ y = [4191363, 4056720, 3925912, 3805316, 3702406, 3622482, 3566231, 3529341, 3504016, 3481375, 3453719, 3416051, 3366573, 3306341, 3238867, 3170528, 3111593, 3076297, 3080390, 3136629, 3250672, 3419680, 3633686, 3877844, 4134000, 4381823, 4600670, 4772494, 4884566, 4930474, 4909285, 4824384, 4683489, 4499721, 4291990, 4083040, 3894990, 3743881, 3635310, 3562919, 3510431, 3456658, 3381808, 3273047, 3127853, 2954345, 2768594, 2589703, 2434411, 2313196, 2229052, 2178656, 2154828, 2149191, 2154439, 2165866, 2181914, 2203509, 2232316, 2268495, 2309010, 2347379, 2375177, 2384629, 2371216, 2335138, 2281102, 2216720, 2150503, 2090490, 2043767, 2016282, 2012334, 2033854, 2080161, 2148690, 2236283, 2340306, 2458965, 2590824, 2733693, 2883240, 3031815, 3168278, 3279283]
35390C279283P2424K3471l1465q7561j40518j87132k25423k54228k72418k78432
35380A898001k70689k48734k14204j70909j24085p9418m2252j6721m495l604q542
35369G14348j2392r997j30J4565K9483M0293M4504M1965L4443K4705J5643R843
35357I47273R232J4543K4897L8192N2070O4506P3494P6558P1060N5346K9807k716
35345A454262l7076o6324q3038q1778o1829k8265R963M4055O8851Q3729R0847
35334A393397R2511Q9432Q0713O5216M3286J7448q621l2098n2298p0039q5721
35323A533226r7894j03609j00373q8231p0437n2290l8918l3265l5062m1120m6840
35312H25187m8645m5967m1460l9051m1192m7158n3291n4656m7197k9429l038K7908
$$ y = [3279283, 3351707, 3375178, 3343713, 3256152, 3115634, 2928502, 2703079, 2448851, 2176433, 1898001, 1627312, 1378578, 1164374, 993465, 869380, 789962, 747710, 730989, 726494, 722890, 714348, 701956, 691959, 691829, 706394, 735877, 776170, 820674, 862639, 897082, 921787, 937430, 947273, 956505, 971048, 995945, 1034137, 1086207, 1150713, 1224207, 1300765, 1371825, 1427171, 1456978, 1454262, 1417186, 1350862, 1267824, 1186046, 1124217, 1095952, 1105915, 1149970, 1218821, 1302550, 1393397, 1485908, 1575340, 1656053, 1721269, 1764555, 1782003, 1773382, 1741284, 1688986, 1618947, 1533226, 1435332, 1331723, 1231350, 1143119, 1072682, 1020392, 981474, 948209, 913147, 872027, 825187, 776542, 730575, 689115, 650064, 608872, 561714, 508423, 453767, 406570, 377141, 374103, 402011]
35300D02011N8540Q4546J02765J11302J09749R9439Q3231O4809M8034L6839L5280
35289A236545M7000P3874J14683J64797K17066K63460K96901L12859L10238K91040
35279C328463K59053K18382J72513J24056P4924K6716j9121o1759j01652j40170
35269C881405j77885k12946k41442k59718k66492k63064k51984k35826k16882
35260A755166j97297j79087j63888j52686j45566j41547j38692j34599j27053
35251C74751j14486r6108p1962m3288j2977J4559L4650M4190M2798L2485J6317
35240B20929k807k2536m0819n5572o4753o6904o1784n0514l5162j7940m21J7154
35228a81129L6049N8135Q3869J10582J32731J44304J41679J25139R8821O9679
$$ y = [402011, 460551, 545097, 647862, 759164, 868913, 968352, 1051583, 1116392, 1164426, 1201265, 1236545, 1283545, 1357419, 1472102, 1636899, 1853965, 2117425, 2414326, 2727185, 3037423, 3328463, 3587516, 3805898, 3978411, 4102467, 4177391, 4204107, 4184986, 4123227, 4021575, 3881405, 3703520, 3490574, 3249132, 2989414, 2722922, 2459858, 2207874, 1972048, 1755166, 1557869, 1378782, 1214894, 1062208, 916642, 775095, 636403, 501804, 374751, 260265, 164157, 92195, 48907, 35930, 50489, 85139, 129329, 172127, 204612, 220929, 218122, 195586, 154767, 99195, 34442, -32462, -94246, -144760, -179922, -197862, -198283, -181129, -145080, -86945, -3076, 107506, 240237, 384541, 526220, 651359, 750180, 819859]
35218H19859M5608L2700L2488M1063N1128N5943N2677M3243L2438K4982K3469
35207A255598K8133L7846N0884O5042P7726Q6763R1447R2714R2087R0211Q6118
35196B054569P7708O3201M2772J9149l591k2548l7921n2834p1214r5395j24695
35185A849201j55175j80445j93652j90410j71201j41451j08992q0711o0515m9350
35175E17299m6286m9538n6920o5904p3688p7594p5839o8148n5440l8706j8174
35164a08938O267L3932O2845R0415J14450J33467J46401J52419J51218J43511
35154I25987J31203J17021J03606R2497Q3690P6021O7950N8018M4876K7320M630
35143A732819k2876n3369q3458j08882j26097j33866j33634j28286j20348j11030
$$ y = [819859, 865467, 898167, 930655, 971718, 1022846, 1078789, 1131466, 1174709, 1207147, 1232129, 1255598, 1283731, 1321577, 1372461, 1437503, 1515229, 1601992, 1693439, 1786153, 1878240, 1968451, 2054569, 2132277, 2195478, 2238250, 2257399, 2253808, 2231260, 2193339, 2140505, 2069291, 1973896, 1849201, 1694026, 1513581, 1319929, 1129519, 958318, 816867, 707875, 627164, 566649, 517299, 471013, 421475, 364555, 298651, 224963, 147369, 71530, 3382, -52058, -90764, -108938, -102671, -68739, -5894, 84521, 198971, 332438, 478839, 631258, 782476, 925987, 1057190, 1174211, 1277817, 1370314, 1454004, 1530025, 1597975, 1655993, 1700869, 1728189, 1732819, 1709943, 1656574, 1573116, 1464234, 1338137, 1204271, 1070637, 942351, 822003, 710973]
35133G10973j00393q8071p3992n8909m4441l2340k3273j6245r241n06J0568K3402
35121B97532L6555M8022N5641N7867N4601M7396L8761L0946K5040K0843J7394
35110G30598J3615Q544J140r920k6009m7780p4250j02308j26947j42410j43932
35099H0341j29461j00549o1943j9962J9696N3765Q1952J05817J26612J43357J52459
35088D52084J49112J29857R5004M9573K080l8351o4861p4299o7115m6620j8240
35077E68224J1388L5696M9497M9883L6712J2776j6643m4987o5938p4463o7304
35066D94841m3405m489M4718R7217J45317J82569K05286K13109K08211J93592
35056A736966J71594J43769J12081Q0039N2352L2991K3154K0769K1856K2452J9778
$$ y = [710973, 610580, 522509, 448517, 389608, 345167, 312827, 289554, 273309, 264068, 263562, 274130, 297532, 334087, 382109, 437750, 495617, 550218, 597614, 636375, 667321, 692361, 713204, 730598, 744213, 752757, 753897, 743977, 717968, 670188, 595938, 493630, 366683, 224273, 80341, -49120, -149669, -211612, -231574, -211878, -158113, -76161, 29656, 156268, 299625, 452084, 601196, 731053, 826057, 875630, 877710, 839359, 774498, 700199, 633084, 586464, 568224, 579612, 615308, 664805, 714688, 751400, 764176, 747533, 702546, 636608, 562145, 494841, 451436, 446947, 491665, 588882, 734199, 916768, 1122054, 1335163, 1543374, 1736966, 1908560, 2052329, 2164410, 2244449, 2296801, 2329792, 2352946, 2373715, 2395571, 2418023, 2437801]
35045B437801J2474O11j4279k9573m2552n1350n5128n3680m7187l6465k3349j0691
35033B086632j633J590j294q837j9631l4155n4644q2602j15903j48015j69989
35022A451519j73813j55309j15594o0924j201N2320Q9605J04338R5865O9753L6017
35011A392576N410j4390k0637j4899j066J6494L3915M8157N7103N9612N5566M5830
34999A663671L2163J7150L979m297n969j722N577J2595J7645K1410K5502K9935
34987A817639L1686K5670P549k3529o3952j06869j44805j72278j87291j91209
34977I92611j87448j79819j71221j63144j56056j50148j45669j42485j39570j35326
34967e78275j28451j18250j03854q3526n5267j8416K5236P1671J15741J52438
$$ y = [2437801, 2450275, 2450886, 2436607, 2407034, 2364482, 2313132, 2258004, 2204324, 2157137, 2120672, 2097323, 2086632, 2084999, 2086589, 2085295, 2076458, 2056827, 2022672, 1968028, 1885426, 1769523, 1621508, 1451519, 1277706, 1122397, 1006803, 945879, 944678, 996998, 1086603, 1190941, 1286806, 1356559, 1392576, 1397986, 1383596, 1362959, 1348060, 1346994, 1363488, 1397403, 1445560, 1502663, 1562275, 1617841, 1663671, 1695834, 1712984, 1716963, 1712666, 1706697, 1704975, 1710552, 1723147, 1740792, 1762202, 1787704, 1817639, 1849325, 1874995, 1882544, 1859015, 1795063, 1688194, 1543389, 1371111, 1183820, 992611, 805163, 625344, 454123, 290979, 134923, -15225, -160894, -303379, -442949, -578275, -706726, -824976, -928830, -1012356, -1067623, -1086039, -1060803, -989132, -873391, -720953]
34957g20953J78127J91477J93587J87020J74314J56963J35402J09915Q1891N4523
34947G42266L2235J9017J6833K5154M1672O3462Q7840J12545J35110J51853J57554
34936A585541J46930J17559P2474K0369k7289o0932p6774p7707p0905o3909o1706
34925A503651o5924p5693q8856j02804j14930j23020j25631j22327j13465r9752
34915D71249q2016o1311l8809j5076J0693M0184P4056J10205J43908J69927J84858
34904A007868J88254J82236J70274J55701J40579J25702J11901J01553R8423J05307
34894B387798J21201J40397J54357J55107J38173J04002N7494N963m3813q7817
34884C132862j25237j57179j84967k09012k28415k41081k44462k36878k18731
$$ y = [-720953, -542826, -351349, -157762, 29258, 203572, 360535, 495937, 605852, 687743, 742266, 774501, 793518, 810351, 835505, 877177, 940639, 1028479, 1141024, 1276134, 1427987, 1585541, 1732471, 1850030, 1922504, 1942873, 1915584, 1854652, 1777878, 1700171, 1629266, 1565357, 1503651, 1437727, 1362034, 1273178, 1170374, 1055444, 932424, 806793, 684466, 571001, 471249, 389233, 327922, 289113, 274037, 284730, 324914, 398970, 509175, 653083, 823010, 1007868, 1196122, 1378358, 1548632, 1704333, 1844912, 1970614, 2082515, 2184068, 2282491, 2387798, 2508999, 2649396, 2803753, 2958860, 3097033, 3201035, 3258529, 3264492, 3220679, 3132862, 3007625, 2850446, 2665479, 2456467, 2228052, 1986971, 1742509, 1505631, 1286900]
34875A286900j92736j62965j33497j07601q7628p4969o9704p0197p3294p5163
34865B39146p2236o1844m2743j5751J5964M7680P4710R3854J03953J05878J02317
34854E90928R7185R4376R6274J03054J13366J25878J40345J57150J75553J92489
34844A886598K03580K06028K00721J91462J82021J73945J66797J59704J52196
34835C523052J43808J33760J21616J08309R6366Q8989Q8881R7754J16514J45485
34825D664534J84282K31692K86043L45955M10828M80487N54196O29811P03937
34816H491765P73367Q37112Q97696R60652J032445J118216J220865J342008J484142
34807A8158268J652695J856489K105831K408913K768488L180676L636047M121518
$$ y = [1286900, 1094164, 931199, 797702, 690101, 602473, 527504, 457800, 387603, 314309, 239146, 166910, 105066, 62323, 46572, 62536, 110216, 184926, 278780, 382733, 488611, 590928, 688113, 782489, 878763, 981817, 1095183, 1221061, 1361406, 1518556, 1694109, 1886598, 2090178, 2296206, 2496927, 2688389, 2870410, 3044355, 3211152, 3370856, 3523052, 3666860, 3800620, 3922236, 4030545, 4126911, 4215900, 4304781, 4402535, 4519049, 4664534, 4848816, 5080508, 5366551, 5712506, 6123334, 6603821, 7158017, 7787828, 8491765, 9265132, 10102244, 10999940, 11960592, 12993037, 14111253, 15332118, 16674126, 18158268, 19810963, 21667452, 23773283, 26182196, 28950684, 32131360, 35767407, 39888925]
34799C9888925M621386N117013N585343N996881O313690O488669O467274O192900
34791H6672081N616895M713500L496999K033769M39925j139607k564274l729234
34783I5540054m582111n121631n383610n423061n298961n064438m762377m425015
34775E5478850m075392l729276l396872l084333k794954k529883k288484k068770
34767C1510886j868172j684400j516115j363088j225878j105153j001051r12943
34759B0834086q39653p79812p32013o94803o66708o46129o30991o18373o04785
34750A4620819n87368n65051n38455n08544m75330m38031l96255l50844l03592
34741A0457349k56495k11623j71368j38267j14090r9210r3052r5136j05422j23486
$$ y = [39888925, 44510311, 49627324, 55212667, 61209548, 67523238, 74011907, 80479181, 86672081, 92288976, 97002476, 100499475, 102533244, 102973169, 101833562, 99269288, 95540054, 90957943, 85836312, 80452702, 75029641, 69730680, 64666242, 59903865, 55478850, 51403458, 47674182, 44277310, 41192977, 38398023, 35868140, 33579656, 31510886, 29642714, 27958314, 26442199, 25079111, 23853233, 22748080, 21747029, 20834086, 19994433, 19214621, 18482608, 17787805, 17121097, 16474968, 15843977, 15225604, 14620819, 14033451, 13468400, 12929945, 12421401, 11946071, 11508040, 11111785, 10760941, 10457349, 10200854, 9989231, 9817863, 9679596, 9565506, 9466296, 9373244, 9278108, 9172686, 9049200]
34731I049200j47471j73983j99019k19085k31753k35651k30231k15609j92584
34722G203814j62845j29108r4896o3884l9021k1756j1605o369l192m8L060L900
34710F678050j355j6975m6183q9457j43370k01026k54249k96250l23137l33845
34700D972203l29385l12450k87263k58797k31192k06383j84212j64096j46751
34691B851674j34308j28746j30007j35417j40889j42891j39696j31253j18118
34682A650349j00662p9162n4220k6805K091L1363N9016Q1662R5356R7625Q9170
34671A845783P3947N7717M6109M2922M8892O1273P4919Q4644Q7448Q2891P1707
34660B578252N4290L0609J391l0630o0548q2484r1780q7061p0756m7634k2526
$$ y = [9049200, 8901729, 8727746, 8528727, 8309642, 8077889, 7842238, 7612007, 7396398, 7203814, 7040969, 6911861, 6816965, 6753081, 6714060, 6692304, 6680699, 6674330, 6671138, 6671090, 6674150, 6678050, 6676695, 6659720, 6613537, 6524080, 6380710, 6179684, 5925435, 5629185, 5306048, 4972203, 4642818, 4330368, 4043105, 3784308, 3553116, 3346733, 3162521, 2998425, 2851674, 2717366, 2588620, 2458613, 2323196, 2182307, 2039416, 1899720, 1768467, 1650349, 1549687, 1470525, 1416305, 1389500, 1391591, 1422954, 1481970, 1563632, 1658988, 1756613, 1845783, 1919730, 1977447, 2023556, 2066478, 2115370, 2176643, 2251562, 2336206, 2423654, 2506545, 2578252, 2632542, 2663151, 2664542, 2633912, 2573364, 2490880, 2399100, 2312039, 2241283, 2193649, 2171123]
34649B171123R82K0366L3674L9701L8484L1228J9669N873p123j4684j1255P391
34637B335429M1581Q6600J33801J73351J97341K02043J88795J63142J32350J02327
34627C756760P5763N2530L1651J2795l764j8239l1917m6528o2962q0401r6520
34616C589168j08431j13700j10882r9579q0346n4659k4938N649L3699N6163P0873
34605C163017P6810P4150O3968M7665K6506J857k4057m7865o6155p7483q3579
34594C154834q8541r6347j08395j22457j33406j35039j22236r2999m9945n43M4849
34583B249775P7034R2174R3408Q8640Q6031R0184J00968J14765J26726J32694
34573C252399J30180J18371R7674O9418L6058J459k9462n1889o2485o0181m6290
$$ y = [2171123, 2172105, 2192471, 2226145, 2265846, 2304330, 2335558, 2355227, 2361100, 2353977, 2339293, 2328038, 2335429, 2377010, 2463610, 2597411, 2770762, 2968103, 3170146, 3358941, 3522083, 3654433, 3756760, 3832523, 3885053, 3916704, 3929499, 3925735, 3907496, 3875579, 3829051, 3766089, 3685688, 3589168, 3480737, 3367037, 3256155, 3156576, 3076230, 3021571, 2996633, 3002282, 3035981, 3092144, 3163017, 3239827, 3313977, 3377945, 3425610, 3452116, 3453973, 3429916, 3382051, 3315896, 3238413, 3154834, 3066293, 2969946, 2861551, 2739094, 2605688, 2470649, 2348413, 2255414, 2205469, 2204926, 2249775, 2326809, 2418983, 2512391, 2601031, 2687062, 2777246, 2878214, 2992979, 3119705, 3252399, 3382579, 3500950, 3598624, 3668042, 3704100, 3705559, 3676097, 3624208, 3561723, 3501542, 3455252]
34562C455252k4283O18K2326L5409L6707K6289P443j4285l2908m4247m7505m4979
34550C375837m0047l5070l0696k6498k1765j5753p802K145J2796K1342K4272J8850
34538C277611M388j7249m2105o5425q3409r4782j01151j05703j11043j17764j24630
34527B418738j29938j32998j34891j38057j44723j55028j66332j74247j74385
34518A068139j63373j39031j00733n0198Q090O7689J21910J65560J96165K14386
34508A388604K23436K27468K29643K30766K29022K20700K01539J68128J18979
34499C238285N5077j9913r9757j76446k41809k89629l17274l25930l19253l01124
34489A202227k73685k36884j89715j32463o8396l793N3897R8817J28829J45969
$$ y = [3455252, 3430969, 3431587, 3453913, 3489322, 3526029, 3552318, 3559761, 3545476, 3512568, 3468321, 3420816, 3375837, 3335790, 3300720, 3270024, 3243526, 3221761, 3206008, 3198206, 3200351, 3213147, 3234489, 3258761, 3277611, 3281999, 3264750, 3222645, 3157220, 3073811, 2979029, 2877878, 2772175, 2661132, 2543368, 2418738, 2288800, 2155802, 2020911, 1882854, 1738131, 1583103, 1416771, 1242524, 1068139, 904766, 765735, 665002, 614804, 622894, 690583, 812493, 978053, 1174218, 1388604, 1612040, 1839508, 2069151, 2299917, 2528939, 2749639, 2951178, 3119306, 3238285, 3293362, 3273449, 3173692, 2997246, 2755437, 2465808, 2148534, 1822604, 1503351, 1202227, 928542, 691658, 501943, 369480, 301084, 297291, 351188, 450005, 578834, 724803]
34479G24803J55094J61592J69185J78686J88039J93325J90232J75540J48508J11720
34469B396724P0516L0712m077l3595n9898q5225j10416j34535j55278j69818j75801
34458A569309j72337j60751j44790j29774j20522j18901j22885j28036j30404
34449C40909j28588j23760j18340j14651j14214j17550j24167j32487j39848j42892
34439i15588j38772j26787j09228r0350p3794o0364m7893l3160j4230Q442L2407
34428a569317N4300P0863P9672P9720P1785N8507M3907L2058K5285K3032K2449
34417a007739K0472J5768R318L623J261L520R616J7030K2843K5106K3276J7723
34405h38183R044k159j4942k7414l6620l9580l5065k4362r972O437K4496M3544
$$ y = [724803, 879897, 1041489, 1210674, 1389360, 1577399, 1770724, 1960956, 2136496, 2285004, 2396724, 2467240, 2497952, 2493875, 2460280, 2400382, 2315157, 2204741, 2070206, 1914928, 1745110, 1569309, 1396972, 1236221, 1091431, 961657, 841135, 722234, 599349, 471313, 340909, 212321, 88561, -29779, -144430, -258644, -376194, -500361, -632848, -772696, -915588, -1054360, -1181147, -1290375, -1380725, -1454519, -1514883, -1562776, -1595936, -1610166, -1601724, -1569317, -1515017, -1444154, -1364482, -1284762, -1212977, -1154470, -1110563, -1078505, -1053220, -1030188, -1007739, -987267, -971499, -962181, -958558, -957297, -953777, -944161, -927131, -904288, -879182, -855906, -838183, -829139, -831298, -846240, -873654, -910274, -949854, -984919, -1009281, -1019253, -1012816, -988320, -944776]
34393i44776O1276P4561Q1784Q4134Q4617Q5821Q8422R1258R2430R0385Q4441
34382b5647P4849O2707M9678L7314K6154J5243K555j3864l4663n8400q1475r9144
34370d4693j07377j04715r2871p5607n6709l8486k1513n296J0865K7142M2777
34359d66483N6088O5064O8243O5430N8068M9361M3948M6697O0754Q5941J18467
34348B51578J52038J79494J94558J93556J76562J47064J09962O9069K5857j9724
34338A480014o7093j13273j52933j80387j92226j88857j74129j53437j31503j10838
34328A5338r1591p2502n2016k8643r09L2121O9453J07226J39532J60837J68414
34317D47260J63342J49752J33139J18737J10553J10972J20557J38082J61039J86626
$$ y = [-944776, -883500, -808939, -727155, -643021, -558404, -472583, -384161, -292903, -200473, -110088, -25647, 49202, 111909, 161587, 198901, 225055, 240298, 242853, 228989, 194326, 135926, 54451, -44693, -152070, -256785, -349656, -425263, -481972, -520458, -541971, -547267, -536402, -509260, -466483, -410395, -345331, -277088, -211658, -153590, -104229, -60281, -13584, 47170, 133111, 251578, 403616, 583110, 777668, 971224, 1147786, 1294850, 1404812, 1473881, 1499738, 1480014, 1412921, 1299648, 1146715, 966328, 774102, 585245, 411116, 257679, 126176, 15338, -76253, -148755, -200771, -229414, -230323, -198202, -128749, -21523, 118009, 278846, 447260, 610602, 760354, 893493, 1012230, 1122783, 1233755, 1354312, 1492394, 1653433, 1840059]
34307A840059K12572K37180K58713K74591K80993K73347K47922K03870J44329
34298C973576P5428L788o5757j30810j90521k44133k90031l25803l49174l59054
34288B097509l55896l41200l16734k84094k44814k00710j54093j07639o3915k4847
34278C567Q614L6529N9657P8844R4262J05141J10323J09313J02957R3341Q3255
34267H85803P5651P3069P6937Q7091J02064J20036J39504J58906J75684J86023
34257B080768J86061J73772J50159J18967Q5561N5896L5633K8843L6377N4997
34247C007034P8258R8988J11962J15442J11054J02412R3201Q5576P9423P2631
34237C955981O1980M4212J6962k0488o6674j17918j68894k13620k46490k63024
$$ y = [1840059, 2052631, 2289811, 2548524, 2823115, 3104108, 3377455, 3625377, 3829247, 3973576, 4049004, 4052792, 3987035, 3856225, 3665704, 3421571, 3131540, 2805737, 2456563, 2097509, 1741613, 1400413, 1083679, 799585, 554771, 354061, 199968, 92329, 28414, 3567, 12181, 48710, 108367, 187211, 281473, 386614, 496937, 606250, 709207, 802548, 885803, 961454, 1034523, 1111460, 1198551, 1300615, 1420651, 1560155, 1719061, 1894745, 2080768, 2266829, 2440601, 2590760, 2709727, 2795288, 2851184, 2886817, 2915660, 2952037, 3007034, 3085292, 3184280, 3296242, 3411684, 3522738, 3625150, 3718351, 3803927, 3883350, 3955981, 4017961, 4062173, 4079135, 4058647, 3991973, 3874055, 3705161, 3491541, 3245051, 2982027]
34227B982027k60423k38021j97675j43866q3192k3145K9508P0028R6066J07165
34217B338472J03918Q7326N8571J9272k7925p8876j28105j69515j97137k05657
34207A800344j91222j52847r3776k1498N4019J23078J78444K16042K34259K32761
34197B379604K11769J72230J16421M8535k5209r7027j58609k02647k24450k23416
34187A997201k03895j74742j46876j29330j25811j33710j45663j52409j45885
34178F38880j22152q3474l8111K933L0807M2600M1852L5850L1704L3560M1967
34167F56416N4593O7091P4118P1259N7522L6544J5048n71p098n050K811J3549
34155A036232K5263L6853M7135N4757N9401O2873O8226P7281Q8791R9043J04128
$$ y = [2982027, 2721604, 2483583, 2285908, 2142042, 2058850, 2035705, 2065213, 2135241, 2231307, 2338472, 2442390, 2529716, 2588287, 2607559, 2579634, 2500758, 2372653, 2203138, 2006001, 1800344, 1609122, 1456275, 1362499, 1341001, 1395020, 1518098, 1696542, 1912584, 2146843, 2379604, 2591373, 2763603, 2880024, 2928559, 2903350, 2806323, 2647714, 2445067, 2220617, 1997201, 1793306, 1618564, 1471688, 1342358, 1216547, 1082837, 937174, 784765, 638880, 516728, 433254, 395143, 398076, 428883, 471483, 513335, 549185, 580889, 614449, 656416, 711009, 778100, 852218, 923477, 980999, 1017543, 1032591, 1032020, 1024922, 1019872, 1022683, 1036232, 1061495, 1098348, 1145483, 1200240, 1259641, 1322514, 1390740, 1468021, 1556812, 1655855, 1759983]
34144A759983J01814R2003P6176N6682L6146J7062J649q206j1296p680J140J2735
34132B128208K4592L4435M0200M0250L4329K4458J4753R789J2466K2896L8998
34121B425374N8251P9078J00877J22920J43304J58874J66029J61901J45438J18095
34111C680141Q3755M7653J4834j1115k8571l7986m1819m3950m8171n6435o8014
34100C490322q0398r1155r9370j05812j12118j19819j29766j41980j55795j70139
34090B283970j83721j94920k01539k00952j90761j69434j36314r1291l5128K9489
34080I09399R7104J60140K10839K43367K54927K45722K18255J76330J24143O5719
34070B705945M901n4243j07094j48790j75392j85317j79908j62542j36807j05121
$$ y = [1759983, 1861797, 1953800, 2029976, 2086658, 2122804, 2139866, 2141515, 2133309, 2122013, 2114333, 2115473, 2128208, 2152800, 2187235, 2227435, 2267685, 2302014, 2326472, 2341225, 2351014, 2363480, 2386376, 2425374, 2483625, 2562703, 2663580, 2786500, 2929804, 3088678, 3254707, 3416608, 3562046, 3680141, 3763896, 3811549, 3826383, 3815268, 3786697, 3748711, 3706892, 3662942, 3614771, 3558336, 3490322, 3409924, 3318769, 3219399, 3113587, 3001469, 2881650, 2751884, 2609904, 2454109, 2283970, 2100249, 1905329, 1703790, 1502838, 1312077, 1142643, 1006329, 915038, 879910, 909399, 1006503, 1166643, 1377482, 1620849, 1875776, 2121498, 2339753, 2516083, 2640226, 2705945, 2710846, 2656603, 2549509, 2400719, 2225327, 2040010, 1860102, 1697560, 1560753, 1455632]
34060A455632o8658k8189J5211O0205J05607J50354J92847K30215K58212K71835
$$ y = [1455632, 1386974, 1358785, 1373996, 1434201, 1539808, 1690162, 1883009, 2113224, 2371436, 2643271]
$$ [...]
##END NTUPLES=NMR SPECTRUM
##END=
