##TITLE=31Pdec_DE-75K_NaOH
 D2O, 64 sc
 25.11.2024
##JCAMPDX= 6.0         $$ Bruker NMR JCAMP-DX V2.0
##DATA TYPE= NMR SPECTRUM
##DATA CLASS= NTUPLES
##ORIGIN= UXNMR, Bruker Analytische Messtechnik GmbH
##OWNER= root
$$ XWIN-NMR		Version 3.5
$$ Mon Nov 25 14:53:26 2024 Russian Standard Time (UT+4h)  she@DPX200
##.OBSERVE FREQUENCY= 81.013821
##.OBSERVE NUCLEUS= ^31P
##.ACQUISITION MODE= SIMULTANEOUS
##.ACQUISITION SCHEME= undefined
##.AVERAGES= 24
##.DIGITISER RES= 17
##SPECTROMETER/DATA SYSTEM= spect
##.PULSE SEQUENCE= zgpg30
##.SOLVENT NAME= CDCl3
##.SHIFT REFERENCE= (INTERNAL, CDCl3, 0, 198.062)
##AUDIT TRAIL= $$ (NUMBER, WHEN, WHO, WHERE, WHAT)
$$ ##TITLE= Audit trail, XWIN-NMR		Version 3.5
$$ ##JCAMPDX= 5.01
$$ ##ORIGIN= Bruker BioSpin GmbH
$$ ##OWNER= she
$$ F:/spectra/data/she/nmr/P31/2/pdata/1/auditp.txt
$$ ##AUDIT TRAIL=  $$ (NUMBER, WHEN, WHO, WHERE, WHAT)
(   1,<2024-11-25 14:52:20.65 +0400>,<she>,<DPX200>,
      <created by zg, POWCHK disabled, PULCHK disabled
       configuration hash MD5:
       00 E9 B6 7A A2 85 ED C7 34 08 36 98 17 FE 4E 26
       data hash MD5: 32K
       FE C8 09 52 2E 6D 97 77 F6 79 B4 FB D9 33 00 4D>)
(   2,<2024-11-25 14:52:26.87 +0400>,<she>,<DPX200>,
      <Start of raw data processing
       efp BC_mod = 2 LB = 1.5 FT_mod = 6 PKNL = 1 PHC0 = 2259.697 PHC1 = 83.48821 SI = 64K 
       data hash MD5: 64K
       41 23 30 91 27 E0 16 33 2D 9B ED 20 AE 98 E6 32>)
(   3,<2024-11-25 14:52:41.09 +0400>,<she>,<DPX200>,
      <pk PHC0 = 5.504121 PHC1 = 0 
       data hash MD5: 64K
       C7 90 EF E4 DF FA 86 B1 59 BC AE 77 03 72 B1 C3>)
(   4,<2024-11-25 14:52:44.65 +0400>,<she>,<DPX200>,
      <abs ABSG = 5 
       data hash MD5: 64K
       D2 81 20 DF 7C 4F D7 30 8D 99 95 67 29 76 9A 36>)
$$ ##END=
$$ 
$$ hash MD5
$$ D8 A6 53 20 47 4D 43 03 35 34 74 F6 02 98 68 B0
##$RELAX= 
##$RELAX= 
##$RELAX= 
##$RELAX= 
##$RELAX= 
##$RELAX= 
##$RELAX= 
##$RELAX= 
$$ Bruker specific parameters
$$ --------------------------
##$DU= <F:/spectra>
##$EXPNO= 2
##$NAME= <P31>
##$PROCNO= 1
##$TYPE= <nmr>
##$USER= <she>
##$AMP= (0..31)
100 100 100 100 100 100 100 100 100 100 100 100 100 100 100 100 100 100 
100 100 100 100 100 100 100 100 100 100 100 100 100 100 
##$AQSEQ= 0
##$AQ_mod= 1
##$AUNM= <au_zg>
##$AUTOPOS= <>
##$BF1= 81.014009
##$BF2= 200.13
##$BF3= 200.13
##$BF4= 200.13
##$BF5= 200.13
##$BF6= 200.13
##$BF7= 200.13
##$BF8= 200.13
##$BYTORDA= 1
##$CFDGTYP= 0
##$CFRGTYP= 5
##$CHEMSTR= <none>
##$CNST= (0..31)
1 1 145 1 1 1 1 1 1 1 1 1 1 1 1 1 1 1 1 1 1 1 1 1 1 1 1 1 1 1 1 1 
##$CPDPRG= <waltz16>
##$CPDPRG1= <>
##$CPDPRG2= <waltz16>
##$CPDPRG3= <>
##$CPDPRG4= <mlev>
##$CPDPRG5= <mlev>
##$CPDPRG6= <mlev>
##$CPDPRG7= <mlev>
##$CPDPRG8= <mlev>
##$CPDPRGB= <>
##$CPDPRGT= <>
##$D= (0..31)
0 1 0 0 0 0 0 0 0 0.06 0 0.03 2e-05 3e-06 0 0 0.0002 0 0 0 0 0 0 0 0 0 
0 0 0 0 0 0 
##$DATE= 1732531940
##$DBL= (0..7)
120 120 120 11 120 120 24 19 
##$DBP= (0..7)
150 150 150 150 150 150 150 150 
##$DBP07= 0
##$DBPNAM0= <>
##$DBPNAM1= <>
$$ [...]
##$SUBNAM3= <"">
##$SUBNAM4= <"">
##$SUBNAM5= <"">
##$SUBNAM6= <"">
##$SUBNAM7= <"">
##$SUBNAM8= <"">
##$SUBNAM9= <"">
##$SW= 400.765351723535
##$SWIBOX= (0..15)
0 1 3 0 0 0 0 0 0 0 0 0 0 0 0 0 
##$SW_h= 32467.5324675325
##$TD= 32768
##$TD0= 1
##$TE= 0
##$TE2= 300
##$TE3= 300
##$TEG= 300
##$TL= (0..7)
0 120 53 12 22 120 120 120 
##$TP= (0..7)
150 150 150 150 150 150 150 150 
##$TP07= 0
##$TPNAME0= <>
##$TPNAME1= <>
##$TPNAME2= <>
##$TPNAME3= <>
##$TPNAME4= <>
##$TPNAME5= <>
##$TPNAME6= <>
##$TPNAME7= <>
##$TPOAL= (0..7)
0.5 0.5 0.5 0.5 0.5 0.5 0.5 0.5 
##$TPOFFS= (0..7)
0 0 0 0 0 0 0 0 
##$TUNHIN= 0
##$TUNHOUT= 0
##$TUNXOUT= 0
##$USERA1= <user>
##$USERA2= <user>
##$USERA3= <user>
##$USERA4= <user>
##$USERA5= <user>
##$V9= 5
##$VALIST= <valist>
##$VCLIST= <CCCCCCCCCCCCCCC>
##$VD= 0
##$VDLIST= <DDDDDDDDDDDDDDD>
##$VPLIST= <PPPPPPPPPPPPPPP>
##$VTLIST= <TTTTTTTTTTTTTTT>
##$WBST= 1024
##$WBSW= 4
##$XGAIN= (0..3)
0 0 0 0 
##$XL= 0
##$YL= 0
##$YMAX_a= 7813
##$YMIN_a= -3286
##$ZGOPTNS= <>
##$ZL1= 120
##$ZL2= 120
##$ZL3= 120
##$ZL4= 120
##$ABSF1= 198.0616
##$ABSF2= -202.7028
##$ABSG= 5
##$ABSL= 3
##$ALPHA= 0
##$AQORDER= 0
##$ASSFAC= 0
##$ASSFACI= 0
##$ASSFACX= 0
##$ASSWID= 0
##$AUNMP= <proc_1d>
##$AZFE= 0.1
##$AZFW= 0.5
##$BCFW= 0
##$BC_mod= 2
##$BYTORDP= 0
##$COROFFS= 0
##$CY= -3
##$DATMOD= 1
##$DC= 0
##$DFILT= <>
##$DTYPP= 0
##$F1P= 0
##$F2P= 0
##$FCOR= 1
##$FTSIZE= 65536
##$FT_mod= 6
##$GAMMA= 0
##$GB= 0
##$INTBC= 1
##$INTSCL= 9.790993e-09
##$ISEN= 30
##$LB= 1.5
##$LEV0= 0
##$LPBIN= 0
##$MAXI= 10000
##$MC2= 0
##$MEAN= 0
##$ME_mod= 0
##$MI= 50
##$NCOEF= 0
##$NC_proc= -8
##$NLEV= 6
##$NOISF1= 182.463
##$NOISF2= 159.3651
##$NSP= 0
##$NTH_PI= 0
##$NZP= 0
##$OFFSET= 198.0616
##$PC= 4
##$PHC0= 2265.201
##$PHC1= 83.48821
##$PH_mod= 1
##$PKNL= yes
##$PPARMOD= 0
##$PSCAL= 0
##$PSIGN= 0
##$REVERSE= no
##$SF= 81.0140089999434
##$SI= 65536
##$SIGF1= 159.3651
##$SIGF2= -187.1042
##$SINO= 113.3802
##$SIOLD= 16384
##$SREGLST= <1H.CDCl3>
##$SSB= 0
##$STSI= 65536
##$STSR= 0
##$SW_p= 32467.5324675325
##$SYMM= 0
##$S_DEV= 0
##$TDeff= 32768
##$TDoff= 0
##$TI= <>
##$TILT= no
##$TM1= 0
##$TM2= 0
##$TOPLEV= 0
##$USERP1= <user>
##$USERP2= <user>
##$USERP3= <user>
##$USERP4= <user>
##$USERP5= <user>
##$WDW= 1
##$XDIM= 65536
##$YMAX_p= 327432687
##$YMIN_p= -48820406
$$ End of Bruker specific parameters
$$ ---------------------------------
##NTUPLES= NMR SPECTRUM
##VAR_NAME=  FREQUENCY,     SPECTRUM/REAL,   SPECTRUM/IMAG
##SYMBOL=    X,             R,               I
##VAR_TYPE=  INDEPENDENT,   DEPENDENT,       DEPENDENT
##VAR_FORM=  AFFN,          ASDF,            ASDF
##VAR_DIM=   65536,         65536,           65536
##UNITS=     HZ,            ARBITRARY UNITS, ARBITRARY UNITS
##FACTOR=    0.49542278885378, 1,            1
##FIRST=     16045.7642231865, 0,            0
##LAST=      -16421.768244346, 0,            0
##MIN=       -16421.768244346, -48820406,    0
##MAX=       16045.7642231865, 327432687,    0
$$ Real data points
##PAGE= N=1
##DATA TABLE= (X++(R..R)), XYDATA
$$ [...]
$$ plain form
42006 343354 8657 959643 2328834 2276905 678574 -664844 -248426 1677592 3722212
41997 3722212 4655366 4146368 2773101 1367285 199512 -970289 -2011354 -2230924 -1449986
41988 -1449986 -659099 -914914 -1887231 -2183246 -1019551 1017364 2851859 3915034 4043263
41979 4043263 3013864 887409 -1279773 -1821337 -45637 2843883 4828529 4878428 3353151
41970 3353151 1108571 -969824 -1869572 -1109407 330774 841476 213773 -281546 -14891
41961 -14891 388611 1029673 3215758 6614653 8018750 5241978 811756 -885226 744534
41952 744534 2509520 2534523 2155295 2560463 2806914 2122149 1295204 500707 -1555726
41943 -1555726 -4713399 -6178823 -4385668 -1776126 -1219015 -1546582 334693 4112582
$$ packed form
42006C43354l34697R50986J369191n1929j598331j343418M16418J926018K044620
41997C722212R33154n08998j373267j405816j167773j169801j041065k19570P80938
41988a449986P90887k55815r72317k96015J163695K036915J834495J063175J28229
41979D043263j029399k126455k167182n41564J775700K889520J984646M9899j525277
41970C353151k244580k078395q99748P60165J440181N10702o27703m95319K66655
41961a4891M03502O41062K186085L398895J404097k776772m430222j696982J629760
41952G44534J764986K5003l79228M05168K46451o84765q26945p94497k056433
41943a555726l157673j465424J793155K609542N57111l27567J881275L777889
$$ plain form
41935 4112582 6170807 4771117 2076840 540349 -96719 -1173440 -2532096 -3033055
41927 -3033055 -2548213 -2168047 -2788991 -4160131 -5134594 -4664298 -2820844 -802084 367031
41918 367031 825803 1142467 1208708 758872 475639 1335140 2977132 3937227 3610332 2908537
41908 2908537 2767919 2984095 2810948 1868490 193619 -1819310 -3258408 -3224161 -1855737
41899 -1855737 -277610 634450 860071 613209 -23768 -585675 -191339 1382131 3016746
41890 3016746 3166051 1409518 -1001414 -2102673 -969253 1210952 2139798 868781
41882 868781 -1186903 -2168664 -1981803 -1664452 -1272475 129175 2567203 4768157 5824806
41873 5824806 5917526 5200521 3462166 1363812 506468 1352519 2210615 1282184 -1082895
$$ packed form
41935D112582K058225j399690k694277j536491o37068j076721j358656n00959
41927c033055M84842L80166o20944j371140r74463M70296J843454K018760J169115
41918C67031M58772L16664O6241m49836k83233Q59501J641992R60095l26895p01795
41908B908537j40618K16176j73147r42458j674871k012929j439098L4247J368424
41899a855737J578127R12060K25621k46862o36977n61907L94336J573470J634615
41890C016746J49305j756533k410932j101259J133420K180205R28846j271017
41882H68781k055684r81761J86861L17351L91977J401650K438028K200954J056649
41873E824806R2720p17005j738355k098354q57344Q46051Q58096r28431k365079
$$ plain form
41864 -1082895 -3008111 -3217075 -1756332 624914 2872894 3968368 3785066 3278218 3179688
41855 3179688 2982803 1864512 39319 -1593132 -2657460 -3328266 -3575579 -3283906 -2841969
41846 -2841969 -2739036 -2737428 -2234859 -1304321 -602547 -365516 -280592 -256349 -409755 -206500
41836 -206500 1363974 4203145 6389198 5891394 2930623 39397 -452794 1294498 3106666
41827 3106666 3294204 2114907 687239 -697635 -2382934 -3981153 -4470322 -3844454 -3530976
41818 -3530976 -4516716 -5818190 -5584261 -3345314 -616233 444446 -1322229 -5196010
41810 -5196010 -8829086 -9884508 -8031102 -5011373 -2411171 -1968 3147401 6653647
41802 6653647 8922237 9008403 7514717 5680108 4203617 2964394 1509078 -121951
$$ packed form
41864a082895j925216k08964J460743K381246K247980J095474j83302n06848r8530
41855C179688j96885j118291j825193j632451j064328o70806k47313K91673M41937
41846b841969J02933J608N02569R30538P01774K37031Q4924K4243j53406K03255
41836b06500J570474K839171K186053m97804k960771k891226m92191J747292J812168
41827C106666J87538j179297j427668j384874j685299j598219m89169O25868L13478
41818c530976r85740j301474K33929K238947K729081J060679j766675l873781
41810e196010l633076j055422J853406L019729K600202K409203L149369L506246
41802F653647K268590Q6166j493686j834609j476491j239223j455316j631029
$$ plain form
41794 -121951 -1015030 -415673 699631 170629 -2469398 -4738615 -4106757 -1388470 298442
41785 298442 -480364 -2236830 -3190883 -3262865 -3010660 -2342180 -1272485 -685967 -1157634
41776 -1157634 -1783443 -1278863 189697 1182289 778070 -455934 -1108078 -127358 2266590
41767 2266590 4484726 4841677 3394286 1985733 1901858 2145261 943367 -1583352 -3563270
41758 -3563270 -4055143 -4099242 -4646612 -4883408 -3721338 -1919115 -1133885 -1265071 -529268
41749 -529268 1547060 2978492 2128150 196051 -604940 -311829 -700339 -1997672 -2374096
41740 -2374096 -1006030 563763 1066498 1528278 3168592 4926795 5103362 4411160 5054896
41731 5054896 7058646 7785055 5527754 1721717 -1201235 -2687073 -3752027 -4836760
$$ packed form
41794a21951q93079N99357J115304n29002k640027k269217O31858K718287J686912
41785B98442p78806j756466r54053p1982K52205O68480J069695N86518m71667
41776a157634o25809N04580J468560R92592m04219j234004o52144R80720K393948
41767B266590K218136L56951j447391j408553q3875K43403j201894k526719j979918
41758c563270m91873m4099n47370k36796J162070J802223P85230j31186P35803
41749e29268K076328J431432q50342j932099q00991K93111l88510j297333l76424
41740b374096J368066J569793N02735M61780J640314J758203J76567o92202O43736
41731E054896K003750P26409k257301l806037k922952j485838j064954j084733
$$ plain form
41723 -4836760 -5263420 -4629463 -3830252 -4329615 -6476102 -8709231 -8865858 -6548994 -3708646
41714 -3708646 -2382837 -2475794 -2560048 -2180084 -2065520 -2442717 -2700889 -2808806 -3541438 -4901585
41704 -4901585 -5672622 -5102546 -3826822 -2489556 -645107 2070474 4610788 5415204 4189291
41695 4189291 2068625 367991 -326884 -187771 338274 1242376 3065714 5712098 7502643
41686 7502643 6662873 3795119 1455008 952456 1083185 558078 -48624 165776 515368
41677 515368 -180291 -1651700 -2709933 -2825501 -1949459 136713 2723636 3406888 385505
41668 385505 -4828505 -8679676 -9325390 -7691979 -5294401 -2913551 -1378242 -1649616 -3503533
41659 -3503533 -5472570 -6563761 -6916322 -6577508 -5063076 -2666466 -900649 -823272 -1799668
$$ packed form
41723d836760m26660O33957P99211m99363k146487k233129j56627K316864K840348
41714c708646J325809r2957q4254L79964J14564l77197k58172j07917p32632j360147
41704d901585p71037N70076J275724J337266J844449K715581K540314Q04416j225913
41695D189291k120666j700634o94875J39113N26045R04102J823338K646384J790545
41686G502643q39770k867754k340111n02552J30729n25107o06702K14400L49592
41677E15368o95659j471409j058233j15568Q76042K086172K586923O83252l021383
41668C85505n214010l851171o45714J633411K397578K380850J535309k71374j853917
41659c503533j969037j091191l52561L38814J514432K396610J765817P7377r76396
$$ plain form
41650 -1799668 -2583468 -2821039 -2817155 -2522094 -1580590 -107255 1177437 1571080 999875
41641 999875 121659 -240299 44658 357540 345254 402816 597918 -86613 -2318779 -4764373
41631 -4764373 -5291834 -3702999 -1895455 -1286020 -1459351 -1497275 -1129167 -173869 1624507
41622 1624507 3502204 3808907 2183468 479330 499981 1716472 2279510 1554470 534092
41613 534092 198228 511984 876536 795487 172808 -566221 -820056 -574286 -470175 -842260
41603 -842260 -1176364 -870689 -47200 738961 1113197 916122 164014 -766726 -1494148 -2327980
41593 -2327980 -3850425 -5643122 -6461480 -6063330 -5729453 -6311814 -6871233 -6142899 -4366384
41584 -4366384 -2597386 -1030678 767836 2475502 3041651 1953301 -220654 -2207566
$$ packed form
41650a799668p83800k37571L884K95061R41504J473335J284692L93643n71205
41641I99875q78216l61958K84957L12882j2286N7562J95102o84531k232166k445594
41631d764373n27461J588835J807544O09435j73331l7924L68108R55298J798376
41622A624507J877697L06703j625439j704138K0651J216491N63038p25040j020378
41613E34092l35864L13756L64552q1049o22679p39029k53835K45770J04111l72085
41603h42260l34104L05675Q23489P86161L74236j97075p52108r30740p27422q33832
41593b327980j522445j792697q18358L98150L33877n82361n59419P28334J776515
41584d366384J768998J566708J798514J707666N66149j088350k173955j986912
$$ plain form
41576 -2207566 -2533230 -528560 2383516 3393823 1454239 -1083506 -1261085 743995
41568 743995 2083125 898643 -1986514 -4648626 -5731760 -4707035 -2099900 354055
41560 354055 1077732 330718 -520332 -1170599 -2443139 -4366881 -5813980 -6153834 -5685795
41551 -5685795 -4291081 -1412439 2244337 4790487 5570923 5781667 5954595 4746639 1465336
41542 1465336 -1940730 -3113227 -2317029 -1564958 -1626716 -1641047 -1112558 -541201 -189761
41533 -189761 344853 1221095 1973576 2035020 1043700 -919151 -2752562 -2836889 -1150584
41524 -1150584 13019 -1149709 -3265519 -3695537 -2480496 -2064253 -3121449 -3216477 -473892
41515 -473892 3578434 6188487 6748697 6423259 5681607 4072023 1910708 496019 575906
$$ packed form
41576b207566l25664K004670K912076J010307j939584k537745j77579K005080
41568G43995J339130j184482k885157k662112j083134J024725K607135K453955
41560C54055P23677p47014q51050o50267j272540j923742j447099l39854M68039
41551e685795J394714K878642L656776K546150P80436K10744J72928j207956l281303
41542A465336l406066j172497P96198P52071o1758j4331N28489N71357L51440
41533a89761N34614Q76242P52481O1444r91320j962851j833411q4327J686305
41524a150584J163603j162728k115810m30018J215041M16243j057196r5028K742585
41515d73892M052326K610053N60210l25438p41652j609584k161315j414689P9887
$$ plain form
41506 575906 1676659 2950022 3850800 4089044 3737717 3359230 3358007 3300344 2483390 1008197
41496 1008197 -341690 -1088661 -1276352 -963096 -301042 55358 -480039 -1435269 -1683996
41487 -1683996 -901530 147809 779244 936011 467407 -1062716 -3368907 -5141044 -5429572
41478 -5429572 -4752597 -4218781 -4032977 -3500810 -2215607 -690862 87878 -490838 -2039032
41469 -2039032 -3295805 -3258672 -2223818 -1198868 -407358 716403 2033416 2499149 1911548
41460 1911548 1512656 2063095 2683408 2690733 3103192 4670574 5746811 4410630 1893912
41451 1893912 1202842 2424265 2238383 -1169754 -5262420 -6540201 -4786240 -2408039
41443 -2408039 -1160825 -1164105 -1891455 -2430559 -1708977 -63368 246552 -2320445 -6170438
$$ packed form
41506E75906J100753J273363R00778K38244l51327l78487j223n7663q16954j475193
41496A008197j349887p46971j87691L13256O62054L56400n35397r55230k48727
41487a683996P82466J049339O31435J56767m68604j530123k306191j772137k88528
41478e429572O76975N33816J85804N32167J285203J524745P78740n78716j548194
41469b039032j256773L7133J034854J024950P91510J123761J317013M65733n87601
41460A911548l98892N50439O20313P325M12459J567382J076237j336181k516718
41451A893912o91070J221423j85882l408137m092666j277781J753961K378201
41443b408039J247214l280p27350n39104P21582J645609L09920k566997l849993
$$ plain form
41434 -6170438 -8397944 -8307146 -7395444 -6581468 -5639480 -5067336 -6028242 -7988607 -8612439
41425 -8612439 -6889122 -4578121 -3562224 -3430780 -2969007 -2616181 -3753911 -6302452 -8598774
41416 -8598774 -9399730 -8799882 -7348892 -5389865 -3355130 -1874566 -1352944 -1759412 -2655467
41407 -2655467 -3105656 -2053111 560929 3407781 5155818 5849394 6205261 6149636 5238961
41398 5238961 4128832 4008842 4434706 3466767 744643 -1156824 190488 3752923 6479397
41389 6479397 7353166 8009544 9459847 10462595 9913919 8834832 8434495 7607507 4389707
41380 4389707 -658190 -4523462 -5294800 -3989470 -2532425 -1549423 -917402 -1070127 -2438275
41371 -2438275 -4242492 -5029676 -4331653 -3167101 -2999307 -4473621 -6844541 -8446342 -8235417
$$ packed form
41434f170438k227506R0798R11702Q13976R41988N72144r60906j960365o23832
41425h612439J723317K311001J015897J31444M61773L52826j137730k548541k296322
41416h598774q00956N99848J450990J959027K034735J480564N21622m06468q96055
41407b655467m50189J052545K614040K846852J748037O93576L55867n5625r10675
41398E238961j110129j19990M25864r67939k722124j901467J347312L562435K726474
41389F479397Q73769O56378J450303J002748n48676j079087m00337q26988l217800
41380D389707n047897l865272p71338J305330J457045R83002O32021j52725j368148
41371b438275j804217p87184O98023J164552J67794j474314k370920j601801K10925
$$ plain form
41362 -8235417 -7018140 -6444900 -6712991 -6465534 -5391505 -5319409 -7450534 -9810528 -9349310
41353 -9349310 -6007176 -2799358 -1944361 -2662908 -3055832 -2526296 -1705570 -1229286 -1373437
41344 -1373437 -2121520 -3008131 -3446646 -3469995 -3507777 -3349366 -2241335 -272903 1272160
41335 1272160 1384761 413980 -634642 -1097264 -668812 607962 1840771 1677177 -51873
41326 -51873 -1718517 -1699527 -393684 232894 -1078307 -3493767 -4824077 -3464108 81806
41317 81806 3441722 4452661 3069924 960974 -463777 -921182 -541327 462198 1285430
41308 1285430 971940 -158392 -586842 338402 1402233 1222146 18213 -1062788 -1618130
41299 -1618130 -2209833 -3460527 -5477065 -7629917 -8609313 -7521886 -5245611 -3662423
$$ packed form
41362h235417J217277N73240k68091K47457J074029P2096k131125k359994M61218
41353i349310L342134L207818Q54997p18547l92924N29536Q20726M76284j44151
41344a373437p48083q86611m38515k3349l7782J58411J108031J968432J545063
41335A272160J12601r70781j048622m62622M28452J276774J232809j63594j729050
41326e1873j666644J8990J305843O26578j311201k415460j330310J359969L545914
41317H1806L359916J010939j382737k108950j424751m57405L79855J003525Q23232
41308A285430l13490j130332m28450R25244J063831j80087j203933j081001n55342
41299a618130n91703j250694k016538k152852r79396J087427K276275J583188
$$ plain form
41291 -3662423 -3171268 -2288107 -358315 890909 -295999 -3093176 -5255834 -5834067 -5230901
41282 -5230901 -3550562 -719654 2266195 3942715 4025834 3174944 1666552 -189522 -976552
41273 -976552 482420 2912930 3767002 2729892 2048778 3018901 4230015 4115802 3296373
41264 3296373 3084857 3202474 2610147 1653089 1634309 2520334 2586128 709988 -1870008
41255 -1870008 -2703995 -901223 1602549 1917623 -498207 -2885799 -2160198 1488844 4917013
41246 4917013 5858750 5219646 5126689 5881304 5885764 4039122 1132621 -1149669 -1919906
41237 -1919906 -1595474 -1117593 -911009 -566056 525631 2283728 3758419 3833570 2144555
41228 2144555 -513703 -2631000 -3100400 -2075250 -563031 761026 1867579 2588760
$$ packed form
41291c662423M91155Q83161J929792J249224j186908k797177k162658n78233O03166
41282e230901J680339K830908K985849J676520Q3119q50890j508392j856074p87030
41273i76552J458972K430510Q54072j037110o81114R70123J211114j14213q19429
41264C296373k11516J17617n92327r57058j8780Q86025O5794j876140k579996
41255a870008q33987J802772K503772L15074k415830k387592P25601L649042L428169
41246D917013R41737o39104r2957P54615M460j846642k906501k282290p70237
41237a919906L24432M77881K06584L44953J091687J758097J474691P5151j689015
41228B144555k658258k117297m69400J025150J512219J324057J106553P21181
$$ plain form
41220 2588760 2481954 1878088 2030876 3351949 4331265 3348006 977332 -726020 -804196
41211 -804196 82774 1392686 3328932 5535225 6670889 5938987 4037293 2030756 126024
41202 126024 -1873605 -3628556 -4484893 -4335197 -3787214 -3505283 -3496110 -3142541 -2257420 -1963997
41192 -1963997 -3536152 -6041678 -6577395 -3932497 -611103 447644 -184741 -98371 435064
41183 435064 -1127205 -4746356 -6907283 -5684080 -3602185 -3650251 -5020130 -5092799 -3647595
41174 -3647595 -2452626 -1945308 -1040742 253981 468473 -985940 -2934627 -4159823 -4636742
41165 -4636742 -4836536 -4878442 -4605157 -3824525 -2516865 -1272974 -1069671 -1955406 -2545149
41156 -2545149 -1675176 -42651 701580 45987 -1038718 -1381755 -448458 1543654 3524961
$$ packed form
41220B588760j06806o03866J52788J321073R79316r83259k370674j703352p8176
41211h04196Q86970J309912J936246K206293J135664p31902j901694k006537j904732
41202A26024j999629j754951q56337J49696N47983K81931R173L53569Q85121K93423
41192a963997j572155k505526n35717K644898L321394J058747o32385Q6370N33435
41183D35064j562269l619151k160927J223203K081895m8066j369879p2669J445204
41174c647595J194969N07318R04566J294723K14492j454413j948687j225196m76919
41165d636742j99794m1906K73285P80632J307660J243891K03303q85735n89743
41156b545149Q69973J632525P44231o55593j084705l43037R33297J992112J981307
$$ plain form
41147 3524961 4191184 3490462 2712041 2324226 970948 -2045636 -4603548 -4167672 -1586850
41138 -1586850 -98855 -733258 -1193113 242642 2083954 2019638 101099 -1896738 -3007157
41129 -3007157 -3449945 -3328266 -2548977 -1784342 -2088304 -3288711 -3778725 -2481009 -467075
41120 -467075 96699 -1425376 -3212035 -3071059 -1013324 969519 1533563 1382816 1717945
41111 1717945 2306469 1984836 542256 -836720 -881544 609409 2725006 4077063 3815796
41102 3815796 2541616 1869737 2597967 3742763 3917833 3100049 2315615 2109975 2193661
41093 2193661 2235494 2169928 1983738 1885586 2324960 3204408 3609060 3054025 2330496 2185735
41083 2185735 1912031 517329 -1251597 -1528462 207872 2589395 4180359 4652059 4300679
$$ packed form
41147C524961O66223p00722p78421l87815j353278l016584k557912M35876K580822
41138a586850J487995o34403m59855J435755J841312o4316j918539j997837j110419
41129c007157m42788J21679P79289P64635l03962j200407m90014J297716K013934
41120d67075N63774j522075j786659J40976K057735J982843N64044j50747L35129
41111A717945N88524l21633j442580j378976m4824J490953K115597J352057k61267
41102C815796j274180o71879P28230J144796J75070q17784p84434k05640Q3686
41093B193661M1833o5566j86190r8152M39374Q79448M04652n55035p23529j44761
41083B185735k73704j394702j768926k76865J736334K381523J590964M71700l51380
$$ plain form
41074 4300679 3691474 3758385 4971392 6290420 6101515 4299756 2380808 1498338 1623699
41065 1623699 2567011 4321939 6067693 6303660 4750954 3108266 3102820 4385624 5008475
41056 5008475 3710746 1371464 203435 1341746 3190521 2891408 -134513 -3135810
41048 -3135810 -3411680 -1598875 -193536 50725 197709 376949 -469353 -2048630 -2399431
41039 -2399431 -768753 1190570 1899894 1859927 2331336 3351359 3813974 2578685 -679561
41030 -679561 -4586750 -6259869 -4107472 -404788 879843 -1084955 -3451772 -4026764
41022 -4026764 -3512419 -2979383 -2097762 -1046209 -1291466 -2775298 -2919195 -403613 2407487
41013 2407487 2946736 2108095 2048052 2457833 1868790 967407 1474530 2815217 2972923
$$ packed form
41074D300679o09205O6911J213007J319028j88905j801759j918948q82470J25361
41065A623699R43312J754928J745754K35967j552706j642688n446J282804O22851
41056E008475j297729k339282j168029J138311J848775k99113l025921l001297
41048c135810k75870J812805J405339K44261J46984J79240q46302j579277l50801
41039b399431J630678J959323P09324l9967M71409J020023M62615j235289l258246
41030f79561l907189j673119K152397L702684J284631j964798k366817n74992
41022d026764N14345N33036Q81621J051553k45257j483832j43897K515582K811100
41013B407487N39249q38641o0043M09781n89043r01383N07123J340687J57706
$$ plain form
41004 2972923 2004580 1809521 2772935 3371585 2953291 2341517 1741766 582301 -435982
40995 -435982 365945 2832086 4612228 4154392 2211124 36738 -1928197 -3093523 -2504155
40986 -2504155 -536094 764928 -252 -2062299 -3881973 -4871383 -5115199 -4578684 -3444860
40977 -3444860 -2495385 -2466961 -3323429 -4239106 -3950730 -1607738 1892205 3994882 3131504
40968 3131504 804111 -309427 239132 868377 1040090 1832216 3340832 3874311 2451927
40959 2451927 123329 -2007783 -4156184 -6230120 -6727043 -4819256 -2280079 -1735618
40951 -1735618 -3645073 -6163275 -7420100 -6985937 -5624646 -4502227 -4372223 -5024511 -5760790
40942 -5760790 -6362633 -6855424 -6495270 -4358092 -1212708 666065 202939 -1258093 -2110706
$$ packed form
41004B972923r68343j95059R63414N98650m18294o11774n99751j159465j018283
40995d35982Q01927K466141J780142m57836j943268k174386j964935j165326N89368
40986b504155J968061J301022p65180k062047j819674r89410k43816N36515J133824
40977c444860R49475K8424q56468r15677K88376K342992L499943K102677q63378
40968C131504k327393j113538N48559O29245J71713P92126J508616N33479j422384
40959B451927k328598k131112k148401k073936m96923J907787K539177N44461
40951a735618j909455k518202j256825M34163J361291J122419J30004o52288p36279
40942e760790o01843m92791L60154K137178L145384J878773m63126j461032q52613
$$ plain form
40933 -2110706 -2455795 -3001380 -3423855 -3150779 -2682875 -2671258 -2444988 -945290 1305180
40924 1305180 2533296 1870941 115508 -1541101 -2607125 -3144691 -3291594 -3043478 -2217279
40915 -2217279 -827915 397478 551384 -70259 27603 1515967 3047342 2930677 1306884
40906 1306884 -288989 -942976 -891963 -471209 352110 1537261 2960320 4699204 6501398
40897 6501398 7160642 5403130 1536603 -2458151 -4619654 -4408090 -2640967 -689746
40889 -689746 316053 173329 -256018 140532 1697488 3781773 5313641 5332655 3623118
40880 3623118 1264640 66524 768651 2079300 2147105 785709 -411179 -52388 1577808
40871 1577808 3020742 3092642 1779202 88008 -870480 -779171 -17771 1256502 3317225
$$ packed form
40933b110706l45089n45585m22475K73076M67904J1617K26270J499698K250470
40924A305180J228116o62355j755433j656609j066024n37566j46903K48116Q26199
40915b217279J389364J225393J53906o21643R7862J488364J531375j16665j623793
40906A306884j595873o53987N1013M20754Q23319J185151J423059J738884J802194
40897F501398O59244j757512l866527l994754k161503K11564J767123J951221
40889f89746J005799j42724m29347L96550J556956K084285J531868J9014j709537
40880C623118k358478j198116P02127J310649O7805j361396j196888L58791J630196
40871A577808J442934P1900j313440j691194r58488R1309P61400J274273K060723
$$ plain form
40862 3317225 5775552 6942179 5220276 1088989 -3032399 -5068484 -4974007 -4065951 -3263731
40853 -3263731 -2449147 -1332457 -311862 -68037 -521668 -788296 -320041 530005 1472557
40844 1472557 3033094 5405783 7115582 6235638 3015588 -6645 -927451 -431883 -352577
40835 -352577 -1321248 -2520287 -2923760 -2088199 -368469 1094026 1243486 397480 -82928
40826 -82928 274326 496843 10241 -277526 378944 1090591 732389 -236827 -783928 -1289010
40816 -1289010 -2860427 -5079186 -6063325 -4799258 -2138654 563729 2675248 4052532
40808 4052532 4585491 4239748 3030239 1043552 -1095846 -2290855 -2200749 -1851960 -2221163
40799 -2221163 -2881754 -3039166 -3088728 -3732798 -4191556 -3042630 -628561 1126935 1401277
$$ packed form
40862C317225K458327J166627j721903m131287m121388k036085R4477R08056Q02220
40853c263731Q14584J116690J020595K43825m53631k66628M68255Q50046R42552
40844A472557J560537K372689J709799q79944l220050l022233r20806M95568P9306
40835c52577r68671j199039m03473Q35561J719730J462495J49460q46006m80408
40826h2928L57254K22517m86602k87767O56470P11647l58202r69216n47101n05082
40816a289010j571417k218759r84139J264067K660604K702383K111519J377284
40808D052532N32959l45743j209509j986687k139398j195009R0106L48789l69203
40799b221163o60591j57412m9562o44070m58758J148926K414069J755496K74342
$$ plain form
40790 1401277 1315722 1802638 2226647 1719485 557462 -504502 -1259576 -1783994 -1960388
40781 -1960388 -1739028 -1190709 -129510 1427124 2332291 1073829 -2075190 -4753376 -4937969
40772 -4937969 -2821106 72627 2489899 3596619 2811074 638370 -1072599 -865051
40764 -865051 621876 1510372 972936 -118565 -698089 -869990 -1483668 -2721733 -3619945
40755 -3619945 -3303181 -2446067 -2643849 -3993717 -4394588 -2334055 527105 1240047 -373270
40746 -373270 -1562473 -744264 318267 -741034 -3729873 -6638211 -8149306 -8180395 -7095162
40737 -7095162 -5679630 -4954790 -4813612 -3834385 -1699902 -591025 -2359409 -5227849 -5593602
40728 -5593602 -2896175 -355675 -422396 -1648922 -1214069 1070468 2870729 2664780 1447357
$$ packed form
40790A401277q5555M86916M24009n07162j162023j061964p55074n24418j76394
40781a960388K21360N48319J061199J556634R05167j258462l149019k678186j84593
40772d937969K116863K893733K417272J106720p85545k172704j710969K07548
40764h65051J486927Q88496n37436j091501n79524j71901o13678j238065q98212
40755c619945L16764Q57114j97782j349868m00871K060533K861160P12942j613317
40746c73270j189203Q18209J062531j059301k988839k908338j511095l1089J085233
40737g095162J415532P24840J41178R79227K134483J108877j768384k868440l65753
40728e593602K697427K540500o6721j226526M34853K284537J800261k05949j217423
$$ plain form
40719 1447357 1178178 2583738 4691570 5910833 5396227 3770916 2636552 3029344 4270157
40710 4270157 4737662 3948874 3328029 4331244 6185181 6510033 4372440 1620120 434665
40701 434665 524349 71858 -1096525 -1137120 727471 2540465 2137620 152314 -938786
40692 -938786 -202368 792558 433779 -754183 -947956 586359 2584019 3223927 2125970
40683 2125970 629959 106008 496102 999850 1662405 3145496 4976052 5496510 4233737
40674 4233737 3039431 3727689 5519374 6271605 5673968 5518482 6736244 7785422 6713071
40665 6713071 3813748 1358072 1074392 2501029 3684617 3161387 1272853 -389258
40657 -389258 -805604 -497778 -464669 -704647 -541433 -67218 -135087 -793092 -906316 56289
$$ packed form
40719A447357k69179J405560K107832J219263n14606j625311j134364L92792J240813
40710D270157M67505p88788o20845J003215J853937L24852k137593k752320j185455
40701D34665Q9684m52491j168383m0595J864591J812994m02845j985306j091100
40692i38786P36418R94926l58779j187962j93773J534315J997660O39908j097957
40683B125970j496011n23951L90094N03748O62555J483091J830556N20458j262773
40674D233737j194306O88258J791685P52231n97637j55486J217762J049178j072351
40665F713071k899323k455676k83680J426637J183588n23230j888534j662111
40657c89258m16346L07826L3109k39978J63214M74215o7869o58005j13224R62605
$$ plain form
40647 56289 847073 56015 -1675060 -2249700 -852149 1035068 1653829 1043200 451072
40638 451072 414895 414916 164749 157962 686420 1205188 1244954 1364874 2477475 4489851 6268692
40627 6268692 6853584 6138008 4424258 1978282 -751754 -2946201 -3841076 -3345406 -2207148
40618 -2207148 -1556205 -2058969 -3373474 -4638310 -5494395 -6104716 -6134975 -4772746 -2391609
40609 -2391609 -1072491 -2218140 -4457365 -5467777 -5279480 -5823092 -7388392 -7826329 -5827502
40600 -5827502 -2857425 -753512 750997 2648689 4317271 4372067 2994464 1700692
40592 1700692 1205767 925272 336890 -370880 -882418 -1108316 -1187513 -1747841 -3534402
40583 -3534402 -5995814 -7076105 -5562401 -2957742 -1727339 -2233051 -2812169 -2471021 -1881185
$$ packed form
40647E6289P90784p91058j731075n74640J397551J887217O18761o10629n92128
40638D51072l6177K1k50167o787N28458N18768L9766J19920J112601K012376J778841
40627F268692N84892p15576j713750k445976k730036k194447q94875M95670J138258
40618b207148O50943n02764j314505j264836q56085o10321l0259J362229K381137
40609b391609J319118j145649k239225j010412J88297n43612j565300m37937J998827
40600e827502K970077K103913J504509J897692J668582N4796j377603j293772
40592A700692m94925k80495n88382p07770n11538k25898p9197n60328j786561
40583c534402k461412j080291J513704K604659J230403n05712n79118L41148N89836
$$ plain form
40574 -1881185 -1719764 -1564665 -856198 132337 773867 930302 1065703 1775967 2971213
40565 2971213 3321415 1340294 -2362717 -4978406 -4728456 -3154604 -2762900 -3440896 -3142814
40556 -3142814 -1361007 409434 1396126 2328452 3313242 3258870 1984229 853108 650867
40547 650867 711379 717003 1280970 1965616 984627 -1846806 -3929159 -3250462 -1205551 -340892
40537 -340892 -869358 -1370482 -1619631 -2462526 -3610589 -3720914 -2485761 -1010307 -275890
40528 -275890 -476310 -1409206 -2229317 -1459312 1200099 3610994 3441141 1291008 -168204
40519 -168204 88948 500050 -302450 -1752163 -2823192 -3468090 -3873142 -3709965 -2905636
40510 -2905636 -2085338 -1690380 -1608895 -1880401 -2462045 -2109173 679409 4843580 6802676
$$ packed form
40574a881185J61421J55099P08467R88535O41530J56435J35401P10264J195246
40565B971213L50202j981121l703011k615689K49950J573852L91704o77996K98082
40556c142814J781807J770441R86692R32326R84790n4372j274641j131121k02241
40547F50867O0512N624N63967O84646r80989k831433k082353O78697K044911Q64659
40537c40892n28466n01124k49149q42895j148063j10325J235153J475454P34417
40528b75890k00420r32896q20111P70005K659411K410895j69853k150133j459212
40519a68204K57152M11102q02500j449713j071029o44898m05052J63177Q04329
40510b905636Q20298L94958Q1485k71506n81644L52872K788582M164171J959096
$$ plain form
40501 6802676 4743507 1334604 368672 1840127 2458790 415048 -2688069 -4704515
40493 -4704515 -5494594 -5808668 -5397887 -3595385 -913186 1110702 1347335 -246016 -2869909
40484 -2869909 -5171288 -5816728 -4573207 -2585802 -1048754 -15167 857714 1003125 -433028
40475 -433028 -2784684 -3952639 -2765222 -406456 1042796 841380 -204249 -1209726
40467 -1209726 -2072527 -2930284 -3392219 -2676140 -583658 1710340 2243235 149503 -3231563
40458 -3231563 -5806898 -7132109 -8383814 -9922486 -10295597 -8347841 -5072200 -2310721
40450 -2310721 -633746 283483 201725 -1065226 -2196916 -1518738 372688 949547 -894542
40441 -894542 -3380562 -4257264 -3277607 -1619336 -150278 838462 1195473 1179411 1500277
$$ packed form
40501F802676k059169l408903r65932J471455O18663k043742l103117k016446
40493d704515p90079l14074M10781J802502K682199K023888K36633j593351k623893
40484b869909k301379o45440J243521J987405J537048J033587Q72881J45411j436153
40475d33028k351656j167955J187417K358766J449252k01416j045629j005477
40467a209726q62801q57757m61935P16079K092482K293998N32895k093732l381066
40458c231563k575335j325211j251705j538672l73111J947756L275641K761479
40450b310721J676975R17229q1758j266951j131690O78178J891426N76859j844089
40441h94542k486020q76702R79657J658271J469058R88740L57011j6062L20866
$$ plain form
40432 1500277 2304970 2647396 1590326 -611990 -2851942 -4223869 -4530899 -4351532 -4704248
40423 -4704248 -5885664 -6687783 -5859598 -4309767 -4329171 -6308719 -7908443 -7120689 -4468538
40414 -4468538 -1405112 1507456 3647610 3701957 1862885 857969 2513803 4725592
40406 4725592 4330200 1774833 88004 75860 -203859 -1381749 -1588338 40906 1690520
40397 1690520 1810449 1201912 926753 425690 -909968 -2385444 -3674767 -5808007 -8798376
40388 -8798376 -10211067 -8176902 -4349802 -1755175 -953928 -512909 -74350 -320093 -526543
40379 -526543 1038730 4150678 6460939 6749887 6293057 6417406 6603909 5842475 4271101
40370 4271101 2557721 973480 -79038 129992 1409713 2301911 1879239 877877 206237
$$ packed form
40432A500277Q04693L42426j057070k202316k239952j371927l07030J79367l52716
40423d704248j181416q02119Q28185J549831j9404j979548j599724P87754K652151
40414d468538L063426K912568K140154N4347j839072j004916J655834K211789
40406D725592l95392k555367j686829j2144k79719j177890k06589J629244J649614
40397A690520J19929o08537k75159n01063j335658j475476j289323k133240k990369
40388h798376j412691K034165L827100K594627Q01247M41019M38559k45743k06450
40379e26543J565273L111948K310261K88948m56830J24349J86503p61434j571374
40370D271101j713380j584241j052518K09030J279721Q92198m22672j001362o71640
$$ plain form
40361 206237 -511826 -1816377 -2932821 -2779614 -1641602 -458540 800600 2475196 3543454
40352 3543454 2530839 -21293 -1871849 -2118961 -2176879 -3248060 -4552523 -4898615 -4463649
40343 -4463649 -3913361 -3038257 -1492632 184026 1560072 3335150 5938464 7976851
40335 7976851 7785026 6016167 4944049 5380430 5958122 5477920 4326922 3327921 2665012
40326 2665012 2309570 2233094 1931111 970477 94218 337857 1038464 598354 -519141
40317 -519141 134741 3034983 5156671 4021076 1330231 589016 2570437 5184581 6633330
40308 6633330 6539386 4950255 2586792 1493926 3104899 5862003 6807374 5325362 3340447
40299 3340447 2176031 1537715 1490040 2828814 4973280 5805516 4412609 2105749 101465
$$ packed form
40361B06237p18063j304551j116444J53207J138012J183062J259140J674596J068258
40352C543454j012615k552132j850556k47112n7918j071181j304463l46092M34966
40343d463649N50288Q75104J545625J676658J376046J775078K603314K038387
40335G976851j91825j768859j072118M36381N77692m80202j150998r99001o62909
40326B665012l55442p6476l01983r60634q76259K43639P00607m40110j117495
40317e19141O53882K900242K121688j135595k690845p41215J981421K614144J448749
40308F633330r3944j589131k363463j092866J610973K757104R45371j482012j984915
40299C340447j164416o38316m7675J338774K144466Q32236j392907k306860k004284
$$ plain form
40290 101465 -1885956 -4124610 -5967100 -7245809 -8582056 -9539154 -8666245 -6370069 -5322710
40281 -5322710 -6532089 -7385887 -5560749 -2668143 -1555468 -1832632 -1012154 1104224 2277770
40272 2277770 1578469 376597 -420675 -1517155 -3249591 -4691051 -5244852 -5269468 -4705553
40263 -4705553 -2916670 -410141 1069453 932131 775959 2260622 5091134 7681765
40255 7681765 8763853 7955154 5862803 3946225 3138925 2446794 256917 -2899093 -4677975
40246 -4677975 -4387021 -4056248 -5168771 -6353772 -5721449 -3729438 -2040687 -1028416 -335952
40237 -335952 -663837 -2746588 -5260539 -5986079 -4769663 -3316186 -2281233 -772896 1157160
40228 1157160 1871304 730176 -660709 -802889 -222972 127831 828515 2747794 4914122
$$ packed form
40290A01465j987421k238654j842490j278709j336247r57098Q72909K296176J047359
40281e322710j209379q53798J825138K892606J112675k77164Q20478K116378J173546
40272B277770o99301j201872p97272j096480j732436j441460n53801k4616N63915
40263d705553J788883K506529J479594j37322j56172J484663K830512K590631
40255G681765J082088q08699k092351j916578q07300o92131k189877l156010j778882
40246d677975K90954L30773j112523j185001O32323J992011J688751J012271O92464
40237c35952l27885k082751k513951p25540J216416J453477J034953J508337J930056
40228A157160P14144j141128j390885j42180N79917L50803P00684J919279K166328
$$ plain form
40219 4914122 5383991 3785951 1521987 -261889 -1452897 -1852400 -874388 1208814 2960475
40210 2960475 3376197 2931317 2466930 1890495 782025 -393400 -755411 -465460 -689936
40201 -689936 -1967488 -3420343 -3888578 -3206070 -1995883 -816431 -19605 130219 -31309
40192 -31309 633615 2703088 4743727 4481801 1793314 -726102 -980330 28015 143036
40183 143036 -382960 674234 3653291 5816187 4814489 1590952 -1300232 -2744605
40175 -2744605 -3022297 -2146546 -295196 908689 -159554 -2499232 -3362602 -1920587 -30341
40166 -30341 1019287 2294665 4781343 7231564 7977644 7319629 6420995 5126713 2784957
40157 2784957 288154 -772428 -504125 -344444 -624045 -453892 85701 -252951 -1570117
$$ packed form
40219D914122M69869j598040k263964j783876j191008l99503R78012K083202J751661
40210B960475M15722m44880m64387n76435j108470j175425l62011K89951k24476
40201f89936j277552j452855m68235O82508J210187J179452P96826J49824j61528
40192c1309O64924K069473K040639k61926k688487k519416k54228J008345J15021
40183A43036n25996J057194K979057K162896j001698l223537k891184j444373
40175b744605k77692Q75751J851350J203885j068243k339678q63370J442015J890246
40166c0341J049628J275378K486678K450221P46080o58015q98634j294282k341756
40157B784957k496803j060582K68303J59681k79601J70153N39593l38652j317166
$$ plain form
40148 -1570117 -2256527 -1404149 -111064 390589 398229 655317 1008375 1184572 1680313 2710314
40138 2710314 3297844 2634930 1484136 950005 605935 -714776 -2755889 -4027167 -4052719
40129 -4052719 -3911735 -4211795 -3841349 -1520440 2191517 5342854 6811069 7305425 7950671
40120 7950671 8434061 7274801 4021211 430849 -1242890 -816593 -220003 -1070694 -3025932
40111 -3025932 -4530193 -4283182 -1899302 1806910 4888611 5690173 4643080 3659423 3458853
40102 3458853 2883973 1428932 686925 1941080 3770021 3871024 2346558 1286268 1667201
40093 1667201 2617877 3457030 4365319 4806902 3254629 -693965 -5217544 -8019241 -8282723
40084 -8282723 -6512694 -3518078 -179359 2611183 4479451 5667921 6373075 6454082 5845952
$$ packed form
40148a570117o86410Q52378J293085N01653P640K57088L53058J76197M95741J030001
40138B710314N87530o62914j150794n34131l44070j320711k041113j271278k5552
40129d052719J40984l00060L70446K320909L711957L151337J468215M94356O45246
40120G950671M83390j159260l253590l590362j673739M26297N96590q50691j955238
40111c025932j504261K47011K383880L706212L081701Q01562j047093r83657k00570
40102C458853n74880j455041p42007J254155J828941J01003j524466j060290L80933
40093A667201R50676Q39153R08289M41583j552273l948594m523579k801697k63482
40084h282723J770029K994616L338719K790542J868268J188470P05154Q1007o08130
$$ plain form
40075 5845952 4688306 3116281 1586356 1131342 2262805 3759676 3764988 2135939 437956
40066 437956 -496761 -1497694 -3152882 -4590976 -4996524 -4913677 -4933343 -4301197 -2205129
40057 -2205129 416858 1838970 1861288 1788120 2308130 2730796 2475666 2182407 2821628
40048 2821628 4305510 5471082 5292803 3934342 2602020 2269456 2571459 2293305 1037103
40039 1037103 -91488 236525 2015482 3994083 4996403 4793591 3943237 3163687 2775582
40030 2775582 2552427 2149397 1566030 948419 244952 -359094 -6367 1820589 3925723
40021 3925723 4294733 2676922 1038211 907282 1523675 1392006 397857 -728532 -1901920
40012 -1901920 -3226129 -3957884 -3529827 -2950540 -3402000 -3814718 -1864208 2417927 5958593
$$ packed form
40075E845952j157646j572025j529925m55014J131463J496871N312j629049j697983
40066D37956r34717j000933j655188j438094m05548Q2847j9666O32146K096068
40057b205129K621987J422112K2318p3168N20010M22666k55130k93259O39221
40048B821628J483882J165572j78279j358461j332322l32564L02003k78154j256202
40039A037103j128591L28013J778957J978601J002320k02812q50354p79550l88105
40030B775582k23155m03030n83367o17611p03467o04046L52727J826956K105134
40021C925723L69010j617811j638711j30929O16393j31669r94149j126389j173388
40012a901920j324209p31755M28057N79287m51460m12718J950510M282135L540666
$$ plain form
40003 5958593 6276550 4223996 2175499 915049 -256487 -1230442 -725732 1625757 4099331
39994 4099331 4462399 2268448 -899994 -3197689 -3998627 -3649014 -2469251 -709269 695754
39985 695754 313089 -2267971 -5588178 -7605946 -7624932 -6549181 -5618981 -5448692 -5903018
39976 -5903018 -6140821 -5006397 -2216340 884077 2466314 2036543 433342 -1623256
39968 -1623256 -3792979 -5047331 -3984410 -890427 1850332 2455458 1865013 1973891 2594512
39959 2594512 1816578 -817261 -3151002 -2888677 -67810 3483116 6144517 7203653
39951 7203653 6411287 4035467 1239476 -491446 -520790 714380 2512153 4350560 5573440
39942 5573440 5422498 3796667 1576006 -147891 -881568 -599160 653241 2466692 3667558
$$ packed form
40003E958593L17957k052554k048497j260450j171536r73955N04710K351489K473574
39994D099331L63068k193951l168442k297695q00938L49613J179763J759982J405023
39985F95754l82665k581060l320207k017768j8986J075751R30200J70289m54326
39976e903018k37803J134424K790057L100417J582237m29771j603201k056598
39968a623256k169723j254352J062921L093983K740759O05126n90445J08878O20621
39959B594512p77934k633839k333741K62325K820867L550926K661401J059136
39951G203653p92366k375820k795991j730922k9344J235170J797773J838407J222880
39942E573440j50942j625831k220661j723897p33677K82408J252401J813451J200866
$$ plain form
39933 3667558 2923938 3770 -3752308 -6258631 -6010277 -3021292 1067009 3953510
39925 3953510 4318437 2759215 1035525 466628 1106963 2057058 2154505 721114 -1673397
39916 -1673397 -3267096 -2629948 -305262 1597193 1685785 800577 1012741 3320934 6519968
39907 6519968 8344417 7747938 5925481 4778911 4617500 4251597 3359250 3249446 4455340
39898 4455340 5165524 3738126 1580336 1281512 2580140 2857321 1579121 1316007 3574000
39889 3574000 6371846 7367015 6992190 6711148 6277902 4909083 3523689 3452591 4098799
39880 4098799 4130765 3930770 4495415 4890306 3539072 1492976 1457144 3500780 4628351
39871 4628351 3232387 1316928 1222550 2446030 3134316 2864624 2278413 1317783 -391607
$$ packed form
39933C667558p43620k920168l756078k506323K48354K988985M088301K886501
39925C953510L64927j559222j723690n68897O40335R50095R7447j433391k394511
39916a673397j593699O37148K324686J902455Q8592q85208K12164K308193L199034
39907F519968J824449n96479j822457j146570j61411l65903q92347j09804J205894
39898D455340P10184j427398k157790k98824J298628K77181j278200k63114K257993
39889C574000K797846R95169l74825k81042m33246j368819j385394p1098O46208
39880D098799L1966j99995N64645L94891j351234k046096l5832K043636J127571
39871D628351j395964j915459r4378J223480O88286k69692n86211r60630j709390
$$ plain form
39862 -391607 -2121089 -2556157 -1505272 -10442 1139289 2205081 3783271 5770162
39854 5770162 7171798 6950879 5140203 2842173 866864 -1039259 -3000005 -3900407
39846 -3900407 -2757634 -619527 583893 893421 2185181 5030287 7630070 8457681
39838 8457681 8115114 7671116 6877352 5287835 3752223 3315787 3505338 3001642 1442475
39829 1442475 -393577 -1597750 -1571713 -200539 1669833 2694367 2641784 2696414 3562591
39820 3562591 4369920 4190758 3374779 2433814 997012 -854745 -1612283 -380451 1221655
39811 1221655 1094208 -237303 -537104 716872 1945519 2232462 2284092 2467326 1958601
39802 1958601 448723 -955716 -1241474 -649526 167146 931291 1258056 662969 -397817
$$ packed form
39862c91607j729482m35068J050885J494830J149731J065792J578190J986891
39854E770162J401636k20919j810676k298030j975309j906123j960746r00402
39846c900407J142773K138107J203420L09528J291760K845106K599783Q27611
39838H457681l42567m43998p93764j589517j535612m36436J89551n03696j559167
39829A442475j836052j204173K6037J371174J870372J024534n2583N4630Q66177
39820C562591Q07329j79162q15979r40965j436802j851757p57538J231832J602106
39811A221655j27447j331511k99801J253976J228647K86943N1630J83234n08725
39802A958601j509878j404439k85758N91948Q16672P64145L26765n95087j060786
$$ plain form
39793 -397817 -694765 -10852 434699 -13437 -320011 419375 1215062 542494 -1314386
39784 -1314386 -2647296 -2614785 -1823096 -841124 428621 1665993 1758674 273191 -1541404
39775 -1541404 -2101259 -1360232 -491704 -117112 -18720 -543021 -2709854 -6072605 -7793812
39766 -7793812 -5536523 -852469 2023050 916739 -2223520 -4293671 -4374005 -3330316
39758 -3330316 -1784937 -46564 956349 420182 -948806 -1594714 -939544 490545 2301712
39749 2301712 4273704 5463355 4817280 2889815 1668511 2260891 3678533 4253975 3435276
39740 3435276 1809726 47896 -1684908 -3509408 -5201858 -5843908 -4608593 -2128136
39732 -2128136 -192559 565942 1602758 3951825 5993376 5599558 3692893 3288120 5166093
$$ packed form
39793c97817k96948O83913M45551m48136l06574P39386P95687o72568j856880
39784a314386j332910L2511P91689R81972J269745J237372R2681j485483j814595
39775a541404n59855P41027Q68528L74592R8392n24301k166833l362751j721207
39766g793812K257289M684054K875519j106311l140259k070151q0334J043689
39758c330316J545379J738373J002913n36167j368988o45908O55170J430089J811167
39749B301712J971992J189651o46075j927465j221304N92380J417642N75442q18699
39740C435276j625550j761830j732804j824500j692450o42050J235315K480457
39732b128136J935577P58501J036816K349067K041551l93818j906665m04773J877973
$$ plain form
39723 5166093 6992972 7056354 6294267 5724694 4417063 1669204 -815200 -960642 767685
39714 767685 2339491 2996451 3322085 3419670 2978473 2593770 3191477 4532880 5967146
39705 5967146 8137208 11971359 16374293 19309375 21359283 25709427 33676367 42388967
39697 42388967 48158114 50216402 49533804 45895835 38828232 30562575 25124047 23975420
39689 23975420 24689995 24613730 23856338 23575801 23227385 21476471 18793764 16979243 16328950
39680 16328950 15190924 12556136 9428910 7175583 6030115 5870547 7013724 9312983
39672 9312983 11680832 13446024 14992278 16119776 15322576 12206755 9148064 8450923
39664 8450923 8989973 8167898 6405297 6648520 9521733 12285642 13365270 14672182 17951542
$$ packed form
39723E166093J826879O3382p62087n69573j307631k747859k484404j45442J728327
39714G67685J571806O56960L25634R7585m41197l84703N97707J341403J434266
39705E967146K170062L834151M402934K935082K049908M350144P966940Q712600
39697D2388967N769147K058288o82598l637969p067603q265657n438528j148627
39689B3975420P14575p6265p57392k80537l48416j750914k682707j814521o50293
39680A6328950j138026k634788l127226k253327j145468j59568J143177K299259
39672I312983K367849J765192J546254J127498p97200l115821l058691o97141
39664H450923N39050q22075j762601K43223K873213K763909J079628J306912L279360
$$ plain form
39655 17951542 21888112 25022192 28681261 33862900 37346951 34929190 27804559 21831829
39647 21831829 20191582 20359415 19244906 17707114 17848179 18672745 17497667 14259060
39639 14259060 11464944 10368816 9823769 8928448 8244436 7732501 5833889 2038637 -1296344
39630 -1296344 -1453360 1285800 4426952 6630318 8404068 9889807 10257484 9691609 9847809
39621 9847809 11354265 12619513 12323082 11431657 11209237 10835408 9120810 7349487 7774429
39612 7774429 9853881 10783688 9784569 8997452 9550897 9663926 7998974 6279298 6531695
39603 6531695 7656826 7058901 4479553 2026706 1167826 1669112 2916870 4327368 4756775
39594 4756775 3383110 1223665 260294 949940 1834928 1629383 552931 -392283 -438924
$$ packed form
39655A7951542L936570L134080L659069N181639L484051k417761p124631n972730
39647B1831829j640247J67833j114509j537792J41065Q24566j175078l238607
39639A4259060k794116j096128n45047q95321o84012n11935j898612l795252l334981
39630a296344j57016K739160L141152K203366J773750J485739L67677n65875J56200
39621I847809J506456J265248k96431q91425k22420l73829j714598j771323M24942
39612G774429K079452R29807r99119p87117N53445J13029j664952j719676K52397
39603F531695J125131n97925k579348k452847q58880N01286J247758J410498M29407
39594D756775j373665k159445r63371O89646Q84988k05545j076452r45214m6641
$$ plain form
39585 -438924 609799 2192280 3293914 3613559 3916758 4543435 4578807 3662469 3389544
39576 3389544 5080856 7160912 7088369 5328490 4765208 6196887 7177551 5895781 3584654
39567 3584654 2047459 1156244 206665 -274234 241881 773964 193701 -1037262 -1845925
39558 -1845925 -2118513 -2029074 -1093284 608882 1474260 389878 -1192587 -957112 1179357
39549 1179357 3373741 4660207 5649950 6824883 7957551 9073635 10230076 10352591
39541 10352591 8097253 4156037 1067700 272702 772950 1108752 1098408 941925 197572
39532 197572 -1136569 -1663424 -139022 2587320 4468443 4852292 5036064 6186741 7689077
39523 7689077 7953572 6317083 3716293 1684644 1019120 1472384 2494344 3834661 5166939
$$ packed form
39585d38924J048723J582481J101634L19645L03199O26677L5372r16338k72925
39576C389544J691312K080056p2543j759879n63282J431679R80664j281770k311127
39567C584654j537195q91215r49579m80899N16115N32083n80263j230963q08663
39558a845925k72588Q9439R35790J702166Q65378j084382j582465K35475K136469
39549A179357K194384J286466R89743J174933J132668J116084J156441J22515
39541A0352591k255338l941216l088337p94998N00248L35802j0344j56483p44353
39532A97572j334141n26855J524402K726342J881123L83849J83772J150677J502336
39523G689077K64495j636489k600790k031649o65524M53264J021960J340317J332278
$$ plain form
39514 5166939 5555351 4137653 1544746 -98239 783116 3469142 5770204 6322443 5438840
39505 5438840 3921563 2077771 303261 -319655 923828 3001721 3939656 3283019 2823565
39496 2823565 4279785 7025424 9029083 9508003 9404392 9326856 8479487 6264766 3814752
39487 3814752 2825511 3372603 3907444 3232026 1556438 -374367 -2220786 -3726217 -4187672
39478 -4187672 -3006976 -704552 1134219 1249628 39425 -732742 164715 1874341 2229005
39469 2229005 312209 -2192094 -2721586 -711392 1859052 2861166 2369448 2220651 3538232
39460 3538232 5306542 5635115 4074737 2104775 1207315 1075931 411474 -754167 -562142
39451 -562142 2327093 6518460 8854912 7610801 4180039 1426200 716133 919313 279254
$$ packed form
39514E166939L88412j417698k592907j642985Q81355K686026K301062N52239q83603
39505E438840j517277j843792j774510o22916J243483K077893R37935o56637m59454
39496B823565J456220K745639K003659M78920j03611p7536q47369k214721k450014
39487C814752r89241N47092N34841o75418j675588j930805j846419j505431m61455
39478d187672J180696K302424J838771J15409j210203p72167Q97457J709626L54664
39469B229005j916796k504303n29492K010194K570444J002114m91718j48797J317581
39460C538232J768310L28573j560378j969962q97460j31384o64457j165641J92025
39451e62142K889235M191367K336452j244111l430762k753839p10067K03180o40059
$$ plain form
39442 279254 -1179089 -1669874 -129661 2105324 2893880 2137977 1858585 3334165 5451800
39433 5451800 6552965 6784829 7474243 8851653 9769415 9578038 9071378 9268697 10102277
39424 10102277 10729280 10633062 10033298 9408777 8786841 7527111 5111113 2351087 1248618
39415 1248618 2982446 6401428 9300079 10865613 11845979 12499928 11807984 9177905 5749257
39406 5749257 3216753 2193417 2504287 4200479 7066186 9611269 10009594 8234265
39398 8234265 6163995 5199061 4728214 3533836 1864666 1194293 2386210 5077184 8662843
39389 8662843 12788890 16703889 19216478 19912078 19716991 19679849 19850316 20017203 20849109
39380 20849109 23322796 27393817 32095053 36562756 40164219 42367972 43859942 47196819
$$ packed form
39442B79254j458343m90785J540213K234985P88556p55903k79392J475580K117635
39433E451800J101165K31864O89414J377410R17762j91377n06660J97319Q33580
39424A0102277O27003r6218n99764o24521o21936j259730k415998k760026j102469
39415A248618J733828L418982K898651J565534R80366O53949o91944k630079l428648
39406E749257k532504j023336L10870J696192K865707K545083L98325j775329
39398H234265k070270r64934m70847j194378j669170o70373J191917K690974L585659
39389H662843M126047L914999K512589O95600j95087l7142J70467J66887Q31906
39380B0849109K473687M071021M701236M467703L601463K203753J491970L336877
$$ plain form
39372 47196819 54527594 64823079 75296554 85669333 99030485 118402253 144943868
39365 144943868 179625599 222583605 268462345 305873415 325509056 327432687 317347477
39358 317347477 297835026 267913169 230283133 193279183 163838711 142330956 125936400
39351 125936400 113360194 103847465 94942594 84699212 74387540 66242878 59995386
39344 59995386 54181180 49390940 47274904 47302653 47544627 48221953 51457909 57331998 62887454
39335 62887454 65613345 65550997 63236873 57948120 49472766 40005298 32529326 27859575
39327 27859575 24384790 20444679 16275545 13762058 14491903 17757333 20553394 20180198
39319 20180198 16836834 12968655 10229742 8173844 6029211 4391410 4350274 5786388
$$ packed form
39372D7196819P330775J0295485J0473475J0372779J3361152J9371768K6541615
39365A44943868L4681731M2958006M5878740L7411070J9635641J923631j0085210
39358C17347477j9512451k9921857l7630036l7003950k9440472k1507755j6394556
39351A25936400j2576206r512729q904871j0243382j0311672q144662o247492
39344E9995386n814206m790240k116036K7749K41974O77326L235956N874089N555456
39335F2887454K725891o2348k314124n288753q475354r467468p475972m669751
39327B7859575l474785l940111m169134k513487P29845L265430K796061l73196
39319B0180198l343364l868179k738913k055898k144633j637801m1136J436114
$$ plain form
39311 5786388 7464317 8464087 8823545 8956183 9055773 9157723 9386450 9803829 9986011
39302 9986011 9130910 7104612 5221244 5078842 6393331 7127611 6472026 6411572 8900362
39293 8900362 12443655 13524969 11224307 8344157 7572861 8491056 9294217 9753521 10884724
39284 10884724 12587914 13332982 12254413 10446955 9693095 10307245 10772013 9776855 8335980
39275 8335980 9020580 12713320 17105808 19380017 19563370 19913202 21694301 24315087 27200783
39266 27200783 30322873 32718613 32724212 30365777 27583556 25349794 22568763 18752545
39258 18752545 15567721 14235033 13416483 11601370 9890279 10165641 11740267 12196665
39250 12196665 10813895 8955469 7567312 6386705 5291732 4452191 3376320 1643415
$$ packed form
39311E786388J677929R99770L59458J32638R9590J01950K28727M17379J82182
39302I986011q55101k026298j883368j42402J314489P34280o55585o0454K488790
39293H900362L543293J081314k300662k880150p71296R18195Q03161M59304J131203
39284A0884724J703190P45068j078569j807458p53860O14150M64768r95158j440875
39275H335980O84600L692740M392488K274209J83353L49832J781099K620786K885696
39266B7200783L122090K395740N599k358435k782221k233762k781031l816218
39258A8752545l184824j332688q18550j815113j711091K75362J574626M56398
39250A2196665j382770j858426j388157j180607j094973q39541j075871j732905
$$ plain form
39242 1643415 250936 311268 792842 -232456 -2279029 -2842821 -1306663 102336 -55419
39233 -55419 -304824 1038022 3134330 4154186 3978822 3765328 3893963 3824056 3311944
39224 3311944 2627311 2059859 1928502 2423769 2968906 2702351 2041772 2444580 3930365
39215 3930365 4444575 2899254 1330358 2289797 5137968 6842623 5886516 3537936 1534226
39206 1534226 347467 -149184 41243 630046 1120649 1704616 3062497 4939985 5972051
39197 5972051 5436201 4263122 3639473 3376187 2584919 1553323 1779636 3816826 5945926
39188 5945926 5888719 3630311 1542330 1419684 2428385 2791285 2541413 3155510 4920605
39179 4920605 6392492 6552129 5859050 4897213 3735429 3153128 4539712 7538326 9639363
$$ packed form
39242A643415j392479O0332M81574j025298k046573n63792J536158J408999j57755
39233e5419k49405J342846K096308J019856j75364k13494J28635o9907n12112
39224C311944o84633n67452j31357M95267N45137k66555o60579M02808J485785
39215C930365N14210j545321j568896R59439K848171J704655r56107k348580k003710
39206A534226j186759m96651J90427N88803M90603N83967J357881J877488J032066
39197E972051n35850j173079o23649k63286p91268j031596K26313K037190K129100
39188E945926n7207k258408k087981j22646J008701L62900k49872O14097J765095
39179D920605J471887J59637o93079r61837j161784n82301J386584K998614K101037
$$ plain form
39170 9639363 9515535 9040394 10266464 12025031 11772602 9624892 7992104 7791771 7575766
39161 7575766 6330737 4784634 3689374 2904949 2565159 3202318 4199512 3937834 2179860
39152 2179860 745550 1054543 2248399 2398800 576477 -2576567 -5235567 -5286365 -2222053
39143 -2222053 1694961 3606471 3489574 3813989 5761521 7831955 8552810 8288830 7530410
39134 7530410 5638358 2599279 140781 -349171 482071 1479816 2546378 3520638 3376565
39125 3376565 2011795 1032731 1188123 938915 -594136 -1360833 478303 2945445 2726345
39116 2726345 36692 -2014385 -2073488 -1444257 -864939 291919 1483834 853982 -1650302
39107 -1650302 -3691624 -3962194 -3848296 -4694507 -5504396 -4587750 -2001520 618463 1586686
$$ packed form
39170I639363j23828m75141J226070J758567k52429k147710j632788k00333k16005
39161G575766j245029j546103j095260p84425l39790O37159R97194k61678j757974
39152B179860j434310L08993J193856J50401j822323l153044k659000n0798L064312
39143b222053L917014J911510j16897L24415J947532K070434P20855k63980p58420
39134G530410j892052l039079k458498m89952Q31242R97745J066562R74260j44073
39125C376565j364770r79064J55392k49208j533051p66697J839136K467142k19100
39116B726345k689653k051077n9103O29231N79318J156858J191915o29852k504284
39107a650302k041322k70570J13898q46211q09889R16646K586230K619983R68223
$$ plain form
39098 1586686 195644 -2547312 -4269177 -3881064 -3535040 -5814567 -9386660 -10385388 -8170248
39089 -8170248 -6134718 -5964693 -5141520 -2213085 -601318 -3672132 -8860072 -10782613
39081 -10782613 -8492501 -5548470 -3921938 -2202391 125000 895854 -973317 -3273210
39073 -3273210 -3801311 -3397160 -3842387 -4697000 -4355992 -3101243 -3004504 -5041859 -7776966
39064 -7776966 -9015041 -7885899 -5199159 -2356879 -175574 1363621 2416306 2741631
39056 2741631 2192959 1350008 1026692 1348262 1932716 2684852 3574919 3900485 2919792
39047 2919792 1326392 982080 2757405 5432925 7128820 7169526 6250475 5452875 5471597
39038 5471597 6273388 7148344 7377009 6866525 5808960 4091643 1817665 33176 -237351
$$ packed form
39098A586686j391042k742956j721865L88113L46024k279527l572093r98728K215140
39089h170248K035530J70025Q23173K928435J611767l070814n187940j922541
39081a0782613K290112K944031J626532J719547K327391P70854j869171k299893
39073c273210n28101M04151m45227q54613L41008J254749R6739k037355k735107
39064g776966j238075J129142K686740K842280K181305J539195J052685L25325
39056B741631n48672q42951l23316L21570N84454P52136Q90067L25566r80693
39047B919792j593400l44312J775325K675520J695895M0706r19051p97600J8722
39038E471597Q01791Q74956K28665n10484j057565j717317k273978j784489k70527
$$ plain form
39029 -237351 436457 596698 202734 680693 2340388 3484158 2956779 2035021 2598326
39020 2598326 4689618 7126078 9283264 10843687 11047958 10078065 10187367 13188206 17295460
39011 17295460 18805600 16804060 13821300 11705130 9635947 7107083 5968395 7497010
39003 7497010 9557727 9149208 6447324 3834481 1873783 -917637 -4486915 -6304232
38995 -6304232 -4734235 -1163595 2150322 4512512 6082138 6512662 5731690 4860975 5005676
38986 5005676 5998863 7307156 8953159 10347996 9668373 6230227 2379836 882441
38978 882441 1191068 696475 -780317 -615954 2126338 4703899 4502486 2601684 1820826
38969 1820826 2805940 3885347 3776940 2734745 1646575 1417444 2729640 5170529 7056196
$$ packed form
39029b37351O73808J60241l93964M77959J659695J143770n27379r21758N63305
39020B598326K091292K436460K157186J560423K04271r69893J09302L000839M107254
39011A7295460J510140k001540k982760k116170k069183k528864j138688J528615
39003G497010K060717m08519k701884k612843j960698k791420l569278j817317
38995f304232J569997L570640L313917K362190J569626M30524p80972q70715J44701
38986E005676R93187J308293J646003J394837o79623l438146l850391j497395
38978H82441L08627m94593j476792J64363K742292K577561k01413j900802p80858
38969A820826R85114J079407j08407j042195j088170k29131J312196K440889J885667
$$ plain form
38960 7056196 7159426 6046015 4810029 3481105 1982229 1551424 3227266 5495866
38952 5495866 5667880 3677341 2466604 4068519 7025029 8478104 7491537 5469763
38944 5469763 4280634 4692322 5906139 6117231 4226574 1268419 -677268 -1072739 -1228717
38935 -1228717 -1815207 -1696036 -118930 1437001 1075290 -764817 -1938124 -1566963 -940616
38926 -940616 -1514294 -3275995 -5276870 -6691330 -6932353 -5549916 -2669981 755560 3519249
38917 3519249 4877125 4703422 3412743 2046509 1998530 3913362 6716195 8327736 7813731
38908 7813731 6491242 6338184 7587624 8722450 8709127 8033494 7259048 6031409 4431937
38899 4431937 3912596 5291771 6748974 5708784 2287983 -1004944 -2701251 -3374047
$$ packed form
38960G056196J03230j113411j235986j328924j498876m30805J675842K268600
38952E495866J72014j990539j210737J601915K956510J453075r86567k021774
38944E469763j189129M11688J213817K11092j890657k958155j945687l95471j55978
38935a228717n86490J19171J577106J555931l61711j840107j173307L71161O26347
38926i40616n73678j761701k000875j414460k41023J382437K879935L425541K763689
38917C519249J357876j73703j290679j366234m7979J914832K802833J611541n14005
38908G813731j322489j53058J249440J134826j3323o75633p74446j227639j599472
38899D431937n19341J379175J457203j040190l420801l292927j696307o72796
$$ plain form
38891 -3374047 -3263374 -1490239 1556154 3465366 2920764 1696391 1893387 2798364 2425897
38882 2425897 919200 201909 945550 2053614 2869477 3781768 4500184 3722710 1203269
38873 1203269 -1326167 -2180106 -1714252 -1469497 -1922602 -1925414 -327644 2333965 4063947
38864 4063947 3397512 928443 -1524988 -3023665 -3989420 -4730851 -4789498 -4118502 -3483957
38855 -3483957 -2924444 -1293244 1500113 3296813 2430180 427388 -55830 958245 1348245
38846 1348245 609221 293352 846831 861181 28575 99682 1776716 3123127 2618001
38837 2618001 1616461 1803819 2024514 120547 -3172971 -4840522 -3854087 -2405520 -2467326
38828 -2467326 -3154885 -2462200 -193108 2064389 3151931 3377920 3560775 3988851 4508239
$$ packed form
38891c374047J10673J773135L046393J909212n44602j224373J96996R04977l72467
38882B425897j506697p17291P43641J108064Q15863R12291P18416p77474k519441
38873A203269k529436q53939M65854K44755m53105k812J597770K661609J729982
38864D063947o66435k469069k453431j498677r65755p41431n8647O70996O34545
38855c483957N59513J631200K793357J796700q66633k002792m83218J014075L90000
38846A348245p39024l15869N53479J4350q32606P1107J677034J346411n05126
38837B618001j001540J87358K20695j903967l293518j667551R86435J448567o1806
38828b467326o87559O92685K269092K257497J087542K25989J82855M28076N19388
$$ plain form
38819 4508239 4967819 5136271 4553388 3062030 1401022 585460 533592 111145 -951465
38810 -951465 -1097205 967499 3798291 4497013 2685689 1556133 3976804 8685040 11713825
38801 11713825 11092815 8670734 7160054 6799589 5920371 4025012 2725565 3257380 4427379
38792 4427379 4301807 3179571 3090393 4379277 4888145 3334763 1455919 1213391 1607532
38783 1607532 481903 -1742655 -2805812 -2491143 -2929086 -4928700 -6719817 -6913577 -6221281
38774 -6221281 -5399545 -3858613 -1428271 662022 1831715 3156537 4993028 5642672
38766 5642672 4008164 1700029 711700 760327 839912 1561043 3530288 4950403 3677752
38757 3677752 763427 -860843 -707496 -947957 -2429269 -3261361 -1877879 807237 3037172
$$ packed form
38819D508239M59580J68452n82883j491358j661008q15562n1868m22447j062610
38810i51465j45740K064704K830792O98722j811324j129556K420671M708236L028785
38801A1713825o21010k422081j510680l60465q79218j895359j299447N31815J169999
38792D427379j25572j122236q9178J288884N08868j553382j878844k42528L94141
38783A607532j125629k224558j063157L14669m37943j999614j791117j93760O92296
38774f221281Q21736J540932K430342K090293J169693J324822J836491O49644
38766E642672j634508k308135r88329M8627P9585P21131J969245J420115j272651
38757C677752k914325j624270J53347k40461j481312q32092J383482K685116K229935
$$ plain form
38748 3037172 4153706 4166590 2952319 730621 -1663098 -3457473 -4147877 -3129416 -258171
38739 -258171 3274551 5789774 6810647 6957852 6652696 6200007 6454640 7603019 7831025
38730 7831025 5388539 1725789 140772 1217101 2223736 1529053 783406 1531241 2320782
38721 2320782 1142720 -1150140 -1987560 -491027 2088889 4503433 6430037 7789933
38713 7789933 8490657 8598592 8033161 6657873 5182161 4938824 5987279 6523727 5125121
38704 5125121 2549577 331934 -1261420 -2626189 -3236368 -2288476 -419364 683228
38696 683228 265842 -894087 -1668657 -1539262 -652195 344468 711437 319147 -334016
38687 -334016 -878828 -1151397 -555715 1385022 3582169 4041411 2611548 1494942 2171836
$$ packed form
38748C037172J116534J2884j214271k221698k393719j794375o90404J018461K871245
38739b58171L532722K515223J020873J47205l05156m52689K54633J148379K28006
38730G831025k442486l662750j585017J076329J006635o94683p45647P47835P89541
38721B320782j178062k292860q37420J496533K579916K414544J926604J359896
38713G789933P00724J07935n65431j375288j475712k43337J048455N36448j398606
38704E125121k575544k217643j593354j364769o10179R47892J869112J102592
38696F83228m17386j159929p74570J29395Q87067R96663L66969l92290o53163
38687c34016n44812k72569N95682J940737K197147M59242j429863j116606O76894
$$ plain form
38678 2171836 3487775 3856001 3505365 3048525 1663811 -1292163 -4349675 -5762886 -6022302
38669 -6022302 -6331782 -5911710 -3536836 -822665 -877233 -3811805 -6364212 -6141273 -3754053
38660 -3754053 -634024 2619862 5255513 6292867 6257110 6830419 8052196 7996989 5973213
38651 5973213 3762018 2622439 1300707 -1512547 -4637664 -6025488 -5549044 -4594722
38643 -4594722 -3916728 -3293593 -2487816 -1390327 99413 1574819 2382170 2897556 4267151
38634 4267151 6264480 7016390 5804845 4429913 4504172 5091127 4647910 3663723 3275167
38625 3275167 2592662 -51518 -3804768 -5726915 -4516378 -1754458 673896 2454098
38617 2454098 3803193 4429889 4361440 4494942 5392292 6267900 5885326 4068059 1913751
$$ packed form
38678B171836J315939L68226l50636m56840j384714k955974l057512j413211k59416
38669f022302l09480M20072K374874K714171n4568k934572k552407K22939K387220
38660c754053L120029L253886K635651J037354l5757N73309J221777n5207k023776
38651E973213k211195j139579j321732k813254l125117j387824M76444R54322
38643d594722O77994O23135Q05777J097489J489740J475406Q07351N15386J369595
38634D267151J997329P51910j211545j374932P4259N86955m43217r84187l88556
38625C275167o82505k644180l753250j922147J210537K761920K428354J780202
38617B454098J349095O26696o8449J33502Q97350Q75608l82574j817267k154308
$$ plain form
38608 1913751 722575 831408 1403876 1540634 1552453 2393941 3642870 3324742 668074
38599 668074 -2204741 -2823589 -1649305 -946767 -1033265 28581 2919807 5599429 6207918
38590 6207918 5580862 5639354 6595330 7122395 6534227 5532359 5070965 5338354 5728551
38581 5728551 5334347 3711517 1495612 -49669 -310181 267842 1122084 2193866 3303020
38572 3303020 3755202 3244468 2541337 2500603 2770332 2316255 1076764 241729 672447
38563 672447 1693830 1961646 1245595 699588 1188975 1986515 1853187 1096699 1370657
38554 1370657 3093222 4316238 3156473 402435 -1674598 -2468401 -3298332 -4749630
38546 -4749630 -5714779 -5519788 -5152914 -5392958 -5249000 -3649172 -1623635 -1226945 -2755860
$$ packed form
38608A913751j191176J08833N72468J36758J1819Q41488J248929l18128k656668
38599F68074k872815o18848J174284P02538q6498J061846K891226K679622O08489
38590F207918o27056N8492R55976N27065n88168j001868m61394K67389L90197
38581E728551l94204j622830k215905j545281k60512N78023Q54242J071782J109154
38572C303020M52182n10734p03131m0734K69729m54077j239491q35035M30718
38563F72447J021383K67816p16051n46007M89387P97540j33328p56488K73958
38554A370657J722565J223016j159765k754038k077033p93803q29931j451298
38546d749630r65149J94991L66874k40044J43958J599828K025537L96690j528915
$$ plain form
38537 -2755860 -4419055 -4617511 -3434234 -1943218 -1068871 -1194770 -2061352 -2956359 -3640160
38528 -3640160 -4944715 -7633798 -10769194 -12263481 -11303322 -9254490 -7683826 -6349249
38520 -6349249 -3943434 -334255 2831470 3779217 2362764 125960 -1115623 -812219
38512 -812219 -18337 -96945 -1000063 -1228253 231084 2521571 4156196 5077010 6269596
38503 6269596 7517847 7238653 5171234 3527378 4004092 4946326 3579333 384924 -1308214
38494 -1308214 -250948 939852 8381 -1481615 -952704 851939 1038417 -937171 -2762734
38485 -2762734 -3020860 -2714525 -2696498 -2175896 -781920 67994 -735031 -2175453 -2868089
38476 -2868089 -3285139 -4609111 -6326542 -6672756 -5037390 -2522411 -375569 961706
$$ packed form
38537b755860j663195j98456J183277J491016Q74347j25899q66582q95007o83801
38528c640160j304555k689083l135396j494287R60159K048832J570664J334577
38520f349249K405815L609179L165725R47747j416453k236804j241583L03404
38512h12219P93882p8608r03118k28190J459337K290487J634625R20814J192586
38503F269596J248251k79194k067419j643856M76714R42234j366993l194409j693138
38494a308214J057266J190800r31471j489996N28911J804643J86478j975588j825563
38485b762734k58126L06335J8027N20602J393976Q49914q03025j440422o92636
38476b868089m17050j323972j717431l46214J635366K514979K146842J337275
$$ plain form
38468 961706 1541661 1823404 2745616 4813453 7159354 8395854 8260967 7553746 6713748
38459 6713748 5578425 4449771 4140320 4696237 5165148 5029964 4862794 4994685 4509620
38450 4509620 2501305 -262580 -2065318 -2581111 -3452948 -6046242 -9264561 -10415716
38442 -10415716 -8210626 -4193776 -909728 710028 1500013 2114161 2050789 761513 -1271508
38433 -1271508 -3071263 -4043118 -3792001 -1863510 1430172 4386920 5140835 3535192 1160576
38424 1160576 -352584 -468097 599305 2418423 4269752 5207559 4674770 2902335 607740
38415 607740 -1445304 -2585590 -2420617 -1245233 -50917 338601 276874 1054688 3190407
38406 3190407 5167648 4718051 1621228 -1714445 -3110283 -2994893 -2786128 -2131930 56465
$$ packed form
38468I61706N79955K81743R22212K067837K345901J236500j34887p07221q39998
38459F713748j135323j128654l09451N55917M68911j35184j67170J31891m85065
38450D509620k008315k763885j802738n15793q71837k593294l218319j151155
38442a0415716K205090M016850L284048J619756P89985O14148o3372j289276k033021
38433a271508j799755r71855K51117J928491L293682K956748P53915j605643k374616
38424A160576j513160j15513J067402J819118J851329R37807n32789j772435k294595
38415F07740k053044j140286J64973J175384J194316L89518o1727P77814K135719
38406C190407J977241m49597l096823l335673j395838J15390K08765O54198K188395
$$ plain form
38397 56465 2455615 2169854 -769006 -2674468 -1313133 1015762 1492120 1188873 2514919
38388 2514919 4321283 3359073 -275874 -2985752 -2900514 -1654500 -543057 1389969 4247843
38379 4247843 5758277 4837217 3829156 4858335 6295229 5498618 3212224 2217506 2693652
38370 2693652 2004340 -1081708 -4613541 -6264226 -5875425 -4699372 -3730975 -3386763 -3620070
38361 -3620070 -3791411 -3238578 -2235997 -1656016 -1646082 -1494442 -865732 -316075 -472157 -1451006
38351 -1451006 -3123931 -5169752 -6810469 -7262165 -6536958 -5145151 -3127530 -313046
38343 -313046 2443540 3441393 2101836 -20320 -855343 -23585 1131939 1426964 1113525
38334 1113525 1164566 1744240 1965944 1336291 849224 1840695 3934718 5236742 4861643
$$ packed form
38397E6465K399150k85761k938860j905462J361335K328895M76358l03247J326046
38388B514919J806364r62210l634947k709878Q5238J246014J111443J933026K857874
38379D247843J510434r21060j008061J029179J436894p96611k286394r94718M76146
38370B693652o89312l086048l531833j650685L88801J176053R68397L44212k33307
38361c620070j71341N52833J002581N79981R934J51640O28710N49657j56082r78849
38351a451006j672925k045821j640717m51696P25207J391807K017621K814484
38343c13046K756586R97853j339557k122156q35023Q31758J155524K95025l13439
38334A113525N1041N79674K21704o29653m87067R91471K094023J302024l75099
$$ plain form
38325 4861643 4083761 4254812 4741732 4128147 2559582 1350586 751529 -223598 -1825110
38316 -1825110 -3043843 -3303481 -3205915 -3123614 -2380603 -536293 1566563 2802684 3056773
38307 3056773 2920095 2828792 3052575 3764034 4459819 4020871 2145139 254341 232029
38298 232029 2499257 5787863 8413746 9311857 8342979 6332628 4638180 4091533 4352610
38289 4352610 4515516 4120116 3362713 2659505 2274893 2084422 1571817 491249 -431162
38280 -431162 -199805 847497 1125619 53633 -788093 303934 2787182 4734798 5424535
38271 5424535 5570412 5255337 3437332 24768 -3035384 -3770338 -2464278 -980465 -361782
38262 -361782 -96668 517441 1375881 2135126 2905154 3803886 4297869 3700535 2243643
$$ packed form
38325D861643p77882J71051M86920o13585j568565j208996n99057r75127j601512
38316a825110j218733k59638R7566Q2301P43011J844310K102856J236121K54089
38307C056773j36678r1303K23783P11459O95785m38948j875732j890798k2312
38298B32029K267228L288606K625883Q98111r68878k010351j694448n46647K61077
38289D352610J62906l95400p57403p03208l84612j90471n12605j080568r22411
38280d31162K31357J047302K78122j071986q41726J092027K483248J947616O89737
38271E424535J45877l15075j818005l412564l060152p34954J306060J483813O18683
38262c61782K65114O14109Q58440P59245P70028Q98732M93983n97334j456892
$$ plain form
38253 2243643 944261 149841 -1123006 -3727179 -6650124 -7728840 -6204758 -3591739
38245 -3591739 -1563033 24786 2077169 4026308 4127582 1960756 -728309 -2147441
38237 -2147441 -2357397 -2380627 -2314639 -1391369 431144 1961493 2002975 475940 -1839450
38228 -1839450 -4181582 -6117826 -7201686 -6703761 -4022670 380480 4620593 6610089
38220 6610089 6028801 4677255 4428611 5193619 5440808 4311349 2392367 615416 -594326
38211 -594326 -995756 -444803 445882 532839 -282916 -490430 1145843 3675007 4886417
38202 4886417 3855762 1671729 -185120 -1244071 -1819463 -2286113 -2827257 -3306092 -3248854
38193 -3248854 -2446136 -1504784 -1159890 -1137021 -529960 671736 1376652 922007 -89959
$$ packed form
38253B243643j299382p94420j272847k604173k922945j078716J524082K613019
38245c591739K028706J587819K052383J949139J01274k166826k689065j419132
38237b147441k09956k3230O5988R23270J822513J530349M1482j527035k315390
38228a839450k342132j936244j083860M97925K681091M403150M240113J989496
38220F610089n81288j351546k48644P65008K47189j129459j918982j776951j209742
38211e94326m01430N50953Q90685Q6957q15755k07514J636273K529164J211410
38202D886417j030655k184033j856849j058951n75392m66650n41144m78835N7238
38193c248854Q02718R41352L44894K2869O07061J201696P04916m54645j011966
$$ plain form
38184 -89959 -783186 -983918 -912477 -789507 -1032006 -1811962 -2095828 -433545 2667335 4602457
38174 4602457 3926724 2324163 1947692 2248415 1480877 256031 899113 3438419 4921673
38165 4921673 3366141 153909 -2417669 -3895598 -4697027 -4308834 -2422953 -673781
38157 -673781 -1055197 -2962485 -3713767 -2106580 201038 1294330 1516338 2411992 4053644
38148 4053644 4682775 2986864 -185137 -2801688 -3874478 -4138006 -4630954 -5276166 -5216481
38139 -5216481 -4131826 -2706477 -1941823 -2378806 -3769527 -5066376 -4986330 -3180312 -737629
38130 -737629 946431 1536480 1441465 689831 -773643 -1974491 -1596478 -51115 584479
38121 584479 -625601 -1984216 -1447621 589843 2005814 1831800 1121954 1083077 1510844
$$ packed form
38184h9959o93227k00732P1441J22970k42499p79956k83866J662283L100880J935122
38174D602457o75733j602561l76471L00723p67538j224846O43082K539306J483254
38165D921673j555532l212232k571578j477929q01429L88193J885881J749172
38157f73781l81416j907288p51282J607187K307618J093292K22008Q95654J641652
38148D053644O29131j695911l172001k616551j072790k63528m92948o45212N9685
38139e216481J084655J425349P64654m36983j390721j296849Q0046J806018K442683
38130g37629J684060N90049r5015p51634j463474j200848L78013J545363O35594
38121E84479j210080j358615N36595K037464J415971j74014p09846l8877M27767
$$ plain form
38112 1510844 1429169 575123 -295197 -478711 -369385 -1093169 -2958786 -4689194 -4751297
38103 -4751297 -3187048 -1391488 -284254 327380 655839 459793 -52287 -57628 626404
38094 626404 1175702 1133340 1042785 1193958 997667 296948 -66403 79363 -556641 -2552266
38084 -2552266 -4107836 -3193000 -423126 1868383 2716785 3062957 3826977 5102698 6775492
38075 6775492 8284115 8197768 5751418 2525298 958868 1482214 2700158 3831441 4895024
38066 4895024 4940080 2744762 -468734 -1639489 12993 1821529 1661876 825650 1408806
38057 1408806 2837518 3005153 1581192 152882 -287471 -275796 -594043 -1435468 -2770154
38048 -2770154 -4537938 -6457898 -8183963 -9465593 -9903818 -9088099 -7248511 -5092963
$$ packed form
38112A510844q1675q54046q70320j83514J09326p23784j865617j730408o2103
38103d751297J564249J795560J107234O11634L28459j96046n12080n341O84032
38094F26404N49298m2362r0555J51173j96291p00719l63351J45766o36004j995625
38084b552266j555570R14836K769874K291509Q48402L46172P64020J275721J672794
38075F775492J508623q6347k446350l226120j566430N23346J217944J131283J063583
38066D895024M5056k195318l213496j170755J652482J808536j59653q36226N83156
38057A408806J428712J67635j423961j428310m40353J1675l18247q41425j334686
38048b770154j767784j919960j726065j281630m38225Q15719J839588K155548
$$ plain form
38040 -5092963 -2828534 -327509 1557712 1332562 -763939 -2179130 -985388 1736022
38032 1736022 3568949 3649695 2588116 735609 -1669638 -3402060 -3263481 -2044582 -1884278
38023 -1884278 -3684290 -6409155 -8692864 -9718552 -8752630 -5583498 -1734269 336165
38015 336165 -73094 -1107099 -850537 342521 694001 -594064 -2592472 -3931455 -4126171
38006 -4126171 -3614622 -2897830 -1937665 -515413 1019125 1875857 1851538 1688994 2093849
37997 2093849 2872290 3307535 2788629 871029 -2297908 -5129713 -5372100 -2657532 785984
37988 785984 2945978 4236517 5562758 5811533 3637797 678283 -19844 1400622 1682909
37979 1682909 -292909 -1430644 899825 4674720 5896986 3777674 977843 -282495
$$ packed form
38040e092963K264429K501025J885221k25150k096501j415191J193742K721410
38032A736022J832927Q0746j061579j852507k405247j732422J38579J218899J60304
38023a884278j800012k724865k283709j025688R65922L169132L849229K070434
38015C36165m09259j034005K56562J193058L51480j288065j998408j338983j94716
38006d126171N11549P16792R60165J422252J534538Q56732k4319j62544M04855
37997B093849P78441M35245n18906j917600l168937k831805k42387K714568L443516
37988G85984K159994J290539J326241K48775k173736k959514o98127J420466K82287
37979A682909j975818j137735K330469L774895J222266k119312k799831j260338
$$ plain form
37971 -282495 -150875 351125 734124 825855 529777 -10669 -821370 -2395125 -4642912
37962 -4642912 -5986275 -4795691 -1642950 1155314 2395064 3169440 4751373 6382062
37954 6382062 6131172 3597939 864218 428568 2467098 4581587 4452548 2399397 834070
37945 834070 1446322 3734096 6225656 7963961 8379908 6987725 4217418 1642914 226652
37936 226652 -983313 -3214123 -5715420 -6686827 -6080933 -5699021 -6345407 -6588532 -4927113
37927 -4927113 -1770423 1462653 3950031 5294067 4914519 2822762 310677 -1195367
37919 -1195367 -1452444 -772635 1026790 3743181 5592808 4727030 1919242 -17529 82431
37910 82431 280457 -1408154 -4040481 -5270844 -4813406 -4523217 -5272042 -5623855 -4198554
$$ packed form
37971b82495J31620N02000L82999R1731k96078n40446q10701j573755k247787
37962d642912j343363J190584L152741K798264J239750P74376J581933J630689
37954F382062k50890k533233k733721m35650K038530K114489j29039k053151j565327
37945H34070O12252K287774K491560J738305M15947j392183k770307k574504j416262
37936B26652j209965k230810k501297r71407O05894L81912o46386k43125J661419
37927d927113L156690L233076K487378J344036l79548k091757k512085j506044
37919a195367k57077O79809J799425K716391J849627q65778k807788j936771R9960
37910H2431J98026j688611k632327j230363M57438K90189p48825l51813J425301
$$ plain form
37901 -4198554 -1915309 -764524 -1087820 -1316632 -334651 960632 922512 -609558 -2060991
37892 -2060991 -2076491 -1030958 -105519 670203 2412358 5200185 7035162 6017675 2974945
37883 2974945 634529 331781 911503 1076160 1267954 2418842 4134005 5311793 5675891
37874 5675891 5454052 4313113 2093191 77953 -176156 804753 911158 -451668 -1401207
37865 -1401207 -302643 2014159 3606863 3716964 2706352 885113 -1210763 -2168463
37857 -2168463 -962915 1259778 2041575 484087 -1761789 -2688945 -2246471 -1933346 -2656678
37848 -2656678 -3725717 -3994505 -3477048 -3278225 -3817373 -3758423 -1525575 2282709 5061458
37839 5061458 5102731 3355950 1794690 1152545 1218558 2273524 4605344 7015721 7502261
$$ packed form
37901d198554K283245J150785l23296k28812R81981J295283l8120j532070j451433
37892b060991j5500J045533R25439P75722J742155K787827J834977j017487l042730
37883B974945k340416l02748N79722J64657J91794J150888J715163J177788L64098
37874E675891k21839j140939k219922k015238k54109R80909J06405j362826r49539
37865a401207J098564K316802J592704J10101j010612j821239k095876r57700
37857b168463J205548K222693P81797j557488k245876r27156M42474L13125p23332
37848b656678j069039k68788N17457J98823n39148N8950K232848L808284K778749
37839E061458M1273j746781j561260o42145O6013J054966K331820K410377M86540
$$ plain form
37830 7502261 5625583 2927613 822289 -630026 -1541870 -1273969 390718 2131345
37822 2131345 2218192 368598 -2153932 -3857098 -3977832 -2778105 -1536135 -1661398 -3068697
37813 -3068697 -3886846 -2521614 408203 2923950 3990198 4059519 3748507 3142303 2322350
37804 2322350 1429048 73886 -2202143 -4602816 -5343102 -3850203 -1810205 -1285820 -2429393
37795 -2429393 -3734414 -3934638 -2876680 -1039399 868417 2047568 2149503 1595289 827819
37786 827819 -364120 -2036370 -3119359 -2482450 -840517 -207641 -1107015 -1612568 108892
37777 108892 3313300 5639145 5808068 4384088 2379086 263163 -1702898 -3148444
37769 -3148444 -3953252 -4482069 -5235759 -6378486 -7512757 -7860241 -7037090 -5809556 -5505588
$$ packed form
37830G502261j876678k697970k105324j452315r11844K67901J664687J740627
37822B131345Q6847j849594k522530j703166j20734J199727J241970j25263j407299
37813c068697q18149J365232K929817K515747J066248O9321l11012o06204q19953
37804B322350q93302j355162k276029k400673p40286J492899K039998N24385j143573
37795b429393j305021k00224J057958J837281J907816J179151J01935n54214p67470
37786H27819j191939j672250j082989O36909J641933O32876q99374n05553J721460
37777A08892L204408K325845J68923j423980k005002k115923j966061j445546
37769c148444q04808n28817p53690j142727j134271l47484Q23151J227534L03968
$$ plain form
37760 -5505588 -6318884 -6851492 -5884725 -3918736 -2234405 -1155004 -224101 552485 908249
37751 908249 1313026 2379081 3543891 3819370 3631324 4121828 4581863 2788791 -1295048
37742 -1295048 -4278914 -3376622 -222490 1150580 -733540 -3619357 -4783565 -3723032
37734 -3723032 -1665982 -11890 331487 -817111 -2705468 -4085579 -4101545 -2667070 -363881
37725 -363881 1651273 2255233 1621746 1364761 2535312 3939735 3526234 1155477 -1177483
37716 -1177483 -1835686 -1186805 -717208 -1477107 -3459791 -5570377 -6138355 -4443167 -1909092
37707 -1909092 -911484 -2250680 -4588775 -6274965 -6635416 -5535033 -3175362 -772411
37699 -772411 -21357 -1106653 -2360065 -2634687 -2816441 -3963743 -5104813 -4410342 -2016310
$$ packed form
37760e505588q13296n32608R66767J965989J684331J079401R30903P76586L55764
37751I08249M04777J066055J164810K75479j88046M90504M60035j793072m083839
37742a295048k983866R02292L154132J373070j884120k885817j164208J060533
37734c723032K057050J654092L43377j148598j888357j380111j5966J434475K303189
37725c63881K015154O03960o33487k56985J170551J404423m13501k370757k332960
37716a177483o58203O48881M69597p59899j982684k110586n67978J695188K534075
37707a909092R97608j339196k338095j686190l60451J100383K359671K402951
37699g72411P51054j085296j253412k74622j81754j147302j141070O94471K394032
$$ plain form
37690 -2016310 -163422 -482840 -2207714 -3255258 -2391691 -246750 1324460 955134 -744404
37681 -744404 -1629704 -364380 2047686 3541947 3239521 1676543 -569351 -3229184 -5505084
37672 -5505084 -6264630 -5460700 -4368372 -3968382 -3933351 -3660287 -3380181 -3440529 -3168991 -1552029
37662 -1552029 1061534 2856974 2410627 111192 -2501130 -4328933 -5238246 -5281427 -4077378
37653 -4077378 -1342480 2149641 4641683 4800168 3037994 1176557 653276 1180310 1321449
37644 1321449 333743 -771697 -164119 2763520 6345986 7840338 5930367 2135499
37636 2135499 -443499 6020 2366624 3863983 2867233 271285 -1723468 -1767793 -246994
37627 -246994 1435297 2029075 1248971 16797 -176173 1325883 3531524 4778650 4437453
$$ packed form
37690b016310J852888l19418j724874j047544Q63567K144941J571210l69326j699538
37681g44404q85300J265324K412066J494261l02426j562978k245894k659833k275900
37672e505084p59546Q03930J092328L99990L5031K73064K80106o0348K71538J616962
37662a552029K613563J795440m46347k299435k612322j827803r09313m3181J204049
37653d077378K734898L492121K492042J58485j762174j861437n23281N27034J41139
37644A321449r87706j105440O07578K927639L582466J494352j909971l794868
37636B135499k578998M49519K360604J497359r96750k595948j994753m4325J520799
37627b46994J682291N93778p80104j232174j92970J502056K205641J247126l41197
$$ plain form
37618 4437453 3178800 1790566 596996 67185 868719 2757589 4270301 4219170 2890035
37609 2890035 1244859 -238973 -1266132 -1284145 -454035 -197853 -1399772 -2738857 -2414679
37600 -2414679 -1016510 -732226 -1841456 -2225235 -877252 273430 -768544 -3079153
37592 -3079153 -4212715 -3418851 -1913547 -712678 244165 1109179 1582003 1412344 686721
37583 686721 -307780 -1072471 -1196234 -1139728 -2011121 -3837907 -4813994 -3271380 109145
37574 109145 2988529 3743733 2225243 -1101994 -5318309 -8675133 -9643964 -8581408 -7215353
37565 -7215353 -6318456 -5028468 -2730534 -404256 570420 136904 -632160 -967047 -947977
37556 -947977 -800142 -280839 927204 2401508 3067391 2485344 1697603 2029106 3193143
$$ packed form
37618D437453j258653j388234j193570n29811Q01534J888870J512712n1131j329135
37609B890035j645176j483832j027159j8013Q30110K56182j201919j339085L24178
37600b414679J398169K84284j109230l83779J347983J150682j041974k310609
37592c079153j133562P93864J505304J200869R56843Q65014M72824j69659p25623
37583F86721r94501p64691j23763N6506q71393j826786r76087J542614L380525
37574A09145K879384P55204j518490l327237m216315l356824r68831J062556J366055
37565g215353Q96897J289988K297934K326278R74676m33516p69064l34887J9070
37556i47977J47835N19303J208043J474304O65883n82047p87741L31503J164037
$$ plain form
37547 3193143 3666373 3057998 2709801 3384794 3893224 3072418 1673496 857928 234681
37538 234681 -744899 -742061 1652327 4824243 5606148 3686087 1880847 1860100 2338386
37529 2338386 2037774 1606716 1517476 726128 -1035786 -1963219 -946329 371433 149603
37520 149603 -915028 -1402748 -1878430 -3425638 -5075088 -5425355 -5647800 -7849746 -10995671
37511 -10995671 -11509639 -8076795 -3234233 119829 1398770 1184303 -30307 -1115696
37503 -1115696 -584156 1284958 2419556 2021455 1747295 2649960 2956591 745465 -2630403
37494 -2630403 -3978658 -2492815 -666121 -1170096 -4245452 -8036731 -10246611 -9555702
37486 -9555702 -6612458 -3733662 -2742321 -3119097 -3055303 -2016348 -1113203 -1058960 -1195676
$$ packed form
37547C193143M73230o08375l48197O74993N08430q20806j398922q15568o23247
37538B34681r79580K838K394388L171916P81905j920061j805240k0747M78286
37529B338386l00612m31058q9240p91348j761914r27433J016890J317762k21830
37520A49603j064631m87720m75682j547208j649450l50267k22445k201946l145925
37511a0995671n13968L432844M842562L354062J278941k14467j214610j085389
37503a115696N31540J869114J134598l98101k74160R02665L06631k211126l375868
37494b630403j348255J485843J826694n03975l075356l791279k209880O90909
37486i555702K943244K878796R91341l76776O3794J038955R03145N4243j36716
$$ plain form
37477 -1195676 -960941 -1001981 -1961424 -3125472 -3440727 -3323002 -4061743 -5365207 -4904865
37468 -4904865 -1184560 3925313 6727498 5703172 2963126 1505806 2083216 3387783
37460 3387783 4290887 4625865 4272620 3043650 1656005 1407214 2303327 2692640 1584270
37451 1584270 302033 704561 2485775 3575979 2905635 1431732 400818 -124209 -636917
37442 -636917 -1153004 -1423214 -1506588 -1586669 -1680956 -1882754 -2364840 -2841546 -2703208 -2112184
37432 -2112184 -2182595 -3382193 -4506847 -4219245 -3009277 -2393914 -2547852 -2247203 -1190996
37423 -1190996 -670362 -1309700 -1741666 -712823 711469 559014 -1215962 -2958710 -3927406
37414 -3927406 -4849712 -5829680 -5588344 -3512777 -1046289 -79768 -845347 -2109930 -2623176
$$ packed form
37477a195676K34735m1040r59443j164048l15255J17725p38741j303464M60342
37468d904865L720305N109873K802185j024326k740046j457320N77410J304567
37460C387783R03104L34978l53245j228970j387645k48791Q96113L89313j108370
37451A584270j282237M02528J781214J090204o70344j473903j030914n25027n12708
37442f36917n16087k70210q3374q0081r4287k01798m82086m76706J38338N91024
37432b112184p0411j199598j124654K87602J209968O15363j53938L00649J056207
37423a190996N20634o39338m31966J028843J424292j52455j774976j742748r68696
37414c927406r22306r79968K41336K075567K466488R66521p65579j264583n13246
$$ plain form
37405 -2623176 -1827421 -161196 692322 -937425 -4276259 -6172325 -4832742 -2289899
37397 -2289899 -1569892 -2563275 -2814813 -1589332 -524093 -352147 260545 1991559 3526094
37388 3526094 4038008 4665967 5990537 6187213 3787578 639736 -333138 678685 912087
37379 912087 -784975 -2835455 -3919717 -4528916 -5018022 -4488782 -2776091 -1682940 -2675673
37370 -2675673 -4503840 -4656778 -2595357 -234622 508621 -415129 -1682030 -2087041 -1391052
37361 -1391052 -192924 778835 1231412 1151044 464718 -540389 -772413 559670 2289706
37352 2289706 2116396 -293678 -2366426 -1844747 258614 1429117 1384939 1956725 3487123
37343 3487123 3661029 741334 -3682578 -6375163 -5919641 -3432783 -550208 2052852
$$ packed form
37405b623176P95755J666225Q53518j629747l338834j896066J339583K542843
37397b289899P20007r93383k51538J225481J065239J71946O12692J731014J534535
37388C526094N11914O27959J324570J96676k399635l147842r72874J011823K33402
37379I12087j697062k050480j084262o09199m89106N29240J712691J093151r92733
37370b675673j828167j52938K061421K360735P43243r23750j266901m05011O95989
37361a391052J198128R71759M52577q0368o86326j005107k32024J332083J730036
37352B289706j73310k410074k072748N21679K103361J170503m4178N71786J530398
37343C487123J73906k919695m423912k692585M55522K486858K882575K603060
$$ plain form
37335 2052852 4261850 5665174 5563749 3750917 1216909 -246534 228116 1305285
37327 1305285 805686 -1402691 -2947412 -2023631 156949 1060192 110981 -1099424 -1316588
37318 -1316588 -694997 481456 2369021 4408907 5126691 3898036 1866113 465396
37310 465396 117669 992799 3567303 7129381 9002529 7195186 3324234 994279 1314900
37301 1314900 1892072 612080 -1473525 -2031076 -699742 1010708 2241485 3608443
37293 3608443 5588254 7327157 7461487 5566590 2577529 87331 -760298 -17225 1325582
37284 1325582 2378699 2957820 3155067 2855975 2024612 978328 -79321 -1314646 -2517435
37275 -2517435 -2724351 -1509760 -215262 -655757 -2588720 -3695644 -2459450 -5106
$$ packed form
37335B052852K208998J403324j01425j812832k534008j463443M74650J077169
37327A305285m99599k208377j544721R23781K180580R03243r49211j210405k17164
37318a316588O21591J176453J887565K039886P17784j228655k031923j400717
37310D65396l47727Q75130K574504L562078J873148j807343l870952k329955L20621
37301A314900N77172j279992k085605n57551J331334J710450J230777J366958
37293C608443J979811J738903J34330j894897k989061k490198q47629P43073J342807
37284A325582J053117N79121J97247k99092q31363j046284j057649j235325j202789
37275b517435k06916J214591J294498m40495j932963j106924J236194K454344
$$ plain form
37267 -5106 1522738 1523915 1074500 1127482 1531300 1607578 912869 -515730 -2029596 -2493111
37257 -2493111 -1175841 1280176 3218856 3577428 2955949 2894598 4152704 5851185 6409397
37248 6409397 5298251 3630915 2839943 3066880 3289933 2750569 1506621 -257286 -2339761
37239 -2339761 -3748105 -3233743 -1450026 -1220411 -4107291 -7570390 -7474079 -3204849 1659835
37230 1659835 3981136 4283695 4529326 4682258 3295182 492184 -1584490 -1315928 601356
37221 601356 2029815 1400100 -966859 -2940686 -2339203 728654 3689821 4332636 3182640
37212 3182640 2203985 1956698 1441134 219183 -1015779 -1837384 -2327547 -1894876 215380
37203 215380 2855640 3526307 1922174 910130 2523362 4800547 4607115 2203294 536564
$$ packed form
37267e106J527844J177m49415N2982M03818P6278o94709j428599j513866m63515
37257b493111J317270K456017J938680L58572o21479o1351J258106J698481N58212
37248F409397j111146j667336p90972K26937K23053n39364j243948j763907k082475
37239b339761j408344N14362J783717K29615k886880l463099R6311M269230M864684
37230A659835K321301L02559K45631J52932j387076k802998k076674K68562J917284
37221F01356J428459o29715k366959j973827O01483L067857K961167O42815j149996
37212C182640r78655k47287n15564j221951j234962q21605m90163M32671K110256
37203B15380K640260O70667j604133j012044J613232K277185j93432k403821j666730
$$ plain form
37194 536564 706809 822618 -505989 -2030318 -2077322 -1019183 -399386 -895058 -2207369
37185 -2207369 -3949870 -5591993 -6298122 -5832853 -5076875 -4790977 -4403227 -2920483 -646590
37176 -646590 921798 758196 -823795 -2769388 -4090425 -4253472 -3481088 -2710104 -2752166
37167 -2752166 -3462963 -4073358 -4218296 -4247753 -4613858 -5293760 -5745756 -5282063 -3836696
37158 -3836696 -2623819 -3434003 -6584359 -9947836 -10872319 -8966462 -6220251 -4436171
37150 -4436171 -3446093 -2077031 -258 1980216 3039893 3167170 2990277 3090285 3482375
37141 3482375 3680471 3282656 2410552 1513137 1010908 1333547 2828232 5039068 6451287
37132 6451287 5862080 3980184 2743904 2867222 2980281 1587656 -1014655 -3380734 -4667458
$$ packed form
37194E36564J70245J15809j328607j524329m7004J058139O19797m95672j312311
37185b207369j742501j642123p06129M65269P55978K85898L87750J482744K273893
37176f46590J568388j63602j581991j945593j321037j63047P72384P70984m2062
37167b752166p10797o10395j44938k9457l66105o79902m51996M63693J445367
37158c836696J212877q10184l150356l363477r24483J905857K746211J784080
37150d436171R90078J369062K076773J980474J059677J27277j76893J00008L92090
37141C482375J98096l97815q72104q97415n02229L22639J494685K210836J412219
37132F451287n89207j881896j236280J23318J13059j392625k602311k366079j286724
$$ plain form
37123 -4667458 -4903239 -4110438 -2235788 204726 2343417 3868217 4981575 5477865 4748611
37114 4748611 2929143 1168806 281170 -105222 -352865 485432 3515481 7676388 9999388
37105 9999388 8873018 6017975 4124271 3219832 970335 -3374675 -7068197 -6919989
37097 -6919989 -3227061 613892 1931075 1015124 -220938 -539928 -116895 85463 -658173
37088 -658173 -1927381 -2361612 -1403729 -406966 -847280 -1810563 -1024532 1471354 2767852
37079 2767852 1042013 -1889213 -3290101 -2935056 -2034743 -504129 2135196 4271613
37071 4271613 3660708 1101542 -285653 335569 615896 -614218 -1300419 -89573 696153
37062 696153 -1384246 -4522800 -4955800 -2400657 -57672 280563 -20543 308367 518214
$$ packed form
37123d667458k35781P92801J874650K440514K138691J524800J113358M96290p29254
37114D748611j819468j760337q87636l86392k47643Q38297L030049M160907K323000
37105I999388j126370k855043j893704r04439k249497m345010l693522J48208
37097f919989L692928L840953J317183r15951j236062l18990M23033K02358p43636
37088f58173j269208m34231R57883R96763m40314r63283P86031K495886J296498
37079B767852j725839k931226j400888L55045R00313J530614K639325K136417
37071D271613o10905k559166j387195O21222K80327j230114o86201J210846P85726
37062F96153k080399l138554m33000K555143K342985L38235l01106L28910K09847
$$ plain form
37053 518214 78196 195016 1642878 3064451 2975442 1833210 549124 -1458772 -4705774
37044 -4705774 -7329166 -6772251 -3409602 -269907 875710 1038450 1351350 1163060 -202195
37035 -202195 -1737327 -2381828 -2977017 -4778338 -6904226 -7267469 -5736138 -4386049 -4414649
37026 -4414649 -4666329 -3869548 -2656253 -2236807 -2357447 -2001040 -1318631 -1350063 -2149153
37017 -2149153 -2566524 -1873694 -446067 1202576 2955295 4547617 5579741 6269587 7109735
37008 7109735 7574830 6486020 4142681 2611674 2866715 2914442 264137 -4494130 -8148124
36999 -8148124 -8539304 -6318360 -3272769 -563593 1154043 1457455 772335 239636 316268
36990 316268 358066 104485 523393 2291635 4267748 4632969 3203753 1589438 1150518
$$ packed form
37053E18214m40018J16820J447862J421573q9009j142232j284086k007896l247002
37044d705774k623392N56915L362649L139695J145617J62740L12900j88290j365255
37035b02195j535132o44501n95189j801321k125888l63243J531331J350089k8600
37026d414649k51680P96781J213295M19446j20640L56407O82409l1432p99090
37017b149153m17371O92830J427627J648643J752719J592322J032124O89846Q40148
37008G109735M65095j088810k343339j531007K55041M7727k650305m758267l653994
36999h148124l91180K220944L045591K709176J717636L03412o85120n32699P6632
36990C16268M1798k53581M18908J768242J976113L65221j429216j614315m38920
$$ plain form
36981 1150518 1676986 2168325 2162512 1941588 1792314 1432392 280725 -1621859 -3100067
36972 -3100067 -2747536 -558493 1824025 2887391 2876466 3163313 4344329 5585112 5729266
36963 5729266 4520357 2729811 1434442 1126829 1323284 1216714 799690 838220 1504703
36954 1504703 1825637 1091859 -14306 -660578 -1445188 -3348645 -5639378 -6593105 -6242818
36945 -6242818 -6472981 -7888951 -8505759 -6612310 -3352619 -1079624 -405697 -465889 -1091794
36936 -1091794 -2799201 -5004710 -6051281 -5109324 -2817518 -202911 1795128 2166233
36928 2166233 931455 229463 2252199 5828182 7260144 5354523 3408324 4778019
36920 4778019 8409459 10690557 10217286 8402386 6362386 3853229 1106702 -748466
$$ packed form
36981A150518N26468M91339n813k20924j49274l59922j151667j902584j478208
36972c100067L52531K189043K382518J063366j0925K86847J181016J240783J44154
36963E729266j208909j790546j295369l07613J96455j06570m17024L8530O66483
36954A504703L20934p33778j106165o46272p84610j903457k290733r53727L50287
36945f242818k30163j415970o16808J893449L259691K272995O73927o0192o25905
36936a091794j707407k205509j046571R41957K291806K614607J998039L71105
36928B166233j234778p01992K022736L575983J431962j905621j946199J369695
36920D778019L631440K281098m73271j814900k040000k509157k746527j855168
$$ plain form
36912 -748466 -1492868 -2049674 -2487484 -1718637 245277 1741341 2084316 2807759 4942608
36903 4942608 6828119 6473515 4804779 4445011 5964573 7400172 7171811 5492497 2975113
36894 2975113 -61585 -2517864 -2767475 -922565 726678 642607 126604 1217776 3570281
36885 3570281 4981237 4452777 3109241 2168460 1558707 929139 659678 955932 807982
36876 807982 -942526 -3679456 -5262715 -4568632 -2978886 -2587035 -3332318 -2980127 -197769
36867 -197769 3339303 4807841 3768920 2729963 3976322 6749878 8236149 6907298
36859 6907298 4087844 2145557 1807004 1810216 957222 -350099 -1052336 -1174096 -1574115
36850 -1574115 -2250429 -2349471 -2159691 -3413270 -6525916 -9049211 -8611098 -6315143 -5085206
$$ packed form
36912g48466p44402n56806m37810P68847J963914J496064L42975P23443K134849
36903D942608J885511l54604j668736l59768J519562J435599k28361j679314k517384
36894B975113l036698k456279k49611J844910J649243q4071n16003J091172K352505
36885C570281J410956n28460j343536r40781o09753o29568k69461K96254j47950
36876H07982j750508k736930j583259O94083J589746L91851p45283L52191K782358
36867a97769L537072J468538j038921j038957J246359K773556J486271j328851
36859F907298k819454j942287l38553L212q52994j307321p02237j21760m00019
36850a574115o76314r9042J89780j253579l112646k523295M38113K295955J229937
$$ plain form
36841 -5085206 -5350814 -4955489 -3167074 -1784532 -1586345 -715612 1843152 3913900 3544508
36832 3544508 2570634 3933680 6948184 8378059 7485987 6875095 8380496 11015953 13292648
36823 13292648 14805519 14885258 12435264 8355210 5787295 6335963 7790796 7139622 4307157
36814 4307157 1353303 -565560 -1586815 -1621200 -483032 960989 1493667 1139206 709328
36805 709328 208660 -851664 -1949281 -2019778 -1380244 -1584020 -3076147 -4338761 -3793089
36796 -3793089 -1487151 1435166 3873147 4961840 4199364 2107839 116196 -806748
36788 -806748 -955430 -1034172 -1195631 -1394422 -1973949 -3119981 -4127709 -4029082 -2871290
36779 -2871290 -1715443 -1297429 -1222351 -669041 528180 1807519 2623612 2847546 2446694
$$ packed form
36841e085206k65608L95325J788415J382542J98187Q70733K558764K070748l69392
36832C544508r73874J363046L014504J429875q92072o10892J505401K635457K276695
36823A3292648J512871P9739k449994m080054k567915N48668J454833o51174k832465
36814D307157k953854j918863j021255l4385J138168J444021N32678l54461m29878
36805G09328n00668j060324j097617p0497O39534k03776j492127j262614N45672
36796c793089K305938K922317K437981J088693p62476k091525j991643r22944
36788h06748j48682p8742j61459j98791n79527j146032j007728R8627J157792
36779b871290J155847M18014P5078N53310J197221J279339Q16093K23934m00852
$$ plain form
36770 2446694 1205079 -916935 -3293437 -4879345 -5119708 -4561752 -4501916 -5903609 -8393882
36761 -8393882 -10286146 -10038106 -7970734 -6047993 -5491115 -5279637 -3909656 -1932598 -1153453
36752 -1153453 -1546755 -1105360 624425 1136313 -1220060 -3804789 -2638573 1923613 5198229
36743 5198229 4138176 880899 -616258 537164 2200869 2731791 2465058 2064975 1265981
36734 1265981 -232680 -1771844 -2429107 -2213563 -1859973 -1575149 -666940 1309574 3502447
36725 3502447 4445710 3740599 2506520 1999949 2262536 2386930 1673230 219663 -1191408
$$ packed form
36770B446694j241615k122014k376502j585908k40363N57956N9836j401693k490273
36761h393882j892264K48040K067372J922741N56878K11478J369981J977058P79145
36752a153453l93302M41395J729785N11888k356373k584729J166216M562186L274616
36743E198229j060053l257277j497157J153422J663705N30922k66733m00083p98994
36734A265981j498661j539164o57263K15544L53590K84824R08209J976514K192873
36725C502447R43263p05111j234079n06571K62587J24394p13700j453567j411071
$$ [...]
##END NTUPLES=NMR SPECTRUM
##END=
