##TITLE=31Pdec_DE-108_oil_TFA
CDCl3, 24 sc
 2.9.2025
##JCAMPDX= 6.0         $$ Bruker NMR JCAMP-DX V2.0
##DATA TYPE= NMR SPECTRUM
##DATA CLASS= NTUPLES
##ORIGIN= UXNMR, Bruker Analytische Messtechnik GmbH
##OWNER= root
$$ XWIN-NMR		Version 3.5
$$ Tue Sep  2 14:35:04 2025 Russian Standard Time (UT+4h)  she@DPX200
##.OBSERVE FREQUENCY= 81.013821
##.OBSERVE NUCLEUS= ^31P
##.ACQUISITION MODE= SIMULTANEOUS
##.ACQUISITION SCHEME= undefined
##.AVERAGES= 64
##.DIGITISER RES= 17
##SPECTROMETER/DATA SYSTEM= spect
##.PULSE SEQUENCE= zgpg30
##.SOLVENT NAME= CDCl3
##.SHIFT REFERENCE= (INTERNAL, CDCl3, 0, 198.062)
##AUDIT TRAIL= $$ (NUMBER, WHEN, WHO, WHERE, WHAT)
$$ ##TITLE= Audit trail, XWIN-NMR		Version 3.5
$$ ##JCAMPDX= 5.01
$$ ##ORIGIN= Bruker BioSpin GmbH
$$ ##OWNER= she
$$ F:/spectra/data/she/nmr/P31/2/pdata/1/auditp.txt
$$ ##AUDIT TRAIL=  $$ (NUMBER, WHEN, WHO, WHERE, WHAT)
(   1,<2025-09-02 14:33:35.40 +0400>,<she>,<DPX200>,
      <created by zg, POWCHK disabled, PULCHK disabled
       configuration hash MD5:
       00 E9 B6 7A A2 85 ED C7 34 08 36 98 17 FE 4E 26
       data hash MD5: 32K
       D9 EE B2 85 8B B7 D3 0D 83 4E F0 8E 49 12 0C 4A>)
(   2,<2025-09-02 14:33:39.21 +0400>,<she>,<DPX200>,
      <Start of raw data processing
       efp BC_mod = 2 LB = 1.5 FT_mod = 6 PKNL = 1 PHC0 = 1362.553 PHC1 = 149.4999 SI = 64K 
       data hash MD5: 64K
       3F 85 72 9C 21 08 A8 B1 30 25 47 BE B5 6F C8 18>)
(   3,<2025-09-02 14:34:28.50 +0400>,<she>,<DPX200>,
      <abs ABSG = 5 
       data hash MD5: 64K
       8F A1 BA 11 23 E8 BE 39 91 53 49 83 7B 08 85 C8>)
$$ ##END=
$$ 
$$ hash MD5
$$ 96 AF 7E A3 DA 64 C1 8F E8 7C D2 E3 BB F5 9F 6F
##$RELAX= 
##$RELAX= 
##$RELAX= 
##$RELAX= 
##$RELAX= 
##$RELAX= 
##$RELAX= 
##$RELAX= 
$$ Bruker specific parameters
$$ --------------------------
##$DU= <F:/spectra>
##$EXPNO= 2
##$NAME= <P31>
##$PROCNO= 1
##$TYPE= <nmr>
##$USER= <she>
##$AMP= (0..31)
100 100 100 100 100 100 100 100 100 100 100 100 100 100 100 100 100 100 
100 100 100 100 100 100 100 100 100 100 100 100 100 100 
##$AQSEQ= 0
##$AQ_mod= 1
##$AUNM= <au_zg>
##$AUTOPOS= <>
##$BF1= 81.014009
##$BF2= 200.13
##$BF3= 200.13
##$BF4= 200.13
##$BF5= 200.13
##$BF6= 200.13
##$BF7= 200.13
##$BF8= 200.13
##$BYTORDA= 1
##$CFDGTYP= 0
##$CFRGTYP= 5
##$CHEMSTR= <none>
##$CNST= (0..31)
1 1 145 1 1 1 1 1 1 1 1 1 1 1 1 1 1 1 1 1 1 1 1 1 1 1 1 1 1 1 1 1 
##$CPDPRG= <waltz16>
##$CPDPRG1= <>
##$CPDPRG2= <waltz16>
##$CPDPRG3= <>
##$CPDPRG4= <mlev>
##$CPDPRG5= <mlev>
##$CPDPRG6= <mlev>
##$CPDPRG7= <mlev>
##$CPDPRG8= <mlev>
##$CPDPRGB= <>
##$CPDPRGT= <>
##$D= (0..31)
0 1 0 0 0 0 0 0 0 0.06 0 0.03 2e-05 3e-06 0 0 0.0002 0 0 0 0 0 0 0 0 0 
0 0 0 0 0 0 
##$DATE= 1756809214
##$DBL= (0..7)
120 120 120 11 120 120 24 19 
##$DBP= (0..7)
150 150 150 150 150 150 150 150 
##$DBP07= 0
##$DBPNAM0= <>
##$DBPNAM1= <>
##$DBPNAM2= <>
##$DBPNAM3= <>
##$DBPNAM4= <>
##$DBPNAM5= <>
##$DBPNAM6= <>
##$DBPNAM7= <>
##$DBPOAL= (0..7)
0.5 0.5 0.5 0.5 0.5 0.5 0.5 0.5 
##$DBPOFFS= (0..7)
0 0 0 0 0 0 0 0 
$$ [...]
##$SUBNAM3= <"">
##$SUBNAM4= <"">
##$SUBNAM5= <"">
##$SUBNAM6= <"">
##$SUBNAM7= <"">
##$SUBNAM8= <"">
##$SUBNAM9= <"">
##$SW= 400.765351723535
##$SWIBOX= (0..15)
0 1 3 0 0 0 0 0 0 0 0 0 0 0 0 0 
##$SW_h= 32467.5324675325
##$TD= 32768
##$TD0= 1
##$TE= 0
##$TE2= 300
##$TE3= 300
##$TEG= 300
##$TL= (0..7)
0 120 53 12 22 120 120 120 
##$TP= (0..7)
150 150 150 150 150 150 150 150 
##$TP07= 0
##$TPNAME0= <>
##$TPNAME1= <>
##$TPNAME2= <>
##$TPNAME3= <>
##$TPNAME4= <>
##$TPNAME5= <>
##$TPNAME6= <>
##$TPNAME7= <>
##$TPOAL= (0..7)
0.5 0.5 0.5 0.5 0.5 0.5 0.5 0.5 
##$TPOFFS= (0..7)
0 0 0 0 0 0 0 0 
##$TUNHIN= 0
##$TUNHOUT= 0
##$TUNXOUT= 0
##$USERA1= <user>
##$USERA2= <user>
##$USERA3= <user>
##$USERA4= <user>
##$USERA5= <user>
##$V9= 5
##$VALIST= <valist>
##$VCLIST= <CCCCCCCCCCCCCCC>
##$VD= 0
##$VDLIST= <DDDDDDDDDDDDDDD>
##$VPLIST= <PPPPPPPPPPPPPPP>
##$VTLIST= <TTTTTTTTTTTTTTT>
##$WBST= 1024
##$WBSW= 4
##$XGAIN= (0..3)
0 0 0 0 
##$XL= 0
##$YL= 0
##$YMAX_a= 3718
##$YMIN_a= -6851
##$ZGOPTNS= <>
##$ZL1= 120
##$ZL2= 120
##$ZL3= 120
##$ZL4= 120
##$ABSF1= 198.0616
##$ABSF2= -202.7028
##$ABSG= 5
##$ABSL= 3
##$ALPHA= 0
##$AQORDER= 0
##$ASSFAC= 0
##$ASSFACI= 0
##$ASSFACX= 0
##$ASSWID= 0
##$AUNMP= <proc_1d>
##$AZFE= 0.1
##$AZFW= 0.5
##$BCFW= 0
##$BC_mod= 2
##$BYTORDP= 0
##$COROFFS= 0
##$CY= -3
##$DATMOD= 1
##$DC= 0
##$DFILT= <>
##$DTYPP= 0
##$F1P= 0
##$F2P= 0
##$FCOR= 1
##$FTSIZE= 65536
##$FT_mod= 6
##$GAMMA= 0
##$GB= 0
##$INTBC= 1
##$INTSCL= 9.790993e-09
##$ISEN= 30
##$LB= 1.5
##$LEV0= 0
##$LPBIN= 0
##$MAXI= 10000
##$MC2= 0
##$MEAN= 0
##$ME_mod= 0
##$MI= 50
##$NCOEF= 0
##$NC_proc= -9
##$NLEV= 6
##$NOISF1= 182.463
##$NOISF2= 159.3651
##$NSP= 0
##$NTH_PI= 0
##$NZP= 0
##$OFFSET= 198.0616
##$PC= 4
##$PHC0= 1362.553
##$PHC1= 149.4999
##$PH_mod= 1
##$PKNL= yes
##$PPARMOD= 0
##$PSCAL= 0
##$PSIGN= 0
##$REVERSE= no
##$SF= 81.0140089999434
##$SI= 65536
##$SIGF1= 159.3651
##$SIGF2= -187.1042
##$SINO= 113.3802
##$SIOLD= 16384
##$SREGLST= <1H.CDCl3>
##$SSB= 0
##$STSI= 65536
##$STSR= 0
##$SW_p= 32467.5324675325
##$SYMM= 0
##$S_DEV= 0
##$TDeff= 32768
##$TDoff= 0
##$TI= <>
##$TILT= no
##$TM1= 0
##$TM2= 0
##$TOPLEV= 0
##$USERP1= <user>
##$USERP2= <user>
##$USERP3= <user>
##$USERP4= <user>
##$USERP5= <user>
##$WDW= 1
##$XDIM= 65536
##$YMAX_p= 88893558
##$YMIN_p= -385379976
$$ End of Bruker specific parameters
$$ ---------------------------------
##NTUPLES= NMR SPECTRUM
##VAR_NAME=  FREQUENCY,     SPECTRUM/REAL,   SPECTRUM/IMAG
##SYMBOL=    X,             R,               I
##VAR_TYPE=  INDEPENDENT,   DEPENDENT,       DEPENDENT
##VAR_FORM=  AFFN,          ASDF,            ASDF
##VAR_DIM=   65536,         65536,           65536
##UNITS=     HZ,            ARBITRARY UNITS, ARBITRARY UNITS
##FACTOR=    0.49542278885378, 1,            1
##FIRST=     16045.7642231865, 0,            0
##LAST=      -16421.768244346, 0,            0
##MIN=       -16421.768244346, -385379976,   0
##MAX=       16045.7642231865, 88893558,     0
$$ Real data points
##PAGE= N=1
##DATA TABLE= (X++(R..R)), XYDATA
$$ [...]
##PAGE= N=2
##DATA TABLE= (X++(I..I)), XYDATA
7353g312019n156811l221288j651965L6686J977384K973660K703800K003554J212448
7344f434551O99130J839306M676221O032587L035445k570927o299811n999117
7336e021717l013180Q4048J109823k82583j279310J235448N325016N459063Q42265
7327D458873k885045k748685l099410p055355r619289n404990J976242N227762
7319a9149897M087414L618649M966474N062476L294915J619978k07164l240459
7311E2386n103478l240678k75133O980m91521J993655N001976L141864k326769
7302a240718m903315k791046k05040K67670l33988j757227m037930m186831l80697
7293a9569122K806462R25799j762069P59748M364602J122001n426866m891024
$$ plain form
7353 -7312019 -12468830 -15690118 -17342083 -17305397 -15328013 -12354353 -9650553 -7646999 -6434551
7344 -6434551 -5735421 -3896115 780106 6812693 9848138 7277211 977400 -5021717
7336 -5021717 -8034897 -7950849 -6841026 -7123609 -8402919 -7167471 -1842455 3616608 4458873
7327 4458873 1573828 -1174857 -4274267 -11329622 -20948911 -26353901 -24377659 -19149897
7319 -19149897 -15062483 -11443834 -6477360 -1414884 1880031 3500009 3292845 52386
7311 52386 -5051092 -8291770 -8566903 -8559923 -9051444 -7057789 -2055813 1086051 -1240718
7302 -1240718 -6144033 -8935079 -9140119 -8872449 -9206437 -10963664 -15001594 -19188425 -19569122
7293 -19569122 -16762660 -15836861 -17598930 -16839182 -12474580 -11352579 -16779445 -21670469
7285b1670469J402355J992224l419831j421364J1320226J8742777R104211o504186
7277I545943j0896748m299029J346846J872661J227636l86291m894223p504109
7269a3987314k530517M834437M623684k033008m760597n45021L135577K151682
7261i111077J314879L667181M301207o18779o206169n508986O79741N108861K982027
7252c391115l142961o540930l665046J543813K287840j712910l535803J26624
7244a8030488L202904K06611l867685j347902M834521N434027L68633q46112N072435
7235d973056R232518M021761n682031r547065m407882M386131R997195R003351
7227A2030922K766019l248142m141787j036234R41765J23750o52329n62102k452857
$$ plain form
7285 -21670469 -20268114 -18275890 -21695721 -23117085 -11796859 6945918 16050129 9545943
7277 9545943 -1350805 -5649834 -4302988 -2430327 -1202691 -1588982 -6483205 -13987314
7269 -13987314 -16517831 -11683394 -7059710 -9092718 -13853315 -14398336 -11262759 -9111077
7261 -9111077 -7796198 -4129017 172190 -446589 -6652758 -12161744 -11482003 -6373142 -3391115
7252 -3391115 -6534076 -13075006 -16740052 -15196239 -12908399 -14621309 -18157112 -18030488
7244 -18030488 -14827584 -14620973 -18488658 -19836560 -15002039 -9568012 -9199379 -10045491 -4973056
7235 -4973056 4259462 8281223 2599192 -6947873 -11355755 -6969624 3027571 12030922
7227 12030922 14796941 11548799 7407012 6370778 7312543 7436293 6783964 6221862 3769005
7218C769005o402285p632138l744044J149655K754915K405695L196441M606814
7210A04058M483056K598365p83791n725619q995870m834649O144547J3707097
7202F697194R605371j100718o608623l604752P93177P76998j645131k291196o98298
7193A924022J361917K764129K859984J811799J748614M110058N737824K046497
7185B4364844n172525q128538l327231L045644L166786k635187p770347q206270
7177d662824n222062j139631L164318O635637P706770O457625M688458L190294
7169B0818585R07008k653120n965452p152041n815630k831085M18863K266783
7161f089J524134j364382m587004o404537n788665k550427J713351L798868K266772
$$ plain form
7218 3769005 -2633280 -10265418 -14009462 -12859807 -10104892 -7699197 -4502756 104058
7210 104058 4587114 7185479 6401688 676069 -8319801 -13154450 -7009903 6697194
7202 6697194 16302565 15201847 8593224 4988472 5781649 6558647 4913516 2622320 1924022
7193 1924022 3285939 6050068 8910052 10721851 12470465 16580523 22318347 24364844
7185 24364844 19192319 11063781 7736550 10782194 13948980 11313793 3543446 -4662824
7177 -4662824 -9884886 -11024517 -7860199 -1224562 6482208 12939833 17628291 20818585
7169 20818585 21725593 19072473 13107021 5954980 139350 -2691735 -2272872 -6089
7161 -6089 1518045 153663 -4433341 -10837878 -16626543 -19176970 -17463619 -13664751 -11397979
7152a1397979m0109N12187L044530L838956K831009L591265O084036N201019q18557
7143A2846357o122256n632716k644772k624600m031000k178970J435280J816639
7135g136038Q3028J371086M241762K133147m018245n226470Q00173M998287J716926
7126a036344k206551N1772L356113L04847n056918m145556J063838J572627l087718
7117i183890m560463r2695L741273K648435J03693p12501j714305l969396m425635
7108a8165484j412803K741470O469256J0113681J1045473M927250n792986j1777157
7100a851300q377495j159998K854579L044529J514606j402268m175669l174643
7092a2727659J123534L137816J174131O10397L891699N128448N39923l513673
$$ plain form
7152 -11397979 -11438088 -10925901 -7881371 -4042415 -1211406 2379859 8463895 13664914 12846357
7143 12846357 6724101 1091385 -1553387 -4177987 -8208987 -10387957 -8952677 -7136038
7135 -7136038 -7053010 -5681924 -1440162 692985 -3325260 -8551730 -7751557 -2753270 -1036344
7126 -1036344 -3242895 -3191123 164990 469837 -4587081 -8732637 -7668799 -6096172 -9183890
7117 -9183890 -13744353 -13837048 -10095775 -7447340 -7343647 -8056148 -9770453 -13739849 -18165484
7108 -18165484 -19578287 -16836817 -10367561 -253880 10791593 15718843 9925857 -1851300
7100 -1851300 -10228795 -11388793 -8534214 -5489685 -3975079 -5377347 -9553016 -12727659
7092 -12727659 -11604125 -8466309 -7292178 -6681781 -2790082 2338366 2878289 -635384
7084f35384o73618M071286K311693l893030o038637l276778k000134l385044j965404
7075a5485050L244281N870433K322939k741071l304463J131447O601120Q085083
7067E724719K524365o644368r929995k924673N669741N059165j428329j584788
7059c534163N765278R047284L716098j87880M290009Q798237L964731m676759
7051B7182835n990896r04959R28348k645114n052956l804306l645728o755954
7043f88730q817270o243873n47753N415063R817667J0258623N429855j296277
7035A3327305m884804m870257l904997j997503J444723J930368n068336j3756090
7027a7779591j2548756q80474Q340493O768001J334434J232148L753850J784890
$$ plain form
7084 -635384 -1309002 2762284 5073977 1180947 -4857690 -8134468 -10134602 -13519646 -15485050
7075 -15485050 -12240769 -6370336 -4047397 -6788468 -10092931 -8961484 -2360364 5724719
7067 5724719 8249084 1604716 -8325279 -11249952 -5580211 -521046 -1949375 -3534163
7059 -3534163 2231115 11278399 14994497 14806617 19096626 27894863 31859594 27182835
7051 27182835 21191939 20286980 21215328 18570214 13517258 9712952 6067224 -688730
7043 -688730 -9506000 -15749873 -16297626 -10882563 -1064896 9193727 14623582 13327305
7035 13327305 8442501 3572244 -332753 -2330256 -885533 1044835 -4023501 -17779591
7027 -17779591 -30328347 -31208821 -22868328 -16100327 -14765893 -13533745 -9779895 -7995005
7019g995005k304428j332640K721940J384157n092231o947785q65972M158371
7011a6273593J004525m651699l688650K956385P183252N804975K725055J390787
7003c548963J414843J715171J643045m49247m920060p666184m294088K587515
6995a3517968N477025J993261k509385l486147k643071k596515k007328K09039
6987a9081089J263941L8203J307719Q190487J4577801J2756989N503528J560771
6979B6118350Q32839m965440j5806344j9515751r691628L041087N761520Q83176
6971a3342191p30869K339805L015293Q51458K865223Q901258R020816m99012r261755
6962C160026p092053J774232N988908K810851r88405m33874K634384M552605M057047
$$ plain form
7019 -7995005 -10299433 -11632073 -8910133 -7525976 -12618207 -19565992 -20431964 -16273593
7011 -16273593 -15269068 -19920767 -23609417 -20653032 -13469780 -7664805 -4939750 -3548963
7003 -3548963 -2134120 -418949 1224096 774849 -4145211 -11811395 -16105483 -13517968
6995 -13517968 -8040943 -6047682 -8557067 -12043214 -14686285 -17282800 -19290128 -19081089
6987 -19081089 -17817148 -17778945 -16471226 -8280739 6297062 19054051 24557579 26118350
6979 26118350 26951189 21985749 6179405 -13336346 -23027974 -19986887 -14225367 -13342191
6971 -13342191 -14073060 -11733255 -8717962 -7866504 -5001281 3899977 12920793 12421781 3160026
6962 3160026 -3932027 -2157795 3831113 6641964 5653559 5219685 7854069 12406674 16463721
6953A6463721J529625k076493n345456p402109q004761n944512k63224N742882
6945e300327O210833J069671k225540O96426M011886R76061m484768l289472M568645
6936B233415R914599P683428K076004j979910m591995o532106o393126m678747
6928b268438m583690o140994n244124q72789K536947K628893K991522O028759
6920d923914P870211M856477K8670j752716j002639j184986k803590m400751n760038
6911i073276n696724p83961Q525705J4472061J0717183J396468m532146m905991
6903A0119319l894329l119518j121434K94892k156818n483004l043896M214980
6895d189808P669637M130900N78196K321615M593789J429161l847578m154970
$$ plain form
6953 16463721 17993346 15916853 10571397 3169288 -4835473 -10779985 -11043209 -5300327
6945 -5300327 910506 1980177 -245363 451063 4462949 5439010 954242 -2335230 2233415
6936 2233415 12148014 19831442 21907446 19927536 15335541 8803435 2410309 -2268438
6928 -2268438 -6852128 -12993122 -18237246 -19110035 -16573088 -13944195 -10952673 -4923914
6920 -4923914 2946297 7802774 7831444 6078728 5076089 3891103 1087513 -3313238 -9073276
6911 -9073276 -14770000 -15553961 -7028256 7443805 18160988 19557456 15025310 10119319
6903 10119319 6224990 3105472 1984038 2278930 122112 -5360892 -8404788 -4189808
6895 -4189808 3479829 7610729 8188925 10510540 15104329 16533490 12685912 8530942
6887H530942k83698P06963l043908n504011k217544L011807L271174k549236q490797
6878f568308q501521l063145J967866K666355J121888Q74691R13710j799924n220408
6869a7608796l498264L423811P366072K571138n749793q212676l462245J727089
6861b3443664K811671K093017K594634K708655k89621m523575m905341K45934
6853b2708290O555939Q355401M588481j236189n708733p714876o396281p41735
6845b5006283O946109J0733636P689980K286766L35053J209049R69942K27046
6837E391298J746624K193855m280514j3590803j3456375j524672Q323479M542685
6829a0654423n777528p912517R281P818578R942122R767254R202816N375314j065129
$$ plain form
6887 8530942 8247244 8954207 5910299 406288 -1811256 1200551 4471725 1922489 -6568308
6878 -6568308 -15069829 -18132974 -16165108 -13498753 -12376865 -11502174 -10588464 -12388388 -17608796
6869 -17608796 -21107060 -17683249 -10317177 -7746039 -13495832 -21708508 -25170753 -23443664
6861 -23443664 -20631993 -18538976 -15944342 -13235687 -13525308 -18048883 -22954224 -22708290
6853 -22708290 -16152351 -7796950 -3208469 -4444658 -10153391 -17868267 -24264548 -25006283
6845 -25006283 -18060174 -7326538 363442 2650208 2985261 4194310 5164252 5391298
6837 5391298 7137922 9331777 5051263 -8539540 -21995915 -23520587 -15197108 -10654423
6829 -10654423 -16431951 -24344468 -24335187 -16516609 -6574487 3192767 12395583 17770897 16705768
6820A6705768m184097k060023M4600j336296k777280j040425J150080K17292k551815
6811D167804m005568l511824j427062K308741N150554K404881n572569j1065395
6803a1550438q169440o74215L453630K204153k53258n90558J174384M089408O563364
6794c752970N739900Q56228l960245m204787j099075O90397k4317p81185j009888
6785g545942k422914l957108j904292L518170O623425L630891k172295n031326
6777i261391l298431Q36644M861422O313343K790995m488829r228161o447357
6769a7921765N82826L850361N73739m483944o539182n660758k969575K520159
6761c0048139R854721J3545039J0183828M786672M661315Q438300P775081J78107
$$ plain form
6820 16705768 12521671 10461648 10506248 9169952 6392672 5352247 6502327 6719619 4167804
6811 4167804 162236 -3349588 -4776650 -2467909 2682645 5087526 -485043 -11550438
6803 -11550438 -19719878 -20394093 -16940463 -14736310 -14989568 -15580126 -14405742 -10316334 -3752970
6794 -3752970 1986930 2843158 -1117087 -5321874 -6420949 -5730552 -5754869 -6536054 -7545942
6785 -7545942 -9968856 -13925964 -15830256 -12312086 -5688661 -2057770 -4230065 -9261391
6777 -9261391 -12559822 -11723178 -6861756 -548413 2242582 -2246247 -11474408 -17921765
6769 -17921765 -17338939 -13488578 -12914839 -17398783 -23937965 -29598723 -32568298 -30048139
6761 -30048139 -20193418 -6648379 3535449 8322121 12983436 21421736 29196817 29374924
6753B9374924o909772p245692m449327m932129p329712n384517J298305O089285
6745E11365M663626j20516l510791m300091l364199p37759L160609N597184L552715
6736E452143k482114p896693p699874j556689M903289N503463Q25808k483530
6728e434197r38302J174691n06384k529875P90296O928815P678195J280110n385877
6719C057472p124393n524775k607767K514897P762866O934677p11078o545554
6711b243655l966827K181266L837665J777991J770803L140815L68726n815070
6703A051714q149161m151566K08547l4093k255344j656510J869519N040589N601086
6694b475219L213551r67143l854564k374988K543870O183166N262677R13303l798957
$$ plain form
6753 29374924 22465152 15219460 10770133 5838004 -1491708 -6876225 -5577920 511365
6745 511365 5174991 5054475 1543684 -2756407 -6120606 -6858365 -3697756 1899428 5452143
6736 5452143 2970029 -4926664 -12626538 -14183227 -9279938 -3776475 -2950667 -5434197
6728 -5434197 -6372499 -5197808 -5704192 -8234067 -7443771 -514956 7163239 8443349 3057472
6719 3057472 -4066921 -9591696 -12199463 -9684566 -1921700 5012977 4301899 -2243655
6711 -2243655 -6210482 -4029216 -191551 1586440 3357243 6498058 6866784 1051714
6703 1051714 -7097447 -11249013 -11040466 -11074559 -13329903 -14986413 -13116894 -8076305 -2475219
6694 -2475219 738332 -228811 -4083375 -6458363 -3914493 2268673 7531350 8444653 4645696
6685D645696o621248o127819k188335K612434M700606L567994J871608J257556
6677C718492Q05775j60536q76384j298035k283431k972305j403171J339375J319423
6668a810797k254489m726679k050085L551799O432479M084995j209653n591536
6660c573966o508054l632276J298568N746573P794418O200156Q24317n044026
6652C105710n342366J439207P344720L405164p325603j2207023n720252L808055
6644a1492388P009968N034293L382547J947412j311726k820870J305125O060890
6636I115251L134568n908766j0982731p548034q13606M087626P041934O925842
6628E052084M66898r132399j1340020j962711R105842J0292575L205779j796754
$$ plain form
6685 4645696 -1975552 -8103371 -10291706 -7679272 -2978666 589328 2460936 3718492
6677 3718492 4524267 4363731 3487347 2189312 -94119 -3066424 -4469595 -3130220 -1810797
6668 -1810797 -4065286 -8791965 -10842050 -7290251 -857772 3227223 2017570 -3573966
6660 -3573966 -10082020 -13714296 -12415728 -6669155 1125263 7325419 8149736 3105710
6652 3105710 -2236656 -797449 6547271 9952435 2626832 -9580191 -15300443 -11492388
6644 -11492388 -4482420 551873 3934420 5881832 4570106 1749236 3054361 9115251
6636 9115251 12249819 6341053 -4641678 -12189712 -13003318 -8915692 -1873758 5052084
6628 5052084 5518982 -3613417 -14953437 -16916148 -7810306 2482269 5688048 3891294
6620C891294p49382J001792r19693m339733n630681m405060j774827J632681M403415
6611f890194M392482J497564j846845l656862l908476k929671o51207K081123
6603a1912086L600447L491430K952755K755386K381305J388081J20022j107205
6595C670135k187870k595438j826162l28531J027414J779718J230521j436474
6587f66687m648356m266510Q38600M936664J913378n082415o264366J208695Q113489
6578c917508N181920m267601q767400l444959M891404P210992K565320k349374
6570b897206j557808L752912O731973K648144n106363q389116m179006J454194
6562g542276J125516m505041q165872n265119J684679P318091Q620157N618557
$$ plain form
6620 3891294 3141912 4143704 3224011 -1115722 -6746403 -11151463 -12926290 -11293609 -6890194
6611 -6890194 -2497712 -1000148 -2846993 -6503855 -10412331 -13342002 -13993209 -11912086
6603 -11912086 -8311639 -4820209 -1867454 887932 3269237 4657318 4777340 3670135
6595 3670135 1482265 -1113173 -2939335 -3267866 -2240452 -460734 769787 -666687
6587 -666687 -5315043 -9581553 -8742953 -3806289 -1892911 -6975326 -13239692 -12030997 -3917508
6578 -3917508 1264412 -3003189 -11770589 -15215548 -10324144 -3113152 -547832 -2897206
6570 -2897206 -4455014 -702102 6029871 8678015 3571652 -4817464 -8996470 -7542276
6562 -7542276 -6416760 -10921801 -19087673 -24352792 -22668113 -15350022 -6729865 -1111308
6554a111308Q1974n132626p287383n638423j770958J679632K263813o69464m115300
6545b1700043l262993K245366O078428K903496l654079n661811k140560O85257
6537b4506939M16547K010822P549993J0225632M484860l447854k898176O201048
6529C5933J3323430J1688237N153867k35887m415103r452393j2858638j0153916
6521f914470k307330L970133L863943k34654k142272O72564M557517M837858K028498
6512H331787O71372K139969K244175j689664m899217j273524O317583Q178040
6504B0020521J302989n551781l791109L200492N533205P20092m584516n743057
6496A1106836n774166p909583q972877m902976J240223K897334J14752l68523
$$ plain form
6554 -1111308 -1029334 -6161960 -13449343 -19087766 -20858724 -19179092 -16915279 -17584743 -21700043
6545 -21700043 -24963036 -22717670 -16639242 -13735746 -17389825 -23051636 -25192196 -24506939
6537 -24506939 -24090392 -22079570 -14529577 -4303945 180915 -3266939 -6165115 35933
6529 35933 13359363 25047600 30201467 29965580 25550477 16098084 3239446 -6914470
6521 -6914470 -9221800 -5251667 -1387724 -1622378 -3764650 -3092086 1465431 6303289 8331787
6512 8331787 9003159 11143128 13387303 11697639 6798422 5524898 11842481 20020521
6504 20020521 21323510 15771729 11980620 15181112 20714317 21434409 16849893 11106836
6496 11106836 5332670 -2576913 -11549790 -16452766 -15212543 -12315209 -12200457 -12568980
6488a2568980M038421P114544L440703k422717k203454L370936N311959M7152
6480F128564m909210k221510M270244N399354p5593m676402l525052J51956J837027
6471B379378J980627K407401J190215m081593j0064374r689216r98636R223780
6463g652418J2084507N467807m507534r871922p778169j733569K809388L290509
6455g891401Q96523j828540l002418j899301O29351K102547N93720k477850l477644
6446a6355013j250445J318330J792679J949115M397311P171968N736978L54901
6438E115824k987181r01500K117403L05511m463537n552232k051586n6650k315317
6429a0789265l238040J776831P655857O681482O27499j963479O44968J119262
$$ plain form
6488 -12568980 -8530559 -1416015 2024688 -398029 -2601483 769453 6081412 6128564
6480 6128564 1219354 -1002156 3268088 8667442 8591849 3915447 390395 542351 2379378
6471 2379378 4360005 6767406 7957621 3876028 -6188346 -15877562 -16876198 -7652418
6463 -7652418 4432089 9899896 5392362 -4479560 -12257729 -13991298 -11181910 -7891401
6455 -7891401 -6994878 -8823418 -11825836 -13725137 -13095786 -10993239 -10399519 -12877369 -16355013
6446 -16355013 -17605458 -16287128 -14494449 -12545334 -8148023 -976055 4760923 5115824
6438 5115824 2128643 1227143 3344546 3650057 -813480 -6365712 -8417298 -8473948 -10789265
6429 -10789265 -14027305 -12250474 -4594617 2086865 2714364 750885 1395853 2515115
6421B515115m309575r304951p289145q56439L634245M941000M759130K217422
6413c693198k429337l247561L827058J1910385J0694616J489119m704360l734460
6405A0112262k568283n483370o916529k558354K284107K015730J92206J740210
6397a182021K711713k635684r373892p292121L060512J0148516P933504L112346
6389F482873L179276N502613L242006l412741p659028n316196P72910M712685
6381G504398L082710k910510q627310r439300m513727K236481N273544K251213
6373e142501l234658m029565L217464J2544138J3695646M430505n891179q131234
6365G458616m520780k750293l136152k02316M655014K783632o898898j2723908
$$ plain form
6421 2515115 -1794460 -11099411 -18388556 -19244995 -15610750 -10669750 -5910620 -3693198
6413 -3693198 -6122535 -9370096 -5543038 6367347 17061963 18551082 13846722 10112262
6405 10112262 7543979 2060609 -4855920 -7414274 -5130167 -3114437 -2922231 -1182021
6397 -1182021 1529692 -1105992 -10479884 -17772005 -14711493 -4562977 3370527 6482873
6389 6482873 9662149 15164762 18406768 14994027 7334999 2018803 2791713 7504398
6381 7504398 10587108 7676598 -950712 -10390012 -14903739 -12667258 -7393714 -5142501
6373 -5142501 -8377159 -12406724 -9189260 3354878 17050524 21481029 15589850 7458616
6365 7458616 2937836 187543 -2948609 -3150925 1504089 4287721 -2611177 -15335085
6357a5335085n892702O498999J1708076Q722890O277213P192098N241740k437761
6349B1975468r697684j1009947q940370p914132o833893k959246J671673L381377
6341b0326754L178015M243363N315619K578062k845075n464249l960784l292060
6333b0573863o532442r880973q602616l502375J895364O630542J0589643J0967659
6325a9009061N869129m05961j276306L332361P047830N827321J808631j766268
6317A427676m106888m334769r72166L906386N256948K536149J381166M397877
6309I492379N830520N26372o749082p758882l223343j210901m648084q132169
6301a5873190p335145m323175j983230M66796L935510O522386O618760M922298
$$ plain form
6357 -15335085 -21227787 -14728788 -3020712 5702178 11979391 19171489 24413229 21975468
6349 21975468 12277784 1267837 -7672533 -15586665 -22420558 -25379804 -23708131 -20326754
6341 -20326754 -17148739 -12905376 -7589757 -5011695 -7856770 -13321019 -17281803 -20573863
6333 -20573863 -27106305 -36987278 -45589894 -49092269 -47196905 -40566363 -29976720 -19009061
6325 -19009061 -13139932 -13545893 -14822199 -11489838 -4442008 1385313 3193944 1427676
6317 1427676 -2679212 -7013981 -7986147 -4079761 1177187 3713336 5094502 9492379
6309 9492379 15322899 15849271 9100189 1341307 -1882036 -3092937 -7741021 -15873190
6301 -15873190 -23208335 -27531510 -29514740 -29047944 -25112434 -18590048 -11971288 -7048990
6293g048990J887451k324190m294745K61770Q224403R786032J682362o454256
6285A719837m854472K455697L914390k833055q825691p215016n62085N886334
6277a0314061J0393442J1870998P823452o99376p083369o575492k332913j37792
6269B944889l48240L50439J905285J320065p85715P0886M720773P438272L146557
6260B0763211n701583j2179408j2505536p953348j326688M896904P969964O432926
6252C96442K769916J251612K206380J560257k503583n837553m105698L90977J582421
6243b288829j939426n507518n320028k729220n84729R83355K992853M580667M258073
6234e554802K692271J804150J852139J373696l66822k372841l107516j695166
$$ plain form
6293 -7048990 -5161539 -7485729 -11780474 -11518704 -3294301 6491731 8174093 1719837
6285 1719837 -3134635 -678938 3235452 402397 -8423294 -15638310 -16200395 -10314061
6277 -10314061 79381 11950379 19773831 19074455 11991086 5415594 3082681 2944889
6269 2944889 2596649 2947088 4852373 6172438 5386723 5457609 10178382 17616654 20763211
6260 20763211 15061628 2882220 -9623316 -17576664 -18903352 -14006448 -6036484 396442
6252 396442 3166358 4417970 6624350 8184607 5681024 -156529 -4262227 -3871250 -2288829
6243 -2288829 -4228255 -9735773 -15055801 -17785021 -18369750 -17386395 -14393542 -9812875 -5554802
6234 -5554802 -2862531 -1058381 793758 2167454 1800632 -572209 -3679725 -5374891
6226e374891J590042N131035O752728N505270K426211n67235j897935r78949O66841
6217A3253117n03938n920993j0727796p746575K788582J1618800J1373106M971523
6209A9105826o94666m826036j0081906j3376820q298381L236049J0563532Q180083
6201C807681K519446J064036J897737k43494l687642l228217k8497K5165l628433
6192a502218n416899k778456P74352K426230L438532M422660L413572O81900l31631
6183E128042P08043l83154m503770o133203k118430K339640J864466m65690N75920
6174b988136K354160p13956n520944l694148L970412O973020J117986m671132
6166c172738j949129N109712P245847L423166l72140j281812j395086j926142
$$ plain form
6226 -5374891 -3784849 1346186 8098914 13604184 16030395 15463160 13565225 12586276 13253117
6217 13253117 12749179 6828186 -3899610 -11646185 -8857603 2761197 14134303 19105826
6209 19105826 18411160 13585124 3503218 -9873602 -18171983 -14935934 -4372402 3807681
6201 3807681 6327127 7391163 9288900 9045406 5357764 2129547 2101050 2126215 -1502218
6192 -1502218 -6919117 -9697573 -8923221 -6496991 -3058459 1364201 4777773 5459673 5128042
6183 5128042 5836085 5452931 949161 -5184042 -7302472 -4962832 -3098366 -3564056 -2988136
6174 -2988136 -633976 -1347932 -6868876 -10563024 -6592612 380408 1498394 -3172738
6166 -3172738 -5121867 -12155 7233692 10656858 10284718 9002906 7607820 5681678
6158E681678k120162k709014m768833n868059k525346L770843P601270O574395
6150E636772L156774p8966k674797l775102j936685J615493L231889J414743j637003
6141D953118l431756l369207j640557R09125J949808m2269k938380l729281l222925
6132a0562324l787100l728723J67879N059308M478636n13460j015193N555427
6124d345550R719522M409065k905118j641973M301357K077083r217368j5792324
6116a3395306r473998O79557K807724q25441J04190O656620R504656L838970l974468
6107d077496o686782n561829n297628n227246j603837M301442O928338M823056
6099a2401982K395751K311323J791327j011197k293663J320039N885631M858926
$$ plain form
6158 5681678 3561516 852502 -3916331 -9784390 -12309736 -8538893 -937623 5636772
6150 5636772 8793546 8714580 6039783 2264681 327996 1943489 5175378 6590121 4953118
6141 4953118 1521362 -1847845 -3488402 -2579277 -629469 -671738 -3610118 -7339399 -10562324
6132 -10562324 -14349424 -18078147 -17910268 -12850960 -8372324 -8885784 -9900977 -4345550
6124 -4345550 5373972 9783037 6877919 5235946 9537303 11614386 2397018 -13395306
6116 -13395306 -22869304 -22189747 -19382023 -20207464 -20103274 -13446654 -3941998 -103028 -4077496
6107 -4077496 -10764278 -16326107 -21623735 -26850981 -28454818 -24153376 -17225038 -12401982
6099 -12401982 -10006231 -7694908 -5903581 -6914778 -9208441 -7888402 -2002771 2856155
6091B856155j341614n970073n202491j505015J849622M211142N044514L287166
6083C229406M60793k52191P53934j54889l247687m474910k566927j104026j328084
6074h684581L38915M157028L971484k054527m863617K985958J3670900J3191151
6066B2712711J462228p381454m856028J912008K669152k319959n672791l654849
6058D871018J360335N160626M487834j309660q268540j0200676n667595r354J527212
6049h048800l22942j791801j503445l06947J291862K549810J703241j438275m045014
6040a1912311l702864j301403J304249L763507N310195L932910O02360N24279
6032a479078N488831Q233363R15328j2142390j7462412r329642K965492P781792
$$ plain form
6091 2856155 1514541 -4455532 -9658023 -11163038 -9313416 -5102274 -57760 3229406
6083 3229406 3690199 3438008 4191942 4037053 789366 -3685544 -6252471 -7356497 -8684581
6074 -8684581 -8345666 -4188638 -217154 -2271681 -7135298 -4149340 9521560 22712711
6066 22712711 24174939 16793485 11937457 13849465 16518617 14198658 8525867 4871018
6058 4871018 6231353 11391979 15879813 14570153 6301613 -3899063 -9566658 -9576012 -8048800
6049 -8048800 -8371742 -10163543 -11666988 -11973935 -10682073 -8132263 -6429022 -7867297 -11912311
6040 -11912311 -15615175 -16916578 -15612329 -11848822 -6538627 -2605717 -2003357 -1479078
6032 -1479078 4009753 12243116 13158444 1016054 -16446358 -25776000 -22810508 -15028716
6024a5028716N146500L149759M674441M839537Q16612k887923j482339K780315
6016B008186M400532K820390K090129L550683L979698J777015O7441J023272J231566
6007B2948912k975756q244491p747722j424807L032167Q80923l156487k369508
5999I43231J953101K939098j221152m429730j345673N233246P997361L842555
5991A5912037l457011q098383p494142l182891J184225K367138j10857l290202
5983f170086l746556j798199r92228k478041k469702K122373P700999P764084
5975f7356J979902l243284l929577l251492m897455o718862n082918j715024q92119
5966b7818185k066090r44866K929565N245141L852219J507626O40185J26705r86287
$$ plain form
6024 -15028716 -9882216 -6732457 -2058016 2781521 3598133 710210 -772129 2008186
6016 2008186 6408718 9229108 11319237 14869920 18849618 20626633 20694074 21717346 22948912
6007 22948912 19973156 11728665 3980943 2556136 5588303 6469226 3312739 943231
5999 943231 2896332 5835430 4614278 184548 -1161125 4072121 12069482 15912037
5991 15912037 12455026 4356643 -3137499 -6320390 -5136165 -2769027 -2879884 -6170086
5983 -6170086 -9916642 -11714841 -12707069 -15185110 -17654812 -15532439 -7831440 -67356
5975 -67356 1912546 -1330738 -5260315 -8511807 -13409262 -20128124 -25211042 -26926066 -27818185
5966 -27818185 -29884275 -30829141 -27899576 -22654435 -18802216 -17294590 -16654405 -16527700 -17513987
5957a7513987r23342J208953K965877K586714K332618M491582O511938M004800
5949E665153k518200p499298o866892j954349L285079O387777O797836M340183
5941G637289n89808n606302p011146l307927K343594M789819K561265o04663r62390
5932g50269L21127l76012l147871m319415k100986Q72931J658357P19432j71216
5923g293922j265667l566921n685585m831510q80619K836971L602872K634814
5915a4449567L030575N172684O061601L667924Q2494j301809l73795L99402L96330
5906B685839J227255K717035K448098L21989o00428L38995n28912m652552p318430
5897c361111m376421J177221M199560N063153O476063O342533J214433n448451
$$ plain form
5957 -17513987 -18437329 -17228376 -14262499 -11675785 -9343167 -4851585 1660353 5665153
5949 5665153 3146953 -4352345 -11219237 -13173586 -9888507 -3500730 3297106 7637289
5941 7637289 7047481 1441179 -5569967 -8877894 -6534300 -1744481 816784 212121 -750269
5932 -750269 -429142 -805154 -3953025 -8272440 -10373426 -9500495 -7842138 -7122706 -7293922
5923 -7293922 -8559589 -12126510 -17812095 -22643605 -23524224 -20687253 -17084381 -14449567
5915 -14449567 -11418992 -6246308 -184707 3483217 3565711 2263902 1890107 2289509 2685839
5906 2685839 3913094 6630129 9078227 9400216 8799788 9138783 8609871 3957319 -3361111
5897 -3361111 -7737532 -6560311 -2360751 2702402 9178465 15520998 16735431 11286980
5889A1286980o575917k221920Q79992K25393k14944R57369K74849j931637J96265
5880B876430P190022J0054464K583281q529833j1920520n425712L335139O493565
5872F656836J934003o449274j0937777o436299K212408M091803l574726j0814523
5864b3317549q364099N96944P256399R250635R233228P046915J505764l651652
5856d43415l571217J36708K325586K323903K462130J589329k358793n647578k891474
5847f074821L169062M314266p18950m433538k224919J670217J971135m46920k070306
5838d844774k359280k703146l214557l047281j762732O93556L536356M888184
5830h813674M147440L413980L747611K036054m189314j0570031r966560k290330
$$ plain form
5889 11286980 4711063 2489143 3369135 3594528 3379584 4336953 4611802 2680165 2876430
5880 2876430 10066452 20120916 22704197 14174364 2253844 -3171868 163271 6656836
5872 6656836 8590839 2141565 -8796212 -15232511 -13020103 -8928300 -12503026 -23317549
5864 -23317549 -31681648 -31084704 -23828305 -14577670 -5344442 1702473 3208237 -443415
5856 -443415 -4014632 -3877924 -1552338 771565 3233695 4823024 2464231 -3183347 -6074821
5847 -6074821 -2905759 1408507 689557 -3743981 -5968900 -4298683 -2327548 -2774468 -4844774
5838 -4844774 -7204054 -9907200 -13121757 -16169038 -17931770 -17238214 -13701858 -8813674
5830 -8813674 -4666234 -1252254 2495357 4531411 342097 -10227934 -20194494 -22484824
5822b2484824M883453N862777K390940q15069j682985r86414m62266j604256l891930
5813a8790574m450645j733647J800306L337881L797080M826377M574143J122101
5805e516978k506243k251749K96372R37691L14642J728678L505891J179252l602235
5796e914679m234208O03931N295292O305958N518723L957126j01991n288239o816348
5787f74435m077349j924251k552364k644774l89060J336557Q69798M99084J320887
5778h235907J533826J412441L441833O101056M661957j83690k145448K22041J050930
5769G859039k198163m134954j211382K070793J248397j114529j058976P44440
5761B204665K411418L622616K128047m620053j1545983r209415J157811O535477
$$ plain form
5822 -22484824 -17601371 -11738594 -9347654 -10162723 -11845708 -12832122 -13294388 -14898644 -18790574
5813 -18790574 -23241219 -24974866 -23174560 -19836679 -16039599 -11213222 -6639079 -5516978
5805 -5516978 -8023221 -10274970 -9978598 -9040907 -8726265 -6997587 -3491696 -2312444 -5914679
5796 -5914679 -10148887 -9544956 -4249664 2056294 7575017 11532143 11430152 6141913 -674435
5787 -674435 -4751784 -6676035 -9228399 -11873173 -12262233 -10925676 -10055878 -9556794 -8235907
5778 -8235907 -6702081 -5289640 -1847807 4253249 8915206 8731516 6586068 6808109 7859039
5769 7859039 5660876 1525922 314540 2385333 3633730 2519201 1460225 2204665
5761 2204665 4616083 8238699 10366746 5746693 -5799290 -15008705 -13850894 -7315417
5753g315417J326303l880593o5292N713066L653280k011315k105356P20086j619768
5744e585006o253975m140430L097323N640588K262497O29260K025140l64982p264303
5735i953888j0331724n685488O24783L233013L827675M482153L601921J126866
5727i074689o2825Q1171j228982l083035k087711k57586k645582o517607l253599
5718b8130445O798539J2172998P104848K91244J050601N836904N901256J117646
5710A2143591k190225k432104l513274o654709q330478n992109j294889K315022
5702a5949175K653912K32680j770604m25016L085223M612701K680706J39968m43143
5693e182748L02319J111084J879382J759278o86609l900465l775321K93831L363841
$$ plain form
5753 -7315417 -5989114 -9869707 -9934999 -4221933 -568653 -2579968 -4685324 -3965238 -5585006
5744 -5585006 -11838981 -15979411 -12882088 -7241500 -4979003 -4349743 -2324603 -2689585 -9953888
5735 -9953888 -20285612 -25971100 -25346317 -22113304 -18285629 -13803476 -10201555 -9074689
5727 -9074689 -9137514 -9056343 -10285325 -13368360 -15456071 -15713657 -18359239 -24876846 -28130445
5718 -28130445 -21331906 -9158908 -2054060 -1762816 -712215 5124689 11025945 12143591
5710 12143591 9953366 7521262 4007988 -2646721 -10977199 -16969308 -18264197 -15949175
5702 -15949175 -13295263 -13062583 -14833187 -15258203 -12172980 -7560279 -4879573 -4739605 -5182748
5693 -5182748 -4880429 -3769345 -1889963 -130685 -817294 -4717759 -8493080 -8199249 -4835408
5684d835408J399328l077754m331114m84043M845085O923059M714984J652968
5676F807105J280322K044124r00274p205506r096919j910056P352104Q461021
5668F831921J849345l598606m324977m578042o004899m981623j626054j312435
5660a7745370m182589k896843M723066J0057264O616724L93171J43355M146278
5652A255056M686862P46181k095853j534401q30795k467096n204627o650477m875824
5643a6970974P44248O996414P856230J620669n881657q591929p189292n176321
5635b6592612k548227J534919L988098K117270l27261J780605N825091M563252
5627i658865k267724o570899l257718L044451N087016K419062N85435L161772
$$ plain form
5684 -4835408 -3436080 -6513834 -10844948 -11328991 -6483906 439153 5154137 6807105
5676 6807105 8087427 10131551 9231277 2025771 -7071148 -8981204 -1629100 6831921
5668 6831921 8681266 5082660 757683 -3820359 -9825258 -14806881 -16432935 -17745370
5660 -17745370 -21927959 -24824802 -20101736 -10044472 -3427748 -3034577 -2891222 1255056
5652 1255056 5941918 6688099 4592246 3057845 2227050 -240046 -5444673 -12095150 -16970974
5643 -16970974 -16226726 -9230312 -1374082 246587 -5635070 -14226999 -21416291 -26592612
5635 -26592612 -29140839 -27605920 -23617822 -21500552 -21827813 -20047208 -14222117 -9658865
5627 -9658865 -11926589 -18497488 -21755206 -18710755 -13623739 -11204677 -10619242 -7457470
5619g457470P457815Q147223L893927q85292j699128l2278q52323m647909o437045
5610b512480l804119q21184j018661j247859K746964Q008602P247325j004199
5602G594389r685382j0928989l942516M636521O926072J435083m837637m061955
5594a2864414K635390O950214N280869K755071L198330K448144l033669p439778
5586f9843l356522N867499R971323O086256J067555l2272j4806k693717o501652
5577A0323821p638117n424156k162293k29660o77273k880838m925685n352240
5569a8966441m009513o71448M864043R984000J0000792M378010j080310j485318
5561C013815J004320J749194M70542p49032k259910m394422m051056K72353L606294
$$ plain form
5619 -7457470 345 8147568 12041495 11156203 9457075 9424797 8572474 3924565 -2512480
5610 -2512480 -6316599 -7137783 -8156444 -9404303 -6657339 1351263 8598588 7594389
5602 7594389 -2090993 -13019982 -16962498 -12325977 -5399905 -3964822 -8802459 -12864414
5594 -12864414 -10229024 -3278810 2002059 4757130 7955460 10403604 7369935 -69843
5586 -69843 -3426365 2441134 12412457 18498713 19566268 19533996 19519190 16825473 10323821
5577 10323821 2685704 -2738452 -4900745 -5130405 -5807678 -8688516 -13614201 -18966441
5569 -18966441 -22975954 -23647402 -18783359 -8799359 1201433 5579443 4499133 3013815
5561 3013815 4018135 5767329 6237871 5488839 3228929 -1165493 -5216549 -4944196 -1337902
5552a337902J364991k316968p48805L792402L576949j431776l807929j738596
5544b647634j457167m873192n039134J905291R017980Q435178K389132j573404
5536F157050j509879j273892k880918m137138k744130R46672M865208O971394
5528F394367O669647N179652L637585J451605j710990l834584l463664k977831
5520A1345787m946489o926564m828425N6763L031635L416570L332338P31779p572757
5511b359363j6043015j3852859q61289R619096Q451903K033809L51410K442950
5503a0217358J706671j262211p42552L105914M542905K064649N0263P83108J402816
5494A434205m08076k790598l080930j472626j44286m31289j308968m33620K390977
$$ plain form
5552 -1337902 27089 -2289879 -3038684 753718 4330667 2898891 -909038 -2647634
5544 -2647634 -4104801 -8977993 -14017127 -12111836 -3093856 5341322 7730454 6157050
5536 6157050 4647171 3373279 492361 -3644777 -6388907 -5442235 -577027 6394367
5528 6394367 13064014 18243666 21881251 23332856 21621866 17787282 14323618 11345787
5520 11345787 6399298 -527266 -5355691 -5298928 -2267293 1149277 4481615 5213394 -2359363
5511 -2359363 -18402378 -32255237 -33116526 -23497430 -15045527 -13011718 -12660308 -10217358
5503 -10217358 -8510687 -9772898 -10515450 -7409536 -2866631 -801982 -751719 31389 1434205
5494 1434205 1026129 -1764469 -4845399 -6318025 -6462311 -6893600 -8202568 -8636188 -6245211
5485f245211L495312m5867m796314m718770o54736K07383m275052p594631n227355
5476b9855241r35658J924805O621785J3711369J4279521K692031j0553734j0817171
5468a2932293j41973O583048M127096J755998M809648N698187j750407j0828442
5460b679138j2165522o792850j583829J576299M557728O227009M580262K128494
5452d151547K281290L065255Q17701k303697j204010L297614N297715L007167
5444A0107488M18392p32878l805049r749238j2937674q692234p85740L368508
5436b2808425K485908J425145K660175L146564O60731j537830N44944N148944
5428h273844O889061M226549Q89701l23983j132931l414450m898321k716564J003407
$$ plain form
5485 -6245211 -2749899 -2795766 -7592080 -12310850 -12965586 -12758203 -17033255 -24627886 -29855241
5476 -29855241 -30790899 -28866094 -22244309 -8532940 5746581 8438612 -2115122 -12932293
5468 -12932293 -13074266 -6491218 -2364122 -608124 4201524 9899711 8149304 -2679138
5460 -2679138 -14844660 -21637510 -23221339 -21645040 -17087312 -10860303 -6280041 -4151547
5452 -4151547 -1870257 1194998 2012699 -290998 -1495008 1802606 7100321 10107488
5444 10107488 10525880 9793002 5987953 -3761285 -16698959 -25391193 -26176933 -22808425
5436 -22808425 -20322517 -18897372 -16237197 -13090633 -12429902 -13967732 -13422788 -8273844
5428 -8273844 -1384783 2841766 3731467 3407484 2274553 -1139897 -6038218 -8754782 -7751375
5419g751375J651015l45364L79485N083197P071030Q82080q223572r830613k513747
5410a3597864L906720J957236l505512l160203L247054P497086N258112R04834
5402B507463p82204r85710j853791j029510L593552P672257N414126r76961l313768
5393A0245454J091870N898459M943457l14350m707507o040161m922287j867556
5385D327379J764417K698443n93272m870980o036203m548582l731100m179003
5377a5168901l790943k767465m185588q505877j1148435p892929n43881N361810
5369d8642209P409842Q127713R933535J1183516R058712M450224R82082l13987
5361B189428j925151m765065n869035l296107J97400J747117L377328P553962
$$ plain form
5419 -7751375 -6100360 -6445724 -6066239 -983042 6087988 6970068 -1253504 -11084117 -13597864
5410 -13597864 -9691144 -7733908 -11239420 -14399623 -11152569 -3655483 1602629 2507463
5402 2507463 1725259 739549 -1114242 -2143752 1449800 9122057 14536183 13559222 10245454
5393 10245454 11337324 17235783 22179240 21864890 17157383 11117222 6194935 4327379
5385 4327379 6091796 8790239 8196967 3325987 -2710216 -7258798 -10989898 -15168901
5377 -15168901 -18959844 -21727309 -25912897 -34418774 -45567209 -53460138 -54004019 -48642209
5369 -48642209 -41232367 -33104654 -23171119 -11987603 -2928891 1521333 2503415 2189428
5361 2189428 264277 -4500788 -10369823 -13665930 -13468530 -11721413 -8344085 -790123
5353g90123J0273103N282402n074883j0320895n223378L286378N727996J493328
5345D653928l220235m504744l017151k83161K206658J905833k180298o586673
5337a1025843o944821l886660j835215k229887j680947K333012O956894P104983
5329a1208484K050505k891109k084989L478846O851451L848472j416644k848420
5321d220372j696059l843431q715757q601120j058353N859512N432542K372902
5313a4470136M393279R179805Q262924Q64497n065736n099230l380115m186975
5305i501687n526339l785354M76320M261224N964981N202964J936166k098136
5297c069861l542092j006022K958957M608471K637741j137468l434556k093844
$$ plain form
5353 -790123 9482980 14765382 9690499 -630396 -5853774 -2567396 3160600 4653928
5345 4653928 1433693 -3071051 -6088202 -6371363 -4164705 -2258872 -4439170 -11025843
5337 -11025843 -17970664 -21857324 -23692539 -25922426 -27603373 -25270361 -18313467 -11208484
5329 -11208484 -9157979 -12049088 -14134077 -10655231 -3803780 44692 -1371952 -4220372
5321 -4220372 -5916431 -9759862 -18475619 -27076739 -28135092 -22275580 -16843038 -14470136
5313 -14470136 -10076857 -897052 7365872 8230369 3164633 -1934597 -5314712 -9501687
5305 -9501687 -15028026 -18813380 -18337060 -14075836 -8110855 -2907891 -971725 -3069861
5297 -3069861 -6611953 -7617975 -4659018 -50547 2587194 1449726 -1984830 -4078674
5289d078674J512095L189272N40715m011988o332490n260455k427552O44755K887602
5280a3336720L189002K251966K741404M809974M484906J31766l106779n17677
5272F47842L884030K903750k419810m672338k137931n49814k416817l314729r12321
5263h988138O09193j228840j919574K304068P308764O811547J068588m648744
5255A316864o686017m477260P32559M978100L369899l273748p384283m180133
5247a5604019J681232L261406J009387Q4785J718639L246121L994360M885549
5239D277460M218019K83295l305824j789494J951786K95625o749735r921763m153472
5230a4894103L670234N113271K284469K927184P257064P603387O44633p335522
$$ plain form
5289 -4078674 -2566579 622693 1163408 -2848580 -9181070 -14441525 -16869077 -16224322 -13336720
5280 -13336720 -10147718 -7895752 -5154348 -344374 4140532 4272298 1165519 647842
5272 647842 4531872 7435622 5015812 343474 -1794457 -2344271 -4761088 -8075817 -8988138
5263 -8988138 -8378945 -9607785 -11527359 -9223291 -1914527 4897020 5965608 1316864
5255 1316864 -5369153 -9846413 -9113854 -4135754 -765855 -4039603 -11423886 -15604019
5247 -15604019 -13922787 -10661381 -9651994 -9567209 -7848570 -4602449 -608089 4277460
5239 4277460 8495479 8778774 5472950 3683456 5635242 5930867 -818868 -10740631 -14894103
5230 -14894103 -11223869 -6110598 -3826129 -898945 6358119 13961506 14606139 7270617
5222G270617r551141p354704o046334o113288l726712J716226N782259N274884
5214a2748193K175897j60927j390484k687443l683644l585531l396742m186050
5206b9663117m421207j800472K995978O770901P399039N004719P53411l135961
5198a6096709l476847O83558N540795O132541K164643k222816l789106k670948
5190a3734889n36528P15708n94059l574560m054870K26237N245659N733557K774434
5181g799311J025013K11156l339338p359697m851915L413698O816743K9245p740254
5172a9594660n381000M247396Q941296M021628l354794n396285k157565J632746
5164a7041238K959863K412701K582506N000964P243835M663502k985162r215201
$$ plain form
5222 7270617 -2280524 -9635228 -15681562 -21794850 -25521562 -23805336 -18023077 -12748193
5214 -12748193 -10572296 -10733223 -12123707 -14811150 -18494794 -22080325 -25477067 -29663117
5206 -29663117 -34084324 -35884796 -32888818 -26117917 -18718878 -13714159 -12960748 -16096709
5198 -16096709 -19573556 -18889998 -13349203 -7216662 -5052019 -7274835 -11063941 -13734889
5190 -13734889 -14271417 -13555709 -14149768 -17724328 -21779198 -21552961 -16307302 -10573745 -7799311
5181 -7799311 -6774298 -6563142 -9902480 -17262177 -22114092 -18700394 -11883651 -11854406 -19594660
5172 -19594660 -24975660 -20728264 -11786968 -7765340 -11120134 -16516419 -18673984 -17041238
5164 -17041238 -14081375 -11668674 -9086168 -4085204 3158631 7822133 4836971 -4378230
5156d378230q308446k810886L25554q34330k064911k04981K962993M161223K411986
5147h740028j031365m078634n092938m439585l828608k777726J734693R463548
5139a8790643J3856851R395616N9591m846317k718798j17950k600384p284262
5131a3046296p773378k780288K990980M757622K402653j6701J188627M826573
5123g450208N636613J054124m226740l401453L308470Q268968N812762j358999
5115G643537o623988p305405n621796l731113j139075K753835N998329N725146
5107b300530J887331k187914l479342k273442n24549J312212L638409M869518
5099I41693K524927k395107n308047l629350K37049K838934L696006L553978J751545
$$ plain form
5156 -4378230 -12686676 -15497562 -15172008 -16006338 -18071249 -18276230 -15313237 -11152014 -8740028
5147 -8740028 -9771393 -13850027 -18942965 -23382550 -27211158 -29988884 -28254191 -18790643
5139 -18790643 -4933792 4461824 4521415 -324902 -3043700 -3161650 -5762034 -13046296
5131 -13046296 -20819674 -23599962 -20608982 -15851360 -13448707 -13465408 -12276781 -7450208
5123 -7450208 -1813595 -759471 -4986211 -8387664 -5079194 3189774 9002536 7643537
5115 7643537 1019549 -6285856 -11907652 -15638765 -16777840 -14024005 -8025676 -2300530
5107 -2300530 -413199 -2601113 -6080455 -8353897 -8878446 -7566234 -3927825 941693
5099 941693 3466620 1071513 -4236534 -7865884 -7628835 -4789901 -1093895 2460083 4211628
5090D211628j738174l965749k102152K302966N018993M320905K139427P27883
5082A0915727K45745p03170l361735p048045q800728o494203k430302r94447k283257
5073b0954415j925660J574443M066344K729601Q08117J742171L462183L170419
5065e326797K987768M907691M571281k329465j0457769j0245849j843081M862709
5057a2873512M503189K124018L066993N035299L837180M06829k352202m539651
5049g91857o416860m874744J955370R223552R778793L189055l872207o107724
5041B083378m856064m230709n121269n133543l109313j029250o83588n52540J654631
5032b0978267M409870L853132K81217r79665K707971O610171N112275k82565l605599
$$ plain form
5090 4211628 2473454 -1492295 -3594447 -1291481 3727512 8048417 10187844 10915727
5082 10915727 11161472 10458302 7096567 48522 -8752206 -15246409 -17676711 -18671158 -20954415
5073 -20954415 -22880075 -21305632 -17239288 -14509687 -13701570 -11959399 -8497216 -5326797
5065 -5326797 -2339029 2568662 7139943 4810478 -5647291 -15893140 -17736221 -12873512
5057 -12873512 -8370323 -6246305 -3179312 1855987 5693167 6099996 3747794 -791857
5049 -791857 -7208717 -12083461 -10128091 -904539 8874254 12063309 8191102 2083378
5041 2083378 -2772686 -7003395 -12124664 -17258207 -20367520 -21396770 -22080358 -22632898 -20978267
5032 -20978267 -16568397 -12715265 -12434048 -13413713 -10705742 -4095571 1016704 734139 -2871460
5023b871460k496108R76650N211896R228982R461689K912433o284960r646111
5015F493011n083578N73899J638479O68517K343719M941469K854456m332851r878772
5006B18349p696310R5806M802684M33780r246149j4327626r689724o3580O920720
4997b8552050R269923R129268O437293o1807o901989p686474j985108L013966
4989a7336978J918859k183967l032732N10033M656755O613382O667388N325205
4981C137945J846364l244400o179401l117272M080838P732736K850463n633685
4973A473588q389183m032572l08680j826421l525823k9601N282268O469985M650662
4964b35777M153036L555151j107944p191603q254547m482525j823607j478359
$$ plain form
5023 -2871460 -5367568 -4390918 820978 10049960 19511649 22424082 16139122 6493011
5015 6493011 1409433 1983332 3621811 4290328 6634047 11575516 14429972 10097121 218349
5006 218349 -7477961 -7382155 -2579471 -2145691 -11391840 -25719466 -35409190 -35472770 -28552050
4997 -28552050 -19282127 -10152859 -3715566 -3777373 -10679362 -18365836 -20350944 -17336978
4989 -17336978 -15418119 -17602086 -20634818 -20124785 -15468030 -8854648 -2187260 3137945
4981 3137945 4984309 1739909 -4439492 -7556764 -3475926 4256810 7107273 1473588
4973 1473588 -6915595 -10948167 -11256847 -13083268 -16609091 -16638692 -11356424 -4886439 -235777
4964 -235777 3917259 7472410 6364466 -827137 -9081684 -13564209 -15387816 -16866175
4956a6866175J205879P021376J0253647P212757O64806n352845q950007q234575
4948a3045137k466319L910855M970719J805165R15516L777282N115712K351665
4940G335458p37230j404709j830618l488377m063152k203063J88246J775610K560284
4931a867551O08391n630680j1535639r939789j357709O202205Q122957O890567
4923h507248M919781J612941j741369k004784j29034K4328j229166p32787L80967
4914g406371q16625j593062J689738M159578n49276o693713l724637M869814N821087
4905d243467j739715n794085l484697m476698r968015q762290R11160O092570
4897c1465237J880025r44345J970461M61957p648028q827644P00561N042154l276055
$$ plain form
4956 -16866175 -15660296 -8638920 1614727 8827484 9492290 4139445 -4810562 -13045137
4948 -13045137 -15511456 -11600601 -6629882 -4824717 -3909201 -131919 4983793 7335458
4940 7335458 6598228 5193519 3362901 -125476 -4188628 -6391691 -6203445 -4427835 -1867551
4931 -1867551 -1259160 -6889840 -18425479 -28365268 -29722977 -23520772 -15397815 -8507248
4923 -8507248 -3587467 -1974526 -3715895 -5720679 -5849713 -5825385 -7054551 -7787338 -7406371
4914 -7406371 -8222996 -9816058 -8126320 -3966742 -4516018 -11209731 -14934368 -10064554 -4243467
4905 -4243467 -5983182 -11777267 -15261964 -19738662 -29706677 -38468967 -37557807 -31465237
4897 -31465237 -29585212 -30529557 -28559096 -28097139 -35745167 -44572811 -43872250 -38830096 -42106151
4888d2106151q977932j953929M907541J551693j151584L459020K215629q759633
4880e0815346j0093764K503980J204023k3281489l5061674j8156684k2131674
4873a55832628p9568826j17037625l7154699J21919490K05185752J37492129J4886634
4866H9890227l6695180j4811877L031767r116177j3984195L254786J3607694K594219
4858C7771264q512139m372815M022342N970101N158632L282951l610797j0605625
4850B9103914q614508k631976m068465q497466l179115P563312Q187404k1220
4842A7841880j173055O277167P381705j422329o025344K58381O929136O311227
4834C6378768L737188K687173k012188j0387913j3137054p151963r29116J96416
$$ plain form
4888 -42106151 -51084083 -53038012 -48130471 -46578778 -47730362 -44271342 -42055713 -50815346
4880 -50815346 -60909110 -58405130 -57201107 -80482596 -115544270 -133700954 -155832628
4873 -155832628 -235401454 -352439079 -389593778 -267674288 -62488536 75003593 89890227
4866 89890227 53195047 38383170 41414937 32298760 18314565 21569351 35177045 37771264
4858 37771264 29259125 24886310 28908652 34878753 40037385 43320336 39709539 29103914
4850 29103914 20489406 17857430 13788965 5291499 2112384 9675696 17863100 17841880
4842 17841880 16668825 22945992 30327697 28905368 22880024 23138405 30067541 36378768
4834 36378768 40115956 42803129 40790941 30403028 17265974 10114011 9184895 9381311
4826I381311N48049K223635Q54060k935605j982615L261297L028892m551844q369967
4817A457213k254966M876640L372783l897974r007223r740249p193610j611590
4809b3998976M457707O844012O660908Q303474R564222M190263m861758p204066
4801C955786j840148J466872K11765K992457J0624573J0322456k741691j3857557
4793A1134513j0135564L2098J702673l771322m596757J456677O998089Q875158
4785A1695565R111353O598594k77728o398082n985378k476571k605671m736777
4777D925305l200099l5230j215452m350253j987190M439282N767402K27470l761696
4768H09539j332031K421796K204036k53791j885725l520649n726200n628852j689893
$$ plain form
4826 9381311 9929360 12152995 13007055 10071450 8088835 11350132 14379024 9827180 1457213
4817 1457213 -797753 4078887 7451670 3553696 -5453527 -15193776 -22387386 -23998976
4809 -23998976 -19541269 -12697257 -6036349 2267125 11831347 16021610 11159852 3955786
4801 3955786 2115638 3582510 3794275 6786732 17411305 27733761 24992070 11134513
4793 11134513 998949 1031047 2733720 -1037602 -5634359 -4177682 2820407 11695565
4785 11695565 20806918 27405512 27127784 20729702 14744324 12267753 9662082 4925305
4777 4925305 1725206 1689976 474524 -3875729 -5862919 -1423637 4343765 4571235 809539
4768 809539 -522492 1899304 4103340 3849549 1963824 -1556825 -7283025 -12911877 -14601770
4759a4601770K872614M446452L256563J290314n25143j472530n75462J624616
4751c684346L297194L768099L391380J666787j451754l515387k647894j325477
4743e01398k551912l750280l06491N612169O764193J995429j659806j95824J388265
4734F794345j739012n705412m223596J492386N456618O203683O665449O727708
4726B1672169L071815l390069o553176l708200M3368r95090n297264p131500m778734
4717g066681j574377J04716J491079L422310L593600K71250l546986k950071K272252
4708c982908O661449N602871P93592k279676j060956J771436K342231n5085l205543
4699F587411n000508m942112l556859j918822j434817k352337k376607J107798
$$ plain form
4759 -14601770 -11729156 -7282704 -4026141 -2735827 -3260970 -4733500 -5308962 -3684346
4751 -3684346 -387152 3380947 6772327 8439114 6987360 3471973 824079 -501398
4743 -501398 -3053310 -6803590 -7110081 -1497912 5266281 7261710 5601904 5406080 6794345
4734 6794345 5055333 -650079 -4873675 -3381289 2075329 8279012 14944461 21672169
4726 21672169 24743984 21353915 14800739 11092539 11135907 10140817 4843553 -2287947 -7066681
4717 -7066681 -8641058 -8536342 -7045263 -3622953 -29353 241897 -3305089 -6255160 -3982908
4708 -3982908 2678541 8281412 9075004 6795328 5734372 7505808 9848039 9792954 6587411
4699 6587411 1586903 -3355209 -6912068 -8830890 -10265707 -12618044 -14994651 -13886853
4691a3886853O586672Q588883M365438j637285l051948O5933K149101Q34963j84078
4682C830826J896844M380085M226294L244318L975823M090915M3886o190237r590650
4673I908104r631032r346610p858542j019408R367501J4272887R105221J078569
4665A5876690q1122M820258O183730j064308j0864492j3262028n241303O373285
4657B740710J1277043N019369o666568j3110191r223468j00290N559068M853234
4649C48907J718115L08783O01725N65748l68639j396444j990765j832216k58586
4640b303372K480206M141135K748007j17005o99752J396082J815643k048168n590681
4631A822095k243227O558970J1632833P470755j180035o442665o572232m585795
$$ plain form
4691 -13886853 -7300181 1288702 5654140 4016855 964907 1030840 3179941 4014904 3830826
4682 3830826 5727670 10107755 14334049 17578367 21554190 25645105 25688991 19498754 9908104
4673 9908104 277072 -9069538 -16928080 -17947488 -8579987 5692900 14798121 15876690
4665 15876690 15795568 20615826 26799556 25735248 14870756 1608728 -3632575 2740710
4657 2740710 14017753 19037122 12370554 -739637 -9963105 -10063395 -4504327 348907
4649 348907 2067022 2375805 2977530 3543278 3174639 1778195 -212570 -2044786 -2303372
4640 -2303372 176834 4317969 7065976 6948971 6249219 7645301 9460944 7412776 1822095
4631 1822095 -421132 6137838 17770671 25241426 24061391 17618726 11046494 6460699
4623F460699j828455J763306L571805O86503m132817m594127K73723M343590K877777
4614I422004j572964l785345k639432o00091Q11815J893744K390677J062207k161415
4605D821200n049874m889086j515464J845848J758811j287532l470651k821818
4597a0608566j486977j562990j580761L53339K532881K150087q0995j287258q59857
4588a2431097r6805R29469K476214K721906K41427k470219j899281J407128M372911
4579d748347N992116O299570L518398k456805o460138m272494K1390O5990j878071
4570c918391J008006O617799N136134n098091j3358827j1360650l244467K931365
4562b1287122N120461M525202J159571k789853k394330K311058M791541K490821
$$ plain form
4623 6460699 4632244 6395550 9967355 10653858 6521041 1926914 2200637 6544227 9422004
4614 9422004 7849040 4063695 1424263 824172 1635987 3529731 5920408 6982615 4821200
4605 4821200 -228674 -5117760 -6633224 -4787376 -3028565 -4316097 -7786748 -10608566
4597 -10608566 -12095543 -13658533 -15239294 -14885955 -12353074 -10202987 -10283982 -11571240 -12431097
4588 -12431097 -12527902 -11598433 -9122219 -6400313 -6158886 -8629105 -10528386 -9121258 -4748347
4579 -4748347 1243769 7543339 11061737 8604932 2144794 -2127700 -2106310 -2040320 -3918391
4570 -3918391 -2910385 3707414 8843548 3745457 -9613370 -20974020 -24218487 -21287122
4562 -21287122 -16166661 -11641459 -10481888 -13271741 -15666071 -13355013 -8563472 -6072651
4554f072651J285058M585141O277441J070770n795120o757323l123726k21241
4546h751651K182042N931962O893455J148662n615096m998813R11442L097556
4538G99559K9198j539809R47208K611572P89378j251381j645198k800101m880667
4529f940241l722133J818648O145121L731963l994263j0590828j0861037m744865
4521b9157635K493396M478194O71900k425940K09428N302695O936782N441200
4513f049980M850079M612579J168121l848448m811108j504065Q718l006274n980871
4504a4561249m518344m76217J611690L98594j644332j151699K665780N864498
4496a1811279L241653l718666o417315p12328O075667N770234J588313J439763
$$ plain form
4554 -6072651 -4787593 -202452 6074989 7145759 1350639 -5406684 -8530410 -8751651
4546 -8751651 -6569609 -637647 6255808 7404470 1789374 -3209439 -2297997 799559
4538 799559 828757 -711052 236156 2847728 3637106 2385725 740527 -2059574 -6940241
4529 -6940241 -10662374 -8843726 -2698605 1033358 -2960905 -13551733 -24412770 -29157635
4521 -29157635 -26664239 -22186045 -21514145 -23940085 -23730657 -18427962 -11491180 -6049980
4513 -6049980 -1199901 3412678 4580799 732351 -4078757 -5582822 -5574104 -8580378 -14561249
4504 -14561249 -19079593 -19555810 -17944120 -17545526 -19189858 -20341557 -17675777 -11811279
4496 -11811279 -8569626 -12288292 -18705607 -19417935 -13342268 -7572034 -5983721 -4543958
4488d543958L991048K437198j105985J793502R155304Q447187l560138j3632427
4480B981731j0609616l65107M876620L331668J690660K817762L649037J930716
4472A0303471j158875l121589j638379L032672N684592J321138n895650n964864
4464B562516K080433P033227J896611n266047l967659K725188L933017k385790
4456H611496q054759p344930k440541K534052N457780M657389J2535m168015k784277
4447c519270L128763P251012N617372l6191n606288p709887m601841K234314Q154258
4438D912242R872772Q464651N550317j30800q286909j2918943q903655q20277
4430b260602J606392l450697q028815o268888j598585L55527R5560J231794L161487
$$ plain form
4488 -4543958 -552910 1884288 778303 2571805 11727109 20174296 16614158 2981731
4480 2981731 -7627885 -7992992 -3116372 215296 1905956 4723718 8372755 10303471
4472 10303471 9144596 6023007 4384628 7417300 13101892 14423030 8527380 2562516
4464 2562516 4642949 11676176 13572787 8306740 4339081 7064269 10997286 8611496
4456 8611496 556737 -6788193 -9228734 -6694682 -1236902 3420487 3433022 -734993 -3519270
4447 -3519270 -390507 6860505 12477877 12441686 6835398 -874489 -5476330 -3242016 4912242
4438 4912242 14785014 23249665 28799982 28669182 20382273 7463330 -1440325 -2260602
4430 -2260602 -654210 -4104907 -12133722 -18402610 -20001195 -19645668 -19550108 -18318314 -15156827
4421a5156827K110904j763116l125163J589701Q933499J2037178Q067230L51999
4413A3045405o027605q464098o799381k188229K443727L384060M9095l837883
4405h394909n110246m788322m276644j558587M180006P632039L863664k481726
4397a0934725k578300K793013M007489j973154o813717m416966M66873J994794
4389a7454693K189728L815458L263228j336397k944383L649675J0526224P166502
4381H875342k606489o244531j933091M74556k812786m296545l5008K822746j381497
4372g137303o917895o190059j460255K90037j289506j102228K245700N219747
4364a6341762N616169M576928L209433J572599N23885J052539K169088K205466
$$ plain form
4421 -15156827 -13045923 -14809039 -17934202 -16344501 -7411002 4626176 12693406 13045405
4413 13045405 7017800 -1446298 -8245679 -10433908 -7990181 -4606121 -4557026 -8394909
4405 -8394909 -13505155 -18293477 -22570121 -24128708 -19948702 -12316663 -8452999 -10934725
4397 -10934725 -13513025 -10720012 -6712523 -8685677 -15499394 -19916360 -19449487 -17454693
4389 -17454693 -15264965 -11449507 -8186279 -9522676 -12467059 -8817384 1708840 8875342
4381 8875342 6268853 24322 -1908769 -1434213 -4246999 -8543544 -8578552 -5755806 -7137303
4372 -7137303 -14055198 -20245257 -21705512 -21415475 -22704981 -23807209 -21561509 -16341762
4364 -16341762 -10725593 -6148665 -2939232 -1366633 -842748 209791 2378879 4584345
4356D584345J424995P55594q09863m272253o993837n003533P48484M339384K527179
4347b699505r28960r17751J923955L098279J292876o59711j220806j871651k656201
4338d639475q63505L516300N548988K303293j710591p32819L606662N237312K857553
4329A5123718J2740k292711n837018q611003o036522J48928K230870j872944n119710
4320a2253652k789693M41780l63156j736963J273979N723096N694716K090399
4312a919494J48564O13477M35207m41974J82398J318659L86136j569111j970761
4303b816899j798227k889679k978097J70894K649822n9906m054360k255842K846924
4294a1185370J691867o491318j0535088l446665P096828R675356M076719q50010
$$ plain form
4356 4584345 6009340 6764934 5955071 1682818 -5311019 -10314552 -9566068 -5226684 -2699505
4347 -2699505 -3628465 -4546216 -2622261 476018 1768894 1109183 -111623 -1983274 -4639475
4338 -4639475 -5502980 -1986680 3562308 5865601 4155010 3422191 7028853 12266165 15123718
4329 15123718 15136458 12843747 7006729 -1604274 -7640796 -7491868 -5260998 -7133942 -12253652
4320 -12253652 -15043345 -14601565 -14964721 -16701684 -15427705 -9704609 -4009893 -1919494
4312 -1919494 -1770930 -1157453 -722246 -1164220 -981822 336837 722973 -846138 -2816899
4303 -2816899 -4615126 -7504805 -10482902 -10312008 -7662186 -7722092 -11776452 -14032294 -11185370
4294 -11185370 -9493503 -15984821 -26519909 -29966574 -22869746 -13194390 -9117671 -9967681
4286i967681l48242J469761r40218o878782j0313947o858773J350258Q253526
4278b4234098J0599635R783934P008423J064622o746796j0449800o766555p21034
4270b0461669J394625R01793K542784N294158M935964K675006K529816K331707
4262B144184k949357r909430r392589j309583L901439J071200k752539q73197
4254b0069872L412663M719500L977775L042071n32018o375193o909641J531829
4246a7202886R658864O673374l815832q924040m519100J687878L785325M360700
4238h295717O219611O368274K175482k665996l016279M09722K675192J600318
4230E470607l05006j52425J737928K832785J446096j693997m177637l818371m05034
$$ plain form
4286 -9967681 -10315923 -8846162 -9786380 -16665162 -26979109 -33837882 -32487624 -24234098
4278 -24234098 -13634463 -3850529 3157894 4222516 -2524280 -12974080 -19740635 -20461669
4270 -20461669 -19067044 -18165251 -15622467 -10328309 -5392345 -2717339 -187523 2144184
4262 2144184 -805173 -10714603 -20107192 -21416775 -17515336 -16444136 -19196675 -20069872
4254 -20069872 -16657209 -11937709 -7959934 -4917863 -5449881 -11825074 -18734715 -17202886
4246 -17202886 -7544022 -870648 -4686480 -13610520 -18129620 -16441742 -12656417 -8295717
4238 -8295717 -2076106 4292168 6467650 3801654 785375 1195097 3870289 5470607
4230 5470607 5165601 5013176 6751104 9583889 11029985 9335988 5158351 1339980 934946
4221I34946L814805N685072L939164L42983k711169n204856q420739j1209400
4213a2829194j0100233m066259L352331P915190Q201212M396087k691492r421987
4205a5244345j0314170m599710J663293L358938K423780K622484L023528J871786
4197a5194416K152819O298789R073567L857115o057109j0528985o060524J082896
4189a5375848M454633L034645j867703p817576r535855l149780P369700J3718203
4181i169581J2524421O099909k947366j1066133j1782582l414765M543783K589513
4173a2622801m583353n797198j269394L27500r18589K326661P535144M141067
4165a0860963o639314j1421779o500839k334695l024242k57682P362962Q696722
$$ plain form
4221 934946 4749751 10434823 14373987 14716970 12005801 6800945 -1619794 -12829194
4213 -12829194 -22929427 -26995686 -23643355 -15728165 -7526953 -3130866 -5822358 -15244345
4205 -15244345 -25558515 -30158225 -28494932 -25135994 -22712214 -20089730 -17066202 -15194416
4197 -15194416 -13041597 -6742808 2330759 6187874 130765 -10398220 -16458744 -15375848
4189 -15375848 -10921215 -7886570 -9754273 -17571849 -27107704 -30257484 -22887784 -9169581
4181 -9169581 3354840 9454749 6507383 -4558750 -16341332 -19756097 -15212314 -12622801
4173 -12622801 -17206154 -23003352 -24272746 -23945246 -24863835 -22537174 -15002030 -10860963
4165 -10860963 -17500277 -28922056 -35422895 -37757590 -40781832 -41039514 -33676552 -24979830
4157b4979830P39912m587642k138573j783066o440119m302981O024616O990260
4149c0477423o770932j4251334l513450N149208n178769j6573887j0302384m798417
4141h6717388j9653970k5020345K0654442R1955070J12756763N8274211j0975925
4134A41272858l3944524k0623333j3384021j8750247j5024350o44671N110922
4127D4012634k153995q151422o638086m641418m593908k314156N3727k932640
4119A2640736o999382m169215J711480R78431l705064j100981Q509012J2502163
4111B0367180N636844l025051m691032j138890J514591L58368m320648r370903
4103E330459r225696k504682L569810K233925k181618p59730N759643Q618981
$$ plain form
4157 -24979830 -24239918 -28827560 -30966133 -32749199 -39189318 -43492299 -37467683 -30477423
4149 -30477423 -37248355 -51499689 -55013139 -49863931 -55042700 -71616587 -81918971 -86717388
4141 -86717388 -106371358 -131391703 -110737261 -18782191 93974572 152248783 141272858
4134 141272858 107328334 86705001 73320980 54570733 39546383 38901712 44012634
4127 44012634 41858639 33707217 27069131 22427713 17833805 15519649 15573376 12640736
4119 12640736 5641354 1472139 3183619 4162050 456986 -643995 7865017 20367180
4111 20367180 26004024 22978973 18287941 17149051 18663642 19022010 14701362 5330459
4103 5330459 -3895237 -6399919 -2830109 -596184 -2777802 -3537532 2222111 10841092
4095A0841092N061294Q77527l74370r69281j545985M28027L289360J231325n664300
4086A3174689r237850m499047L144333N375526R39415m865030o914006l945720
4078f827690J728074O242993P331272N748430K688384k102841p364150q726564
4070a282092m292020R93923J565227p70049p99468P96776o22976m078770l707675
4061a2197124Q08700L144392J351818J485322O731245J0777912P422533N54998
4053B0079796k022983m29173j138975n748799q563380n718976n88664J921047
4045b210107J847111J989862K550984J763116K49515O29799K703472K825445n70100
4036A1779097m058104m009849j558269k161L12270R93282J432731k26273l133783
$$ plain form
4095 10841092 15902386 16779913 16405543 15436262 13890277 14318304 17607664 18838989 13174689
4086 13174689 3936839 -562208 2582125 7957651 8897066 4032036 -2881970 -6827690
4078 -6827690 -5099616 1143377 8474649 14223079 16911463 14808622 7444472 -1282092
4070 -1282092 -5574112 -4580189 -3014962 -3785011 -4584479 -3787703 -4410679 -8489449 -12197124
4061 -12197124 -11388424 -8244032 -6892214 -5406892 1324353 12102265 19524798 20079796
4053 20079796 18056813 17627640 16488665 10739866 2176486 -3542490 -4131154 -2210107
4045 -2210107 -362996 1626866 4177850 5940966 6190481 6820280 9523752 12349197 11779097
4036 11779097 7720993 3711144 2152875 2150714 2462984 3456266 4888997 4662724 1528941
4027A528941m783392m828387l778589J2343O503713R407264L271438n903594o557438
4018e127701J220705N054909l14249m808624k47212N919139L787559j979598q11655
4009B693273N136035N125035j227907l799722N740J461229l074064n385150k8725
4000I05744N709753L490132l215765n664029k854812k61907r1394m84528j674951
3991d141757n425552r000873o353499L265388J2466461J3683457P399269M75928
3983A2368822k112601j554815j397544k048884j247769J126720K218458R62798
3975H315185N5590R82656Q03749k370576m133227L33274P112215P220691l92158
3966A7927399o608114n139580j054675j855059n501429m077451L202363Q226900
$$ plain form
4027 1528941 -3254451 -8082838 -11861427 -11849084 -5345371 4061893 7333331 1429737 -5127701
4018 -5127701 -3906996 1147913 833664 -3974960 -4222172 1696967 5484526 3504928 2693273
4009 2693273 7829308 12954343 11726436 7926714 7932454 9393683 6319619 934469 905744
4000 905744 6615497 10105629 6889864 1225835 -1628977 -1890884 -1982278 -2466806 -4141757
3991 -4141757 -9567309 -18568182 -24921681 -21656293 -9189832 4493625 11892894 12368822
3983 12368822 10256221 8701406 7303862 5254978 4007209 5133929 7352387 8315185
3975 8315185 8370775 9353431 10157180 7786604 3653377 3986651 11098866 18319557 17927399
3966 17927399 11319285 6179705 5125030 3269971 -2231458 -6308909 -3106546 5120354
3958E120354O015525J782271K342352N417986L578304l237933o602140k577555
3950A1839164J417470k130017q275002o373042L183527Q424676K839356o038708
3942D887424q310379l974079J214375M847403O442916K980328o216837j3895848
3934a2024697j2104551l139556L545876L850086J874421J395320J297543j01366
3926a5406924j782100k188492j037173J194494L067847K845559J654559K927489
3918h724741N840210M193948l415663q045044k325640P036389P880415J46248
3910B586122n523750m615935k832061l353896j580872M766980J0157391R659184
3902I263163N170084K01634m539376p896166p450755m178885j585345O90828N136420
$$ plain form
3958 5120354 11135879 12918150 15260502 20678488 24256792 21018859 14416719 11839164
3950 11839164 13256634 11126617 2851615 -3521427 -337900 8086776 10926132 4887424
3942 4887424 -3422955 -7397034 -6182659 -1335256 5107660 8087988 1871151 -12024697
3934 -12024697 -24129248 -27268804 -23722928 -19872842 -17998421 -16603101 -15305558 -15406924
3926 -15406924 -17189024 -19377516 -20414689 -19220195 -16152348 -13306789 -11652230 -8724741
3918 -8724741 -2884531 1309417 -2106246 -10151290 -12476930 -5440541 2439874 2586122
3910 2586122 -2937628 -7553563 -10385624 -13739520 -15320392 -10553412 -396021 9263163
3902 9263163 14433247 14634881 10095505 2199339 -5251416 -9430301 -11015646 -10324818 -5188398
3893e188398Q246877L719456n055421o601363J472419P974792N270561l40538
3885I498385j441281j357326m800524o850178j781856M899144M409302q95778
3877A679888j993337J822299L084884q19072m508967l981013j162353R38072J448406
3868c491193K30345j986243k968218j926927p78005K00333L328775O747197L449204
3859B805268p060200j3302342o382675N987720R694096L541649k237842k856042
3851i810368k397461k401873M22529M617308L875124j354767k751485K340910
3843g460083N944897K031206m402155n585345j521022K372806K852786K36611
3835e530299l315491m065635M22310O619290P810463L091681j377578j370995
$$ plain form
3893 -5188398 3058479 6777935 1722514 -4878849 -3406430 4568362 9838923 9498385
3885 9498385 8057104 6699778 1899254 -4950924 -6732780 -1833636 2575666 1679888
3877 1679888 -313449 1508850 4593734 3774662 -734305 -4715318 -5877671 -4939599 -3491193
3868 -3491193 -3260848 -5247091 -8215309 -10142236 -10920241 -10719908 -7391133 -643936 2805268
3859 2805268 -4254932 -17557274 -23939949 -17952229 -8258133 -4716484 -6954326 -9810368
3851 -9810368 -12207829 -14609702 -14187173 -9569865 -5694741 -7049508 -9800993 -7460083
3843 -7460083 -1515186 516020 -3886135 -9471480 -10992502 -8619696 -5766910 -5530299
3835 -5530299 -8845790 -12911425 -12489115 -5869825 1940638 5032319 3654741 2283746
3827B283746P92000K070805K880418L268719J177560k700924m162017k290766
3819C319541j171681k274496j710814J814623L517219J209459J27458L632642
3811H463951O282137L109117p57881J694502O695782N052640k811410p286696
3803B0442142m243788K43648O53715j162564j942683k104969j955990N04532M486125
3794A4920168M967316L41424l619871j930847J964895J900409j345903k240457
3786A4957134j69744j77397m128103p453934o418196l436049k393975k699353
3778a1919617j433811J369027L239354L328360K552515Q94222k053514m522404
3770h545868l921356p45443J733925J736357L60364j021869j925895j665869k50397
$$ plain form
3827 2283746 3075746 5146551 8026969 11295688 12473248 9772324 5610307 3319541
3819 3319541 2147860 -126636 -1837450 -22827 3494392 4703851 4831309 8463951
3811 8463951 14746088 17855205 17097324 18791826 25487608 30540248 27728838 20442142
3803 20442142 16198354 16442002 17095717 15933153 13990470 11885501 9929511 10434043 14920168
3794 14920168 19887484 20228908 16609037 14678190 16643085 18543494 17197591 14957134
3786 14957134 14787390 14609993 10481890 3027956 -3390240 -6826289 -9220264 -11919617
3778 -11919617 -13353428 -11984401 -8745047 -5416687 -2864172 -1969950 -4023464 -8545868
3770 -8545868 -12467224 -13212667 -11478742 -9742385 -9382021 -10403890 -12329785 -13995654 -14246051
3761a4246051J20911j852368k686969J747791Q367135R343145L613371r20768
3753C486197P61336M074603M031537L360703M973619L743840m924669j3746985
3745E760181j1863709j792247L453498l27857l898306j049335K191416k25598
3737g751957l325022K4822O441411O840478n5685o772169p750804m505359q26635
3728a7680920J726575K997394K671922Q29298j317282j619050J701454P336806
3720c353803J0039435N838890j566940l887982R15623N444302K937491l956315
3712A2410701p963633o882575m317347l470984m278616m970391l410549J261029
3704b1622365O060269O058591J229000k298131p93087J760513J082105K77139
$$ plain form
3761 -14246051 -14125140 -15977508 -18664477 -16916686 -8549551 793594 4406965 3486197
3753 3486197 4247533 8322136 12353673 15714376 20687995 24431835 19507166 5760181
3745 5760181 -6103528 -7895775 -4442277 -4770134 -8668440 -9717775 -7526359 -7751957
3737 -7751957 -11076979 -11052157 -4610746 2229732 2174047 -4598122 -12348926 -16854285 -17680920
3728 -17680920 -15954345 -12956951 -10285029 -9455731 -10773013 -12392063 -10690609 -3353803
3720 -3353803 6685632 12524522 10957582 7069600 7985223 13429525 16367016 12410701
3712 12410701 4447068 -2435507 -6752854 -10223838 -14502454 -19472845 -22883394 -21622365
3704 -21622365 -15562096 -9503505 -8274505 -10572636 -11365723 -9605210 -8523105 -8245966
3696h245966L785015P835458N213950k406192n649107j117175M388769M945794
3688H750546L014329K798637L072376J137526j472213k328247l123470o123971
3680E725513q554269n991839K56098M412433M317250L371718M067247M262618
3672A1866769J582344k213284l801555k825771j279322m9737J185317J620291
3664F085052p3683k747631l196902m85904K478825K999295K050985J790331J490509
3655A0390877j202576n753609q455144o989179l010358M00683K064722K850786
3647i703798L870677N081029M982363K108881k279162m324703k287894M61886
3639b090721Q5241j705511n19613K810397K862540j182516l149642P03788N402738
$$ plain form
3696 -8245966 -4460951 3374507 8588457 6182265 533158 -584017 3804752 8750546
3688 8750546 11764875 14563512 17635888 18773414 17301201 14972954 11849484 5725513
3680 5725513 -2828756 -8820595 -8564497 -4152064 165186 3536904 7604151 11866769
3672 11866769 13449113 11235829 7434274 4608503 3329181 3279444 4464761 6085052
3664 6085052 6011369 3263738 66836 -419068 2059757 5059052 7110037 8900368 10390877
3655 10390877 9188301 3434692 -5020452 -12009631 -15019989 -14619306 -12554584 -9703798
3647 -9703798 -5833121 -752092 4230271 6339152 4059990 -264713 -2552607 -2090721
3639 -2090721 -2005480 -3710991 -4230604 -1420207 1442333 259817 -2889825 -2186037 3216701
3630C216701M437038j064953m888718m244760j260842J385551J979249o48666
3622a089400m672701m885245M86667N145455K637275l235411k985278M208548
3614d390090Q617651M189396k750110l092550K400646N581566K868558j139694
3606A2285373j450614Q35299J418734p60866k634354j862663O1092P90872R88935
3597I671808K138738J849288l465399j0387533r555534R02917R125438M024240
3589D303963q110190j0994128r75298Q284008N680078l024556n901655j392271
3581a2130049L236243M130371L304957K067135n5496r63040K384462P704878Q541737
3572A8221198K616300n389600r918763r251083l961966M327710J1144405J0723904
$$ plain form
3630 3216701 7653739 6588786 1700068 -2544692 -3805534 -2419983 -440734 -1089400
3622 -1089400 -5762101 -10647346 -10160679 -5015224 -2377949 -5613360 -8598638 -4390090
3614 -4390090 4227561 8416957 5666847 2574297 4974943 10556509 13425067 12285373
3606 12285373 10834759 11670058 13088792 12327926 9693572 7830909 7892001 8682873 9671808
3597 9671808 11810546 13659834 10194435 -193098 -9748632 -8845715 279723 4303963
3589 4303963 -3806227 -14800355 -15775653 -7491645 -1811567 -4836123 -10737778 -12130049
3581 -12130049 -8893806 -4763435 -1458478 608657 553161 -409879 1974583 9679461 18221198
3572 18221198 20837498 15447898 5529135 -3721948 -7683914 -3356204 7788201 18512105
3564A8512105K405016p123893j0431832o601589n64872K648763J412743k575176
3556b318735n674907m845872o23298L209716L990606L032505L046082M198332
3548D014429M340150K203917j060197k997143j890140J183060K156012j800593
3540F149495p131248o540887R19071O443429K588557n598273p052765m80806M474173
3531f229254K487867o2476L128927P500426N489849j015277m490551l843598l469029
3522e03116k912802K107396Q719944P924396j030275p598731n447288j158218
3514A01306j491716j741403M151624R940161N536133n228855q210278J65912P586685
3505A0809569L831937o086236j0991611p659077q18775M640211O067026K319085
$$ plain form
3564 18512105 20917121 13793228 3361396 -3240193 -3805065 -1156302 256441 -2318735
3556 -2318735 -7993642 -12839514 -13462812 -10253096 -6262490 -3229985 -183903 4014429
3548 4014429 8354579 10558496 9498299 6501156 4611016 5794076 7950088 6149495
3540 6149495 -981753 -7522640 -6603569 -160140 2428417 -3169856 -10222621 -10703427 -6229254
3531 -6229254 -3741387 -3803863 -674936 6825490 12315339 11300062 6809511 2965913 -503116
3522 -503116 -3415918 -1308522 7411422 15335818 14305543 6706812 1259524 101306
3514 101306 -1390410 -3131813 1019811 10959972 16496105 11267250 3056972 3222884 10809569
3505 10809569 14641506 8555270 -2436341 -10095418 -10914193 -6273982 -206956 2112129
3497B112129m012386o685669k566023L969101O721946N067583K289311m28507
3489F467485l850150o391237m834846N48710N105860M971765J337632j190647
3481B164572N7933K463353R86151m788091q557509n278428Q56297J790590k033607
3472a2338739k220499L395665O080435M51296n216871j142184P943902R373825
3464F326830J682202m187539k384883M63166j952051n513374l745857J418563
3456g892943L397030Q79060j961283k441011j596634j011145j046794j060665
3448a2734385P08750N296225R399964P207334j409765q325196o628697O65224
3440e820546N744700O571422O734185P115084M578604j058449n056714m388028
$$ plain form
3497 2112129 -1900257 -8585926 -11151949 -7182848 -460902 4606681 6895992 6467485
3489 6467485 2617335 -3773902 -8608748 -8060038 -2954178 2017587 3355219 2164572
3481 2164572 2222505 4685858 5672009 883918 -7673591 -12952019 -12095722 -10305132 -12338739
3472 -12338739 -14559238 -11163573 -5083138 -4631842 -9848713 -10990897 -3046995 6326830
3464 6326830 8009032 3821493 1436610 1899776 -52275 -5565649 -9311506 -7892943
3456 -7892943 -4495913 -3616853 -5578136 -8019147 -9615781 -10626926 -11673720 -12734385
3448 -12734385 -12025635 -6729410 2670554 9877888 8468123 142927 -6485770 -5820546
3440 -5820546 -75846 6495576 13229761 20344845 24923449 23865000 18808286 14420258
3432A4420258j620115m25055j152862k601928m530688o256868n692389k029587
3424i889234K556417N350355N471485L202388n56377l464169l263167j141227
3416a733529p47874l021388n180408n498498m944133l069546K377736R415890
3408a2401750J1383207O582397K469914M551274O840221J337820p474770p846320
3400E441993J154078P538751L678696m226530p041233m149218L04676M583923
3392G285136P265444M835858k394847p532871o281532l513046m367093m715620
3384i418571J168638Q394483P304304p88115m587663J67113M974191K299084m067103
3375E446361o541117m368052j722236m85484K07033Q64823K007648M594069P091081
$$ plain form
3432 14420258 12800143 12375088 11222226 8620298 4089610 -2167258 -7859647 -9889234
3424 -9889234 -7332817 -1982462 3489023 6691411 6135034 2670865 -592302 -1733529
3416 -1733529 -2481403 -5502791 -10683199 -16181697 -21125830 -24195376 -21817640 -12401750
3408 -12401750 -1018543 5563854 8033768 12585042 19425263 20763083 13288313 5441993
3400 5441993 6596071 14134822 17813518 13586988 6545755 2396537 2701213 7285136
3392 7285136 14550580 19386438 16991591 9458720 3177188 -335858 -4702951 -9418571
3384 -9418571 -8249933 144550 7448854 6660739 2073076 2240189 7214380 9513464 5446361
3375 5446361 -1094756 -5462808 -7185044 -7670528 -7463495 -6598672 -4591024 3045 7094126
3366G094126N459426q88431o368152n711044m86106L704964L905019J076600k428698
3357E357704l859332j197963L910843O809825N665493L651947L127368J762234
3349B5228119k092355m510722j583958L196009K913141k960075p969022p146330
3341E074807j724430L714802M854233j01598p429925q933754j197358P717210
3333A973987O948368k564985r090947o186933l21817n936m187604n739174j468950
3324b0643991N897297J2066389J3349078P693081k097687q527300o979263j578283
3316h20679K2265l837692p891864p070393j180676O212570J0223172P305992p80012
3307B182683o651148m824806J200469L595940J216315M13995L993593N707751
$$ plain form
3366 7094126 12553552 11665121 5296969 -414075 -900181 2804783 6709802 7786402 5357704
3357 5357704 1498372 300409 4211252 11021077 16686570 20338517 23465885 25228119
3349 25228119 23135764 18625042 17041084 20237093 23150234 20190159 12221137 5074807
3341 5074807 3350377 7065179 11919412 11817814 4387889 -4545865 -5743223 1973987
3333 1973987 8922355 6357370 -2733577 -8920510 -9242327 -9248263 -13435867 -19175041 -20643991
3324 -20643991 -14746694 -2680305 10668773 18361854 16264167 7736867 757604 -820679
3316 -820679 -798414 -4636106 -12527970 -19598363 -20779039 -14566469 -4343297 2962695 2182683
3307 2182683 -4468465 -9293271 -8092802 -4496862 -3280547 -2866552 1127041 6834792
3299F834792l19963r418084j1533996m740534K465222K934538n59581j364375
3291a5701981O69653L8004m447926o475555j364400N987185O968419J237408k628632
3282a5717825R42334P231712Q570236M529040L82374j488191k903114l825398
3274b278832j427909L559205N266206M45427o292690q378284n260959j067280
3266a5435116J823689L710326M109353K006577j074905k228600j214479j36558
3258h439713K43869M44235m04435k862761l751868K34720N693097N547622j79741
3249c474975l648379j505540r1350l830824o343388o47142Q057764R431409L856324
3240A803899N34526J506827o14674p678760j0653156m042219M428401N532061
$$ plain form
3299 6834792 6514829 -2903255 -14437251 -19177785 -16712563 -13778025 -14337606 -15701981
3291 -15701981 -15032328 -14994324 -19442250 -25917805 -27282205 -21295020 -14326601 -13089193 -15717825
3282 -15717825 -14775491 -7543779 1026457 5555497 5937871 4449680 1546566 -2278832
3274 -2278832 -3706741 -147536 5118670 5564097 -728593 -9106877 -14367836 -15435116
3266 -15435116 -13611427 -9901101 -5791748 -3785171 -4860076 -7088676 -8303155 -8439713
3258 -8439713 -8195844 -7751609 -8156044 -11018805 -14770673 -14535953 -8842856 -3295234 -3474975
3249 -3474975 -7123354 -8628894 -8720244 -12551068 -18894456 -19541598 -11483834 -2052425 1803899
3240 1803899 2338425 3845252 3230578 -4448182 -15101338 -19143557 -14715156 -9183095
3232i183095J996183J917158M737970L533471j813085l691128R59961O012508
3224D469943N744671K288810N60594R88871R27440k15498j027198j452904k878183
3215I406546n243358o178911l461990K170512O734620O047379J30668n607546
3207C997920n100520J788655Q253130P055478j742714r944735r076594K86850
3199d482530Q291459O564476k173725q249857p507678m576417l474016j752081
3191a7360369K725163N738776L456302L07120K676516P943606Q080922K514958
3183A6082994j565110j753811l736151r671527j2471753o651813K396137O115785
3175a1255249M418326L248236M506549M968850K929019J9722k300885l318850
$$ plain form
3232 -9183095 -7186912 -5269754 -531784 3001687 1188602 -2502526 -1542565 4469943
3224 4469943 10214614 12503424 13064018 14052889 14980329 14764831 13737633 12284729 9406546
3215 9406546 4163188 -2015723 -5477713 -3307201 3427419 9474798 9605466 3997920
3207 3997920 -1102600 686055 8939185 15994663 14251949 4307214 -4769380 -4482530
3199 -4482530 3808929 10373405 8199680 -50177 -7557855 -12134272 -15608288 -17360369
3191 -17360369 -14635206 -8896430 -5440128 -5133008 -2456492 5487114 13568036 16082994
3183 16082994 14517884 12764073 9027922 -643605 -13115358 -19767171 -17371034 -11255249
3175 -11255249 -6836923 -3588687 917862 5886712 8815731 8835453 6534568 3215718
3167C215718j603296K540385M856740K119295k287584k856431n24702q14101m079739
3158E66285m361993Q54706N985952N096015n60416n667758p493860o324598k692816
3149a4598483K299925O007042O437186M067500J51980m219063o165501k249564
3141h268978N428668Q497477K248993o747754q329000j965104L639868L084218
3133b411612k85684j939774k189640k175408j80842L825763N003374L21164n049225
3124e081884l877417K570195O118258L239020r42165j162053R06907O94384k111951
3115C53294l842904k262462J131776L350778K646156l53798l156826l748603k778169
3106h660758k112064j255985K166224P412789R317124M748351j805920k913984
$$ plain form
3167 3215718 1612422 4152807 9009547 11128842 8841258 5984827 5460125 4646024 566285
3158 566285 -3795708 -2941002 3044950 8140965 7580549 1912791 -5581069 -11905667 -14598483
3149 -14598483 -12298558 -6291516 145670 4213170 4365150 146087 -6019414 -8268978
3141 -8268978 -2840310 5657167 7906160 1158406 -7170594 -9135698 -5495830 -2411612
3133 -2411612 -2697296 -4637070 -6826710 -9002118 -9182960 -5357197 -353823 -32659 -5081884
3124 -5081884 -8959301 -6389106 -270848 2968172 2026007 863954 1770861 2465245 353294
3115 353294 -3489610 -5752072 -4620296 -1269518 1376638 1022840 -2133986 -5882589 -8660758
3106 -8660758 -10772822 -12028807 -9862583 -2449794 6867330 11615681 9809761 6895777
3098F895777K017258N428607J374737o199683p692384K83413R935372J0646785
3090B2689882J117874r030951j0102960k643793M517801M795390l6381l554279
3082G752583j947986K766268N186330K058555l807524o328381m008571k389722
3074g18448n835495j0099332q252879j574756K601146K952574N373466J0837092
3066d716632J1722409M601531k363923j629212J888753r2339m547732k426656
3058B436199M833760N979655k538493j0420137q050297R88296O233650L571901
3050C034534k111578m226948j235584K449743J417368l760680o086295j288495
3042a1807935N413712O341903K288907l6522O90900k35290l502765l958651j94694
$$ plain form
3098 6895777 8913035 14341642 15716379 9516696 1824312 2107725 12043097 22689882
3090 22689882 23807756 14776805 4673845 2030052 6547853 11343243 11306862 7752583
3082 7752583 5804597 8570865 13757195 15815750 12008226 5679845 1671274 -718448
3074 -718448 -6553943 -16653275 -24906154 -26480910 -23879764 -20927190 -15553724 -4716632
3066 -4716632 7005777 11607308 9243385 7614173 9502926 9410587 4862855 2436199
3058 2436199 7269959 13249614 10711121 290984 -7759313 -6771017 -537367 3034534
3050 3034534 922956 -3303992 -4539576 -2089833 -672465 -4433145 -10519440 -11807935
3042 -11807935 -6394223 -52320 2236587 2200065 2890965 2655675 -847090 -4805741 -5000435
3033e000435K457130J010493q15297k26461J70000j152694j287759p9036k927163
3024g851222j1011938j5781203r833227K215310J0281175J1437203R466925O386395
3016d690582J952659j252678L22257N161881P982650O317252K000621k040733
3008A5753327l099006K87244M950562M324499k763230q507264o170754M19522
3000E194900K987201L57386k426673k869487k036171N9682L011948K899447k003157
2991E175076n333051o77335P055314P502890L92225m828364m326822l886460o211742
2982e138269n595699N92617N164824K084403l557767l477290J468377L819494
2974d639310Q15900l163486l679517q70325K128693K190331j471100n938243o850429
$$ plain form
3033 -5000435 -2543305 -1532812 -2348109 -2574570 -2404570 -3557264 -4845023 -4924059 -7851222
3024 -7851222 -18863160 -34644363 -44477590 -42262280 -31981105 -20543902 -11076977 -4690582
3016 -4690582 -2737923 -3990601 -3668344 1493537 9476187 15793439 17794060 15753327
3008 15753327 12654321 12941565 17892127 22216626 19453396 10946132 4775378 5194900
3000 5194900 8182101 8539487 6112814 3243327 1207156 1266838 4278786 7178233 5175076
2991 5175076 -157975 -835310 6220004 13722894 14115119 9286755 4959933 1073473 -5138269
2982 -5138269 -10733968 -10141351 -4976527 -2892124 -6449891 -9927181 -8458804 -4639310
2974 -4639310 -3823410 -6986896 -10666413 -11536738 -9408045 -7217714 -8688814 -14627057 -21477486
2965b1477486l282979J338204L754848L850060K837576J765152K307599N319897
2957c587129P941360O241061J483909r46626P0051m04239m735815q155065o313797
2948h406290k170926r09857k244945k526243j001239Q86655L488744P155449Q774026
2939C045374N439079K12325r92668K234683M440775K447436q32687j809832j228108
2930A2956377j533593k368909j806219n17306j263715l991321m620442q17396
2922c962524L214438J358037n468280r339697n607084J203810M362486L358287
2914a0880527J373222j172294m618218n253947j30131N386538L417984l545135
2906a5422508m695012K921934R622392P661635J754748J7701J965024J891460
$$ plain form
2965 -21477486 -24760465 -23422261 -19667413 -15817353 -12979777 -11214625 -8907026 -3587129
2957 -3587129 4354231 10595292 12079201 11132575 11202626 10798387 6062572 -2092493 -8406290
2948 -8406290 -10577216 -11487073 -13732018 -16258261 -17259500 -16372845 -12884101 -5728652 3045374
2939 3045374 8484453 8696778 7704110 9938793 14379568 16827004 15994317 14184485 12956377
2930 12956377 11422784 9053875 7247656 6730350 5466635 1475314 -3145128 -3962524
2922 -3962524 -748086 609951 -4858329 -14198026 -19805110 -18601300 -14238814 -10880527
2914 -10880527 -9507305 -10679599 -15297817 -20551764 -20681895 -15295357 -11877373 -15422508
2906 -15422508 -20117520 -17195586 -7573194 88441 1843189 1860890 3825914 5717374
2898E717374j275172l807819l222925K70151M879204O428492J256753o640693
2890C605365p410302J222248Q918155O867833M8560k073795l67256j879495n910404
2881C020909n405055R7822L737691K942530J784620J596892r21066m952421m420188
2872b518266J751696O563272N368764K106651J701755K832668J981973r14254
2864A8874259m253249p151084p350387k222972N313593P744480L281914o36661
2856A3599893J667244N496325L527745k870627o469871m802575j494412O79567
2848I333289J734201P47601l678185r147974j0702880p021527j712129J735300
2840a8712304K853145K255878O16852r9953J962867N210168N930975L735284K314486
$$ plain form
2898 5717374 4442202 634383 -2588542 -2318391 2560813 8989305 10246058 3605365
2890 3605365 -3804937 -2582689 6335466 13203299 13251859 11178064 10810808 8931313 3020909
2881 3020909 -2384146 -2286324 1451367 4393897 6178517 7775409 6854343 1901922 -2518266
2872 -2518266 -766570 5796702 11165466 13272117 14973872 17806540 19788513 18874259
2864 18874259 14621010 7469926 119539 -2103433 3210160 10954640 14236554 13599893
2856 13599893 15267137 20763462 24291207 21420580 14950709 10148134 8653722 9333289
2848 9333289 11067490 11815091 8136906 -1011068 -11713948 -18735475 -20447604 -18712304
2840 -18712304 -15859159 -13603281 -12986429 -13086382 -11123515 -5913347 17628 3752912 6067398
2831F067398L687817N169180L933726J371281J42345n21896l013291o260362o375458
2822D200740k461768J605009K140174k73259k851807m260181m476193l202716
2814i580001p75051P98168J17710j316054j362700n76826o00290n27866J561151
2805a2261759M275093M386840K484868K287799L709238K239293k778677n289117
2797i46422j773686K198222K18874m551423m076743K147722O779617N800690K762748
2788H559599J367764O70765m74035k95999J627915J953713j133785m086935l093111
2779E095891j4524N64929j773763l127175j131201K324557M355223M551992M327083
2770A5173012M133195K584604j382939o001445p588552m740393m36935J468943
$$ plain form
2831 6067398 9755215 14924395 18858121 20229402 20371747 19849851 16836560 10576198 4200740
2822 4200740 1738972 3343981 5484155 5210896 2359089 -1901092 -6377285 -9580001
2814 -9580001 -10355052 -9556884 -9439174 -10755228 -12117928 -12694754 -13295044 -13822910 -12261759
2805 -12261759 -7986666 -3599826 -1114958 1172841 4882079 7121372 4342695 -946422
2797 -946422 -2720108 -521886 -303012 -4854435 -8931178 -6783456 -3839 5796851 8559599
2788 8559599 9927363 10598128 10124093 9828094 11456009 13409722 12275937 8189002 5095891
2779 5095891 5081367 5646296 3872533 745358 -385843 1938714 6293937 10845929 15173012
2770 15173012 19306207 21890811 20507872 14506427 6917875 2177482 1740547 3209490
2762C209490P89502p219m35011k623436o970564r985598p999217j557713N108514
2753b0471252Q137443O782585K973831o90780k310499q79746L182484O678174
2745C402240M738119l576283j1598177j1298470l662336K067679Q92837k039995
2737b1074386r81281J463119K60212k800873k734237K0718J972035L851268P537528
2728a2485897R228676M881137l96361J188196O299608N032767j548476k229823
2720I969827M347278N634192l648913j1296422p402319o27279k538788p265696
2712a2828120k190698Q829388J0300317K47877o512570j673328N400152M607480
2704F180498K3002j4359K190228j156525q649223j0629193l999393K813860K364468
$$ plain form
2762 3209490 3998992 3991773 3556762 933326 -6037238 -16022836 -24022053 -25579766 -20471252
2753 -20471252 -12333809 -5551224 -2577393 -3268173 -5578672 -6458418 -3275934 3402240
2745 3402240 8140359 4564076 -7034101 -18332571 -21994907 -19927228 -19034391 -21074386
2737 -21074386 -22055667 -20592548 -20332336 -23133209 -25867446 -25846728 -23874693 -20023425 -12485897
2728 -12485897 -3257221 1623916 1227555 2415751 8715359 13748126 12199650 9969827
2720 9969827 14317105 19951297 16302384 5005962 -2396357 -3023636 -5562424 -12828120
2712 -12828120 -15018818 -6189430 4110887 4358764 -2153806 -3827134 1573018 6180498
2704 6180498 6203500 6189141 8379369 7222844 -1426379 -12055572 -16054965 -13241105 -10876637
2695a0876637r99539J548315Q611595R198182n06317r144980n469778M370929
2687c268230N304536l304833o078401L898348J2945581P462129m877016p007823
2679E074291K090536Q126422M058069k585296m950798n779495p930647p640834
2671i537752k551445K330419K375478N05070J532164M572355N619508L476570
2663H322367m35688m268218n147610r21231M949272N284182r38382n725379k822356
2654a703043L584307N368123J333025l463742n801771o239975n130173k015445
2646a4068694J635674L182497K237308O90111j90739o77127j394702k640254l760560
2637a4986486k650836J771205N991055M453199k603566p765208n503422J030788
$$ plain form
2695 -10876637 -11876176 -10327861 -1716266 7481916 6975599 -2169381 -7639159 -3268230
2687 -3268230 2036306 -1268527 -7346928 -3448580 9497001 16959130 12082114 5074291
2679 5074291 7164827 15291249 19349318 16764022 11813224 6033729 -1896918 -9537752
2671 -9537752 -12089197 -9758778 -7383300 -6878230 -5346066 -773711 4845797 8322367
2663 8322367 7886679 3618461 -1529149 -2450380 2498892 7783074 6844692 1119313 -1703043
2654 -1703043 1881264 7249387 8582412 5118670 -683101 -6923076 -12053249 -14068694
2646 -14068694 -12433020 -9250523 -7013215 -6323104 -6513843 -7190970 -8585672 -11225926 -14986486
2637 -14986486 -17637322 -15866117 -9875062 -5421863 -8025429 -15790637 -21294059 -20263271
2629b0263271N219495N201145L304685J089326m82844Q43503N123518P277787
2621G313344L092694l658966n603955j845919K018585K726977J877524K81083
2613F201367l068666n738745l048514L342865N322686K02438m417595k528409
2605c732573N47642k477116p489730m767590M518736Q451827K020996n532148
2597h459956m964967Q8093Q57846k543129l036920J197168N059882O000160O925963
2588A124140Q728879P449282J667752l573342m125917k922227m163947n480409
2580a295789j763453N300025P715179J652295p104665r722011l796520M823527
2572d191412Q223870M016545k366463l383364J961623O731864M692730j801956
$$ plain form
2629 -20263271 -15043776 -9842631 -6537946 -5448620 -5931464 -5087961 35557 7313344
2621 7313344 10406038 6747072 1143117 -702802 1315783 4042760 5920284 6201367
2613 6201367 3132701 -2606044 -5654558 -2311693 3010993 3213431 -1204164 -3732573
2605 -3732573 -3184931 -5662047 -13151777 -17919367 -13400631 -4948804 -2927808 -8459956
2597 -8459956 -13424923 -13336830 -12478984 -15022113 -18059033 -16861865 -11801983 -5801823 1124140
2588 1124140 9853019 17302301 18970053 15396711 11270794 8348567 4184620 -1295789
2580 -1295789 -3059242 2240783 9955962 11608257 4503592 -5218419 -9014939 -4191412
2572 -4191412 4032458 8049003 5682540 2299176 4260799 10992663 15685393 13883437
2564A3883437n119331j894086L903723O589580M298823q88716n585498p535596
2556G652336p090026o053990m360768K7334O264737Q891002M592480j828519k870003
2547E224583J811497N690566M423539k95504n096204p844733o522158q03494M797216
2538A385308M743548K30393j994552P88831M331665M888774L688814K468386N67792
2529B1098959j508861j515723n43178k536976o549575o419472j188150J749528
2521B586552j848405o229510n840623m308298n866262n688173J288238Q183505
2513a7722976M944454m201672n157925M480995J1174712N543066m879160q370716
2505a4189222m944888k177903j967871j05321M149476O175663L682673L20859
$$ plain form
2564 13883437 8764106 6870020 10773743 17363323 21662146 20773430 15187932 7652336
2556 7652336 562310 -5491680 -9852448 -9825114 -3560377 5330625 9923105 8094586 5224583
2547 5224583 7036080 12726646 17150185 16854681 11758477 3913744 -2608414 -3411908 1385308
2538 1385308 6128856 6359249 4364697 5153528 9485193 14373967 18062781 20531167 21098959
2529 21098959 19590098 18074375 17531197 14994221 8444646 2025174 837024 2586552
2521 2586552 738147 -5491363 -11331986 -15640284 -21506546 -27194719 -25906481 -17722976
2513 -17722976 -12778522 -16980194 -22138119 -17657124 -6482412 -939346 -5818506 -14189222
2505 -14189222 -19134110 -21312013 -23279884 -23385205 -19235729 -13060066 -9377393 -9056534
2497i056534K6351J631904J386265j249594k971107j525692J219962K408888K383265
2488e746292L048759L471204J357500j286058M48529N656807O427053q95821q979955
2479C501726r339811l850304p4357K56770L75639L6174k860242m716949m03896
2470a7075250O108392N920631J64741p52751N151888O856400j660454j0597487
2462e883890r192558j489913K108548J016576J449440L031246K20056n460466
2454a4200961n808430J232409Q193436Q670709M028623j484057n692314p200270
2446a2260855m940159p38814K004051K887977L714291L706709Q83563k079910
2438f823147K17715P052361J0965480Q018643K716828P4474j282359m193452o396784
$$ plain form
2497 -9056534 -9030183 -7398279 -6012014 -7261608 -10232715 -11758407 -10538445 -8129557 -5746292
2488 -5746292 -2697533 773671 2131171 845113 1293642 6950449 13377502 12481681 3501726
2479 3501726 -5838085 -9688389 -9762746 -9505976 -9130337 -9094163 -11954405 -16671354 -17075250
2470 -17075250 -10966858 -5046227 -4881486 -5634237 -482349 6374051 4713597 -5883890
2462 -5883890 -15076448 -16566361 -14457813 -13441237 -11991797 -8960551 -8740495 -14200961
2454 -14200961 -20009391 -18776982 -10583546 -1912837 2115786 631729 -5060585 -12260855
2446 -12260855 -17201014 -17939828 -15935777 -13047800 -9333509 -5626800 -4743237 -6823147
2438 -6823147 -6605432 446929 11412409 19431052 22147880 22222354 20939995 16746543 10349759
2429A0349759m154882Q57832L510069K294499O5648j081267j605678j757668p21739
2420G756573J181556K175916J432788m1855j154431j847917k275001k027922n85000
2411D614707J805512L626570K830097p76353l989079k924235K149191O550610
2403A3887020O547399K982828j341752n281162q383102q699741m706975J387948
2395c607537M954515L765233R9182j931000m72867K121951J407400l678370p862168
$$ plain form
2429 10349759 6194877 7052709 10562778 12857277 12922925 11841658 10235980 8478312 7756573
2420 7756573 8938129 11114045 12546833 12504978 11350547 9502630 7227629 5199707 4614707
2411 4614707 6420219 10046789 12876886 12100533 8111454 5187219 7336410 13887020
2403 13887020 20434419 23417247 22075495 16794333 8411231 -288510 -4995485 -3607537
2395 -3607537 1346978 5112211 5211393 3280393 2807526 4929477 6336877 2658507 -5203661
$$ [...]
##END NTUPLES=NMR SPECTRUM
##END=
