##TITLE=31Pdec_D.E.-1
 CDCl3, 128 sc
 18.5.2023
##JCAMPDX= 6.0         $$ Bruker NMR JCAMP-DX V2.0
##DATA TYPE= NMR SPECTRUM
##DATA CLASS= NTUPLES
##ORIGIN= UXNMR, Bruker Analytische Messtechnik GmbH
##OWNER= root
$$ XWIN-NMR		Version 3.5
$$ Thu May 18 14:34:46 2023 Russian Standard Time (UT+4h)  she@DPX200
##.OBSERVE FREQUENCY= 81.013821
##.OBSERVE NUCLEUS= ^31P
##.ACQUISITION MODE= SIMULTANEOUS
##.ACQUISITION SCHEME= undefined
##.AVERAGES= 128
##.DIGITISER RES= 16
##SPECTROMETER/DATA SYSTEM= spect
##.PULSE SEQUENCE= zgpg30
##.SOLVENT NAME= CDCl3
##.SHIFT REFERENCE= (INTERNAL, CDCl3, 0, 248.564)
##AUDIT TRAIL= $$ (NUMBER, WHEN, WHO, WHERE, WHAT)
$$ ##TITLE= Audit trail, XWIN-NMR		Version 3.5
$$ ##JCAMPDX= 5.01
$$ ##ORIGIN= Bruker BioSpin GmbH
$$ ##OWNER= she
$$ F:/spectra/data/she/nmr/P31/1/pdata/1/auditp.txt
$$ ##AUDIT TRAIL=  $$ (NUMBER, WHEN, WHO, WHERE, WHAT)
(   1,<2023-05-18 14:33:34.75 +0400>,<she>,<DPX200>,
      <continue with go, POWCHK disabled, PULCHK disabled
       configuration hash MD5:
       00 E9 B6 7A A2 85 ED C7 34 08 36 98 17 FE 4E 26
       data hash MD5: 32K
       C9 D1 9B 0E 55 E3 63 83 99 FB 2F E0 E3 87 0E 39>)
(   2,<2023-05-18 14:33:40.67 +0400>,<she>,<DPX200>,
      <Start of raw data processing
       efp BC_mod = 2 LB = 1 FT_mod = 6 PKNL = 1 PHC0 = -11083.82 PHC1 = 372.6849 SI = 64K 
       data hash MD5: 64K
       05 BC 90 A7 A2 32 E7 3B F2 0C EC 5A 88 6C D8 F1>)
(   3,<2023-05-18 14:34:08.34 +0400>,<she>,<DPX200>,
      <pk PHC0 = -48.74483 PHC1 = 227 
       data hash MD5: 64K
       6B 0B C5 2C 66 8A 41 AF 7E D6 4C 43 75 87 E5 36>)
$$ ##END=
$$ 
$$ hash MD5
$$ 02 9D A0 26 BE 3A 1D 2F 0F 4D 88 A4 6C D7 8F 32
##$RELAX= 
##$RELAX= 
##$RELAX= 
##$RELAX= 
##$RELAX= 
##$RELAX= 
##$RELAX= 
##$RELAX= 
##$RELAX= 
$$ Bruker specific parameters
$$ --------------------------
##$DU= <F:/spectra>
##$EXPNO= 1
##$NAME= <P31>
##$PROCNO= 1
##$TYPE= <nmr>
##$USER= <she>
##$AMP= (0..31)
100 100 100 100 100 100 100 100 100 100 100 100 100 100 100 100 100 100 
100 100 100 100 100 100 100 100 100 100 100 100 100 100 
##$AQSEQ= 0
##$AQ_mod= 1
##$AUNM= <au_zg>
##$AUTOPOS= <>
##$BF1= 81.014009
##$BF2= 200.13
##$BF3= 200.13
##$BF4= 200.13
##$BF5= 200.13
##$BF6= 200.13
##$BF7= 200.13
##$BF8= 200.13
##$BYTORDA= 1
##$CFDGTYP= 0
##$CFRGTYP= 5
##$CHEMSTR= <none>
##$CNST= (0..31)
1 1 145 1 1 1 1 1 1 1 1 1 1 1 1 1 1 1 1 1 1 1 1 1 1 1 1 1 1 1 1 1 
##$CPDPRG= <waltz16>
##$CPDPRG1= <>
##$CPDPRG2= <waltz16>
##$CPDPRG3= <>
##$CPDPRG4= <mlev>
##$CPDPRG5= <mlev>
##$CPDPRG6= <mlev>
##$CPDPRG7= <mlev>
##$CPDPRG8= <mlev>
##$CPDPRGB= <>
##$CPDPRGT= <>
##$D= (0..31)
0 1 0 0 0 0 0 0 0 0 0 0.03 2e-05 3e-06 0 0 0 0 0 0 0 0 0 0 0 0 0 0 0 0 
0 0 
##$DATE= 1684405727
##$DBL= (0..7)
120 120 120 11 120 120 24 19 
##$DBP= (0..7)
150 150 150 150 150 150 150 150 
##$DBP07= 0
##$DBPNAM0= <>
##$DBPNAM1= <>
##$DBPNAM2= <>
##$DBPNAM3= <>
##$DBPNAM4= <>
##$DBPNAM5= <>
##$DBPNAM6= <>
##$DBPNAM7= <>
##$DBPOAL= (0..7)
0.5 0.5 0.5 0.5 0.5 0.5 0.5 0.5 
##$DBPOFFS= (0..7)
$$ [...]
##$SUBNAM2= <"">
##$SUBNAM3= <"">
##$SUBNAM4= <"">
##$SUBNAM5= <"">
##$SUBNAM6= <"">
##$SUBNAM7= <"">
##$SUBNAM8= <"">
##$SUBNAM9= <"">
##$SW= 501.771253377433
##$SWIBOX= (0..15)
0 1 3 0 0 0 0 0 0 0 0 0 0 0 0 0 
##$SW_h= 40650.406504065
##$TD= 32768
##$TD0= 1
##$TE= 0
##$TE2= 300
##$TE3= 300
##$TEG= 300
##$TL= (0..7)
0 120 53 12 22 120 120 120 
##$TP= (0..7)
150 150 150 150 150 150 150 150 
##$TP07= 0
##$TPNAME0= <>
##$TPNAME1= <>
##$TPNAME2= <>
##$TPNAME3= <>
##$TPNAME4= <>
##$TPNAME5= <>
##$TPNAME6= <>
##$TPNAME7= <>
##$TPOAL= (0..7)
0.5 0.5 0.5 0.5 0.5 0.5 0.5 0.5 
##$TPOFFS= (0..7)
0 0 0 0 0 0 0 0 
##$TUNHIN= 0
##$TUNHOUT= 0
##$TUNXOUT= 0
##$USERA1= <user>
##$USERA2= <user>
##$USERA3= <user>
##$USERA4= <user>
##$USERA5= <user>
##$V9= 5
##$VALIST= <valist>
##$VCLIST= <CCCCCCCCCCCCCCC>
##$VD= 0
##$VDLIST= <DDDDDDDDDDDDDDD>
##$VPLIST= <PPPPPPPPPPPPPPP>
##$VTLIST= <TTTTTTTTTTTTTTT>
##$WBST= 1024
##$WBSW= 4
##$XGAIN= (0..3)
0 0 0 0 
##$XL= 0
##$YL= 0
##$YMAX_a= 13000
##$YMIN_a= -3575
##$ZGOPTNS= <>
##$ZL1= 120
##$ZL2= 120
##$ZL3= 120
##$ZL4= 120
##$ABSF1= 0
##$ABSF2= 0
##$ABSG= 0
##$ABSL= 0
##$ALPHA= 0
##$AQORDER= 0
##$ASSFAC= 0
##$ASSFACI= 0
##$ASSFACX= 0
##$ASSWID= 0
##$AUNMP= <proc_1d>
##$AZFE= 0.1
##$AZFW= 0.5
##$BCFW= 0
##$BC_mod= 2
##$BYTORDP= 0
##$COROFFS= 0
##$CY= -3
##$DATMOD= 1
##$DC= 0
##$DFILT= <>
##$DTYPP= 0
##$F1P= 0
##$F2P= 0
##$FCOR= 1
##$FTSIZE= 65536
##$FT_mod= 6
##$GAMMA= 0
##$GB= 0
##$INTBC= 1
##$INTSCL= 6.047779e-11
##$ISEN= 30
##$LB= 1
##$LEV0= 0
##$LPBIN= 0
##$MAXI= 10000
##$MC2= 0
##$MEAN= 0
##$ME_mod= 0
##$MI= 50
##$NCOEF= 0
##$NC_proc= -5
##$NLEV= 6
##$NOISF1= 182.463
##$NOISF2= 159.3651
##$NSP= 0
##$NTH_PI= 0
##$NZP= 0
##$OFFSET= 248.5645
##$PC= 4
##$PHC0= -11132.57
##$PHC1= 599.6849
##$PH_mod= 1
##$PKNL= yes
##$PPARMOD= 0
##$PSCAL= 0
##$PSIGN= 0
##$REVERSE= no
##$SF= 81.0140089999694
##$SI= 65536
##$SIGF1= 159.3651
##$SIGF2= -187.1042
##$SINO= 113.3802
##$SIOLD= 16384
##$SREGLST= <1H.CDCl3>
##$SSB= 0
##$STSI= 65536
##$STSR= 0
##$SW_p= 40650.406504065
##$SYMM= 0
##$S_DEV= 0
##$TDeff= 32768
##$TDoff= 0
##$TI= <>
##$TILT= no
##$TM1= 0
##$TM2= 0
##$TOPLEV= 0
##$USERP1= <user>
##$USERP2= <user>
##$USERP3= <user>
##$USERP4= <user>
##$USERP5= <user>
##$WDW= 1
##$XDIM= 65536
##$YMAX_p= 402707584
##$YMIN_p= -45125934
$$ End of Bruker specific parameters
$$ ---------------------------------
##NTUPLES= NMR SPECTRUM
##VAR_NAME=  FREQUENCY,     SPECTRUM/REAL,   SPECTRUM/IMAG
##SYMBOL=    X,             R,               I
##VAR_TYPE=  INDEPENDENT,   DEPENDENT,       DEPENDENT
##VAR_FORM=  AFFN,          ASDF,            ASDF
##VAR_DIM=   65536,         65536,           65536
##UNITS=     HZ,            ARBITRARY UNITS, ARBITRARY UNITS
##FACTOR=    0.620285442955139, 1,           1
##FIRST=     20137.2065510682, 0,            0
##LAST=      -20513.1999529968, 0,           0
##MIN=       -20513.1999529968, -45125934,   0
##MAX=       20137.2065510682, 402707584,    0
$$ Real data points
##PAGE= N=1
##DATA TABLE= (X++(R..R)), XYDATA
$$ [...]
##PAGE= N=2
##DATA TABLE= (X++(I..I)), XYDATA
13211b058495K117335r9241j441802o03194O24972N99078J01574K02596K59231
13202b97946l16939m01848P73621J644836N72669j287387j643906n35646K17505
13193a275041K21124N97762J247262P28392q57213j411041q4179J203138O56507
13184A026711p85969j175375m59848j0157j80437j01617N03495R41949R56548
13175G15300J037172J106567L06405j320090k172900j101110P75235J372171K81456
13166A000206j022241j304404o77457L08131J299898J637632O23984j112115j820356
13157a066722r67544p2702k38762l26192Q80960K056603J102674j230048k037227
13148a898960n20603R60002O04810l97303j67891J103090J977472J808660P28307
$$ y = [-2058495, 58840, -40401, -1482203, -2085397, -1460425, -861347, -759773, -557177, -297946, -614885, -1016733, -243112, 1401724, 1974393, 687006, -956900, -1492546, -1275041, -1053917, -456155, 791107, 1519499, 662286, -748755, -832934, 370204, 1026711, 240742, -934633, -1394481, -1404638, -1585075, -1686692, -1183197, -241248, 715300, 1752472, 2859039, 3165444, 1845354, -327546, -1428656, -653421, 718750, 1000206, -22035, -1326439, -2003896, -1695765, -395867, 1241765, 1865749, 753634, -1066722, -2034266, -2106968, -2345730, -2671922, -1790962, 265641, 1368315, 138267, -1898960, -2419563, -1459561, -854751, -1252054, -1419945, -316855, 1660617, 3469277, 4197584]
13139D197584j022223k504699k171822M4528J883217J454064k31436r16064k67215
13130D65934L29144L12670L19450M19972m7279q73449r45861n4976P10384O35222
13120A271211J66395k00685n65470q34085m83525M17667R44604N64775j37970
13111A142917l93171k01609j5402o8525l10072n01012k48858N34716J198233R75689
13101B112906M8793o33813n67732j07214K13999J06714n27995j307241j287585
13092a949168r7545J137634J091749J75170j32248L41274L77154k94916m40831
13083B08273L98230R13496K16664o36831m70822J31342J28503p8703L76142R66430
13073B152724O20556k50122l31194L52173M78516l78744j197413j259721r96592
$$ y = [4197584, 3175361, 670662, -1501160, -1456632, 426585, 1880649, 1649213, 733149, 465934, 795078, 1107748, 1427198, 1847170, 1799891, 926442, -19419, -74395, 635989, 1271211, 1437606, 1236921, 671451, -162634, -646159, -228492, 716112, 1280887, 1142917, 749746, 548137, 532735, 464210, 154138, -346874, -595732, -61016, 1137217, 2112906, 2161699, 1527886, 960154, 852940, 1066939, 1173653, 645658, -661583, -1949168, -2046713, -909079, 182670, 357840, 225592, 566866, 944020, 649104, 208273, 606503, 1519999, 1736663, 1099832, 629010, 760352, 888855, 810152, 1186294, 2152724, 2773280, 2523158, 2191964, 2544137, 3022653, 2643909, 1446496, 186775, -809817]
13064h09817q02395l62605L54069N98672j0840p09358o07426J18318O30870N77908
13054a022604L17333K58001L62853K56684k59812p81101o27933J80816P25298
13045e90465M17426p3776J47444P49365P45830J44112j92308j22983k91966o17212
13035C15467k64090N87507N78189o03664j419714q39526N825k13739p47997o6024
13025b667766J499999K167518J284870j03541j013480j365050j198532m45177
13017a841159M54512Q28895O64198L05031l63074j306076j471545p5193J639694
13008a164717J740206M99126p9995L79526J40839j291476j914154n19741J098437
12999a111949R40244j68225l39859J99974M83p17779n13910N16377P75423j81075
$$ y = [-809817, -1612212, -1974817, -1620748, -1022076, -1032916, -1742274, -2349700, -2231382, -1600512, -1022604, -705271, -447270, -84417, 172267, -87545, -868646, -1496579, -1315763, -590465, -173039, -246815, -99371, 649994, 1395824, 1539936, 1347628, 1224645, 932679, 315467, 51377, 638884, 1217073, 613409, -806305, -1645831, -1640006, -1853745, -2601742, -2667766, -1167767, 999751, 2284621, 2181080, 1167600, -197450, -1395982, -1841159, -1386647, -557752, 106446, 411477, 48403, -1257673, -2729218, -2804411, -1164717, 575489, 1074615, 994620, 1374146, 1514985, 223509, -1690645, -2210386, -1111949, -171705, -339930, -679789, -479815, -479332, -1197111, -1711021, -1194644, -419221, -600296]
12989f00296j046236q76894r0556O82801J161665Q62460l93422j414929p44663
12980b460070J054151J857272R10463l71572p97831p95303q84809n58391M26634
12971a619456J135601Q66238K81076J86992K56439j09065o14376o96675m83105
12962g96331k92358K5976M94093N73783J07985j29105L56345Q07279L41035o40234
12952H48468j049563n68668K69528R03091R61110K71753o65349q46483p3080N88823
12942F39630L27736k36514k04460J17445p1134n50820m75115J11501K82717l53449
12932d12463j107379j049538J01405J692871K407685J369244o10218j599985q64568
12923g2946K38660K44991n80559j181762j326033j187581m42824Q54466J488426
$$ y = [-600296, -1646532, -2523426, -2613982, -1931181, -769516, 92944, -300478, -1715407, -2460070, -1405919, 451353, 1361816, 990244, 192413, -602890, -1487699, -2046090, -1619456, -483855, 382383, 663459, 850451, 1106890, 997825, 383449, -313226, -796331, -1088689, -1062713, -568620, 5163, 113148, -15957, 340388, 1147667, 1488702, 848468, -201095, -769763, -500235, 402856, 1363966, 1635719, 970370, 123887, 50807, 639630, 967366, 730852, 526392, 643837, 572703, 21883, -453232, -341731, -59014, -412463, -1519842, -2569380, -2467975, -775104, 1632581, 3001825, 2391607, 791622, -72946, 165714, 410705, -169854, -1351616, -2677649, -3865230, -4308054, -3453588, -1965162]
12914a965162P10851k13879K30768J312529J225169J17582k57268L78644M86825
12905B026059l90249p82377R310N68286k24535j288694j150175j71359M05510
12896i98224M71859O64069Q16840K83193o52030r92210n04712O8267K17372J96792
12886d28784K93437L23459R5345j27105L3785M40215M64401k09544r72897q97966
12876i85654m7809M07239k08913j002407p83134J57636O09089L91058L99681P76823
12866b86391N44245n63118j321018q01081K30552N76094L07302K22817L80593
12857g10005K74069k0258K6331L30008K42236l43800p35793m13976L19938Q00952
12847b30298P03184J95597l07588m86288l54964j29635J53799N89671Q86018M34994
$$ y = [-1965162, -1254311, -1468190, -1237422, 75107, 1300276, 1417858, 1160590, 1539234, 2026059, 1635810, 853433, 862743, 1431029, 1206494, -82200, -1232375, -1403734, -998224, -526365, 137704, 954544, 1237737, 585707, -406503, -911215, -842948, -625576, -428784, -135347, 188112, 283457, 156352, 190137, 630352, 1094753, 885209, -87688, -985654, -1033463, -626224, -835137, -1837544, -2620678, -2463042, -1853953, -1462895, -1063214, -286391, 257854, -305264, -1626282, -2427363, -2196811, -1620717, -1313415, -1090598, -710005, -435936, -456194, -429863, -99855, 142381, -201419, -937212, -1351188, -1031250, -230298, 472886, 668483, 360895, -125393, -480357, -609992, -456193, 133478, 1019496, 1454490]
12837A454490p06277j424103q21688M33090Q79870K94937o0947M95925Q56471
12828A401768j43309j555145j321852O47765J986378J077153o72147j016201k04923
12819A99487k33052j266483j197015P43352K224374J094504j305651k026319o34348
12810b401151O68791N84531J67210N09287R43355M05898p40095j258366o96386
12801a816926K88033Q32685N87393j50424o68665m47887L01591R00232R16267
12792G42299L52337n78959j355374j185797O8042J244071J066129j06901o90764
12783d44917q6850N66580J79417p09670p70569K63547J249105J042815j20629
12774A168829q59739l35876N66840L79935p23891r99120J76523J125773M47474
$$ y = [1454490, 748213, -675890, -1497578, -1064488, -184618, 110319, 49372, 545297, 1401768, 1258459, -296686, -1618538, -970773, 1015605, 2092758, 1420611, 404410, 199487, -33565, -1300048, -2497063, -1753711, 470663, 1565167, 259516, -1766803, -2401151, -1732360, -1147829, -980619, -471332, 472023, 877921, 137826, -1120540, -1816926, -1528893, -696208, -108815, -259239, -927904, -1375791, -1074200, -173968, 742299, 1094636, 515677, -839697, -2025494, -1957452, -713381, 352748, 245847, -444917, -531767, 34813, 214230, -495440, -1266009, -1002462, 246643, 1289458, 1168829, 309090, -26786, 540054, 919989, 196098, -803022, -626499, 499274, 946748]
12765I46748o74658m31140N40360K94007r25065r52402N77609J486887O08673
12756A471019m41663j40068N30500M6025j035600j149237k35812M69703M41274
12747d3859K61475M19278P07863N76144l70138j727137k082845m86748J735646
12738a010321K095461K92766j205969o81326N32994M25431o79405j036886j51871
12729a419126J039127J699469J454968J92386j262637j365090j6601P43451l81383
12720F84564j797685j472178n6148N61467M72463R70509J581147P56845r71606
12711G29378j482154o00663k44801q38433n70118J116002K197267J364081K1820
12702A692379l66965n19320j278380j572655m32246Q23224O18126j57560K18058
$$ y = [946748, 272090, -159050, 381310, 675317, -249748, -1202150, -624541, 862346, 1471019, 1029356, 889288, 1419788, 1465813, 430213, -719024, -954836, -485133, -43859, 217616, 636894, 1344757, 1920901, 1550763, -176374, -2259219, -2745967, -1010321, 1085140, 1377906, 171937, -509389, 23605, 449036, -230369, -1267255, -1419126, -379999, 1319470, 2774438, 2966824, 1704187, 339097, 322496, 1065947, 684564, -1113121, -2585299, -2641447, -2079980, -1607517, -637008, 944139, 1700984, 729378, -752776, -1353439, -1598240, -2436673, -3006791, -1890789, 306478, 1670559, 1692379, 1325414, 806094, -472286, -2044941, -2477187, -1653963, -1035837, -1193397, -975339]
12693i75339J151030P48952p77122j373942n79857j02603o77394p93598N79347
12684b800526K017733J661405j60841j551030j384701o8677J265288J516874L52723
12675H48248j058326r04577Q67650K008696Q79067j133615j575138m17894L18907
12666a66982l4712o2443Q59596J240620r711j606339j744113n43018O75068J338995
12656e3039J472936P33696p74973j618476o77919R80106J545103J083422Q67776
12647C558632P82986k91376j810823j849635l01807P11160K25873k56619K34413
12638A002804L84008p20066j514381n42883Q55978P27652k03030M3332J103024
12629A136438Q71347p88679j691770q14584L40320M16260P3204K97591O53532
$$ y = [-975339, 175691, 924643, 147521, -1226421, -1806278, -1908881, -2586275, -3379873, -2800526, -782793, 878612, 717771, -833259, -2217960, -2286637, -1021349, 495525, 848248, -210078, -1114655, -247005, 1761691, 2640758, 1507143, -67995, -485889, -166982, -201694, -264137, 595459, 1836079, 1826368, 220029, -1524084, -2067102, -1392034, -53039, 1419897, 2153593, 1378620, -239856, -917775, 62331, 1607434, 2690856, 3558632, 4341618, 4050242, 2239419, 389784, 87977, 799137, 1025010, 768391, 1002804, 1386812, 666746, -847635, -1390518, -534540, 193112, -9918, 33414, 1136438, 2007785, 1219106, -472664, -1287248, -946928, -530668, -457464, -159873, 493659]
12620D93659M04893M5992L95065R88064O63430n81426j397362q32487M26046Q75739
12610A481613M622j076709r65480K76208J174201P42554k83361n38891J87715
12601A002472R31854R61925M46283j56587o18290p63408m03070K78211O30319
12592B309709J48911q67389j451892r45711J36255N58535o5977o66250k49845
12583a093654N63356N86478J03659L07033R36465M82369r76508j380893j0735
12574d82430J072789L32522p04492k14957O48870p8191j322194n27812J743204
12565D67309K254672J64859j708023j378381l38703m73484j107064q61384j71518
12556c151717N4761M45451J648405K265540P37502j605159j914715Q194J348197
$$ y = [493659, 898552, 944544, 1339609, 2327673, 2991103, 2409677, 1012315, 179828, 605874, 1481613, 1486235, 409526, -555954, -279746, 894455, 1637009, 1353648, 814757, 1002472, 1934326, 2896251, 3342534, 3185947, 2567657, 1804249, 1401179, 1679390, 2309709, 2458620, 1591231, 139339, -806372, -670117, -111582, -177559, -843809, -1093654, -530298, 56180, 159839, 466872, 1403337, 1885706, 909198, -471695, -482430, 590359, 922881, 218389, 3432, 652302, 574111, -748083, -1275895, 467309, 2721981, 2886840, 1178817, -199564, -538267, -1011751, -2118815, -2980199, -3151717, -3096956, -2651505, -1003100, 1262440, 1999942, 394783, -1519932, -1511738, -163541]
12547a63541L86944j239031j287782q1379N18241J10763l2304O16052R41239J13076
12537a17722r20589p70823L61577J077508Q06875K61174p5699n81450j211177
12528a170326q88868Q47714K534152K365714N97045q97956j190306j072088j244802
12519a19721j178660l52982N20284M69703j66085j46240Q40112J598831R38495
12510B403737p55521j896474j513409k47779O20786P25098P01574R54804J062853
12501B055669N75257k36739p72553p80274l57146K43905N31520O2552q30689j171025
12491f79523n86586J78568M17165L80334M74132L65500k34230o00427O1345J111173
12481H87451J110883j19750j182185j009091j78382P7935m43691p77580j76072
$$ y = [-163541, 223403, -1015628, -2303410, -2384789, -1866548, -1755785, -1788089, -1172037, -230798, -117722, -1038311, -1809134, -1447557, -370049, 436826, 698000, 622301, 40851, -1170326, -2059194, -1211480, 1322672, 3688386, 4285431, 3387475, 2197169, 1125081, -119721, -1298381, -1651363, -1131079, -661376, -827461, -973701, -133589, 1465242, 2403737, 1648216, -248258, -1761667, -2009446, -1388660, -663562, 38012, 992816, 2055669, 2630926, 2394187, 1621634, 841360, 484214, 728119, 1259639, 1322191, 491502, -679523, -1266109, -1087541, -670376, -290042, 184090, 549590, 315360, -285067, -223722, 887451, 1998334, 1878584, 696399, -312692, -491074, -413139, -856830, -1634410, -1810482]
12472a810482Q23881J061008M01586O8745Q17159J492636N57756j376211k152966
12463a16888j227081l53255o19607q01354K18987J273201Q18064m18211o11784
12454a837928L14641R20621O50646J96836r6039m89891p71699m09487L71611Q76219
12444b74470R94362R28417M56577m10165q11462l45705r3463q86879j582972q31667
12434b857427M25527L36436p47431q64600K97732J117413Q50391M16941L16267
12425g08751n3799p61261r90665n75540j56771K15176R19948J398238Q30294o8676
12415D8193L0840O64316L28277o76491o79018K79885N41302l5152K5830O35283
12405A163265O3198j480195j530336M63110J925355J282361Q9183k96447q35279
$$ y = [-1810482, -986601, 74407, 475993, 544738, 1361897, 2854533, 3412289, 2036078, -116888, -1343969, -1697224, -2316831, -3118185, -2899198, -1625997, -807933, -1226144, -1837928, -1523287, -602666, 47980, 244816, 148777, -341114, -1112813, -1522300, -1150689, -274470, 719892, 1648309, 2104886, 1694721, 883259, 537554, 444091, -442788, -2025760, -2857427, -2431900, -2095464, -2842895, -3707495, -3409763, -2292350, -1441959, -1025018, -708751, -762550, -1523811, -2514476, -3090016, -3246787, -3031611, -2111663, -713425, 116869, 48193, 79033, 743349, 1071626, 395135, -283883, -3998, 537304, 502152, 527982, 1163265, 1226463, -253732, -1784068, -1320958, 604397, 1886758, 1975941, 1679494, 844215]
12396H44215j891161j560657Q02636K429021J132835j116908j340503L9103P12859
12387E1440L62206J44930L1108n37096p90891m3845M91785k37768q71591N449
12377a394273J031716M64171m27040L27692J386124K55399j800691j346363J267834
12368b35431K048269k22759k078988r94719J015015J156143p1368o56483l64039
12359d04360q3167J82026O77430P23584j01238q17239n45100j249j40494m39155
12349i48962L9342Q23714P66800n3736n56341l88421k10654m17528o02190l37755
12339a885731K34194P08802Q64891P00203K60792l97515r92699q98226K33443
12330a171846J547295J494409q8610j269419m90584J018683Q73981q79253j768593
$$ y = [844215, -1046946, -2607603, -1804967, 624054, 1756889, 639981, -700522, -661419, 51440, 413646, 558576, 589684, 52588, -738303, -782148, -290363, -528131, -1399722, -1394273, -362557, 101614, -325426, 2266, 1388390, 1643789, -156902, -1503265, -235431, 1812838, 1590079, -488909, -1483628, -468613, 687530, 616162, -40321, -404360, -487527, -305501, 371929, 1095513, 994275, 177036, -368064, -369313, -509807, -948962, -909620, -85906, 680894, 627158, 70817, -317604, -528258, -945786, -1547976, -1885731, -1651537, -942735, -77844, 622359, 883151, 485636, -507063, -1405289, -1171846, 375449, 1869858, 1781248, 511829, 21245, 1039928, 1913909, 1034656, -733937]
12321g33937n79457J001606J100379J73603k84723p4561K844k98267p20256j300135
12311a712904j865757j453906M20480K411214K635296J097836m16210p32841l39249
12302D3959o0463L7677J51208K23368K96514N04715M82787k44284j061489o90167
12292c16175O98231J202744n2374j305817p36807O20745N63258n58478l84937
12283b69610J311216J882608N248k035332j787089j33488O27839L65940L95274
12274C62606N67394j85729j177176o59844R90028J478958K07555q54574m21931
12265C07287L70381K83600j69458k10828j93662m04402k20576M29585M43165n03371
12255A31721j058878m43621J56406j93649l79539O28856J548225P76820p52648
$$ y = [-733937, -1313394, -311788, 788591, 962194, 677471, 602910, 605754, 307487, -412769, -1712904, -3578661, -5032567, -4612087, -2200873, 434423, 1532259, 1116049, 383208, 43959, -16504, 21173, 172381, 395749, 692263, 1196978, 1679765, 1435481, 373992, -316175, 382056, 1584800, 1532426, 226609, -510198, 110547, 673805, 115327, -269610, 1041606, 2924214, 2929462, 894130, -892959, -1026447, -398608, -32668, 362606, 930000, 744271, -432905, -1092749, -102721, 1376237, 1583792, 729218, 307287, 677668, 961268, 791810, 580982, 387320, -17082, -237658, 191927, 635092, 131721, -927157, -1370778, -1214372, -1408021, -1787560, -1158704, 389521, 1166341, 413693]
12246D13693j005089r4702K89391l9667J81828Q79275N47501q50683j405022l64498
12236a447973N26767j06257j014195m66296Q06287P31398p30770j344282R3630
12227b951691J895175J819754J51445q81071k96216N75472M41747j15216q6476
12218E52923N7236n16372r30678K69006K228076K335457O7838j911811j471310
12209F80365Q7436K55898j048393j820010j073240J20921M90985J22757k9703
12200b212984N22826J193607R64950k53827j217815q56996K40850Q04139P90410
12191b4840R07498P67910m60042j790531j279921O11176J211187j44856r96686
12182a199105j5929P10450m59800j554670l26234J702902J654344m9721p29437
$$ y = [413693, -591396, -686098, -396707, -436374, -254546, 624729, 1172230, 321547, -1083475, -1447973, -921206, -1027463, -2041658, -2507954, -1701667, -970269, -1701039, -3045321, -2951691, -1056516, 763238, 914683, 33612, -262604, 312868, 754615, 639399, 552923, 610159, 93787, -836891, -567885, 1660191, 3995648, 4063486, 2151675, 680365, 767801, 1023699, -24694, -1844704, -2917944, -2797023, -2306038, -2183281, -2212984, -1690158, -496551, 468399, 214572, -1003243, -1860239, -1619389, -815250, -24840, 882658, 1650568, 1190526, -600005, -1879926, -1268750, -57563, -202419, -1199105, -1215034, -504584, -964384, -2519054, -2845288, -1142386, 511958, 462237, -267200]
12173b67200O1213L64592m97536j138649q16423k66577J31158P00870J067699
12164f60853N67367p1793M32894J516710J314763l83673j742966j565867n48822
12155a142240K63516N87559L43655m65519j174742r99840j09009Q25050J602501
12146b69069J964839J097716q30609j769689l77936J497767J182357q22816j692358
12137a9798n66325O75102P36561L73636L44131K58316j24128l79362m49746n45863
12127C02524j66224J053254J913928J055618o60297j292271q26865p21163j020014
12118c61510o02196J32235k28700j096136m81638J310036J776461L36983q55883
12109g0348p42991o82480j144587m94691J617113K827665J670507j42773o95029
$$ y = [-267200, -205987, 158605, -338931, -1477580, -2294003, -2560580, -2429422, -1728552, -660853, -93486, -165279, 267615, 1784325, 3099088, 2715415, 972449, -593418, -1142240, -878724, -291165, 52490, -413029, -1587771, -2587611, -2696620, -1871570, -269069, 1695770, 2793486, 1962877, 193188, -184748, 1313019, 2495376, 1672560, -19798, -586123, 88979, 825540, 1199176, 1543307, 1801623, 1677495, 1298133, 848387, 302524, 136300, 1189554, 3103482, 4159100, 3498803, 2206532, 1379667, 658504, -361510, -963706, -831471, -1060171, -2156307, -2637945, -1327909, 448552, 785535, -70348, -813339, -1495819, -2640406, -3135097, -1517984, 1309681, 2980188, 2837415, 2142386]
12100B142386n56232q51462j083468o39003k81828m93733l87431K78993K16841
12091a654937q10598r23748O80495J917897J133979j53627j9254O30826N9963
12082H60996j056628j062685l44228k26654k54962O77255J630243Q74500r09856
12073A87981j402674j93976R02559Q20927K39483k23305o12578m65916Q30208
12064H2709K305672K005164j96618k032238j718449r3279P88461K10741p72928
12055E79235r24328k19413L18191L956n48514k77067O77185J037698K88322n29558
12045D05707m12979K02185L50941q358k75782k76759k35259j52093J17731M86184
12035B01518P27511O47666J08420o20289p48327k0518M81558k21012j193698q56943
$$ y = [2142386, 1586154, 734692, -348776, -987779, -1269607, -1763340, -2150771, -1871778, -1654937, -2465535, -3389283, -2708788, -790891, 343088, 189461, 170207, 801033, 860996, -195632, -1258317, -1602545, -1829199, -2084161, -1406906, 223337, 1097837, 187981, -1214693, -1408669, -506110, 314817, 554300, 330995, -281583, -747499, 82709, 2388381, 4393545, 4196927, 2164689, 446240, 352961, 1141422, 1352163, 579235, -345093, -564506, -246315, -242359, -790873, -1067940, -390755, 646943, 935265, 405707, -7272, 194913, 545854, 537496, 261714, -15045, -250304, -402397, -284666, 201518, 929029, 1576695, 1685115, 1064826, 316499, 295981, 777539, 556527, -637171, -1494114]
12025a494114K86742L47493n76813l44112J379084K056718L33517j552358j241134
12016h04977K30003O07059J11262L60357J074926O57631p16331j217130l49285
12007d6485M03267J1507q09094r87150m44840J87827L59028M5970j51610K61673
11997a169907O58067n3020j424423j567693M2075J506899J345374O44461Q49059
11988H30892J131643N3221j493111j438888Q3461R07480J49870p69264n33758
11979a078454M16636R52357O52672j42860p83645p53310k58634o0093k58043m1079
11969a354453P39380R23815p965o35433L05790J677824J553205J88213n47387
11960B842989j46196J12939m74764j089443r34203k84137K04912J76173m15944
$$ y = [-1494114, -1207372, -859879, -1436692, -1780804, -401720, 1654998, 1988515, 436157, -804977, -574974, 32085, 143347, 503704, 1578630, 2236261, 1519930, 302800, -46485, 356782, 368289, -440805, -1427955, -1872795, -1684968, -1325940, -1279970, -1431580, -1169907, -511840, -564860, -1989283, -3556976, -3514901, -2008002, -662628, -18167, 830892, 1962535, 2015756, 522645, -916243, -832782, 74698, 224568, -544696, -1078454, -661818, 290539, 943211, 800351, 16706, -736604, -995238, -1055331, -1313374, -1354453, -615073, 308742, 300777, -334656, -28866, 1648958, 3202163, 3390376, 2842989, 2696793, 2809732, 2334968, 1245525, 311322, 27185, 232097, 408270, -7674]
11951g674j073755q10536O17854J911440J651629J45404j099877j271314o74498
11942f11327J61621P69222O71618K3422k39697K32413M71669k12989q71222l48117
11932D6613Q28969J321819R00371J70379p19396j663231j786809o39599N42088
11923i98796L36380p55933j174232n48328L49130J051147J307175N35443r95362
11914h93376j521381j53563J264779P51450n95707m76658O46252M98673p70353
11905a249884o98714J115974K117880R45863n47261n20250K37155K44524l08589
11896A336698n82174p02216r73547q71491k7608Q93948J202621J008035M60942
11887A745208n49941j392260q93682O67588J295691K9243j424624j054484O02412
$$ y = [-7674, -1081429, -1891965, -1274111, 637329, 2288958, 2434362, 1334485, 63171, -611327, -449706, 319516, 991134, 1014556, 774859, 1007272, 1478941, 1265952, 394730, 46613, 875582, 2197401, 3097772, 3268151, 2548755, 885524, -901285, -1540884, -998796, -662416, -1418349, -2592581, -3140909, -2791779, -1740632, -433457, 101986, -893376, -2414757, -2568320, -1303541, -552091, -1147798, -1624456, -978204, -479531, -1249884, -1948598, -832624, 1285256, 2231119, 1683858, 1163608, 1400763, 1645287, 1336698, 754524, 52308, -921239, -1792730, -1820338, -926390, 276231, 1284266, 1745208, 1195267, -196993, -1090675, -423087, 872604, 901847, -522777, -1577261, -974849]
11878i74849J408293O76675k23693r9618N35606M79851l81896r13819k70862Q75655
11868A111343J157410M13979j11865K09343L06655p63749j944335j564615K2027
11859a163807Q33552J21301p37236l94288P33691J275839N65284p80125j414692
11850i60481n52700Q51097Q47419q85158k160048j182644P81066J316841M48121
11841a496487J23991P59254Q53833J8818k64144N39378Q81959j71140j203960
11832D1502p25367M72638O95911j08300o52951m13175r4210k93426p00513o63480
11822b441371l4266O50283P61521L55245R6015K66131L97850K14312J17143J66573
11812E49436l49302j387819j439058K20118J755442J188647l84229l43668J249654
$$ y = [-974849, 433444, 1110119, 886426, 786808, 1322414, 1802265, 1420369, 506550, 235688, 1111343, 2268753, 2682732, 2570867, 2780210, 3086865, 2323116, 378781, -1185834, -1163807, -330255, -208954, -946190, -1340478, -606787, 669052, 1234336, 454211, -960481, -1513181, -662084, 185335, -699823, -2859871, -4042515, -3261449, -1944608, -1496487, -1372496, -613242, 240591, 259409, -4735, 534643, 1416602, 1245462, 41502, -683865, -211227, 484684, 376384, -276567, -689742, -783952, -1077378, -1777891, -2441371, -2475637, -1825354, -1063833, -708588, -612573, -346442, 51408, 265720, 382863, 549436, 200134, -1187685, -2626743, -2406625, -651183, 537464, 153235, -190433, 1059221]
11803A059221J681282j13260j915858j594900J14447J172403Q28858l10381j410467
11794d88655j735840r46317L11311R83226R69163R26957Q84082L80695k12584
11785A072038j38555J29163m82056j483488j322565q5843N25779J71629L90379
11776a223519J554091J823727K32955j461620j406880k43849L52200J22019j57043
11767d07919j42469J77366Q26328J155762J86814j540390k038075o87414P33638
11758a736359Q50971O32001J208483J681587Q51431m60212p49952k68339k27520
11749A782091n77376m26708R4974J58007j72951k44555j78551m61015o93825k07999
11739i27908N15995M52976k66234n76545j69587K44034K16380L7408N845J05315
$$ y = [1059221, 2740503, 2627243, 711385, -883515, -769068, 403335, 1232193, 921812, -488655, -2224495, -3170812, -2859501, -1876275, -907112, 19845, 903927, 1284622, 1072038, 933483, 1062646, 580590, -902898, -2225463, -2311306, -1785527, -1613898, -1223519, 330572, 2154299, 2387254, 925634, -481246, -725095, -372895, -250876, -407919, -550388, -373022, 453306, 1609068, 1795882, 255492, -1782583, -2469997, -1736359, -885388, -253387, 955096, 2636683, 3488114, 3027902, 2277950, 2009611, 1782091, 1204715, 778007, 872981, 1030988, 858037, 613482, 434931, -26084, -719909, -927908, -411913, 41063, -225171, -801716, -971303, -727269, -510889, -473481, -467636, -362321]
11729c62321L33479O62024Q01784N47119J42388r0328j66026k10166k72093n06917
11719H78943r13722q89898J8399R47776O07298n52866p09265M29449J033183K40071
11709A089368l26740N04435J134312j53870j960657j717487K33150J181673J88755
11700A72939r27105p73546j31105N783M7810N42341Q42637J60144r76862j281396
11690b318360k98392J128361J733343R78113l91934r53917j13724J159615J514241
11681B437346P95356j47214q08614j280068j403014p99084J39330L64290l10902
11672a012574p14216N4193J213100J343300L99682l05742p6534K63862j45366
11663A019705p65634o04752M8199J11807k98996O9844J273895J573268R0909j464073
$$ y = [-362321, -28842, 633182, 1434966, 1982085, 2124473, 2034145, 1868119, 1657953, 1385860, 878943, -34779, -924677, -906278, 41498, 648796, 95930, -613335, -183886, 849297, 1089368, 762628, 1267063, 2401375, 2247505, 286848, -1430639, -1197489, -15816, 172939, -754166, -1527712, -1658817, -1653034, -1605224, -1062883, -220246, -60102, -1036964, -2318360, -2616752, -1488391, 244952, 1223065, 831131, -122786, -236510, 923105, 2437346, 3232702, 3085488, 2276874, 996806, -406208, -1205292, -1065962, -701672, -1012574, -1726790, -1672597, -459497, 883803, 1283485, 977743, 901209, 1165071, 1019705, 254071, -350681, -302482, -190675, -489671, -419827, 854068, 2427336, 2518245, 1054172]
11653A054172j172003J98797M57346o51964j351226p31187K45863O64668P29082
11644e56452O74969K86912j49365Q0269P44036P64368k1839n87396m25217j14773
11634F95512k865J76208K05634m62719j273007j007811J09705N80507J21974p538
11624h64400N45001O89100K23125K57182O95006M684j565749j506769P71162K287984
11614A536326J031161p49930l26209J082905P54935q22096j160672j97385M7747
11605A196782o89733q56103l20908l74513p57048L1395J435097J175091o80616
11596A59444j253361N64593K118309J100673r74350j394507l22064P2875o70675
11587e99063q46190M22817J701079J269550n04446j587871p71286Q41393J136720
$$ y = [1054172, -117831, 80966, 538312, -113652, -1464878, -2196065, -1950202, -1285534, -556452, 118517, 405429, 256064, 336333, 1080369, 1844737, 1822898, 1235502, 810285, 695512, 692647, 868855, 1074489, 611770, -661237, -1669048, -1559343, -978836, -856862, -864400, -319399, 369701, 592826, 850008, 1545014, 1549698, -16051, -1522820, -751658, 1536326, 2567487, 1817557, 1491348, 2574253, 3329188, 2507092, 1346420, 1149035, 1196782, 507049, -349054, -669962, -1044475, -1801523, -1770128, -335031, 840060, 159444, -1093917, -529324, 1588985, 2689658, 1715308, 320801, -1263, 71612, -599063, -1445253, -1022436, 678643, 1948193, 1443747, -144124, -915410, -74017, 1062703]
11578A062703l71330j825322j314460O86681J930669J183116m61612j107317k06730
11569d23602J053223J152763j37598j459508j316637J87020J488611J500069P03880
11560B748221P9055j85521l69089m68925n15669q92029j518950j440829j74226
11551b737962J151166J082152j29485q44594j74295J113937J712706J059937l77799
11542A855763j526939j561612p25465j1444J67895L37423P31546P10320R680m65301
11532d78134q36O70056M97735k69555o72855n63430m31472k98493J04751N07084
11522i35149M60481J44846k4575r0246j15547K27160Q26648P73743k14151r87249
11512F5961o94630k42338o58283j123478l75729Q68887R45234N7774j46989M61907
$$ y = [1062703, 691373, -1133949, -2448409, -1761728, 168941, 1352057, 890445, -216872, -423602, 629621, 1782384, 1644786, 185278, -1131359, -944339, 544272, 2044341, 2748221, 2827276, 2641755, 2272666, 1803741, 1288072, 396043, -1122907, -2563736, -2737962, -1586796, -504644, -634129, -1478723, -1653018, -539081, 1173625, 2233562, 1855763, 328824, -1232788, -1958253, -1969697, -1801802, -1464379, -732833, -22513, -12833, -478134, -478970, 191086, 688821, 419266, -253589, -817019, -1248491, -1546984, -1442233, -935149, -474668, -329822, -354397, -444643, -560190, -333030, 493618, 1267361, 1053210, 65961, -628669, -871007, -1529290, -2652768, -3028497, -2159610, -1214376, -1156602, -1303591, -841684]
11502h41684L09163r41725j529329l70381J215245J514587O73226o5880k07307
11493b44085p5559R9599K34256J07510k27415k21277L55038P92579K76248r07191
11483A89703j565927r81973L06579J196366J219891P90430L35740l01947j233616
11474d4754j761595j065315M58512J429300J171695L39968k59702n18462m84600
11465g34953j9489O27073Q54630O51603N24831L50024m22034j254957r01766L00045
11455b4993M77891o66880r99010N34115J804350Q16282r50250r63193K31576J66287
11445D26175j274320j759103m09903J007482J062502M65473L32602N37615M77577
11436H66100J19453k52037l89431l3154O79482R55274L65112l05634j97485K26467
$$ y = [-841684, -532521, -1474246, -3003575, -3373956, -2158711, -644124, 29102, -36778, -244085, -319644, -220045, 14211, 121721, -105694, -326971, 28067, 820646, 1096894, 189703, -1376224, -2358197, -2051618, -855252, 364639, 1155069, 1490809, 1188862, -44754, -1806349, -2871664, -2413152, -983852, 187843, 527811, 268109, -250353, -734953, -754442, -127369, 727261, 1378864, 1903695, 2253719, 1831685, 576728, -325038, -24993, 452898, -213982, -1212992, -678877, 1125473, 1941755, 991505, 28312, 259888, 426175, -848145, -2607248, -3017151, -2009669, -947167, -481694, -149092, 388523, 866100, 985553, 733516, 344085, 310931, 990413, 1945687, 2310799, 2005165, 1807680, 2034147]
11426B034147L5590n90683q62237p38516n28020K6520R05662J068790J01243n46162
11416I06334K29034J020236J83379j046748m88980R92870P20452j110628j559359
11407a53410J25329J314486M82212n74060k60779K45668l03266p36893K17907
11398C57194J336738Q73601m89870q57354j19009K89823j33938n36790l72435
11389C47960m2285j5929k94925o43630p89201o10453l54340k51606K9846Q24785
11379a799778J547822J377101O77334M36852M66349k09171j218437j077647J77988
11370C78413P35941q072m15950M63243J140825L01756q15726m67330P38882R92862
11360C044844J47524m93251m45959l05677k80883p7634J43513O9117R4728O41764
$$ y = [2034147, 2069737, 1479054, 616817, -121699, -649719, -623199, 282463, 1351253, 1452496, 906334, 1135368, 2155604, 2338983, 1292235, 803255, 1796125, 2516577, 1405949, -153410, -28081, 1286405, 1768617, 1194557, 933778, 1179446, 876180, 139287, 357194, 1693932, 2567533, 2077663, 1220309, 1101300, 1391123, 1257185, 720395, 347960, 305675, 289746, -5179, -648809, -1438010, -2048463, -2402803, -2654409, -2624563, -1799778, -251956, 1125145, 1802479, 2239331, 2705680, 2496509, 1278072, 200425, 378413, 1114354, 1106282, 690332, 1153575, 2294400, 2596156, 1780430, 1313100, 2051982, 3044844, 3192368, 2699117, 2253158, 1947481, 1666598, 1588964, 1732477, 1801594, 1896322, 2538086]
11350B538086J060301M49584q24983j596371j474563q83690n3223Q38954J057239
11341A111334J86475p88777o54048J39795K05348m58253n40983K17415N37518
11332d4176j65806p61870l18734M47418N49041K71737K79554K95474q3858j96803
11322B71977O04627J366428O67732r87792j639865p23211L11417M88513N11720
11313H71546P90220K83064j335611k170291p17838J356708J365947l61669j149765
11304a067689k40321M39447n9844k43048P16384J164921j37419j580599j126778
11295b134946N24131J219079N50930j78590k57874k3057K59424M07520n2442r11073
11285e96898q76072M28059J238257J65262j283374q24972R60303J567238M99382
$$ y = [2538086, 3598387, 4047971, 3222988, 1626617, 152054, -731636, -784859, 54095, 1111334, 1297809, 509032, -145016, -5221, 200127, -258126, -799109, -581694, -44176, -209982, -971852, -1290586, -843168, -294127, -22390, 257164, 552638, 468780, 271977, 876604, 2243032, 2910764, 1922972, 283107, -440104, -128687, 359826, 871546, 1661766, 1944830, 609219, -1561072, -2278910, -922202, 443745, 82076, -1067689, -1308010, -868563, -928407, -1171455, -455071, 709850, 572431, -1008168, -2134946, -1610815, -391736, 159194, -19396, -277270, -300327, -40903, 366617, 314175, -596898, -1472970, -1044911, 193346, 358608, -924766, -1749738, -789435, 777803, 1277185]
11276A277185l64637j33018K9029n35539q23649k68571J38185k79090o21125O553
11266a574677J009255J286515O79681k20398q52609q41506j79821M87613N15907
11257C09960K13757L01359N76227J89604q36522j486826j133551o0272J203419
11248g22845K051583J691650J06718j245038j039128J4242L26528o6210L3174
11239A150674M89376L1977j113531j165096K29416J184318M83040p39217j113010
11230e62053r34570q60870m64922N25353R65180j40727j697920j672223J94580
11221d648172K030774K147570Q56189k06945j22448L41925j2763r19828r05953
11212a439651L46112J158505K77432j075622r70469L88243J266898J093870O64926
$$ y = [1277185, 912548, 779530, 808559, 273020, -550629, -819200, -681015, -960105, -1581230, -1574677, -565422, 721093, 1400774, 1180376, 327767, -513739, -693560, -205947, 309960, 523717, 825076, 1401303, 1590907, 754385, -732441, -1865992, -1926264, -722845, 1328738, 3020388, 3127106, 1882068, 842940, 857182, 1183710, 1117500, 1150674, 1640050, 1672027, 558496, -606600, -377184, 807134, 1290174, 550957, -562053, -1496623, -2357493, -2822415, -2297062, -1331882, -1472609, -3170529, -4842752, -4648172, -2617398, -469828, 386361, 179416, 56968, 398893, 386130, -533698, -1439651, -1093539, 64966, 342398, -733224, -1703693, -1315450, -48552, 1045318, 1710244]
11203A710244K27545n59346j047915j73743J373407J678406N02486m23038l10686
11194B977360l50962j227002j731761q77015M11651Q77519P69461R20806J162183
11185B932240Q55199K01282p9733O0574l6186p32675j525980j525362m96361O54017
11175C07015Q89328M96065N52215Q35482j00059k080000k611712n34421J673058
11166e73029J398519j55625k68631O62000J57472j642852k015968k15369J490458
11157a163025J602667J011559M24167o92808j930785j660805J55654J457372J182812
11148C86808M83265K76845J07155l2462O02230J380303O17694j271755j779176
11139G70907l06522P17312k14395j476877j324869l99317J58602N42922Q37591
$$ y = [1710244, 1937789, 1378443, 330528, 156785, 1530192, 3208598, 3711084, 3288046, 2977360, 2626398, 1399396, -332365, -1209380, -797729, 79790, 849251, 1770057, 2932240, 3787439, 3988721, 3908988, 3969562, 3933376, 3200701, 1674721, 149359, -347002, 307015, 1196343, 1692408, 2244623, 3080105, 2980046, 900046, -1711666, -2246087, -573029, 825490, 669865, 401234, 1063234, 1220706, -422146, -2438114, -2653483, -1163025, 439642, 1451201, 1875368, 1182560, -748225, -2409030, -2253376, -796004, 386808, 870073, 1146918, 1254073, 1221611, 1823841, 3204144, 3821838, 2550083, 770907, 464385, 1181697, 967302, -509575, -1834444, -2233761, -2075159, -1532237, -694646]
11130f94646K06100j073950j178937K74061J229005N71725k0186P91422J536621
11121A641215N38286j171328j562567n51931N31021R85533Q34420K15842k98479
11112A162012j28929Q5206n91347j172467R2290K213588K210784j21854j643936
11103B105347r38626k10201q19147r44478L65051Q42866p29038j696889K13K007303
11093a7599J529841j8916N4508R63895M43632q70249r66437l95618q33170j401909
11083a512022k73742J438697J176290p12236j638874r27203l0875M87034J023937
11074i68994R46762k90447j019150L95478K164202J394264j056632j769698k76434
11065d80649N43543m32559j007244J32496J232652O98245m36213o35220j38046
$$ y = [-694646, -488546, -1562496, -2741433, -2467372, -1238367, -666642, -686828, 104594, 1641215, 2179501, 1008173, -554394, -1106325, -575304, 410229, 1244649, 1460491, 1162012, 1033083, 1118289, 526942, -645525, -553235, 1660353, 3871137, 3749283, 2105347, 1166721, 956520, 137373, -807105, -442054, 400812, -328226, -2025115, -2024902, -17599, 1512242, 1493326, 1547834, 2511729, 2955361, 2085112, 1118675, 723057, -110113, -1512022, -1785764, -347067, 829223, 116987, -1521887, -2449090, -2479965, -1992931, -968994, -22232, -312679, -1331829, -936351, 1227851, 2622115, 1565483, -204215, -480649, 62894, -369665, -1376909, -1244413, -11761, 686484, 250271, -384949, -522995]
11056e22995J81891L54123N67349M18612j44590l91985k7175K95400J87159J42428
11046A060217M38844M62245k49157j024121p80314N22767J587766J139220m34917
11037B722550j327394o84927O2633n72013j469616n44252J479896J749444q9731
11028A326590j131024K8250J068266J08013j112917m92919P99967O40348m24257
11019H10317o26218r5682J83496O92768J903887K235883L73604j892847k025878
11010A559330n76972J36736j76506k15749k6766m78644q64224l0937J001837M97433
11000H25538p91770q29989J11473J45286o07368k88035J104199J525055L82530
10991A576919n93510k80184M55253O35292M03038J16013j50778j78158J5309k21526
$$ y = [-522995, -341104, 13019, 580368, 998980, 854390, 462405, 435230, 730630, 917789, 1060217, 1499061, 1961306, 1712149, 688028, -92286, 430481, 2018247, 3157467, 2722550, 1395156, 710229, 772862, 200849, -1268767, -1813019, -333123, 1416321, 1326590, 195566, 223816, 1292082, 1400095, 287178, -205741, 594226, 1234574, 810317, 184099, 88417, 271913, 964681, 2868568, 5104451, 5478055, 3585208, 1559330, 982358, 1119094, 942588, 726839, 700073, 221429, -642795, -673732, 328105, 825538, 33768, -796221, -684748, -539462, -1146830, -1434865, -330666, 1194389, 1576919, 983409, 703225, 1158478, 1793770, 2196808, 2312821, 2162043, 1983885, 1999194, 1777668]
10981A777668j007194j270411n39806p7758o89127j001891J72493J486910J285598
10972A36482M37748M64367O12080l90693j354413n32789R73358R77396K2221N4800
10962A400557N98930r6365j223827o55209Q23776N94654r97569j126906M01682
10953b80277Q07494o13448j320886j68591Q02519L44223M4560R18604J320610
10944A854808N0358j273463q46261N27510J032782N20698O9975J47697L59172
10935B443276J60312o97842j642357j369784M11891J908998J463319Q9029j93078
10926B573764K80813l26945j696652j547422M38391J845934J252449N0881k80698
10917B590515l19430r87648j665095j283967j6470J119763J490244J131467M84781
$$ y = [1777668, 770474, -499937, -1039743, -1117501, -1806628, -2808519, -2636026, -1149116, 136482, 574230, 1038597, 1650677, 1259984, -94429, -627218, 346140, 1323536, 1345757, 1400557, 1999487, 1903122, 679295, 24086, 847862, 1442516, 444947, -681959, -280277, 527217, -86231, -1407117, -1575708, -773189, -428966, -384406, 534198, 1854808, 1905166, 631703, -214558, 312952, 1345734, 1866432, 1936407, 2084104, 2443276, 2603588, 1905746, 263389, -1106395, -694504, 1214494, 2677813, 2766842, 2573764, 2854577, 2527632, 830980, -716442, -278051, 1567883, 2820332, 2871213, 2590515, 2271085, 1283437, -381658, -1665625, -1682095, -562332, 927912, 2059379, 2544160]
10908B544160N8338r7839l30306m66839J55222J193923J184866j52200j064334
10899C024991m57797L09889j43562r07514p46325m12988q08837q14118N26151
10890d30110J558608N64460j019873r02553K08955K07452n27703k12958P26497
10881A72775N92750j76330K8619O66282J20874r01277n20444O97414P30983j75911
10871A235735k19274M50883L55226j47460K26233O89336j49477j052877j32421
10862A255904J264644O55831r38929p67190N55561L34155j007369r21491J11671
10853E42787l69931j483580k89315K135861J804921j042165j940209K12188J616855
10844A187412N29647k92750M99830M24041j414762k065603k37584J071094m7986
$$ y = [2544160, 2602498, 2504659, 2174353, 1707514, 1862736, 3056659, 4241525, 4089325, 3024991, 2567194, 2877083, 2733521, 1826007, 1079682, 666694, -142143, -956261, -430110, 1128498, 1692958, 673085, -229468, -20513, 186939, -340764, -553722, 172775, 765525, 589195, 617814, 1284096, 1404970, 503693, -16751, 680663, 1411646, 1235735, 1016461, 1467344, 1822570, 1675110, 1901343, 2590679, 2441202, 1388325, 1255904, 2520548, 3176379, 2237450, 1470260, 2025821, 2359976, 1352607, 431116, 542787, 172856, -1310724, -1600039, 535822, 2340743, 1298578, -641631, -429443, 1187412, 1717059, 1424309, 1924139, 2348180, 933418, -1132185, -1369769, -298675, -346661]
10835c46661j166293k26257R83718P31617N16591J559287J974783L17348j430876
10826B913257j146776J08350M50290J34498P3087m2567l94739k66854J32607l35184
10816A625969j136660m81430J067720R29064q75967j368135J97553R96772k27509
10807G27377j023719Q3075J000759J83322o58617j35883K79898m71461p57974
10798g73223N00737J580788J087648K79012L32964K90969n33627j037958p11837
10789A015473n82872o55860L45995J756381J159503j180796k031599m52396Q04238
10780A78067L40767J05048R19888P27398r31586j430536l3545M67622p66348o25470
10770a048695J865082K782229o911k488048r08168J985058J664703r85777j958251
$$ y = [-346661, -1512954, -1739211, -755493, -23876, 492715, 2052002, 4026785, 4344133, 2913257, 1766481, 1874831, 2325121, 2459619, 2532706, 2490139, 2095400, 1828546, 1961153, 1625969, 489309, 7879, 1075599, 2004663, 1128696, -239439, -41886, 954886, 727377, -296342, -213267, 787492, 970814, 312197, 176314, 456212, -15249, -773223, -272486, 1308302, 2395950, 2674962, 3007926, 3298895, 2765268, 1727310, 1015473, 432601, -223259, 122736, 1879117, 3038620, 1857824, -173775, -626171, 178067, 518834, 623882, 1543770, 2271168, 1339582, -90954, -124499, 343123, -423225, -1048695, 816387, 3598616, 3591705, 1103657, 195489, 2180547, 3845250, 2859473, 901222]
10761I01222o78283L45076L15214M00404O49244J60876p16270r74897o62593k09793
10751d69800M96051J088974O81120k28404j36708N65470J3857j343567j018809
10742c51816Q08373J066442p12577j292146M07970J230673m13401j556932n6207
10733h69621J677898J205363K5695Q2657L16461m16772p99357j04997j1240r24300
10723A81787m92810J799648K765376P61547j423576j430926p40170p87710k79917
10714C53249J063986Q68914j123425j563343N19629J472573l61394j404253M59519
10705B85455J790974Q1581j485846j27039J349254J67827j075002K55629J467598
10696B710431j41843j689557n4027J992027Q40895j273771o55052J037479M62652
$$ y = [901222, 222939, 568015, 883229, 1283633, 1932877, 2093753, 1377483, 402586, -260007, -469800, 26251, 1115225, 1796345, 1567941, 1431233, 1996703, 2010560, 666993, -351816, 456557, 1522999, 810422, -481724, -73754, 1156919, 743518, -813414, -869621, 808277, 2013640, 2039335, 2121992, 2438453, 2021681, 1222324, 1117327, 1106087, 181787, -311023, 1488625, 4254001, 5015548, 3591972, 2161046, 1420876, 633166, 353249, 1417235, 2286149, 1162724, -400619, 119010, 1591583, 1230189, -174064, 285455, 2076429, 2158010, 672164, 545125, 1894379, 2062206, 987204, 1242833, 2710431, 2568588, 879031, 825004, 2817031, 3657926, 2384155, 1729103, 2766582, 3229234]
10687C229234q67809M1630J422572J65616j831745j032919J047932P66990q30328
10678B111173l63981J211050N69923j403618j138139J089457J866550O55002j13606
10669D483811J63059M6399m64846l67180k76473j026943j328431p7113J116468
10660B268751P41042J24509M65406K94763j117273j472889K61805J286406n408
10651B847112q81408L04388N45607j838832k974986o4639K946966J772473j042748
10642A613933j070790N49248N70766R2831J373800K306947K95903k113002j451073
10633B168563M90721L86383n75084N0384P34980l97911j016934P63184J787934
10624D392220l80410k134827k59716J686797o8458k164762m24670K080123R72201
$$ y = [3229234, 2361425, 2403055, 3825627, 3991243, 2159498, 1126579, 2174511, 2941501, 2111173, 1747192, 2958242, 3528165, 2124547, 986408, 2075865, 3942415, 4597417, 4483811, 4646870, 4693269, 4228423, 3861243, 3584770, 2557827, 1229396, 1152283, 2268751, 3009793, 3134302, 3599708, 3894471, 2777198, 1304309, 1566114, 2852520, 2847112, 1965704, 2270092, 2815699, 976867, -1998119, -2062758, 884208, 2656681, 1613933, 543143, 1092391, 1663157, 1755988, 3129788, 5436735, 5732638, 3619636, 2168563, 2659284, 3045667, 2470583, 2520967, 3255947, 2858036, 1841102, 2604286, 4392220, 4011810, 1876983, 1617267, 3304064, 3235606, 1070844, 646174, 2726297, 3698498]
10615C698498q96472Q82617L254867J142151k756567k598227L35637R33121j59761
10606C835864P64822K008211j47420l060954j857313J309009J070162j320301
10598B602080r34956J288780J030754n38216M98001K234755L40039k874225j979602
10589A667410J657800K479036N33021j03803K27936j319342k831721j015895J419635
10580B714077L67581j468440K78808K643795P94672k130330n77363K670373J674331
10571F967504j360012p49862J362199l67973l149633j065884K957869K175077
10563F769285j261079p64428J858506N88811k208353l86446L085663J238799l069210
10554E851548k155367J838676J382502j592123R5228L940954K206911k564310
$$ y = [3698498, 2802026, 3684643, 6939510, 8081661, 5325094, 2726867, 3062504, 3995625, 3835864, 4600686, 6608897, 6461477, 3400523, 1543210, 2852219, 3922381, 2602080, 1667124, 2955904, 3986658, 3448442, 3946443, 6181198, 6521237, 3647012, 1667410, 3325210, 5804246, 6337267, 6233464, 6461400, 5142058, 2310337, 1294442, 2714077, 3081658, 1613218, 1892026, 4535821, 5330493, 3200163, 2622800, 5293173, 6967504, 5607492, 4857630, 6219829, 5851856, 2702223, 1636339, 4594208, 6769285, 5508206, 4743778, 6602284, 7191095, 4982742, 4596296, 7681959, 8920758, 5851548, 3696181, 5534857, 6917359, 5325236, 5420464, 9361418, 11568329, 9004019]
10546I004019j975339K020032J127152k826390j682487K498894J398861k678941
10538F885801j045873L830150K632734k503566k041045K250844J180230l074494
10530H114781j257042L813318K262209k793357q71530M622532K413474m034963
10522A2269422k667942L301341J631625m064741j110156O027662L388784m289171
10514A4486824j883281N684261K403248n915678j588632Q691200M704204o696557
10506A9885589k724864R806736N459284q794328m158343J2413159Q009885j0729271
10498B9167847n861367J6769851J3354005j0853833l999854K8961093K3310803
10491I0848545j6656669j137472P5506554P3528853q1227792k33727387j89179606
$$ y = [9004019, 7028680, 9048712, 10175864, 7349474, 5666987, 8165881, 9564742, 6885801, 5839928, 9670078, 12302812, 9799246, 7758201, 10009045, 11189275, 8114781, 6857739, 10671057, 12933266, 10139909, 9268379, 13890911, 16304385, 12269422, 9601480, 12902821, 14534446, 10469705, 9359549, 15387211, 18775995, 14486824, 12603543, 18287804, 20691052, 14775374, 13186742, 21877942, 26582146, 19885589, 17160725, 26967461, 32426745, 23632417, 19474074, 31887233, 39897118, 29167847, 23306480, 40076331, 53430336, 42576503, 38576649, 67537742, 90848545, 74191876, 73054404, 148560958, 222089811, 140862019, -92865368, -282044974]
10484b82044974M267025J20970551P2395843r336871o263266L2762552K3784482
10477d3464658r241348n778041J7462735J2493713p840988l989512J2717680P665929
10469a9974490r012101n456189J0263158Q655757m888474m251524O709937N244253
10461a2709673m956140l357483O256403M657870m626453l480721M864489L250422
10453a0101286n204834l639880N581269N921731j807896k639097L338504K968295
10445e583194l310276l184928K856625L244457j598884j108856L667069K351350
10437b666637l614910l400867K153392K341557k701824k795386K430634L333041
10429d921000j132618k353756J059248J871487r14782j177956J195164O98574
$$ y = [-282044974, -277777949, -156807398, -84411555, -93748426, -100011692, -67249140, -43464658, -52706006, -58484047, -41021312, -28527599, -36368587, -40358099, -27640419, -19974490, -28986591, -34442780, -24179622, -15523865, -20412339, -24663863, -17953926, -12709673, -17665813, -21023296, -14766893, -10109023, -14735476, -18216197, -13351708, -10101286, -15306120, -18946000, -13364731, -7443000, -9250896, -11889993, -8551489, -5583194, -8893470, -12078398, -9221773, -5977316, -7576200, -8685056, -5017987, -2666637, -6281547, -9682414, -7529022, -5187465, -7889289, -10684675, -8254041, -4921000, -6053618, -8407374, -7348126, -5476639, -6391421, -7569377, -6374213, -5675639]
10421e675639j644785l12152K523498M74625l750817k306957K898120L182153
10413d611954j157595j986014J469251K291536m38886r07820J296010R44779j635184
10404d735877j165110J625542J241658j454649q07745K176310J413163k343644
10396d050352k591246Q08577J791198l88077p26613J107522O42471j702326j220120
10387f328966J391822J128235j304520p17996K161170J789707j441372j881842
10379e203762N37885N40806j780484j015199K664373L106090n83734k429674l22880
10370d486579J159093k2406m16584J103338J119103j056119j707329J39983J070554
10361c096946j09007q34772m50937q71155j488512K7404K150274J350546j103350
$$ y = [-5675639, -7320424, -7632576, -5109078, -4634453, -8385270, -10692227, -7794107, -4611954, -5769549, -7755563, -6286312, -3994776, -4433662, -5341482, -4045472, -3100693, -4735877, -5900987, -4275445, -3033787, -4488436, -5296181, -3119871, -1706708, -4050352, -6641598, -5833021, -4041823, -4429900, -5156513, -4048991, -3406520, -5108846, -6328966, -4937144, -3808909, -5113429, -5831425, -3670255, -1880548, -3321920, -5203762, -4665877, -4125071, -5905555, -6920754, -4256381, -1150291, -1734025, -4163699, -4486579, -3327486, -3349892, -3766476, -2663138, -1544035, -2600154, -4307483, -4167500, -3096946, -3205953, -4040725, -4491662, -5362817, -6851329, -6823925, -4673651, -3323105, -4426455]
10352d426455r83023J185986J301545n15697o58516N63635j15130j680274m58443
10343e786372K093048J388968j463691j322648J328515J236396j561527j720890
10335e808201J244576K055032l61671j142115J034261J673764o19091j546181
10327c469626M81807J468203l61059j507442k56022M48285o33127p41395P86772
10318c783604R41893o06932m17139J720776J673941j240098k422825j33003J530866
10309b736125K25827q80608L41679J225157J3114q03391K03364N16429j062588
10300b957142j785367k97722P38580o0233j78272J545898K233711K29200j789816
10291b321163j523146l58386K06473R42865J779712R20134j133360j314273O29855
$$ y = [-4426455, -5409478, -4223492, -2921947, -3437644, -4096160, -3532525, -3647655, -5327929, -5786372, -3693324, -2304356, -3768047, -5090695, -3762180, -2525784, -4087311, -5808201, -4563625, -2508593, -2870264, -4012379, -2978118, -1304354, -1923445, -3469626, -2987819, -1519616, -1880675, -3388117, -3644139, -3195854, -3828981, -4570376, -3783604, -2841711, -3448643, -3865782, -2145006, -471065, -1711163, -4133988, -4266991, -2736125, -2510298, -3390906, -3049227, -1824070, -1810956, -2614347, -2410983, -1894554, -2957142, -4742509, -5040231, -4301651, -4361884, -4540156, -2994258, -760547, -531347, -2321163, -3844309, -4202695, -3996222, -3053357, -1273645, -353511, -1486871, -2801144, -2171289]
10282b171289J293482l56650j199988J63217J020551j03979r38283k77026j19170
10273b689135r89177m03469J835696K167573m90732k299554r03139Q44829L15437
10264b611671p37344l59331P5456m89723k34463J464200J889814j00521j460193
10255b563776k54136Q86365k25709j308643o1956J557759J172996K25041O59315
10246H7256R91280n02833j964929j180040L03960M9962r14430l28855J031131
10237b427498R62256j72911m49395J34391J76214l81583n65636l06925n5832L12745
10227b774174O62896J86519q73116r38379K21188O62524n19442j441241m86157
10218e299382J062377J194348J40427m89355o2926Q52268J370617P03271r62078
$$ y = [-2171289, -877807, -1234457, -2434445, -2271228, -1250677, -1354656, -2292939, -2569965, -2689135, -3678312, -4081781, -2246085, -78512, -569244, -2868798, -3771937, -2927108, -2611671, -3349015, -3708346, -3632890, -4122613, -4357076, -2892876, -1003062, -1103583, -2563776, -2817912, -1931547, -2157256, -3465899, -3527855, -1970096, -797100, -572059, 87256, 1078536, 575703, -1389226, -2569266, -2265306, -2215344, -3129774, -3458629, -2427498, -1465242, -1638153, -2087548, -1953157, -1776943, -2158526, -2724162, -3031087, -3086919, -2774174, -2111278, -1924759, -2797875, -3736254, -3515066, -2852542, -3371984, -4813225, -5299382, -4237005, -3042657, -2902230, -3391585, -3454511, -2602243, -1231626, -528355, -1490433]
10209a490433j881505p67136R12422Q60826l45318l16271R03539J070578k2765
10200a076063l55833K25603j94491j367557p95807J362016J800577k81945j512492
10191b195992r324J575065P85028p90245p89588J67034L55763k19684q23484j326037
10181c271464j218554J26349J439614Q03374o70203n2495K112337K072970p86448
10172E55480k631158j508265q3517l02600l05585J100944J774716O36553P4389
10163f89043J209508J363079q23596k327384r90089O62649K36700l42373Q88479
10154h12070J823074M41371j059568m34469L03644r50973j907975k25176J501644
10145a320498J93379j810217q02295J479888R93077j236221j084916J134343J409033
$$ y = [-1490433, -3371938, -4139074, -3226652, -2365826, -2711144, -3027415, -2123876, -1053298, -1076063, -1431896, -1206293, -1400784, -2768341, -3564148, -2202132, -401555, -683500, -2195992, -2205316, -630251, 154777, -635468, -1425056, -1258022, -902259, -1121943, -1945427, -3271464, -4490018, -4363669, -2924055, -2120681, -2790884, -2843379, -731042, 1341928, 555480, -2075678, -3583943, -3667460, -3970060, -4275645, -3174701, -1399985, -763432, -689043, 520465, 1883544, 1059948, -1267436, -2257525, -1594876, -1358176, -1700549, -812070, 1011004, 1452375, 392807, -41662, 261982, -688991, -2596966, -2822142, -1320498, -1127119, -2937336, -3739631, -2259743, -1266666, -2502887, -3587803, -2453460, -1044427]
10136a044427o97308j606155k97380M01530n77289q89535M65755J370240O41904
10127b232665r8649K95451P70032N58131L58413K89363m97876j566024j280586
10118c404410K90397J151447N55534p6400J36685L60970R9496O0897L64609P1384
10108c89391q34272j037624j83435L25363l60715j105477o02659P14734J524617
10099a948859J398130Q69421L65515j57038p08800r21631m37863L84265N87762
10090e69098j03639o29496j06692N79875J22318q01841m85323P02249P14279m77820
10080a055188n59680R57394J443351m33968k102934j100966J039745J514600N19222
10071B21576j7070J1978m21789q22434j86130N75940P8350q10730m80330L11411
$$ y = [-1044427, -1741735, -3347890, -3645270, -3243740, -3821029, -4710564, -4244809, -2874569, -2232665, -2331314, -2035863, -1265831, -707700, -349287, -59924, -557800, -2123824, -3404410, -3114013, -1962566, -1407032, -1483432, -1346747, -985777, -886281, -825384, -460775, -389391, -1223663, -2261287, -2444722, -2119359, -2480074, -3585551, -4188210, -3473476, -1948859, -550729, 318692, 684207, 527169, -181631, -1103262, -1541125, -1156860, -569098, -672737, -1302233, -1408925, -829050, -706732, -1508573, -1993896, -1291647, -577368, -1055188, -1614868, -657474, 785877, 351909, -1751025, -2851991, -1812246, -297646, 221576, 204506, 216484, -205305, -1027739, -1213869, -637929, -559579, -1370309, -1850639, -1539228]
10061a539228k09277j345768r47627P54475J545393J080007J055073J570427P38984
10052B702459j496940k440948p83536J108179P40695q27368q69939Q48936J946445
10043I27983R92628o29493q19661M33076J215635L50585j102560j482866q42822
10034i57495m98843p13069m37030N03282P52220l32767j386800j014712K80926
10025c804288J214489J480484J280961M04619q88816j261154o8752J236269R76919
10016E70731l27912r17170m05362J19575N6587j97367l78587o12142o76018j42859
10006b910524P92810J401146J155283m0928j749587k686311j539501J103291K726132
9997a748189J847729O981m61228L41253M70997o70074j586409j116970J6901N55475
$$ y = [-1539228, -1748505, -3094273, -4041900, -3287425, -1742032, -662025, 393048, 1963475, 2702459, 1205519, -1235429, -2018965, -910786, -170091, -997459, -1867398, -1018462, 927983, 1920611, 1291118, 471457, 904533, 2120168, 2470753, 1368193, -114673, -957495, -1456338, -2169407, -2606437, -2103155, -1350935, -1683702, -3070502, -4085214, -3804288, -2589799, -1109315, 171646, 576265, -312551, -1573705, -1642457, -406188, 570731, 242819, -674351, -1079713, -960138, -903551, -1100918, -1479505, -2091647, -2767665, -2910524, -2117714, -716568, 438715, 397787, -1351800, -4038111, -5577612, -4474321, -1748189, 99540, 106521, -354707, -13454, 457543, -212531, -1798940, -2915910, -2899009, -2343534]
9987b343534L98451K51737L16461J88165j37730j9285O88464R09234k84980j853610
9977a886627j745857N5296J172704M06318k89364Q88559K214999J043100j538595
9968C20533j986000K09908J791038Q18617q42847j047935l30233K3650K29901
9959h13368P35698Q50267K19025j50716K87296N01410j51775o07077m0051N87350
9949A418059L04804j73909L2308K82643k49179q74517n56869K87297N79339L02868
9939A352844J56511J98674J0151k86854j67612L63460O54683K35366m50170l09322
9929A757731J000547K097397J386337l70818p57091N10936Q73482q13103k120825
9920C564593j144187K10933k38120j064579j97134J112272J027844Q57327J896336
$$ y = [-2343534, -1945083, -1693346, -1376885, -1188720, -1326450, -1345735, -657271, 251963, -33017, -1886627, -3632484, -3577188, -2404484, -1998166, -2287530, -1398971, 816028, 1859128, 320533, -1665467, -1455559, 335479, 1154096, 311249, -736686, -1066919, -1043269, -813368, -77670, 772597, 991622, 840906, 1128202, 1629612, 1477837, 870760, 830709, 1418059, 1722863, 1548954, 1581262, 1863905, 1614726, 740209, 183340, 470637, 1049976, 1352844, 1509355, 1708029, 1718180, 1431326, 1263714, 1627174, 2281857, 2517223, 2067053, 1757731, 2758278, 4855675, 6242012, 5871194, 5114103, 5625039, 6498521, 5685418, 3564593, 2420406, 2631339, 2393219, 1328640, 1131506, 2243778, 3271622, 4128949, 6025285]
9911F025285J887177n50019j734422R76710L068668J37653l004863L27582N965059
9902A3098830M382184m007092j1577272j8795614l0659628l8028558k2714007
9895a08301157J2179723L6459850K9663758P808176j297770M511230P191733Q31681
9887a0952776l165695N10452L325174L15946j986459P65141L129996R80554j281999
9878h359666J84710J928418N88725j056856j07240J291974Q85283L16330P80493
9869c547829M13491j094127r63272J037344J231315j210865k163634J07080J595408
9860d595089k68840k019194m41118J932172J645355n9747m76472j63876n82894
9851e029703o83371M93366J121641j32196j252051l77586Q88971O15557m9542
$$ y = [6025285, 7912462, 7362443, 5628021, 6604731, 9673399, 9811052, 6806189, 7133771, 13098830, 17481014, 13473922, 1896650, -16898964, -47558592, -85587150, -108301157, -96121434, -59661584, -29997826, -22189650, -23487420, -18976190, -11784457, -10952776, -14118471, -13608019, -10282845, -9966899, -11953358, -11188217, -8058221, -7077667, -8359666, -8174956, -6246538, -5657813, -6714669, -6821909, -5529935, -4644652, -4328322, -3547829, -3134338, -4228465, -5191737, -4154393, -2923078, -4133943, -6297577, -6190497, -4595089, -4863929, -6883123, -7324241, -5392069, -3746714, -3806461, -4282933, -4446809, -5029703, -5713074, -5219708, -4098067, -4230263, -5482314, -5859900, -4970929, -4355372, -4404914]
9842d404914N00112J204842O69645j29897j08511k72587j160670j032885P38771
9833c996094J497040n17281k646123j722508R54785J920157Q15458O346L97705
9824c290515P91982N10690K8513l73269o20011k52472O76166J082066M36958l34726
9814a344618n20407o39668q72738l29245J013046J577371O19301m83619n37664
9805a518241k19313l48235m70192k67924l45283n77454J18487J358707J109883
9796a159565q55183j914669n06431J451046J719520Q75800M53428K68141l98570
9787f6483r55448p69756n19525o56810l52368N82435P71584k42018p72910J57962
9777b823337J004847M39099l76854j10881M05209J31485j14738L94003N05675
$$ y = [-4404914, -3904802, -2699960, -2030315, -2160212, -2268723, -2541310, -3701980, -4734865, -3996094, -2499054, -3016335, -5662458, -7384966, -6430181, -4510024, -3694566, -3688220, -3290515, -2498533, -1987843, -1959330, -2332599, -2952610, -3205082, -2528916, -1446850, -1009892, -1344618, -1865025, -2504693, -3377431, -3706676, -2693630, -1116259, -496958, -980577, -1518241, -1737554, -2085789, -2555981, -2823905, -3169188, -3746642, -3628155, -2269448, -1159565, -2014748, -3929417, -4435848, -2984802, -1265282, -389482, 63946, 332087, -66483, -1021931, -1791687, -2311212, -2968022, -3320390, -2737955, -1966371, -2208389, -2981299, -2823337, -1818490, -1379391, -1756245, -1867126, -1461917, -1330432, -1445170, -1051167, -545492]
9768e45492m64518q25287O31927J988204J084698q19412j108525M1761M93301
9759D76657j00235k79751K70586M44320p9675o11195r91837j414401j266817k0910
9749c573258J297925J296056L17215k36886n7428J38528J42182J92728K4456n84783
9739a043265r22206k96814P41210J249389J181159Q24498j3186j139548j422553
9730h41316l74068P42505O26459k57627p60756q10373q45800o12887J46592P69481
9720b217790O55543K77798K07209J51207j51806k70545j35369l69035p76794j91343
9710b820925J241341J567819O8976j222933o21561N64615L56456p12468q71059
9701b449739j20124K36911R408K1585L76587N41374M97361M80235L55980K20029
$$ y = [-545492, -1010010, -1835297, -1203370, 784834, 1869532, 1050120, -58405, -16644, 476657, 376422, 96671, 367257, 811577, 731902, 120707, -871130, -2285531, -3552348, -3573258, -2275333, -979277, -662062, -898948, -956376, -817848, -675666, -482938, -458482, -1043265, -1965471, -2262285, -1521075, -271686, 909473, 1733971, 1720785, 581237, -841316, -1215384, -472879, 153580, -104047, -864803, -1675176, -2520976, -3133863, -2987271, -2217790, -1562247, -1284449, -1077240, -926033, -1077839, -1348384, -1483753, -1852788, -2629582, -2820925, -1579584, -11765, 57211, -1165722, -1787283, -1222668, -866212, -1578680, -2449739, -2569863, -2332952, -2323544, -2301959, -1925372, -1383998, -886637, -406402, -50422, 169607]
9691A69607M98873P12803k20983j644368j294371J017499K322978P81376j450516
9682H92898j709185o97924l85407m13674M57680J339102P88623k38275j10405
9673g6567L32816n02700j600592j043280K59356J27737p44485m2447J596633J362825
9663c30704o55144j328892K65583J428263M76114q36224p46140j17110j62523
9654b006777k49031M23120J089461Q47965J58251k10977l04780k82121K5193L46264
9644a63432J35496k64373q7803K56494k22333j041076p99495K78255N98716K2974
9634a286577q986O44214M81289o50656r76220L1833O32981k1995m39805K60550
9624a333372O65122j09267n62220L33006R41333j34410j279681n84840O69702
$$ y = [169607, 668480, 1381283, 1160300, -484068, -1778439, -760940, 1562038, 2343414, 892898, -816287, -1514211, -1899618, -2313292, -1855612, -516510, 272113, 33838, -76567, 256249, -246451, -1847043, -2890323, -2630967, -2503230, -3247715, -3290162, -1693529, -330704, -985848, -2314740, -2049157, -620894, -144780, -981004, -1727144, -1844254, -2006777, -2255808, -1832688, -743227, 104738, 262989, 52012, -252768, -534889, -509696, -163432, -27936, -292309, -380112, -123618, -345951, -1387027, -2186522, -1908267, -1309551, -1286577, -1295563, -651349, -170060, -820716, -1796936, -1765103, -1132122, -1154117, -1593922, -1333372, -668250, -777517, -1339737, -1006731, -65398, -199808, -1479489, -2064329, -1394627]
9615a394627J90298j228185j024307O50054J150315j79315j007214K205J091564
9606a749212M00009j204527j686084o66984O82069J505506J734663J355163L54897
9597G25500p97282j380941j131191m01202K70529O19095Q17918J130042J255087
9588A107555M71182j066461j809287o80960R84441R24569o61661j122388O30458
9579a222552K150757R65396j644041k497859j092177J83234L5069j92087N99695
9570b714565J326024Q17420j04920j07744N28485P02954K84046k35632q32972
9561c36904j397508j147337J5240O79673L569n78937M08158J721815J224768m28016
9551A64521p02655O08996J099345j44443j152244n67056K90163Q0184l52050J6940
$$ y = [-1394627, -1204329, -2432514, -3456821, -2806767, -1656452, -1835767, -2842981, -2840776, -1749212, -1349203, -2553730, -4239814, -4906798, -4224729, -2719223, -984560, 370603, 725500, -71782, -1452723, -2583914, -2985116, -2714587, -2095492, -1277574, -147532, 1107555, 1578737, 512276, -1297011, -1977971, -993530, -68961, -730622, -1853010, -1222552, 928205, 1893601, 249560, -2248299, -3340476, -3157242, -3122173, -3314260, -2714565, -1388541, -571121, -676041, -783785, -255300, 447654, 731700, 496068, -336904, -1734412, -2881749, -2866509, -2186836, -2183267, -2762204, -2354046, -632231, 592537, 164521, -538134, 70862, 1170207, 1025764, -126480, -693536, -403373, -323189, -675239, -658299]
9541f58299L76223j57413o13242J04957J065685P89923l14711q12332n05596j24403
9531h49208K80068Q87883R54892o5178r90733l99657R29239J027236j73028q03752
9521G97762r2458O02216J79723n80276n36992O7675K94536k7762m00115n83316
9511b79007o57742n46816j46978K69242L38843K33189M79549J028982J005270
9502A724532j27193j423663j306017K83157J483045Q72326o23175j148477n24074
9493g89539r0076l70145m91094L2641M85035K83183j79497m39471n58361m66725
9483b584049J35042Q92120R63906L57038r0065k03899n54159q87877k14461J128693
9473a057711J380176Q3933r38149l78185N60691K82009o41598n96001M99578J272671
$$ y = [-658299, -282076, -439489, -1052731, -947774, 117911, 907834, 593123, -219209, -724805, -849208, -569140, 318743, 1273635, 1208457, 217724, -181933, 747306, 1774542, 1601514, 797762, 705304, 1307520, 1487243, 906967, 369975, 437650, 732186, 704424, 304309, -279007, -936749, -1483565, -1630543, -1361301, -1022458, -789269, -309720, 719262, 1724532, 1597339, 173676, -1132341, -849184, 633861, 1506187, 883012, -265465, -789539, -879615, -1249760, -1740854, -1708213, -1223178, -939995, -1119492, -1558963, -2117324, -2584049, -2449007, -1556887, -592981, -235943, -326008, -529907, -1084066, -1971943, -2186404, -1057711, 322465, 406398, -531751, -909936, -349245, -67236, -708834, -1304835, -805257, 467414]
9463D67414Q67883l14769j301186j253006j93682O19627Q9135q38088k83585J358302
9453g81955J541403m14176j953432j250668J4843k33021r60427j32622J552463
9444b617592J858991O74713k70391m57656p26325j016564n19368L04669K39511
9435b530012m04929k67701N20831N37001k41463k35601R35313J576661N06764
9426C96864j168815j681302q05207K87883O10766K36145o4427J68659M75116K44913
9416a299405o7804M35373J207035O42409j091027j621710N9587J681028J077617
9407A023103m84266o34920J90890n9022j224993j354868l04702J07192n97571
9398c339157r07036j49798N56391N46834N34337Q51031P92462J77209k20317j48640
$$ y = [467414, 1335297, 1020528, -280658, -1533664, -1727346, -1107719, -1018584, -1856672, -2140257, -781955, 759448, 345272, -1608160, -2858828, -2843985, -3077006, -4037433, -4170055, -2617592, -758601, -83888, -354279, -811935, -1538260, -2554824, -3074192, -2769523, -2530012, -2934941, -3202642, -2681811, -2144810, -2386273, -2621874, -1686561, -109900, 396864, -771951, -2453253, -3258460, -2970577, -2359811, -2123666, -2188093, -2019434, -1544318, -1299405, -1367209, -931836, 275199, 917608, -173419, -1795129, -1735542, -54514, 1023103, 538837, -96083, 94807, 35785, -1189208, -2544076, -2848778, -2741586, -3339157, -4246193, -4395991, -3839600, -3292766, -2758429, -1907398, -1114936, -937727, -1158044, -1306684]
9388a306684j73446l47795k12826r6832o46202j165349m08930J021345J273154
9379b063565L28155N3508P87734N54129j327310k442455p99057J878058K435870
9370e94933N98254j078938r06496J94877O15873J79147j74360N9076M29742M23253
9360b54505K81585N14774Q31056L46078r11497j597045q14889M70457O98704j68608
9350f03890q15852n16163J18400K48565j45085m11625l1553O92037P76988j31411
9340h19589q56497j68278J032832O99984j047669j758861m66443P51184K65895
9331b367442n52207r8632N99878J43810l57680N14300J368342K98578j314729
9322a765782q60740Q42139P92278r57218j343988M23110J607190O25925o58994
$$ y = [-1306684, -1480130, -1827925, -2040751, -2137583, -2783785, -3949134, -4358064, -3336719, -2063565, -1735410, -1681902, -894168, -340039, -1667349, -4109804, -4908861, -3030803, -594933, 3321, -1075617, -1982113, -1787236, -1171363, -992216, -1166576, -1107500, -677758, -254505, 27080, 541854, 1372910, 1718988, 807491, -789554, -1604443, -1133986, -435282, -603890, -1419742, -1935905, -1817505, -1568940, -1714025, -2125650, -2157203, -1465166, -688178, -819589, -1676086, -1844364, -811532, -111548, -1159217, -2918078, -3384521, -2633337, -2367442, -2919649, -3018281, -2418403, -2274593, -2632273, -2117973, -749631, -451053, -1765782, -2626522, -1784383, -992105, -1949323, -3293311, -2870201, -1263011, -637086, -1296080]
9313a296080m81154J98480O1996k40173K33786P85684L81219n82892r89585m11362
9303b340081P60331J568347R04400r87689j839001m9183K419804K223616n34077
9294B126467k373970j456036L65933J002669P19203L45267l41004j165502r08329
9285a685302N02689J218903K11544j093844j141429l97648J0115Q8321K35560
9276b051091K86361L43492J007366J844901J308033p96174k411596j931386k84354
9267b684448P46523Q26391N96597K73448j29601k61332m4981Q1164N5085K44163
9257b96991L49464l27535j257936j003894M08727J209027N44138l64032l99325
9248a138357r2873j69052k52507N9777L28290K83192L34990M79780J37072m55218
$$ y = [-1296080, -1777234, -1578754, -1516758, -1756931, -1523145, -737461, -356242, -939134, -1928719, -2340081, -1579750, -11403, 892997, -94692, -1933693, -1982876, 436928, 2660544, 2126467, -247503, -1703539, -1337606, -334937, 384266, 729533, 388529, -776973, -1685302, -1182613, 36290, 247834, -846010, -1987439, -2385087, -2374972, -2286651, -2051091, -1764730, -1421238, -413872, 1431029, 2739062, 1942888, -468708, -2400094, -2684448, -1937925, -1111534, -514937, -241489, -371090, -632422, -677403, -596239, -541154, -296991, 52473, -275062, -1532998, -2536892, -2128165, -919138, -375000, -739032, -1138357, -1231230, -1400282, -1652789, -1593012, -1264722, -981530, -646540, -166760, -29688, -484906]
9238d84906k67381O51655R94051L21704l35232l85154l71974m48351j16386K04629
9228b37345m90730j545805j093961P37141J576710M61435p98014p11192k867M50877
9218a653751Q97416R67219m51045k415400k085794P67187K531851J015997j126935
9209a553255p10620J071493J080188o24161j375887k94333R83381J268506R90571
9200H35883P25351M29860o4407q89354j895752k042500l50939J983749K311851
9191A043742K13016j616567j208627J72276N88117J37865l15597p59389q66545
9182b611709L37515K112349J969499l31706j687446m72386P71365j36509j216133
9173a265161j47302J367688P61271p15865n17606M31048k15239j472947q38374
$$ y = [-484906, -752287, -100632, 893419, 1215123, 879891, 494737, 122763, -325588, -441974, -237345, -728075, -2273880, -3367841, -2630700, -1053990, -592555, -1390569, -2101761, -2104628, -1653751, -756335, 210884, -240161, -2655561, -4741355, -3974168, -1442317, -426320, -1553255, -2263875, -1192382, -112194, -736355, -2112242, -2406575, -1423194, -154688, 835883, 1561234, 1991094, 1926687, 1037333, -858419, -2900919, -3251858, -1268109, 1043742, 1256758, -359809, -1568436, -1396160, -808043, -670178, -985775, -1745164, -2611709, -2274194, -161845, 1807654, 1475948, -211498, -683884, 87481, -49028, -1265161, -1412463, -44775, 716496, 631, -516975, -85927, -301166, -1774113, -2612487]
9164b612487Q13177P62523m17269p164J504937J122967j023098j662050j15701
9155a634165P38724j97896n89704O26302J276461J96334n76652K76891Q27549
9146I43844n29866k012182j366976M85474J103660J62222o64209l82878L94347
9137a866564O10894p4093q40418l67392J254696J870946P5208k097161j652080
9128c085964P05169J422697l15857j321137L19753K106552J192889j204145j942440
9119b122483n66636P82732Q76779L97988J46n06255j030476q77006R7832R85562
9109a961817R09842J73883n0352P71124J590250R27132r20712j816781o25190
9100a002621R96748R10600l82068o96471L90757J138112N63270l03998m10262
$$ y = [-2612487, -1799310, -1036787, -1454056, -1461220, 43717, 1166684, 143586, -1518464, -1634165, -895441, -1093337, -1683041, -1056739, 219722, 416056, -160596, 116295, 943844, 413978, -1598204, -2965180, -2479706, -1376046, -1213824, -1878033, -2260911, -1866564, -1255670, -1329763, -2170181, -2537573, -1282877, 588069, 663277, -1433884, -3085964, -2380795, -958098, -1273955, -2595092, -2275339, -168787, 1024102, -180043, -2122483, -2689119, -1906387, -1029608, -631620, -631474, -1137729, -2168205, -3045211, -2947379, -1961817, -1051975, -878092, -928444, -157320, 1432930, 2360062, 1439350, -377431, -1002621, -5873, 904727, 522659, -173812, 216945, 1355057, 1918327, 1614329, 1204067]
9091A204067q6225P4385K04429M34019M14211N3589k99242o30992j177297j532026
9081a341082j022040K7080O18477O05501O09760O09621Q3097n99029n33099N1025
9071h90689J41552j61056O8452N08663o9625j269704j198794L71542J315473M86965
9061f97221m98821m9453Q48647M52031q82962j384950m94191O72556J005022N17440
9051e11902O6749M48246J415142J627784L46549j104814q72857O22326J144462
9042C181685k8727j230459j261961r55713j053361o98116O37141J616854J042089
9033A249432j39504m48252j71439l69642p53720l76734M00641M35898k48688o56847
9023a078855n22391l51109j92121J72687K44066m13573p53583N76834K647162
$$ y = [1204067, 1117842, 1192227, 1396656, 1830675, 2244886, 2298475, 1999233, 1368241, 190944, -1341082, -2363122, -2336042, -1717565, -1112064, -502304, 107317, 190414, -408615, -941714, -890689, -749137, -910193, -841741, -333078, -402703, -1672407, -2871201, -2499659, -1184186, -697221, -1196042, -1245495, -396848, 55183, -827779, -2212729, -2706920, -2034364, -1029342, -511902, -445153, 3093, 1418235, 3046019, 3392568, 2287754, 1414897, 2037223, 3181685, 3152958, 1922499, 660538, -295175, -1348536, -2046652, -1409511, 207343, 1249432, 1109928, 661676, 490237, 120595, -633125, -1009859, -609218, -173320, -422008, -1078855, -1601246, -1952355, -2144476, -1971789, -1727723, -2141296, -2894879, -2318045, 329117]
9014C29117K787709K92830k192873k068446j61078P51367j21414r66312n17626
9005a866726J27243l91104j310845r14071P33147J851973J532981O05900j90259
8996A78239j140822k073352j751724N8397J448569Q65172m54385l42422R56852
8987b255476J393011M90538j62794K27936N60965M7872m44871n0059O81477Q67513
8977A356112N36273K8810o83497j352666j218196k06355N81699L51293k67136
8968h73663l29975J3173Q6175j5220L09582R12520Q43964l27578j698168j862266
8958b941456n00721J123707J542073P94202J44661R0738k65461j365724j995166
8949c373147j061171M79308R56922M63942L00990N58970K33004m90751k07531
$$ y = [329117, 3116826, 3409656, 1216783, -851663, -1012741, -261374, -382788, -1349100, -1866726, -1739483, -2130587, -3441432, -4355503, -3622356, -1770383, -237402, 368498, 178239, -962583, -3035935, -4787659, -4729262, -3280693, -2415521, -2869906, -3212328, -2255476, -862465, -371927, -534721, -306785, 254180, 302052, -142819, -192878, 488599, 1356112, 1892385, 1921195, 1237698, -114968, -1333164, -1539519, -957820, -606527, -873663, -1203638, -1190465, -1104290, -1119510, -809928, 102592, 946556, 618978, -1079190, -2941456, -3442177, -2318470, -776397, 17805, 162466, 253204, -12257, -1377981, -3373147, -4434318, -3955010, -2998088, -2534146, -2233156, -1674186, -1441182, -1931933, -2139464]
8940b139464J178955J895495Q98658o44090j216944q45722l39573N2828L57635
8931h02222L22487P934P3494P21791J102952M68546o73205j151432m78216P40844
8921C32973J380703P04228q40425j784434j132245M63055J536885J435927M86343
8912B583010p81295j644097j223211K19412Q16470n02612j934033j091934J245445
8903b312845K071598O29087o73395j73186P90959M15719r79234j999198k021262
8894d251757j018260P92852K231784J777336j32026j075238N5508J377617Q00373
8885E58189j047889k002745j238067L13584J431075J439142M51312m31130q0575
8876f07104R93833J128896K9560p74366n14307l04206p94082p90179M03372J254297
$$ y = [-2139464, -960509, 934986, 1833644, 1189554, -27390, -873112, -1212685, -1159857, -802222, -479735, -471801, -398307, 323484, 1426436, 1894982, 1221777, 70345, -407871, 332973, 1713676, 2417904, 1577479, -206955, -1339200, -876145, 660740, 2096667, 2583010, 1801715, 157618, -1065593, -846181, -29711, -532323, -2466356, -3558290, -2312845, -241247, 387840, -285555, -458741, 332218, 747937, -231297, -2230495, -4251757, -5270017, -4477165, -2245381, -468045, -600071, -1675309, -1619801, -242184, 558189, -489700, -2492445, -3730512, -3416928, -1985853, -546711, -95399, -526529, -607104, 386729, 1515625, 1545185, 770819, 256512, -47694, -841776, -1631955, -1228583, 25714]
8866B5714M47697o18855M1111J601895J509386o18872k385008j885084J32642
8857a749374J600907J404576J02395q39145m70846N78369P77359k95358j340901
8848b32018j183748k92557K32137K42590K14199J46321j96949n21730l80001J12431
8838a859325N74924Q64580P86924K5023j062890j335718k46153J279335J892587
8829I19287J195678k66289j635064k052847j198506J53246R02097J048476J347232
8820D13310J614351Q48972p84485j756886j404500p37610n16707k37140L36351
8811b224344M21430j73319m36042k2256K5572o59611q59763J9483P51665N05749
8801b651436L03228Q86753J113585R0824r57765p21791L3332J22761L6203M87837
$$ y = [25714, 473411, -145444, -104333, 1497562, 3006948, 2388076, 3068, -1882016, -1749374, -148467, 1256109, 1358504, 519359, 48513, 626882, 1404241, 1108883, -232018, -1415766, -1708323, -1476186, -1233596, -1019397, -873076, -1070025, -1591755, -1971756, -1859325, -1284401, -419821, 367103, 392126, -670764, -2006482, -2252635, -973300, 919287, 2114965, 1848676, 213612, -1839235, -3037741, -2884495, -1982398, -933922, 413310, 2027661, 2876633, 2092148, 335262, -1069238, -1806848, -2323555, -2560695, -2224344, -1802914, -1976233, -2412275, -2434531, -2408959, -3068570, -3928333, -3908850, -3157185, -2651436, -2348208, -1461455, -347870, -257046, -1214811, -1936602, -1903270, -1780509, -1744306, -1256469]
8791a256469O09054l16702r45873K6933J317975R75177m20398q96434l32270j05637
8781a344644m00735k92981J66844K00114J4531K52215M77222J32839J0359P41084
8771d3152J047922j80012j373781n56129J059162Q18405r12036j376148l9037
8762a554806Q58061K95362l12900j65017j55050m55462l8735Q34683N90623n93462
8752f96703o59596O94322J309810L97109j16661O91400R26390m76592j426491
8743F42988k77775J041532K36317j345891r94096Q08644J385205L36501l09146
8734A524279J9396l23599j780894k399699j045845O04176O74547j49706j09661
8725b987006P05065Q00042l2921m11570K43982P92387L99891m5278M31821J068486
$$ y = [-1256469, -647415, -964117, -1909990, -1883057, -565082, 410095, -10303, -906737, -1239007, -1344644, -1745379, -2038360, -1871516, -1671402, -1656871, -1404656, -927434, -794595, -784236, -43152, 1004770, 824758, -549023, -1105152, -45990, 772415, -139621, -1515769, -1554806, -696745, -401383, -714283, -879300, -1034350, -1489812, -1528547, -693864, -103241, -696703, -1356299, -661977, 647833, 1044942, 928281, 1619681, 2546071, 2069479, 642988, 365213, 1406745, 1643062, 297171, -696925, 111719, 1496924, 1833425, 1524279, 1543675, 1220076, -560818, -2960517, -4006362, -3402186, -2727639, -2877345, -2987006, -2281941, -1481899, -1514820, -1926390, -1682408, -890021, -490130, -535408, -103587, 964899]
8715I64899N97436n30759q65210m52253o64095j520781j328810L87799J668907
8706a742867R87862m44817p25216r7737k0335n47412n20728L37650J217254J594385
8696C8039J390110L81932j108530j628454k66235J629983J934635M91183j013723
8687A848940j389705q15940k718K23113p20652j976110j555800P10761K085132
8678a592979P36739j079641l50878J766034J788373l24940j211192K53407J401943
8669A386866N30261n95347k93125K93853k67164j133942r69018j50924L62403
8660h36137N44114M37941l65640j343785j088111K80371Q40945J652m24755N51175
8650a402230J284095M61453n47004k01429N52946K49636m39217k55325J34966
$$ y = [964899, 1562335, 1031576, 166366, -285887, -949982, -2470763, -3799573, -3411774, -1742867, -755005, -1199822, -1925038, -2022775, -2043110, -2590522, -3111250, -2773600, -1556346, 38039, 1428149, 1810081, 701551, -926903, -1193138, 436845, 2371480, 2862663, 1848940, 459235, -356705, -359423, -136310, -856962, -2833072, -4388872, -3678111, -1592979, -856240, -1935881, -2286759, -520725, 1267648, 942708, -268484, -15077, 1386866, 1917127, 1321780, 1028655, 1322508, 1055344, -78598, -1047616, -1198540, -836137, -292023, 145918, -219722, -1563507, -2651618, -2371247, -1530302, -1528650, -1953405, -1402230, -118135, 343318, -203686, -405115, 147831, 397467, -41750, -297075, -162109]
8641a62109m66205j275827p62057O78319J445032J210129O76242j61548j452849
8632b70873k085089j014205O09414P35618n53346j236208l48323R72519J376168
8623a814325P83616j5044j96488M77210J178149P64519m13795o39885M41235Q75203
8613A440395m78657j711614p56506J130110J313459k2934m91437M14986Q59879
8604A697681J09025m86015k42103k00598q29599j067965m44103k4985l98914o24917
8594b512493o7989M86775M39237M19873Q22707R07314L27786j6699K98958K33989
8584A339458p66292j362767l89576R83167R21116k15052n97141Q1118L57275l62522
8574a1216q70250k87710N11409M25602j49586j53727L61903M25067j96192n93171
$$ y = [-162109, -628314, -1904141, -2666198, -1987879, -542847, 667282, 1343524, 1181976, -270873, -2355962, -3370167, -2760753, -2025135, -2578481, -3814689, -4163012, -3190493, -1814325, -1030709, -1045753, -1242241, -765031, 413118, 1177637, 763842, 123957, 565192, 1440395, 961738, -749876, -1506382, -376272, 937187, 914253, 422816, 837802, 1697681, 1806706, 1320691, 1078588, 877990, 48391, -1019574, -1463677, -1488662, -1887576, -2512493, -2580482, -2093707, -1654470, -1234597, -411890, 495424, 823210, 806511, 1105469, 1339458, 573166, -789601, -1179177, -196010, 725106, 510054, -87087, -5969, 351306, -11216, -881466, -1169176, -657767, -232165, -381751, -535478, -173575, 251492, 55300, -537871]
8564e37871j07001O98545Q35731J42171o95835j006840n80244M20430J413484
8555E82570J506797L91222r23727j087596k21703J86758m93968j042954l53310
8546a455911O77231M77137o83455j076521k16983M72925L2335n39882l466J066734
8536a249856J131025j0706r60778o50113M43608J145530R41024K24991l24921
8527F89804l29428Q3637M48061M43876K06868j6971l53116r88162j465833j005969
8517b287233K31616R50463L46950p10837r26310m15127j88819k17032M52127J581491
8507a182711J537204r9392j385421p27509O61779O61771m85234q08433J07524
8498a720422P03811K50056j64795J07342J08629p28293j222507l43241R07755
$$ y = [-537871, -644872, 53673, 889404, 1031575, 335740, -671100, -1251344, -830914, 582570, 2089367, 2480589, 1556862, 469266, 247563, 434321, -59647, -1102601, -1455911, -778680, -301543, -984998, -2061519, -2278502, -1805577, -1773242, -2313124, -2316590, -1249856, -118831, -129537, -1090315, -1740428, -1296820, -151290, 789734, 1014725, 689804, 360376, 444013, 892074, 1335950, 1542818, 1525847, 1172731, 184569, -1281264, -2287233, -2055617, -1105154, -758204, -1469041, -2395351, -2810478, -2999297, -3216329, -2764202, -1182711, 354493, 255101, -1130320, -1857829, -1196050, -534279, -1019513, -1827946, -1720422, -1016611, -766555, -931350, -824008, -715379, -1443672, -2666179, -3009420, -2101665]
8489b101665R10808k22965j053605q91413k27762M29687R47520J034498M06636
8480g68261n02519q09338k74031L92646M11854j53303m22087L49207J695768K116611
8470B036547Q47593q81188j287983m92376k10090r82358j372400m51851O32298
8461b161808O26753K07558O32611J499531J431457K72258q88302j372451j258037
8452a010430n42146O69998J459852R13118m58712j205074p47419J83413O90146
8443d7254M65114k68754q15978m75607L78657M78043l06038l25039J190237K256861
8433B530242R15613j291155j250267Q77943J724966j67934k263222k013214l10283
8424a247311N42348K07927j22223m0692o729q0076n5468j17898k39755J77356
$$ y = [-2101665, -1190857, -1413822, -2467427, -3358840, -3586602, -3156915, -2209395, -1174897, -768261, -1270780, -2080118, -2354149, -1961503, -1549649, -1702952, -2125039, -1775832, -80064, 2036547, 2884140, 2002952, 714969, 222593, 12503, -969855, -2342255, -2794106, -2161808, -1535055, -1327497, -694886, 804645, 2236102, 2508360, 1620058, 247607, -1010430, -1552576, -882578, 577274, 1490392, 1031680, -173394, -920813, -737400, -47254, 417860, 149106, -666872, -1142479, -763822, -285779, -591817, -916856, 273381, 2530242, 3445855, 2154700, 904433, 1782376, 3507342, 3339408, 1076186, -937028, -1247311, -704963, -497036, -619259, -659951, -666680, -746756, -802224, -920122, -1159877, -982521]
8414i82521J012762R28722n38197j598389o08291J183861J329980q0581p28234
8405h0888Q0864M37800p15584j606201m91363J383953J597506J87162n89447K83076
8395D86878J348442J119535K0464p78681j079593j226015r96459j44966N87194
8386f63201K97095n41179o50689K8899K79823k49790l37177P46730J860318J717186
8376B488015Q20233L58560J34208p59077j788285j457368P0922P49307l97575
8367B18940j737054j388798J70880J052663O16898j21419l27264l03757n35919
8358b354830p54794m01210M09964Q32296K52012q31465j173470k33034J066909
8349c187622J500304J131640R36759J023690M41014r58087j762582r36776N12524
$$ y = [-982521, 30241, 958963, 420766, -1177623, -1785914, -602053, 727927, 647346, -80888, -24, 437776, -277808, -1884009, -2375372, -991419, 606087, 793249, 203802, 486878, 1835320, 2954855, 2975319, 2196638, 1117045, -108970, -1105429, -1250395, -663201, -366106, -907285, -1557974, -1529075, -1249252, -1499042, -1836219, -1089489, 770829, 2488015, 3308248, 3666808, 3801016, 3041939, 1253654, -203714, -132792, 616515, 218940, -1518114, -2906912, -2736032, -1683369, -1066471, -1187890, -1515154, -1818911, -2354830, -3109624, -3510834, -3100870, -2268574, -2016562, -2848027, -4021497, -4254531, -3187622, -1687318, -555678, 381081, 1404771, 1845785, 887698, -874884, -1811660, -1299136]
8340a299136Q80340M7804p52234r06023q08973n50725K99203J399125J512078
8331a78541K81844r19485p17940M05525Q49699Q1922p77440n36530N64381J198170
8321B51605N51833o85215j074939j57865R13352Q01142k92839j004045p34419
8312a431390k38601j18017J30462Q96341J315780M82841q34798j029092J3256
8303h13218P60703L55685k22552J78323J141901J386062N10895p13427j372148
8294A212224j129309l09334K64218o7667q72733r05428J98678J176436P99059
8285C66144l70838q38911k95825K51658J86109r5115k25197l42984l55068J35524
8275a584503Q24170P03318m08998j266487p73883N49820J339094J032742J39764
$$ y = [-1299136, -418796, -370992, -1123226, -2029249, -2838222, -3388947, -3089744, -1690619, -178541, 103303, -816182, -1534122, -1128597, -278898, -196976, -974416, -1510946, -946565, 251605, 803438, 118223, -956716, -1114581, -201229, 599913, 307074, -696971, -1431390, -1669991, -1788008, -1657546, -761205, 554575, 1037416, 202618, -826474, -813218, -52515, 303170, 80618, 258941, 1400842, 2786904, 3297799, 2584372, 1212224, 82915, -226419, 37799, -29868, -902601, -1808029, -1609351, -432915, 366144, -4694, -843605, -1139430, -887772, -701663, -796778, -1021975, -1364959, -1720027, -1584503, -760333, -57015, -466013, -1732500, -2506383, -1956563, -617469, 415273, 555037]
8266E55037o36555r00772n58272J09034N63628N56676K93838p3300n70857q31199
8256a492742k16705J002408J448270L99711r53632j002030O2109O40671P6959
8247c4981o07585m04506L59362P70855N68335J35078j79044k44365k8708K83366
8237F17807K75800k32206q24721q91649l64991J79982K22105p7642j36829J98470
8227a033874L81001m4735o68139o88217l5216N53247O12740M89781N92838O93343
8217H52769L35765m73788j298074j646563j189499r1126P74353O33971n364J00660
8207b006896R37821R97830k97491j314171n80697Q00582Q82299R0310M34332J821931
8197A765850J791327m92106k487757j934745j86447J22008p77420n44714J039908
$$ y = [555037, -81518, -982290, -1540562, -1431528, -867900, -311224, -17386, -90686, -661543, -1492742, -1709447, -707039, 741231, 1140942, 187310, -814720, -752611, -111940, -34981, -642566, -1047072, -687710, 83145, 651480, 786558, 607514, 363149, 334441, 617807, 893607, 661401, -163320, -1054969, -1419960, -1239978, -1017873, -1095515, -1232344, -1033874, -652873, -697608, -1365747, -2053964, -2089180, -1535933, -923193, -433412, 159426, 852769, 1188534, 714746, -583328, -2229891, -3419390, -3510516, -2736163, -2102192, -2107556, -2006896, -1069075, -71245, -368736, -1682907, -2263604, -1463022, -580723, -490413, -56081, 1765850, 3557177, 3065071, 577314, -1357431, -1543878, -1421870, -2199290, -2744004, -1704096]
8188a704096J519470j04870j382484q1622K161375K099702l10729j922900j076788
8179h02942L28064K10463n90775k25114R22321J096832K69460n3388K70988j83018
8169A242891j521301j929524p12837M11381K45482Q7253J093781J773654M49743
8160A140523j400370j113687P80772J234941m77557j711660p59537P38022Q72638
8151f95915L62617O14104R75337J13928j254993j325059j43194N70561K33070
8142e49544j7285M02697N92887j7528o01577m36215j02474k64063l93931J75071
8132a211962Q32298O10341p5060k2392O77657O53202n19663j527378j254831k59763
8122b097551L94037O40622Q27389O47907j60598q24743n22140K11150L33089j6120
$$ y = [-1704096, -184626, -289496, -1671980, -1753602, 407773, 2507475, 2196746, 273846, -802942, -474878, -264415, -855190, -1080304, -157983, 938849, 1208309, 1154921, 1425909, 1242891, -278410, -2207934, -2920771, -2509390, -2263908, -2176655, -1082874, 690780, 1140523, -259847, -1373534, -592762, 642179, 164622, -1547038, -2306575, -1568553, -695915, -333298, 280806, 1256143, 1370071, 115078, -1209981, -1353175, -782614, -549544, -566829, -164132, 428755, 411227, -190350, -626565, -729039, -993102, -1387033, -1211962, -379664, 230677, 155617, 133225, 810882, 1464084, 944421, -582957, -1837788, -2097551, -1703514, -1062892, -235503, 412404, 251806, -572937, -1095077, -883927, -550838, -566958]
8112e66958p7755j02982o79372r51834L01137J967268J493469j119540k808764
8103b545331j833092r4583K60869j2689N48248J127921L52847p89635m94840O92122
8093b788163R71900M94715O74982J165215M77687r18633j145593k68440m6045
8084a382375m76211J37229J509515J281110p26415j703370m71476N82209j52686
8075a402470o76302P97725K316263J446291m43973m93009Q73496R36428o81210
8066B673239j804437j599419j396192j611831r19604R19110K012121J148297l15329
8057h94045n01802M41155Q97472J2994j434361j942040p23902J392938K560207
8048a91384J839603K48680o45521n98369l62134k08670L5282K4319o33577j226290
$$ y = [-566958, -644713, -747695, -1427067, -2378901, -2077764, -110496, 1382973, 263433, -2545331, -4378423, -4473006, -4212137, -4224826, -3676578, -2548657, -2195810, -2985445, -3480285, -2788163, -1816263, -1321548, -646566, 518649, 996336, 77703, -1067890, -1336330, -1382375, -1858586, -1721357, -211842, 1069268, 342853, -1360517, -1831993, -1249784, -1402470, -2078772, -1281047, 1035216, 2481507, 2037534, 1544525, 2418021, 3354449, 2673239, 868802, -730617, -2126809, -3738640, -4658244, -3739134, -1727013, -578716, -894045, -1395847, -954692, -57220, -44226, -1478587, -3420627, -4144529, -2751591, -191384, 1648219, 1896899, 1251378, 653009, 290875, 82205, 117487, 141806, -491771, -1718061]
8038a718061o74974O70826J332011Q08704Q3387p6008j5343j52400k42538q8536
8028g2932j7215k46022m98351m90264k03559L30627Q87925Q76250Q5645o35575
8018A6529l60210N24568Q94559N38856P6720m38718j396196k225009j705456P7075
8008c997282J498837J482110O00515j65034n28662m66260N3719N29685K85178
7999g07194l25359k52024M87914P23277R1912l71045m3965L63969K62726Q9277
7989C19488J44454j6965l70120j09565O97925P29533m40719j403446j134440n24251
7979b108106n35550n06788L06354J082698R01745M09890M14235K78792n37991
7970b94721q66717K38074J377658Q63689m22539o54873k69480p73500j466006
$$ y = [-1718061, -2393035, -1722209, -390198, 418506, 501893, 425885, 410542, 258142, 15604, -72932, -90147, -336169, -834520, -1324784, -1528343, -1197716, -309791, 566459, 652104, 16529, -343681, 180887, 1075446, 1614302, 1691022, 1252304, -143892, -2368901, -4074357, -3997282, -2498445, -1016335, -415820, -580854, -1109516, -1575776, -1522057, -992372, -707194, -1032553, -1284577, -796663, -73386, 18526, -352519, -396484, -32515, 230211, 319488, 463942, 446977, 76857, -32708, 665217, 1394750, 954031, -449415, -1583855, -2108106, -2643656, -3150444, -2844090, -1761392, -859647, -449757, -35522, 243270, -294721, -1161438, -923364, 454294, 1317983, 895444, 240571, -28909, -802409, -2268415]
7961b268415n59027J128778J087526m86851q29545O06468J234326P963p41940
7952h20717M02073J380927M34103p68117k98415M89626m61705k001575j628876
7943c272676K75402J231785O51687M6392l1058l26232n92982J61147J243518Q55711
7933B42694p28343j225228m885R05244K31810o10420j78608N81879J64939q86485
7923a507403r42637J49634J046761Q95233P5168o92651r75434n92804K47211Q86965
7913a409957Q18633K23607l61754o34129n55216j82201K55577M17168K04587j39880
7903a363565l02838p1687N24067R37477M63884n79567p49829N04826J529735O27655
7893A520158j135039j279153K28655R00094k02928j015588j47366O52943l92681
$$ y = [-2268415, -2827442, -1698664, -611138, -1097989, -1927534, -1321066, -86740, -78777, -820717, -418644, 962283, 1396386, 628269, 329854, 819480, 357775, -1643800, -3272676, -2997274, -1765489, -1113802, -1067410, -1098468, -1424700, -2017682, -1856535, -613017, 242694, -485649, -1710877, -1715762, -810518, -578708, -1189128, -1367736, -785857, -620918, -1507403, -2450040, -2300406, -1253645, -358412, -283244, -975895, -1951329, -2544133, -2296922, -1409957, -591324, -367717, -729471, -1363600, -1918816, -2101017, -1845440, -1428272, -1223685, -1363565, -1666403, -1738090, -1214023, -276546, 187338, -392229, -1142058, -637232, 892503, 1520158, 385119, -894034, -665379, 234715, 31787, -983801, -1131167, -478224, -870905]
7884h70905j761612r89285J149376J709628J18989j217730q11092R8391J40061
7875b434179j42759J48419N39816K67681k45734k16403J64427K99284K94278M71933
7865h53237M73264o6248m87598N8171J037101J032714j38691j000991m98300N16296
7855G2481N72788l87004j190639j181104o99259k32J021904J772267J036666j004959
7845A2909k091170o20123J769244K106511J41064j520963j324733n41606n02353
7836b571220m03967O59732J452990M74630j220850j374092K1261Q99971M60817
7827a600728K050K68569K58992n82832r88895R2470J536973J554518K57519o76008
7817A22628m41075J04562O3811k03075J43887R82181J255222M27876o79056r64528
$$ y = [-870905, -2632517, -3621802, -2472426, -762798, -643809, -1861539, -2672631, -2574240, -2434179, -2576938, -2428519, -1888703, -1621022, -1866756, -2083159, -1918732, -1619448, -1325170, -853237, -379973, -446221, -933819, -875648, 161453, 1194167, 1055476, 54485, -443815, 72481, 645269, 258265, -932374, -2113478, -2812737, -2812969, -1791065, -18798, 1017868, 12909, -2078261, -2698384, -929140, 1177371, 1318435, -202528, -1527261, -2068867, -2571220, -2975187, -2315455, -862465, -387835, -1608685, -2982777, -2961516, -2061545, -1600728, -1598678, -1330109, -1071117, -1653949, -2642844, -2550374, -1013401, 541117, 798636, 122628, -318447, -213885, -150074, -353149, -209262, 772919, 2028141, 2456017, 1776961, 812433]
7807H12433n86486n92738j081740r27256K01397Q80878Q4524q75742j83257J482550
7797g85437J764295K10863j045722n15206O81941P96888k15035j242668j568802
7788a918883r83279M35141J740350J498373k49623j500057q38439N94498R13317
7779c08602K12354o9754K85517J94403n11534o39457K88451J066978O18342l35864
7769H00834l26611P10242J243158J14655j866191k664415j298711R85744K129216
7760a72079J544479L75468l32033o71608q46955l44272R70537J854655J041465
7751C419657q43319j933804j526529o72906l62833l28915l7323K00991j12253
7742b197234n18329m7918J249594J989976J060380q33943j830792j132691J22815
$$ y = [812433, 225947, -366791, -1448531, -2375787, -2174390, -1293512, -1208988, -2084730, -2267987, -785437, 978858, 1189721, 143999, -371207, 310734, 1107622, 892587, -350081, -1918883, -2902162, -2467021, -726671, 771702, 522079, -977978, -1816417, -1221919, -308602, -96248, -166002, 119515, 313918, -197616, -837073, -548622, 518356, 1136698, 800834, 474223, 1184465, 2427623, 2542278, 676087, -1988328, -3287039, -2301295, -172079, 1372400, 1747868, 1415835, 744227, -102728, -447000, 523537, 2378192, 3419657, 2576338, 642534, -883995, -1556901, -1919734, -2248649, -2285972, -2084981, -2197234, -2715563, -2763481, -1513887, 476089, 1536469, 702526, -1128266, -2260957, -2138142]
7733b138142N91215N22574Q84586J322029N84221j038806j571475l07532Q80564
$$ y = [-2138142, -1546927, -1024353, -139767, 1182262, 1766483, 727677, -843798, -1151330, -270766]
$$ [...]
##END NTUPLES=NMR SPECTRUM
##END=
