##TITLE=31Pdec_DPP0306
 CDCl3
 24 sc
 4.6.2024
##JCAMPDX= 6.0         $$ Bruker NMR JCAMP-DX V2.0
##DATA TYPE= NMR SPECTRUM
##DATA CLASS= NTUPLES
##ORIGIN= UXNMR, Bruker Analytische Messtechnik GmbH
##OWNER= root
$$ XWIN-NMR		Version 3.5
$$ Tue Jun  4 14:07:43 2024 Russian Standard Time (UT+4h)  she@DPX200
##.OBSERVE FREQUENCY= 81.013821
##.OBSERVE NUCLEUS= ^31P
##.ACQUISITION MODE= SIMULTANEOUS
##.ACQUISITION SCHEME= undefined
##.AVERAGES= 24
##.DIGITISER RES= 16
##SPECTROMETER/DATA SYSTEM= spect
##.PULSE SEQUENCE= zgpg30
##.SOLVENT NAME= CDCl3
##.SHIFT REFERENCE= (INTERNAL, CDCl3, 0, 248.564)
##AUDIT TRAIL= $$ (NUMBER, WHEN, WHO, WHERE, WHAT)
$$ ##TITLE= Audit trail, XWIN-NMR		Version 3.5
$$ ##JCAMPDX= 5.01
$$ ##ORIGIN= Bruker BioSpin GmbH
$$ ##OWNER= she
$$ F:/spectra/data/she/nmr/P31/1/pdata/1/auditp.txt
$$ ##AUDIT TRAIL=  $$ (NUMBER, WHEN, WHO, WHERE, WHAT)
(   1,<2024-06-04 14:06:21.54 +0400>,<she>,<DPX200>,
      <created by zg, POWCHK disabled, PULCHK disabled
       configuration hash MD5:
       00 E9 B6 7A A2 85 ED C7 34 08 36 98 17 FE 4E 26
       data hash MD5: 32K
       C2 0A 42 CB 38 F5 D9 34 CC 75 73 FF 84 51 64 B0>)
(   2,<2024-06-04 14:06:56.73 +0400>,<she>,<DPX200>,
      <Start of raw data processing
       efp BC_mod = 2 LB = 10 FT_mod = 6 PKNL = 1 PHC0 = -195.5853 PHC1 = 0 SI = 64K 
       data hash MD5: 64K
       33 88 02 57 34 14 2E AF 1E 95 7E 23 27 89 9E 2F>)
(   3,<2024-06-04 14:07:06.53 +0400>,<she>,<DPX200>,
      <pk PHC0 = 23.03438 PHC1 = 0 
       data hash MD5: 64K
       6E 94 5A 8A B8 9F 9E F5 BC 1E DF B2 B0 F6 44 34>)
$$ ##END=
$$ 
$$ hash MD5
$$ 5B B5 A1 11 15 5D 37 FC 62 C8 B5 2E 92 2F 10 76
##$RELAX= 
##$RELAX= 
##$RELAX= 
##$RELAX= 
##$RELAX= 
##$RELAX= 
##$RELAX= 
##$RELAX= 
##$RELAX= 
$$ Bruker specific parameters
$$ --------------------------
##$DU= <F:/spectra>
##$EXPNO= 1
##$NAME= <P31>
##$PROCNO= 1
##$TYPE= <nmr>
##$USER= <she>
##$AMP= (0..31)
100 100 100 100 100 100 100 100 100 100 100 100 100 100 100 100 100 100 
100 100 100 100 100 100 100 100 100 100 100 100 100 100 
##$AQSEQ= 0
##$AQ_mod= 1
##$AUNM= <au_zg>
##$AUTOPOS= <>
##$BF1= 81.014009
##$BF2= 200.13
##$BF3= 200.13
##$BF4= 200.13
##$BF5= 200.13
##$BF6= 200.13
##$BF7= 200.13
##$BF8= 200.13
##$BYTORDA= 1
##$CFDGTYP= 0
##$CFRGTYP= 5
##$CHEMSTR= <none>
##$CNST= (0..31)
1 1 145 1 1 1 1 1 1 1 1 1 1 1 1 1 1 1 1 1 1 1 1 1 1 1 1 1 1 1 1 1 
##$CPDPRG= <waltz16>
##$CPDPRG1= <>
##$CPDPRG2= <waltz16>
##$CPDPRG3= <>
##$CPDPRG4= <mlev>
##$CPDPRG5= <mlev>
##$CPDPRG6= <mlev>
##$CPDPRG7= <mlev>
##$CPDPRG8= <mlev>
##$CPDPRGB= <>
##$CPDPRGT= <>
##$D= (0..31)
0 1 0 0 0 0 0 0 0 0 0 0.03 2e-05 3e-06 0 0 0 0 0 0 0 0 0 0 0 0 0 0 0 0 
0 0 
##$DATE= 1717495581
##$DBL= (0..7)
120 120 120 11 120 120 24 19 
##$DBP= (0..7)
150 150 150 150 150 150 150 150 
##$DBP07= 0
##$DBPNAM0= <>
##$DBPNAM1= <>
##$DBPNAM2= <>
##$DBPNAM3= <>
##$DBPNAM4= <>
##$DBPNAM5= <>
##$DBPNAM6= <>
##$DBPNAM7= <>
##$DBPOAL= (0..7)
0.5 0.5 0.5 0.5 0.5 0.5 0.5 0.5 
##$DBPOFFS= (0..7)
0 0 0 0 0 0 0 0 
$$ [...]
##$SUBNAM2= <"">
##$SUBNAM3= <"">
##$SUBNAM4= <"">
##$SUBNAM5= <"">
##$SUBNAM6= <"">
##$SUBNAM7= <"">
##$SUBNAM8= <"">
##$SUBNAM9= <"">
##$SW= 501.771253377433
##$SWIBOX= (0..15)
0 1 3 0 0 0 0 0 0 0 0 0 0 0 0 0 
##$SW_h= 40650.406504065
##$TD= 32768
##$TD0= 1
##$TE= 0
##$TE2= 300
##$TE3= 300
##$TEG= 300
##$TL= (0..7)
0 120 53 12 22 120 120 120 
##$TP= (0..7)
150 150 150 150 150 150 150 150 
##$TP07= 0
##$TPNAME0= <>
##$TPNAME1= <>
##$TPNAME2= <>
##$TPNAME3= <>
##$TPNAME4= <>
##$TPNAME5= <>
##$TPNAME6= <>
##$TPNAME7= <>
##$TPOAL= (0..7)
0.5 0.5 0.5 0.5 0.5 0.5 0.5 0.5 
##$TPOFFS= (0..7)
0 0 0 0 0 0 0 0 
##$TUNHIN= 0
##$TUNHOUT= 0
##$TUNXOUT= 0
##$USERA1= <user>
##$USERA2= <user>
##$USERA3= <user>
##$USERA4= <user>
##$USERA5= <user>
##$V9= 5
##$VALIST= <valist>
##$VCLIST= <CCCCCCCCCCCCCCC>
##$VD= 0
##$VDLIST= <DDDDDDDDDDDDDDD>
##$VPLIST= <PPPPPPPPPPPPPPP>
##$VTLIST= <TTTTTTTTTTTTTTT>
##$WBST= 1024
##$WBSW= 4
##$XGAIN= (0..3)
0 0 0 0 
##$XL= 0
##$YL= 0
##$YMAX_a= 3304
##$YMIN_a= -3282
##$ZGOPTNS= <>
##$ZL1= 120
##$ZL2= 120
##$ZL3= 120
##$ZL4= 120
##$ABSF1= 0
##$ABSF2= 0
##$ABSG= 0
##$ABSL= 0
##$ALPHA= 0
##$AQORDER= 0
##$ASSFAC= 0
##$ASSFACI= 0
##$ASSFACX= 0
##$ASSWID= 0
##$AUNMP= <proc_1d>
##$AZFE= 0.1
##$AZFW= 0.5
##$BCFW= 0
##$BC_mod= 2
##$BYTORDP= 0
##$COROFFS= 0
##$CY= -3
##$DATMOD= 1
##$DC= 0
##$DFILT= <>
##$DTYPP= 0
##$F1P= 0
##$F2P= 0
##$FCOR= 1
##$FTSIZE= 65536
##$FT_mod= 6
##$GAMMA= 0
##$GB= 0
##$INTBC= 1
##$INTSCL= 6.047779e-11
##$ISEN= 30
##$LB= 10
##$LEV0= 0
##$LPBIN= 0
##$MAXI= 10000
##$MC2= 0
##$MEAN= 0
##$ME_mod= 0
##$MI= 50
##$NCOEF= 0
##$NC_proc= -8
##$NLEV= 6
##$NOISF1= 182.463
##$NOISF2= 159.3651
##$NSP= 0
##$NTH_PI= 0
##$NZP= 0
##$OFFSET= 248.5645
##$PC= 4
##$PHC0= -172.5509
##$PHC1= 0
##$PH_mod= 1
##$PKNL= yes
##$PPARMOD= 0
##$PSCAL= 0
##$PSIGN= 0
##$REVERSE= no
##$SF= 81.0140089999694
##$SI= 65536
##$SIGF1= 159.3651
##$SIGF2= -187.1042
##$SINO= 113.3802
##$SIOLD= 16384
##$SREGLST= <1H.CDCl3>
##$SSB= 0
##$STSI= 65536
##$STSR= 0
##$SW_p= 40650.406504065
##$SYMM= 0
##$S_DEV= 0
##$TDeff= 32768
##$TDoff= 0
##$TI= <>
##$TILT= no
##$TM1= 0
##$TM2= 0
##$TOPLEV= 0
##$USERP1= <user>
##$USERP2= <user>
##$USERP3= <user>
##$USERP4= <user>
##$USERP5= <user>
##$WDW= 1
##$XDIM= 65536
##$YMAX_p= 444167324
##$YMIN_p= -18404620
$$ End of Bruker specific parameters
$$ ---------------------------------
##NTUPLES= NMR SPECTRUM
##VAR_NAME=  FREQUENCY,     SPECTRUM/REAL,   SPECTRUM/IMAG
##SYMBOL=    X,             R,               I
##VAR_TYPE=  INDEPENDENT,   DEPENDENT,       DEPENDENT
##VAR_FORM=  AFFN,          ASDF,            ASDF
##VAR_DIM=   65536,         65536,           65536
##UNITS=     HZ,            ARBITRARY UNITS, ARBITRARY UNITS
##FACTOR=    0.620285442955139, 1,           1
##FIRST=     20137.2065510682, 0,            0
##LAST=      -20513.1999529968, 0,           0
##MIN=       -20513.1999529968, -18404620,   0
##MAX=       20137.2065510682, 444167324,    0
$$ Real data points
##PAGE= N=1
##DATA TABLE= (X++(R..R)), XYDATA
$$ [...]
39997i46508M09191L37529K44123J40725M0802m1770r5275j13349r6931n3785
39987a75248L900O2588J10168J38141J43175J27853R9996O9950M6475L3209K7955
39976F88162K5143J9811J0528l15q750j2307j1606r530r123j2342k0359l4135
39964F25177n4008p8620j04786j28941j48919j64360j75440j81375j80259j70226
39954g61757j50623j22272q7166m8518j0952J9966L9278M4451L6154J7669o589
39943a030359l2309n5578p2363p8114o8525m1238K566N7801J16473J69546K09032
39932h23068K29708K29922K11339J78162J36377R2963N4702K6638J1037P476J3753
39921C69009K6889M3673O0861P5177Q3206Q1294O5919L4797j1437o7956j25922
$$ y = [-946508, -537317, -199788, 44335, 185060, 225862, 184092, 88817, -24532, -121463, -175248, -171348, -108760, 1408, 139549, 282724, 410577, 510573, 580523, 626998, 660207, 688162, 713305, 733116, 743644, 743329, 734579, 722272, 710666, 701136, 692013, 679671, 659312, 625177, 571169, 492549, 387763, 258822, 109903, -54457, -229897, -411272, -591531, -761757, -912380, -1034652, -1121818, -1170336, -1181288, -1161322, -1122044, -1077593, -1041439, -1023770, -1030359, -1062668, -1118246, -1190609, -1268723, -1337248, -1378486, -1375920, -1318119, -1201646, -1032100, -823068, -593360, -363438, -152099, 26063, 162440, 255403, 310105, 336743, 347780, 355256, 369009, 395898, 439571, 500432, 575609, 658815, 740109, 806028, 840825, 829388, 761432, 635510]
39910F35510j74608k04900k12809k01234j78966j57173j45101j46985j61418j82765
39900a130449k03332k15255k12089j90560j52174j03407n3475j0420K2018M4819
39890b204324O1588P5921R0037J04723J19593J32864J40956J38789J21364Q6057
39880a132432L4436k7592r1403j48288j91848k19182k30522k27806k13126j87951
39870b635714j53285j10293o0856p953M3974Q8868J19593J29622J15476P8534
39860b392034K4822l7404j00667j59858k11706k53185k80387k88459k72426k28561
39850d199865j56147n9180N3016J67124K69085L47946L98409M20828M18879L96575
39840a943330L56316K98896K25082J37700M2989m9802j30739j92534k33006k55139
$$ y = [635510, 460902, 256002, 43193, -158041, -337007, -494180, -639281, -786266, -947684, -1130449, -1333781, -1549036, -1761125, -1951685, -2103859, -2207266, -2260741, -2271161, -2249143, -2204324, -2142736, -2066815, -1976778, -1872055, -1752462, -1619598, -1478642, -1339853, -1218489, -1132432, -1097996, -1125588, -1216991, -1365279, -1557127, -1776309, -2006831, -2234637, -2447763, -2635714, -2788999, -2899292, -2960148, -2968101, -2924127, -2835259, -2715666, -2586044, -2470568, -2392034, -2367212, -2404616, -2505283, -2665141, -2876847, -3130032, -3410419, -3698878, -3971304, -4199865, -4356012, -4415192, -4362176, -4195052, -3925967, -3578021, -3179612, -2758784, -2339905, -1943330, -1587014, -1288118, -1063036, -925336, -882347, -932149, -1062888, -1255422, -1488428, -1743567]
39830a743567k64633k66537k63006k53344k35689k08776j72705j28893p9921k9463
39820c646534J8004N7977Q6975J03522J08782J06476J01810R9883J04593J18451
39810b740061J42364J74597K09770K39703K56603K56488K40490K13621J82625
39801h23800J54322J34460J26520J30624J43206J58117J68923J71353J64598J50701
39791F79024J32557J11930Q8802O2418L3314M752j7947l0262l1462k5156j6924
39780I91046j1244r979j2635j7098k0373j9715j4094m851N051J2492J5348J3091
39768I27039O883j073r011j6774k5472l5813m6856n6533o3429o7959p1905p6951
39756D62146q3870r3308j07414j30347j66494k17230k78587l41594l95002m28875
$$ y = [-1743567, -2008200, -2274737, -2537743, -2791087, -3026776, -3235552, -3408257, -3537150, -3617071, -3646534, -3628530, -3570553, -3483578, -3380056, -3271274, -3164798, -3062988, -2963105, -2858512, -2740061, -2597697, -2423100, -2213330, -1973627, -1717024, -1460536, -1220046, -1006425, -823800, -669478, -535018, -408498, -277874, -134668, 23449, 192372, 363725, 528323, 679024, 811581, 923511, 1012313, 1074731, 1108045, 1112797, 1094850, 1064588, 1033126, 1007970, 991046, 979802, 969823, 957188, 940090, 919717, 900002, 885908, 881057, 886108, 898600, 913948, 927039, 933922, 932849, 923838, 907064, 881592, 845779, 798923, 742390, 678961, 611002, 539097, 462146, 378276, 284968, 177554, 47207, -119287, -336517, -615104, -956698, -1351700, -1780575]
39746a780575m37557m21217l85408l38683k89224k42372k00170j62290j26829
39737d384325r0370m8307L576O6712J38131K10782K75541L23677L48788L47836
39727b807959L21483K74006K12730J46614Q4078L0990r932l8096n3588n6789m9095
39716a945558l3585j4480M333K0632L4142M5783N6346O5251P0141O7707N5494
39705a573794L3517M668k6279n4124p4318q3503p9987o4387l9952j1886J4455
39694a955590L5599N0938O2021P0726P7745Q2302Q3117P9705P3132O5808O0515
39683a213982N9368O3055P0454P8581Q3183Q0300O8212M8453K5025K404j6342
39672f51289l0415m1134n1055o2702p7470r5224j14514j32885j47038j53326j48811
$$ y = [-1780575, -2218132, -2639349, -3024757, -3363440, -3652664, -3895036, -4095206, -4257496, -4384325, -4474695, -4523002, -4519426, -4452714, -4314583, -4103801, -3828260, -3504583, -3155795, -2807959, -2486476, -2212470, -1999740, -1853126, -1769048, -1738058, -1747990, -1786086, -1839674, -1896463, -1945558, -1979143, -1993623, -1989290, -1968658, -1934516, -1888733, -1832387, -1767136, -1696995, -1629288, -1573794, -1540277, -1535609, -1561888, -1616012, -1690330, -1773833, -1853820, -1918207, -1958159, -1970045, -1955590, -1919991, -1869053, -1807032, -1736306, -1658561, -1576259, -1493142, -1413437, -1340305, -1274497, -1213982, -1154614, -1091559, -1021105, -942524, -859341, -779041, -710829, -662376, -637351, -634947, -651289, -681704, -722838, -773893, -836595, -914065, -1009289, -1123803, -1256688, -1403726, -1557052, -1705863]
39661a705863j32477j05785p2461l7930q541R743J3296K568j7659l9949n6983
39650b152041o3841n8870m3306k0390N629L0531N1070O5483P3465P5756P3606
39639a962908O8168N9829M7793L0447O734k2140n1992p6934r2007r5291q8038
39628b176339p3223n4016l3119j2800N029J8929K8120L2704L3874L3768L4873
39617b162200L8932M5727N2284N3242M2887J8219j8480n9214r2528j07668r8695
39606b287494o6425j7354L9381R4668J40514J70127J78359J63014J26359P5744
39596a383107K2197k3014n2473o4827o3752n4708m2070k8276j4642k388P184J3262
39584a686614J5860J5307J1509M182n689j4724j7920j1070P018L3986O5157R5518
$$ y = [-1705863, -1838340, -1944125, -2016586, -2054516, -2063057, -2053314, -2040018, -2037450, -2055109, -2095058, -2152041, -2215882, -2274752, -2318058, -2338448, -2332819, -2302288, -2251218, -2185735, -2112270, -2036514, -1962908, -1894740, -1834911, -1787118, -1756671, -1749937, -1772077, -1824069, -1901003, -1993010, -2088301, -2176339, -2249562, -2303578, -2336697, -2349497, -2344468, -2325539, -2297419, -2264715, -2230841, -2197073, -2162200, -2123268, -2077541, -2025257, -1972015, -1929128, -1910909, -1929389, -1988603, -2081131, -2188799, -2287494, -2353919, -2371273, -2331892, -2237224, -2096710, -1926583, -1748224, -1585210, -1458851, -1383107, -1360910, -1383924, -1436397, -1501224, -1564976, -1619684, -1661754, -1690030, -1704672, -1707060, -1699876, -1686614, -1670754, -1655447, -1643938, -1639756, -1645445, -1660169, -1678089, -1689159, -1682141, -1648155, -1582998, -1487480]
39572a487480J21266J40101J50367J50287J38403J14910Q2277M4318M608l4228
39562e75171o9851r9045j17520j21458j09965q6484n7635l0264r060L773P481
39551a265199K028j1741l1816n5445q0046j03827j25591j44043j57505j64621
39541b137806j65724j63737j63706j70754j87269k10804k34314k48927k47612
39532c930653k27367j89161j36852p6372j5104L9273Q0474J05103J13443J09253
39522d127963R8419Q6695P7904P3960P6432Q7626J09518J40918J75123K00436
39512c000932K04139J78130J23092M8780k9583r6711j42029j62113j60401j44754
39502c182382j24153j05774r3091q5336p8747o9370n5955m0828k8371k2676k6281
$$ y = [-1487480, -1366214, -1226113, -1075746, -925459, -787056, -672146, -589869, -545551, -540943, -575171, -645022, -744067, -861587, -983045, -1093010, -1179494, -1237129, -1267393, -1276453, -1272680, -1265199, -1263171, -1274912, -1306728, -1362173, -1442219, -1546046, -1671637, -1815680, -1973185, -2137806, -2303530, -2467267, -2630973, -2801727, -2988996, -3199800, -3434114, -3683041, -3930653, -4158020, -4347181, -4484033, -4560405, -4575509, -4536236, -4455762, -4350659, -4237216, -4127963, -4029544, -3942849, -3864945, -3790985, -3714553, -3626927, -3517409, -3376491, -3201368, -3000932, -2796793, -2618663, -2495571, -2446791, -2476374, -2573085, -2715114, -2877227, -3037628, -3182382, -3306535, -3412309, -3505400, -3590736, -3669483, -3738853, -3794808, -3835636, -3864007, -3886683, -3912964]
39491c912964l9969o2408q9297j13318j26083j21580r8922o2583k0127K0867N4931
39480d571453P9512R5069J04908J14104J26916J43532J58535J62872J48574J13134
39470c324297O0806M77n7899j06116j38907j53901j51022j31853r9200n6949j0081
39459d168942L5322P2539R5589J01568R2633P5913O0585N3811N7992P0824Q7629
39448c364537J04484J20505J38190J61578J93366K32713K75039L13673L42286
39439a482703L56791L55869L40186L11434K72292K27090J81809J42483J12622
39430H17873R1586P5101N7721L5456O892k7660o7634j12665j61885k13246k63800
39419B37739l10490l50580l81407l99956m02633l85605l46078k84401k05934j21211
$$ y = [-3912964, -3952933, -4015341, -4104638, -4217956, -4344039, -4465619, -4564541, -4627124, -4647251, -4626384, -4571453, -4491941, -4396872, -4291964, -4177860, -4050944, -3907412, -3748877, -3586005, -3437431, -3324297, -3263491, -3263014, -3320913, -3427029, -3565936, -3719837, -3870859, -4002712, -4101912, -4158861, -4168942, -4133620, -4061081, -3965492, -3863924, -3771291, -3695378, -3634793, -3580982, -3522990, -3452166, -3364537, -3260053, -3139548, -3001358, -2839780, -2646414, -2413701, -2138662, -1824989, -1482703, -1125912, -770043, -429857, -118423, 153869, 380959, 562768, 705251, 817873, 909459, 984560, 1042281, 1077737, 1084629, 1056969, 989335, 876670, 714785, 501539, 237739, -72751, -423331, -804738, -1204694, -1607327, -1992932, -2339010, -2623411, -2829345, -2950556]
39409b950556m3759J3664M3054M3778K2736q126l5972n1106m9308l1861l583K9829
39397c021210O3684R4825J21348J42425J58232J69551J76875J79835J77545J69831
39387a567059J58601J48423J45577J55544J80029K15221K52381K80614K90545
39378B59876K77521K43075J94217J41046R3820O0349M4195M3873N3495O4893P0462
39367A546822O5495M8985K2857r677m5437q1694j16024j46210j70425j87168j94955
39356G32569j92272j78459j55021j26322r8822p9094p1475p6458r0452j07055
39346d42861j19423j23025j17662j07395r7975r3380r4173r8615j04776j11355
39336a510640j17252j21621j24906j29430j38185j52556j70701j87405j95314
$$ y = [-2950556, -2994315, -2980651, -2937597, -2893819, -2871083, -2879209, -2915181, -2966287, -3015595, -3047456, -3051039, -3021210, -2957526, -2862701, -2741353, -2598928, -2440696, -2271145, -2094270, -1914435, -1736890, -1567059, -1408458, -1260035, -1114458, -958914, -778885, -563664, -311283, -30669, 259876, 537397, 780472, 974689, 1115735, 1209555, 1269904, 1314099, 1357972, 1411467, 1476360, 1546822, 1612317, 1661302, 1684159, 1674482, 1629045, 1547351, 1431327, 1285117, 1114692, 927524, 732569, 540297, 361838, 206817, 80495, -18327, -97421, -168896, -245354, -335806, -442861, -562284, -685309, -802971, -910366, -1008341, -1101721, -1195894, -1294509, -1399285, -1510640, -1627892, -1749513, -1874419, -2003849, -2142034, -2294590, -2465291, -2652696, -2848010]
39327b848010j87360j59820j14510n8491j361M8113Q4336J06036J16473J22459
39317b892135J31879J50512J79956K17635K58487K96818L27441L45985L48944
39308f34478L34016L00725K50852J88117J17415M4345k4663q2261j21038j35387
39298B37643j23586q8995l9693J3564O0479R4114J12234J16790J12275J04067
39288E98892R6978R3843R4423R5573R3078Q4233O9269N0648L0988J1304r392l3194
39276A276643o1784r4789j28729j57448j74344j75343j60756j34798j03230p0708
39266A4714l9352r267J9431M4521O1153O3462M7290J2149l8570r8682j60363k14951
39254b98465k53926k70912k64159k37725k00034j60352j25478r8309p8236o2221
$$ y = [-2848010, -3035370, -3195190, -3309700, -3368191, -3369552, -3321439, -3237103, -3131067, -3014594, -2892135, -2760256, -2609744, -2429788, -2212153, -1953666, -1656848, -1329407, -983422, -634478, -300462, 263, 251115, 439232, 556647, 600992, 576329, 494068, 373030, 237643, 114057, 25062, -14631, -1067, 59412, 153526, 265760, 382550, 494825, 598892, 695870, 789713, 884136, 979709, 1072787, 1157020, 1226289, 1276937, 1307925, 1319229, 1309837, 1276643, 1214859, 1120070, 991341, 833893, 659549, 484206, 323450, 188652, 85422, 14714, -24638, -33905, -14474, 30047, 91200, 154662, 201952, 214101, 175531, 76849, -83514, -298465, -552391, -823303, -1087462, -1325187, -1525221, -1685573, -1811051, -1909360, -1987596, -2049817]
39244b049817m5875k4727M198M0924Q2026J21572J53258J72839J79646J76459
39234a189497J67960J58640J51128J45550J40044J32148J20458J05716R0612P8205
39224A00964O9862O4342N9011N2205M4650L8594L5706L5700L6575L5868L1822
39213F05299K3924J2598j630j8661l8376n9773q0928j00119j16740j30761j41368
39202d6535j46539j44225j33937j17089r5862p1710m4689j3992K0896N9076R7717
39191f36889J32331J57908J70733J70185J59563J45136J33502J28419J28713J28614
39181H18215J20572R9120O3668J8751k8025o8885r8122j13101j14295j04790q9182
39170E03926p2010n6464m4371l7374l7656m6982o4722q7009j07987j22117j25808
$$ y = [-2049817, -2095692, -2120419, -2116221, -2075297, -1993271, -1871699, -1718441, -1545602, -1365956, -1189497, -1021537, -862897, -711769, -566219, -426175, -294027, -173569, -67853, 22759, 100964, 170826, 235168, 294179, 346384, 391034, 429628, 465334, 501034, 537609, 573477, 605299, 629223, 641821, 640191, 621530, 583154, 523381, 442453, 342334, 225594, 94833, -46535, -193074, -337299, -471236, -588325, -684187, -755897, -800586, -814578, -793682, -734606, -636889, -504558, -346650, -175917, -5732, 153831, 298967, 432469, 560888, 689601, 818215, 938787, 1037907, 1101575, 1120326, 1092301, 1023416, 925294, 812193, 697898, 593108, 503926, 431916, 375452, 331081, 293707, 256051, 209069, 144347, 57338, -50649, -172766, -298574]
39159b98574j17794r8713p0463l5696K140L8462O7711Q4697Q6247P1829M2811
39148b27343J665m7965j00790j50065j88771k11245k14793k00905j75338j46194
39138a661744j20412j00786q5744p1744n5943l6929j3797J4428M8034Q5516J23571
39127a875550J58179J85581K02475K05860J93247J63502J17947O1128M02n5844
39117f43073j00776j31164j48054j55768j59428j61964j62451j57210j43070j20283
39107b083241r2854o6509m6061l3743k9023k9565l2618l5885l7633l6576l2226
39096b555934k5338j7660j0919o047l280k662m159p289j0963j3872j4935j3179
39084b686237p267M345K2074M3652O3992P7198P9427P0531N3555L2720J1331r348
$$ y = [-298574, -416368, -515081, -585544, -621240, -619100, -580638, -512927, -428230, -341983, -270154, -227343, -225678, -273643, -374433, -524498, -713269, -924514, -1139307, -1340212, -1515550, -1661744, -1782156, -1882942, -1968686, -2040430, -2096373, -2133302, -2147099, -2132671, -2084637, -1999121, -1875550, -1717371, -1531790, -1329315, -1123455, -930208, -766706, -648759, -587631, -587229, -643073, -743849, -875013, -1023067, -1178835, -1338263, -1500227, -1662678, -1819888, -1962958, -2083241, -2176095, -2242604, -2288665, -2322408, -2351431, -2380996, -2413614, -2449499, -2487132, -2523708, -2555934, -2581272, -2598932, -2609851, -2615898, -2619178, -2621840, -2625999, -2633288, -2644251, -2658123, -2673058, -2686237, -2693504, -2689159, -2667085, -2623433, -2559441, -2482243, -2402816, -2332285, -2278730, -2246010, -2234679, -2244027]
39072b244027k9788n0860p2426r2868j09678j20611j24756j23303j19568j18026
39062c205911j22547j34834j53949j76939j99870k18518k28554k25732k06901
39053d873755j71814j24355p1527k0287K5459O5454J01371J34789J66475J96812
39043d571378K26276K55305K83719L10260L32767L48890L56980L56623L48737
39034a751821L35433L19575L03896K89853K76975K63192K46042K23864J96143
39025G03152J62680J22404P3340J4443n1856j18792j77234k19289k41061k43316
39015B4471k30295k07946j82146j57326j35485j15844r5388p0405l8395N86M3847
39004a164326Q7042J25624J56161J76999J87792J88175J76886J52663J16265P1524
$$ y = [-2244027, -2273815, -2324675, -2397101, -2489969, -2599647, -2720258, -2845014, -2968317, -3087885, -3205911, -3328458, -3463292, -3617241, -3794180, -3994050, -4212568, -4441122, -4666854, -4873755, -5045569, -5169924, -5241451, -5261738, -5236279, -5170825, -5069454, -4934665, -4768190, -4571378, -4345102, -4089797, -3806078, -3495818, -3163051, -2814161, -2457181, -2100558, -1751821, -1416388, -1096813, -792917, -503064, -226089, 37103, 283145, 507009, 703152, 865832, 988236, 1061576, 1076019, 1024163, 905371, 728137, 508848, 267787, 24471, -205824, -413770, -595916, -753242, -888727, -1004571, -1099959, -1170364, -1208759, -1208173, -1164326, -1077284, -951660, -795499, -618500, -430708, -242533, -65647, 87016, 203281, 274805]
38994B74805K4094k0885n9981r0953j11996j22267j23195j18821j14232j12947
38984e76378j15060j17368j15287j05362q6949o2291l5176r099J3945L3525M9830
38973a125670O2580P0696P3148P0268O4090N7099N0352M2662L1450J4266j0124
38962e99183m1202p6458j11831j43322j68979j89704k08067k26214k44336k60259
38952b269555k69823k67668k48187k06631j40470n1243N3732J61566K57152L28437
38942b652690L70323L84628L76725L51751L13000K62795K04378J43039Q5826M0202
38932a20023J2286N056J6942M1524O9120R0018R7686R0137O8910L7132j477m2381
38920C64930q0227j10225j30084j40345j42419j36127j19431r0880n2624j1193
$$ y = [274805, 298899, 278014, 218033, 127080, 15084, -107183, -230378, -349199, -463431, -576378, -691438, -808806, -924093, -1029455, -1116404, -1178695, -1213871, -1222970, -1209025, -1175500, -1125670, -1063090, -992394, -919246, -848978, -784888, -727789, -677437, -634775, -603325, -589059, -599183, -640385, -716843, -828674, -971996, -1140975, -1330679, -1538746, -1764960, -2009296, -2269555, -2539378, -2807046, -3055233, -3261864, -3402334, -3453577, -3399845, -3238279, -2981127, -2652690, -2282367, -1897739, -1521014, -1169263, -856263, -593468, -389090, -246051, -160225, -120023, -107737, -102681, -85739, -44215, 24905, 114923, 212609, 302746, 371656, 408788, 407311, 364930, 284703, 174478, 44394, -95951, -238370, -374497, -493928, -584808, -637432, -648625]
38910f48625K4903M8917N8199N3722L8106J4485j2890l7910n3737n5566m2865
38899f13261j9273R503L8105O2992Q2707R7430J08195J16087J21530J23967J22247
38888B50229J15712J05392R4414Q7253Q8094R8748J16977J36268J47938J44796
38878A385821J24185Q8760M4951M92l7975o6650q5253r6282j03088j07755j09906
38867A037300j07244r7672q1618o2659m5750l4541l0087l1744l8876n1870p1965
38856C83274j00274j36442j77627k18660k53705k78372k90575k89671k75010k45637
38846a882699k01695j46546q7794l5888n77J3042O558j2760l5315n2994o1717
38835b498385o2070n8122n5154n7205o5345p7112q6975q7657p2401l7881J3675
$$ y = [-648625, -623722, -574805, -516606, -462884, -424778, -410293, -423183, -461093, -514830, -570396, -613261, -632534, -623031, -584926, -521934, -439227, -341797, -233602, -117515, 4015, 127982, 250229, 365941, 471333, 565747, 653000, 741094, 839842, 956819, 1093087, 1241025, 1385821, 1510006, 1598766, 1643717, 1644209, 1606234, 1539584, 1454331, 1358049, 1254961, 1147206, 1037300, 930056, 832384, 750766, 688107, 642357, 607816, 577729, 545985, 507109, 455239, 383274, 283000, 146558, -31069, -249729, -503434, -781806, -1072381, -1362052, -1637062, -1882699, -2084394, -2230940, -2318734, -2354622, -2355199, -2342157, -2335599, -2348359, -2383674, -2436668, -2498385, -2560455, -2618577, -2673731, -2730936, -2796281, -2873393, -2960368, -3048025, -3120426, -3158307, -3144632]
38824c144632P4942J36647J91287K35005K67091K88284K99127K98900K85623K57464
38814h10262K14659J60185R8316L2440l5567j03685j67370k18706k48050k47384
38804a325424k13515j49410o3109L4905J34280K26098L02674L56664L80864L69675
38794E3702L21803K42484J43407L9794n4112j29049j82222k15650k32795k36153
38784b48791k27564k10333j90255j73740j64184j59654j53874j39741j12825p2898
38774a853859k3525K9126P7469J13797J32091J29942J09617P7591M2524J2558
38764a152669o946j4338j1202j073J2168K5835L9407N3949P0080Q6074R7986J01773
38752f98956R5510Q0069N8447L4807J3625j422q763r610p229m876l575j364N217
$$ y = [-3144632, -3069690, -2933043, -2741756, -2506751, -2239660, -1951376, -1652249, -1353349, -1067726, -810262, -595603, -435418, -337102, -304662, -340229, -443914, -611284, -829990, -1078040, -1325424, -1538939, -1688349, -1751458, -1716553, -1582273, -1356175, -1053501, -696837, -315973, 53702, 375505, 617989, 761396, 801190, 747078, 618029, 435807, 220157, -12638, -248791, -476355, -686688, -876943, -1050683, -1214867, -1374521, -1528395, -1668136, -1780961, -1853859, -1877384, -1848258, -1770789, -1656992, -1524901, -1394959, -1285342, -1207751, -1165227, -1152669, -1159615, -1173953, -1185155, -1186228, -1174060, -1148225, -1108818, -1054869, -984789, -898715, -800729, -698956, -603446, -523377, -464930, -430123, -416498, -417920, -426683, -436293, -443522, -448398, -451973, -453337, -448120]
38739d48120J8278L6592N6044P2044Q1930Q5882Q6108Q5159Q4339Q3115P9862
38728C21233P3298O3508N1850M0180L0140K2744J8014J4669J0337K434j0657k8834
38716F08916n0179p1325q8176r7024r5986q5981p0600n4974m4325m2705n1857
38705a44216p0261r3039j13247j24258j22133j07054q3271n7550l6674k5262k4949
38694a001914l4941n2882p5525r9468j22114j42067j58239j68454j69427j58615
38684b183646j36395j06184p2354l8035n008K4783M8373O3101O9087P0408P3687
38673b192183Q4938J06678J37008J70988K03292K30170K49514K59593K58239K43589
38663b48174K15636J77196J33455R0346N2590K2275j291k0566l8479n7568p9451
$$ y = [-448120, -429842, -393250, -337206, -265162, -183232, -97350, -11242, 73917, 158256, 241371, 321233, 394531, 458039, 509889, 550069, 580209, 602953, 620967, 635636, 645973, 648407, 637750, 608916, 558737, 487412, 399236, 302212, 206226, 120245, 49645, -5329, -49654, -92359, -144216, -214477, -307516, -420763, -545021, -667154, -774208, -857479, -915029, -951703, -976965, -1001914, -1036855, -1089737, -1165262, -1264730, -1386844, -1528911, -1687150, -1855604, -2025031, -2183646, -2320041, -2426225, -2498579, -2536614, -2541622, -2516839, -2468466, -2405365, -2336278, -2265870, -2192183, -2107245, -2000567, -1863559, -1692571, -1489279, -1259109, -1009595, -750002, -491763, -248174, -32538, 144658, 278113, 368459, 421049, 443324, 442033, 421467, 382988, 325420, 245969]
38652B45969j04159j29622j52115j67825j74512j72241j62867j49099j33821j19814
38642a220106j09306j02988r9064r3631q2799o5485m4815k7078j8856k3993m2028
38631a930149o8726r8063j24113j41872j47336j37829j12800p4339k6927K3397
38621b838757P0233J08193J34237J48295J53079J53421J55132J62843J77258J94005
38611a382061K05695K06043J92706J66954J31328Q7849L7979j6342p1772j23531
38601e65152j66319j95761k09642k08376j94609j72448j46578j21220r8913p9611
38591b158629o0890l9746j5075J0795L2732M5124M4293K9709L836k8785o2549
38580b199185r1345j08566j07158q0706k5946N4400J50476K47228L29210L86045
$$ y = [245969, 141810, 12188, -139927, -307752, -482264, -654505, -817372, -966471, -1100292, -1220106, -1329412, -1432400, -1531464, -1625095, -1707894, -1773379, -1818194, -1845272, -1864128, -1888121, -1930149, -1998875, -2096938, -2221051, -2362923, -2510259, -2648088, -2760888, -2835227, -2862154, -2838757, -2768524, -2660331, -2526094, -2377799, -2224720, -2071299, -1916167, -1753324, -1576066, -1382061, -1176366, -970323, -777617, -610663, -479335, -391486, -353507, -369849, -441621, -565152, -731471, -927232, -1136874, -1345250, -1539859, -1712307, -1858885, -1980105, -2079018, -2158629, -2219519, -2259265, -2274340, -2263545, -2230813, -2185689, -2141396, -2111687, -2107851, -2136636, -2199185, -2290530, -2399096, -2506254, -2586960, -2612906, -2558506, -2408030, -2160802, -1831592, -1445547]
38570a445547M15661M23239M16509M00571L75690L38859K87102K19733J38665
38561A570482M7774m7543j40464k23170k88028l29418l45396l38337l13846k78438
38551f86384k37250j93072j46991j00015n4583j5113J3063K5905K2554N367k1714
38540a388233n4827r0526j25235j55007j75859j84310j77878j55891j20336p5938
38530b704040k9333J1862L9460M5436K3973k5558r6595j75958k47134k95017l10250
38519c763154k91310k43552j76077r8557j9473N4335J17912J68524K05604K29929
38509c815819K42680K45196K39423K28139K14388K00431J87228J74737J62436
38500a921161J49433J34327J15649R2985O7856M3313K2100M548j2323l3543o3055
$$ y = [-1445547, -1029886, -606647, -190138, 210433, 586123, 924982, 1212084, 1431817, 1570482, 1618256, 1570713, 1430249, 1207079, 919051, 589633, 244237, -94100, -407946, -686384, -923634, -1116706, -1263697, -1363712, -1418295, -1433408, -1420345, -1394440, -1371886, -1366519, -1388233, -1443060, -1533586, -1658821, -1813828, -1989687, -2173997, -2351875, -2507766, -2628102, -2704040, -2733373, -2721511, -2682051, -2636615, -2612642, -2638200, -2734795, -2910753, -3157887, -3452904, -3763154, -4054464, -4298016, -4474093, -4572650, -4592123, -4537788, -4419876, -4251352, -4045748, -3815819, -3573139, -3327943, -3088520, -2860381, -2645993, -2445562, -2258334, -2083597, -1921161, -1771728, -1637401, -1521752, -1428767, -1360911, -1317598, -1295498, -1290950, -1303273, -1336816, -1399871]
38489a399871j00447j40026j73471j94354k01129j96244j82457j59793j25607
38480b873399p7610j7444M7788J07416J51575J75479J80832J73954J62457J52671
38470a816281J48384J50326J56367J62941J67297J68815J68204J65482J58733
38461c69732J44568J19561Q1586L0652l0615r7042j61671k17291k58340k82516
38451a040840k91095k87375k74022k51330k18024j73943j22329o9986k5197N295
38441b748846J8700J6812M482j2950l1360m7790n9739o5535o5811o4248o6193
38430c122478p5757r3363j15094j33799j41320j31142j00679n2268P650P0719
38420c887531J29070J76859K10672K29269K33328K25350K09422J90452J72882
$$ y = [-1399871, -1500318, -1640344, -1813815, -2008169, -2209298, -2405542, -2587999, -2747792, -2873399, -2951009, -2968453, -2920665, -2813249, -2661674, -2486195, -2305363, -2131409, -1968952, -1816281, -1667897, -1517571, -1361204, -1198263, -1030966, -862151, -693947, -528465, -369732, -225164, -105603, -24017, 6635, -23980, -121022, -282693, -499984, -758324, -1040840, -1331935, -1619310, -1893332, -2144662, -2362686, -2536629, -2658958, -2728944, -2754141, -2748846, -2730146, -2713334, -2708852, -2721802, -2753162, -2800952, -2860691, -2926226, -2992037, -3056285, -3122478, -3198235, -3291598, -3406692, -3540491, -3681811, -3812953, -3913632, -3965900, -3958250, -3887531, -3758461, -3581602, -3370930, -3141661, -2908333, -2682983, -2473561, -2283109, -2110227]
38411b110227J59373J50244J44031J38916J33954J29226J24706J18745J07284
38402i03748Q4600M5631j0875q0027j50976k10111k45861k52714k32792j94706
38392b151579j50444j11505q5637p5423p8906r1363j06897j19533j24312j18815
38382c214414j04296q5303o7507n5105m9531m9729n3130n6413n6420n1492m2598
38371c885938l3078k6785k5715k8557l0912k7281j4017Q436L5685O2011Q3606
38360c882545J00130J13803J26875J39143J47074J45151J28739R6530N1148j972
38350b835924n6318j05762j45745j74068j90800j97107j93694j79974j54608j17094
38340d351094o9458j6967L2643P1285R3109R6642Q5365O6220M6597L1482K2365
$$ y = [-2110227, -1950854, -1800610, -1656579, -1517663, -1383709, -1254483, -1129777, -1011032, -903748, -819148, -773517, -784392, -864419, -1015395, -1225506, -1471367, -1724081, -1956873, -2151579, -2302023, -2413528, -2499165, -2574588, -2653494, -2744857, -2851754, -2971287, -3095599, -3214414, -3318710, -3404013, -3471520, -3526625, -3576156, -3625885, -3679015, -3735428, -3791848, -3843340, -3885938, -3919016, -3945801, -3971516, -4000073, -4030985, -4058266, -4072283, -4063847, -4028162, -3966151, -3882545, -3782415, -3668612, -3541737, -3402594, -3255520, -3110369, -2981630, -2885100, -2833952, -2835924, -2892242, -2998004, -3143749, -3317817, -3508617, -3705724, -3899418, -4079392, -4234000, -4351094, -4420552, -4437519, -4404876, -4333591, -4240482, -4143840, -4058475, -3992255, -3945658, -3914176, -3891811]
38329c891811J8074J6345J4930J2007O360k347j3348k4921l5129m2553m6280m5124
38317d033797l7272k1430J230K6436M8625O3899P1875P5345P8374Q4065R3100
38306c549550J03831J13992J22855J32154J44999J63451J86476K09505K26067
38297b146220K30576K20585J97244J64189J26214Q8540N6046L1761J5359L280
38287a012426q943k3581l9121n1358n6335n3054m4062l3640k5075j9218j5139
38276a381952j1801q955o660m362p11N690J5214K6475L6401M1350L9059L0289
38264a219963J8893R981P352J1936K2128L5576N1140O9712R3396J23520J58831
38253f17498J95139K26602K47854K55637K48999K28379J94749J49963R7885M4734
$$ y = [-3891811, -3873737, -3857392, -3842462, -3830455, -3824095, -3826442, -3839790, -3864711, -3899840, -3942393, -3988673, -4033797, -4071069, -4092499, -4091269, -4064833, -4016208, -3952309, -3880434, -3805089, -3726715, -3642650, -3549550, -3445719, -3331727, -3208872, -3076718, -2931719, -2768268, -2581792, -2372287, -2146220, -1915644, -1695059, -1497815, -1333626, -1207412, -1118872, -1062826, -1031065, -1015706, -1012426, -1021369, -1044950, -1084071, -1135429, -1191764, -1244818, -1288880, -1322520, -1347595, -1366813, -1381952, -1393753, -1402708, -1409368, -1413730, -1414441, -1408751, -1393537, -1367062, -1330661, -1289311, -1250252, -1219963, -1201070, -1191089, -1183737, -1171801, -1149673, -1114097, -1062957, -993245, -899849, -776329, -617498, -422359, -195757, 52097, 307734, 556733, 785112, 979861, 1129824, 1227709, 1272443]
38243A272443k420l8253o1066p2933p8242q1487q5247q9427r2277r2312q9462
38232D89317q4730p9353p4518p1325p0209p0229o9468o6715o2705n9398n7816
38221b77149n6750n3762m7603l9654l2772k8413k4627j6981j919K0139M4370O4100
38209d51021P4398P4298O6520N5247M3731L3264K3739J4725N915l169j3338k5045
38197a00736l7234m7042n1223m8759m2771l9938m7509o9890j07105j55738k10857
38186i58802k67216l19329l61438l88185l95589l81445l45182k88145k14704j33032
38176d053067n3763J3392O2923R4362J10812J17008J18312J20090J26546J39518
38166c203867J58594J82575K10582K41488K72536K99162L16675L22306L15747
$$ y = [1272443, 1270023, 1231770, 1170704, 1097771, 1019529, 938042, 852795, 763368, 671091, 578779, 489317, 404587, 325234, 250716, 179391, 109182, 38953, -30515, -97230, -159935, -219333, -277149, -333899, -387661, -435264, -474918, -507690, -536103, -560730, -577711, -579630, -559491, -515121, -451021, -376623, -302325, -235805, -180558, -136827, -103563, -79824, -65099, -59184, -62353, -75691, -100736, -137970, -185012, -236235, -284994, -327765, -367703, -415212, -485102, -592207, -747945, -958802, -1226018, -1545347, -1906785, -2294970, -2690559, -3072004, -3417186, -3705331, -3920035, -4053067, -4106830, -4093438, -4030515, -3936153, -3825341, -3708333, -3590021, -3469931, -3343385, -3203867, -3045273, -2862698, -2652116, -2410628, -2138092, -1838930, -1522255, -1199949, -884202]
38157h84202K97961K69647K30891J82367J27007P0420J9192k2017n2207p3251
38147A65808q7327r4878r4523q4615o5167l8821j0082J6868M0093N9571P4640
38136a18433Q1833P5787N2895J4714l1453p4863j04864j14097j00701o9092k8930
38125d17204P637K9809L1723J4337j5344m7410p3057q7509r0676q5557p5364o1114
38113h69729m1092j2420K6445P3783J24008J68481J97763K04780J87570J49965
38103B09554R9882M6710p38l5211n1592m7608k4582J2279N4810R4353J24888J44893
38091F27638J56455J62491J64520J62616J57007J49266J41874J36515J32550J26916
38081B117848J15591R5652O6613L0543q573m5644p5492r4133r9835r3137p5801
$$ y = [-884202, -586241, -316594, -85703, 96664, 223671, 294091, 313283, 291266, 239059, 165808, 78481, -16397, -110920, -195535, -260702, -299523, -309605, -292737, -252644, -193073, -118433, -36600, 39187, 92082, 106796, 75343, 480, -104384, -218481, -319182, -388274, -417204, -409567, -379758, -348035, -333698, -349042, -396452, -469509, -557018, -647694, -733251, -808615, -869729, -910821, -923241, -896796, -823013, -699005, -530524, -332761, -127981, 59589, 209554, 309436, 356146, 355408, 320197, 268605, 220997, 196415, 208694, 263504, 357857, 482745, 627638, 784093, 946584, 1111104, 1273720, 1430727, 1579993, 1721867, 1858382, 1990932, 2117848, 2233439, 2329091, 2395704, 2426247, 2417674, 2372030, 2296538, 2202405, 2102570, 2009433, 1933632]
38070A933632m9772j7112J9362N5814Q8173J13290J29451J35816J31797J17188
38060B657639R3020O1986K7762o352l8380o7874r5702j23786j54552j89813k29269
38049A934679k69408l03520l23313l21773k96038k48689j86681j18689n2637N425
38039a80644N1272Q2207R7196R7195Q5033O4450L8593Q887k4794o2610j02787
38028A53998j40626j69320j82185j75054j47540j02705m5480J9197Q7326J55178
38018e47211K17535K66701K93961K93226K64440K14300J53831R4454M4647Q249
38008A304133j5491l0685m2819n6692p4743r6367j18445j36909j48465j51633
37998D31884j46780j35543j19983j01635q0689n5898k5670J0230M9669Q8692J23338
$$ y = [1933632, 1883860, 1866748, 1886110, 1941924, 2030097, 2143387, 2272838, 2408654, 2540451, 2657639, 2750659, 2812645, 2840407, 2834055, 2795675, 2727801, 2632099, 2508313, 2353761, 2163948, 1934679, 1665271, 1361751, 1038438, 716665, 420627, 171938, -14743, -133432, -186069, -180644, -129372, -47165, 50031, 147226, 232259, 296709, 335302, 344189, 319395, 256785, 153998, 13372, -155948, -338133, -513187, -660727, -763432, -808912, -789715, -702389, -547211, -329676, -62975, 230986, 524212, 788652, 1002952, 1156783, 1251237, 1295884, 1304133, 1288642, 1257957, 1215138, 1158446, 1083703, 987336, 868891, 731982, 583517, 431884, 285104, 149561, 29578, -72057, -152746, -208644, -234314, -224084, -174415, -85723, 37615]
37987C7615J51321J72359J86918J94417J92475J78020J49554J08757O0165R226
37977A440827l9857q5137j26517j64298j97459k22754k35628k32918k15662j89893
37967b69296j64465j47004j40157j40055j37917j24120r2690m3821J6542P9248
37957a163735J35069J77343K03540K14994K14838K05533J88144J63956J36668
37948D76350J12769R9121R9070J09505J20705J19523R4555M1137l6024j23729
37938A112982k04399k61837k86292k76785k40035j86902j28118p1035j8547K9568
37928e31400P3744J11973J39158J49109J38189J08481O8150K8338j901j9378k6920
37917B37543l0163l3645l8756m4253m7773m6803l8881k2022M043L6802P1337J02250
$$ y = [37615, 188936, 361295, 548213, 742630, 935105, 1113125, 1262679, 1371436, 1431601, 1440827, 1400970, 1315833, 1189316, 1025018, 827559, 604805, 369177, 136259, -79403, -269296, -433761, -580765, -720922, -860977, -998894, -1123014, -1215704, -1259525, -1242983, -1163735, -1028666, -851323, -647783, -432789, -217951, -12418, 175726, 339682, 476350, 589119, 688240, 787310, 896815, 1017520, 1137043, 1231598, 1272735, 1236711, 1112982, 908583, 646746, 360454, 83669, -156366, -343268, -471386, -542421, -560968, -531400, -457656, -345683, -206525, -57416, 80773, 189254, 257404, 285742, 283841, 264463, 237543, 207380, 173735, 134979, 90726, 42953, -3850, -42731, -64753, -60710, -23908, 47429, 149679]
37905A49679J25786J40641J47125J45643J35946J17850R2794O4558L8348J9141
37895A177511J0729J5497L3834O2938R6498J26202J44320J45731J28930R6394
37885B038584N4158J0119k8541n7387p5298q3800q5795q4049p9801p2327n9812
37874A476051m0998j6462J1053L7184N6937O5829O0926M1510R185l2580p9135
37863A589500j25338j66169j97626k17639k26319k25113k15501j98317j74025
37854a56547j43266j07263o8265l0075J946K2157K6586J4287j2839n1221r6386
37843f00886j42704j83058k10112k19287k11241j91353j66248j40204j14079q6751
37833b265923n7250k6106M251K9788M5995M9982M2898L1152K5014L4593O5133
$$ y = [149679, 275465, 416106, 563231, 708874, 844820, 962670, 1055464, 1120022, 1158370, 1177511, 1188240, 1203737, 1237571, 1300509, 1397007, 1523209, 1667529, 1813260, 1942190, 2038584, 2092742, 2102861, 2074320, 2016933, 1941635, 1857835, 1772040, 1687991, 1608190, 1535863, 1476051, 1435053, 1418591, 1429644, 1466828, 1523765, 1589594, 1650520, 1692030, 1701215, 1668635, 1589500, 1464162, 1297993, 1100367, 882728, 656409, 431296, 215795, 17478, -156547, -299813, -407076, -475341, -505416, -503470, -481313, -454727, -440440, -453279, -504500, -600886, -743590, -926648, -1136760, -1356047, -1567288, -1758641, -1924889, -2065093, -2179172, -2265923, -2323173, -2349279, -2345028, -2315240, -2269245, -2219263, -2176365, -2145213, -2120199, -2085606, -2020473]
37822b020473J14450J73868K31666K76796L01327L01381K76897K30608J66899
37813E3419R1343J0931o5865j30212j75131j97470j98390j82145j54315j20814
37803a068649q7905o2271n0008n4564p4968j05778j39059j67249j85331j91477
37793b187259j86650j73881j57429j41473j28548j18736j10233j00740q8587p3097
37783c466633n4333l2567p731K0509N1755Q3592J11615J31347J40967J42647J41180
37772b737652J40591J40960J37834J24805R7613N6999Q694l9196p9699j09642
37762b258693j30217j45278j58381j70316j78460j78115j65114j38478j01608
37753c624660o0991k3085Q240L1710M6738N2166M7224L3533J5711l58j0017j0973
$$ y = [-2020473, -1906023, -1732155, -1500489, -1223693, -922366, -620985, -344088, -113480, 53419, 144762, 155693, 89828, -40384, -215515, -412985, -611375, -793520, -947835, -1068649, -1156554, -1218825, -1268833, -1323397, -1398365, -1504143, -1643202, -1810451, -1995782, -2187259, -2373909, -2547790, -2705219, -2846692, -2975240, -3093976, -3204209, -3304949, -3393536, -3466633, -3520966, -3553533, -3561264, -3540755, -3489000, -3405408, -3293793, -3162446, -3021479, -2878832, -2737652, -2597061, -2456101, -2318267, -2193462, -2095849, -2038850, -2030156, -2069352, -2149051, -2258693, -2388910, -2534188, -2692569, -2862885, -3041345, -3219460, -3384574, -3523052, -3624660, -3685651, -3708736, -3700496, -3668786, -3622048, -3569882, -3522658, -3489125, -3473414, -3473772, -3483789, -3494762]
37741c494762k576J5298M2136P5620J11137J43256J68228J85292J95475J99094
37731b361802J94200J77302J45652R9277M1204k4231r3536j64590k34750k98176
37721b519450l45333l66005l54117l10953k44735j67382r0729k4008K7021N9762
37711d335929P4133P1987N6849L3713Q706j1440k0135j2096J5040N9220J13750
37700c946202J68866K14524K42936K49763K34114J98313J48018R2193M1941Q057
37690b347477j853J4647N4232J08596J66352K15908K48585K60810K54256K33966
37680g91978K05775J74639J44622J19616J03287R7687J01835J11887J23050J31725
37670E22145J36437J37516J36307J34496J33343J32934J31655J26410J13540R0137
$$ y = [-3494762, -3497338, -3482040, -3439904, -3364284, -3253147, -3109891, -2941663, -2756371, -2560896, -2361802, -2167602, -1990300, -1844648, -1745371, -1704167, -1728398, -1821934, -1986524, -2221274, -2519450, -2864783, -3230788, -3584905, -3895858, -4140593, -4307975, -4398704, -4422712, -4395691, -4335929, -4261796, -4189809, -4132960, -4099247, -4090541, -4101981, -4122116, -4134212, -4119172, -4059952, -3946202, -3777336, -3562812, -3319876, -3070113, -2835999, -2637686, -2489668, -2397475, -2355534, -2347477, -2349330, -2334683, -2280451, -2171855, -2005503, -1789595, -1541010, -1280200, -1025944, -791978, -586203, -411564, -266942, -147326, -44039, 53648, 155483, 267370, 390420, 522145, 658582, 796098, 932405, 1066901, 1200244, 1333178, 1464833, 1591243, 1704783, 1794920]
37660A794920N5297J0932l8013q4213j19657j38059j36852j17565q4569m3432
37650A098789J84M1146P5428J00387J14324J15742J03197P5894L4443j8660p8635
37639A662239j38196j88104k18900k23200j97829j45183p3441M694P4502J22143
37629F78725J37343J15922O1641j4089r5627j68206k21664k51323k56935k41544
37619b55757k10743j71892j32973j01395q2728p9259q8834j05146j19992j26519
37609a475238j21475j05358q0987n2039k2359M389K5501M0202M9828N6757O2840
37598a617939O8388P1913P0288N9233L4763m225n3372j02405j38090j49513j32671
37587a893630r1575l5444K5901Q5612J40789J91269K37472K78627L11829L32130
$$ y = [1794920, 1850217, 1861149, 1823136, 1738923, 1619266, 1481207, 1344355, 1226790, 1142221, 1098789, 1098973, 1140119, 1215547, 1315934, 1430258, 1546000, 1649197, 1725091, 1759534, 1740874, 1662239, 1524043, 1335939, 1117039, 893839, 696010, 550827, 477386, 482080, 556582, 678725, 816068, 931990, 993631, 979542, 883915, 715709, 494045, 242722, -14213, -255757, -466500, -638392, -771365, -872760, -955488, -1034747, -1123581, -1228727, -1348719, -1475238, -1596713, -1702071, -1783058, -1835097, -1857456, -1853067, -1827566, -1787364, -1737536, -1680779, -1617939, -1549551, -1477638, -1407350, -1348117, -1313354, -1317579, -1370951, -1473356, -1611446, -1760959, -1893630, -1985205, -2020649, -1994748, -1909136, -1768347, -1577078, -1339606, -1060979, -749150, -417020]
37577d17020L33745L12324K67595K04901J34507O8678J8001j1505j9433r884J1284
37566H93193L9480P2712J10406J50755J89063K18668K33939K33132K19026J96917
37556B557291J71431J44420J15130Q1984M4416L760l6820p3214j01969j22115
37546B784314j35918j47771j61779j79827k01164k23149k42029k53491k53557
37537I85629k39882k12608j73888j26425p2361j3282M8990J11757J71393K23626
37527G02949K64019K88732K95772K86499K66369K43654K26035K16861K13804K10866
37517C215560K02030J83726J55155J17488P3206K5676k1505o5214j03135j33703
37507C649284j56118j70697j79194j84785j91581k03692k23727k51169k81489
$$ y = [-417020, -83275, 229049, 496644, 701545, 836052, 904730, 922731, 911226, 891793, 881909, 893193, 932673, 1005385, 1115791, 1266546, 1455609, 1674277, 1908216, 2141348, 2360374, 2557291, 2728722, 2873142, 2988272, 3070256, 3114672, 3118432, 3081612, 3008398, 2906429, 2784314, 2648396, 2500625, 2338846, 2159019, 1957855, 1734706, 1492677, 1239186, 985629, 745747, 533139, 359251, 232826, 160465, 147183, 196173, 307930, 479323, 702949, 966968, 1255700, 1551472, 1837971, 2104340, 2347994, 2574029, 2790890, 3004694, 3215560, 3417590, 3601316, 3756471, 3873959, 3947165, 3972841, 3951336, 3886122, 3782987, 3649284, 3493166, 3322469, 3143275, 2958490, 2766909, 2563217, 2339490, 2088321, 1806832]
37498A806832l07019l19519l13224k86807k43558j89959j33538q0802l6034j254
37488a04882K2958L6412L8523K8137M177l3024q0469j32484j82082k22675k49107
37477h74516k58066k48207k19912j74471j13415l9121M3494J26057J98228K51056
37467a308873K79873K84595K67415K30029J73090R8605J3025p2515j45862j98909
37457c79527k30167k43329k43678k35257k20027j98403j70125j35268r5401n4239
37447b205421j6839J2652L3134M7018N8730P2412R0073J10931J32037J49956J62606
37436a352711J70120J74318J77221J79544J79859J74969J61656J38992J09643
37427A13611P8981N2358L2458J8529P749k635j4201k7534m2430n6944o6248o3601
$$ y = [1806832, 1499813, 1180294, 867070, 580263, 336705, 146746, 13208, -67594, -103628, -104882, -81924, -45512, -6989, 21148, 25325, -7699, -88168, -220652, -402734, -625409, -874516, -1132582, -1380789, -1600701, -1775172, -1888587, -1927708, -1884214, -1758157, -1559929, -1308873, -1029000, -744405, -476990, -246961, -73871, 24734, 37759, -34756, -180618, -379527, -609694, -853023, -1096701, -1331958, -1551985, -1750388, -1920513, -2055781, -2151182, -2205421, -2222260, -2209608, -2176474, -2129456, -2070726, -1998314, -1908241, -1797310, -1665273, -1515317, -1352711, -1182591, -1008273, -831052, -651508, -471649, -296680, -135024, 3968, 113611, 192592, 244950, 277408, 295937, 303686, 301051, 286850, 259316, 216886, 159942, 93694, 30093]
37415C0093m4060q644L4517P3297R7028J01056Q8055O6039M4768L2374L3273M7381
37403E95177P0565R6181J17160J27767J24581J06930P7127M0252L149k7159m5228
37392A286502m8800l9877k4526j1018o764j5295l4412n6537p1700p2224n6543
37381H48806k9654j20K4080L8206M1048L3754J8734n26j9318l2493l6716l2708
37369H53093k5312k0723k2655k9997l7171l6639k2176Q436N2381J02886J51920
37358I74043J93065K22968K40883K47316K43097K29337K07444J78968J45889J11851
37348B994861Q3054O7003O9009Q8667J18846J47924J64094J59824J34599R4752
37338D122633N0376J0933j8204l6601m6893n1739n1836m6308l4984k0333p308
$$ y = [30093, -13967, -22611, 11906, 85203, 182231, 283287, 371342, 437381, 482149, 514523, 547796, 595177, 665742, 761923, 879083, 1006850, 1131431, 1238361, 1315488, 1355740, 1358889, 1331730, 1286502, 1237702, 1197825, 1173299, 1162281, 1155517, 1140222, 1105810, 1049273, 977573, 905349, 848806, 819152, 819032, 843112, 881318, 922366, 956120, 974854, 974328, 955010, 922517, 885801, 853093, 827781, 807058, 784403, 754406, 717235, 680596, 658420, 666856, 719237, 822123, 974043, 1167108, 1390076, 1630959, 1878275, 2121372, 2350709, 2558153, 2737121, 2883010, 2994861, 3077915, 3144918, 3213927, 3302594, 3421440, 3569364, 3733458, 3893282, 4027881, 4122633, 4173009, 4183942, 4165738, 4129137, 4082244, 4030505, 3978669, 3932361, 3897377, 3877044, 3869736]
37327C869736r86l838j4535k9043m2856n2578n6093n2284m1720k8072j8410k0804
37315C508517m0102p4618j16176j53626j77742j84899j77965j64480j53130j49959
37305B115820j55718j65576j71289j64779j41385j01486m9979N985N9889J07715
37295A339197J47942J80203K03979K18226K21835K14568J98048J76174J54281
37286C054453J37149J26915J22126J18260J09322Q9852N6654R811m7243j08349
37276C668950j65677k11132k38144k43426k27958j96403j55112j09744o4063k0399
37266B036892J9051N1425P3495Q2676P8037O0684L3360m47l7172p3179j04516
37255B220306j27243j38544j37979j27962j13050r8383q8100q4524q7966r6424
$$ y = [3869736, 3868750, 3864912, 3850377, 3821334, 3778478, 3725900, 3669807, 3617523, 3575803, 3547731, 3529321, 3508517, 3468415, 3393797, 3277621, 3123995, 2946253, 2761354, 2583389, 2418909, 2265779, 2115820, 1960102, 1794526, 1623237, 1458458, 1317073, 1215587, 1165608, 1171593, 1231482, 1339197, 1487139, 1667342, 1871321, 2089547, 2311382, 2525950, 2723998, 2900172, 3054453, 3191602, 3318517, 3440643, 3558903, 3668225, 3758077, 3814731, 3824542, 3777299, 3668950, 3503273, 3292141, 3053997, 2810571, 2582613, 2386210, 2231098, 2121354, 2057291, 2036892, 2055943, 2107368, 2180863, 2263539, 2341576, 2402260, 2435620, 2435173, 2398001, 2324822, 2220306, 2093063, 1954519, 1816540, 1688578, 1575528, 1477145, 1389045, 1304521, 1216555, 1120131]
37245A120131j05064j06603r3395o0365o918O3041J42336K22216K94257L52104
37235A821740L92452M15039M22085M17438M05360L89076L69687L45787L13784
37226E292448K69033K07896J29751L7473o3835j68106k68167l54938m18028m48607
37216D214920m43163m05876l47781k82788k22472j72586j32797r8918o5594k8292
37206B014653J5662O6611J22365J77994K25991K57828K67226K53469K22303J83334
37196C807436J45652J14642R1892P7469P2156P7720R5412J24490J62099K04143
37186D973111K46187K84005L14015L34066L44486L48951L54048L66719L90366
37177G955954M22242M54191M76416M81732M68090M38742M00629L61889L29304
$$ y = [1120131, 1015067, 908464, 815069, 754704, 747786, 810827, 953163, 1175379, 1469636, 1821740, 2214192, 2629231, 3051316, 3468754, 3874114, 4263190, 4632877, 4978664, 5292448, 5561481, 5769377, 5899128, 5936601, 5872766, 5704660, 5436493, 5081555, 4663527, 4214920, 3771757, 3365881, 3018100, 2735312, 2512840, 2340254, 2207457, 2108539, 2042945, 2014653, 2030315, 2096926, 2219291, 2397285, 2623276, 2881104, 3148330, 3401799, 3624102, 3807436, 3953088, 4067730, 4159622, 4237091, 4309247, 4386967, 4482379, 4606869, 4768968, 4973111, 5219298, 5503303, 5817318, 6151384, 6495870, 6844821, 7198869, 7565588, 7955954, 8378196, 8832387, 9308803, 9790535, 10258625, 10697367, 11097996, 11459885, 11789189]
37168A1789189L06447K93265K87331K86064K88312K94368L04941L20479L41133
37159A4511529L66604L95577M25533M53760M78943N02290N27529N59951O05034
37150A8826750O67319P49967Q54465R79781J121498J272555J426078J578587J731397
37141B9208397J889595K059768K248144K460222K701653K978582L296123L656236
37133E0498720M057750M499370M983490N518491O119040O804757P597056Q514963
37125I8593637R571844J0773951J2119705J3599154J5194999J6886029J8650760
37118A95390079K0467368K2306223K4111991K5775136K7100037K7784778K7430736
37111C70366348K5600371K1936573J6330131R068899Q65002p302968j4480606
$$ y = [11789189, 12095636, 12388901, 12676232, 12962296, 13250608, 13544976, 13849917, 14170396, 14511529, 14878133, 15273710, 15699243, 16153003, 16631946, 17134236, 17661765, 18221716, 18826750, 19494069, 20244036, 21098501, 22078282, 23199780, 24472335, 25898413, 27477000, 29208397, 31097992, 33157760, 35405904, 37866126, 40567779, 43546361, 46842484, 50498720, 54556470, 59055840, 64039330, 69557821, 75676861, 82481618, 90078674, 98593637, 108165481, 118939432, 131059137, 144658291, 159853290, 176739319, 195390079, 215857447, 238163670, 262275661, 288050797, 315150834, 342935612, 370366348, 395966719, 417903292, 434233423, 443302322, 444167324, 436864356, 422383750]
37104D22383750k0011701k3660402k5557197k6047450k5539714k4404467k2926615
37097B54236204k1297505j9631047j7989184j6404790j4896905j3478790j2160428
37090A38377555j0947847r842252q841008p939729p133772o418592n789353n240115
37082G6224887m763335m350399l992735l682026l409364l164846k938616k722658
37074D7200908k512424k307985k113933j936903j781832j649908j539486j447947
37066C1910490j372236j308810j254657j208819j172258j145702j127432j112765
37058B2207811j095222j068314j026957r68164q91246p98293o94879n89965m94105
37049A4580666m16521l62396l31201l16427l07103k91348k60698k13222j54158
$$ y = [422383750, 402372049, 378711647, 353154450, 327107000, 301567286, 277162819, 254236204, 232938699, 213307652, 195318468, 178913678, 164016773, 150537983, 138377555, 127429708, 117587456, 108746448, 100806719, 93672947, 87254355, 81465002, 76224887, 71461552, 67111153, 63118418, 59436392, 56027028, 52862182, 49923566, 47200908, 44688484, 42380499, 40266566, 38329663, 36547831, 34897923, 33358437, 31910490, 30538254, 29229444, 27974787, 26765968, 25593710, 24448008, 23320576, 22207811, 21112589, 20044275, 19017318, 18049154, 17157908, 16359615, 15664736, 15074771, 14580666, 14164145, 13801749, 13470548, 13154121, 12847018, 12555670, 12294972, 12081750, 11927592]
37040A1927592r4080m5400j8307j7478m0796q0382j25395j65648j94556k10113
37030A0935437k13541k06980j91943j68952j37733r7808m9826K856N4098R7300
37020A0022908J28673J48804J61334J70013J76316J78760J73921J58571J32013
37011A1451313R7346O0495K7363R50j9659l7976n7543p9461j01304j18204j25884
37000A1097436j23759j16085j10650j16302j40418j86498k52427l30561m10246
36991I310490m81154n35482n68607n79454n70973n49645n23199m97416m73935
36982D530625m50040m20410l79950l26448k61750j90777j19170n1295J0329O4461
36972B405575J10307J46798J71847J81898J72656J41395Q9562K3637m6691j11795
$$ y = [11927592, 11833512, 11788112, 11769805, 11752327, 11711531, 11631149, 11505754, 11340106, 11145550, 10935437, 10721896, 10514916, 10322973, 10154021, 10016288, 9918480, 9868654, 9871510, 9925608, 10022908, 10151581, 10300385, 10461719, 10631732, 10808048, 10986808, 11160729, 11319300, 11451313, 11548659, 11609154, 11636517, 11637467, 11617808, 11579832, 11522289, 11442828, 11341524, 11223320, 11097436, 10973677, 10857592, 10746942, 10630640, 10490222, 10303724, 10051297, 9720736, 9310490, 8829336, 8293854, 7725247, 7145793, 6574820, 6025175, 5501976, 5004560, 4530625, 4080585, 3660175, 3280225, 2953777, 2692027, 2501250, 2382080, 2330785, 2341114, 2405575, 2515882, 2662680, 2834527, 3016425, 3189081, 3330476, 3420038, 3443675, 3396984, 3285189]
36962C285189j64595k01200k20233k22208k09401j85577j54841j20108q2381m1443
36952A683202K858M9871R8078J45025J87144K20076K39859K44210K33092K08621
36942C312036J74848J37333J01892P2509M9795L1435J4700r61j3442k0151k0937
36931C839057j9144j9865k6864m0526n7964p4672q6305q9755q3716o8961m8111
36920C223174k4446k14K4212M9559P6314J04308J33405J63757J94736K23584K45647
36909D414036K56653K55524K45709K34180K28699K34792K53806K82680L15067
36900F721146L42901L57573L50578L14540K45440J45670K5767r7393k05819k86460
36890G913943l34750l54196l52942l39780l21744l03625k88191k76116k66193
$$ y = [3285189, 3120594, 2919394, 2699161, 2476953, 2267552, 2081975, 1927134, 1807026, 1724645, 1683202, 1686060, 1735931, 1834009, 1979034, 2166178, 2386254, 2626113, 2870323, 3103415, 3312036, 3486884, 3624217, 3726109, 3798618, 3848413, 3879848, 3894548, 3893587, 3880145, 3859994, 3839057, 3819913, 3800048, 3773184, 3732658, 3674694, 3600022, 3513717, 3423962, 3340246, 3271285, 3223174, 3198728, 3198514, 3222726, 3272285, 3348599, 3452907, 3586312, 3750069, 3944805, 4168389, 4414036, 4670689, 4926213, 5171922, 5406102, 5634801, 5869593, 6123399, 6406079, 6721146, 7064047, 7421620, 7772198, 8086738, 8332178, 8477848, 8503615, 8406222, 8200403, 7913943, 7579193, 7224997, 6872055, 6532275, 6210531, 5906906, 5618715, 5342599, 5076406]
36881E076406k56736k47479k40243k37827k42517k55265k75118k98414l18696
36872B704111l28283l20671k92093k41890j72634r0288l700P6809J41146J81232
36862A653739J93214J79436J48340J11274P7977N3633L8748L0859K6301K1382
36852B534903J3201N79j4976k8914l4680k6365j885L5095P5968J10521J31066
36841B794513J35182J25950J10079R5097Q6556Q6057R0823R5016R2223P7790N0317
36830C839603J2125l1097p1637j01892j16697j14906r9400p5429m8218k1419K700
36819C173733K2185L5064M0194L8093L0653K0066Q119l677j3750k0692k3990k4681
36807C281317k5058k7321l2018l7563m1322m1278l6913k8920j8589p521K586J0717
$$ y = [5076406, 4819670, 4572191, 4331948, 4094121, 3851604, 3596339, 3321221, 3022807, 2704111, 2375828, 2055157, 1763064, 1521174, 1348540, 1258252, 1254552, 1331361, 1472507, 1653739, 1846953, 2026389, 2174729, 2286003, 2363980, 2417613, 2456361, 2487220, 2513521, 2534903, 2548104, 2548683, 2533707, 2504793, 2470113, 2443748, 2441863, 2476958, 2552926, 2663447, 2794513, 2929695, 3055645, 3165724, 3260821, 3347377, 3433434, 3524257, 3619273, 3711496, 3789286, 3839603, 3851728, 3820631, 3748994, 3647102, 3530405, 3415499, 3316099, 3240670, 3192452, 3171033, 3173733, 3195918, 3230982, 3271176, 3309269, 3339922, 3359988, 3368107, 3364430, 3350680, 3329988, 3305998, 3281317, 3256259, 3228938, 3196920, 3159357, 3118035, 3076757, 3039844, 3010924, 2992335, 2984814, 2987400, 2998117]
36795B998117J7582K5670L7738N4803P5519R7565J19603J41963J65708J91189
36785C925457K17123K40373K56415K60529K49403K22242J80815J28849P1510J5087
36775E767803l3635o8623q6237q6576p3568n3219l0764q585J3471L5901N7549
36764E433517P5463Q6272Q7476P7494N4772J7311l6372j05240j84321k65204l38265
36753D902903l95265m31129m44655m38516m18434l91357l62810l34549l04009
36744A382179k66283k17459j56896q6960j1057O7757J46440K20940K86230L37738
36734A702629L72825L90916L92423L77783L47818L05144K55126K05140J62293
36725D512097J30981J11659J01132R3909Q4067O7162M1540Q375k9612o9850j10734
$$ y = [2998117, 3015699, 3041369, 3079107, 3133910, 3209429, 3306994, 3426597, 3568560, 3734268, 3925457, 4142580, 4382953, 4639368, 4899897, 5149300, 5371542, 5552357, 5681206, 5752716, 5767803, 5734168, 5665545, 5579308, 5492732, 5419164, 5365945, 5335181, 5326596, 5340067, 5375968, 5433517, 5508980, 5595252, 5682728, 5760222, 5814994, 5832305, 5795933, 5690693, 5506372, 5241168, 4902903, 4507638, 4076509, 3631854, 3193338, 2774904, 2383547, 2020737, 1686188, 1382179, 1115896, 898437, 741541, 654581, 643524, 711281, 857721, 1078661, 1364891, 1702629, 2075454, 2466370, 2858793, 3236576, 3584394, 3889538, 4144664, 4349804, 4512097, 4643078, 4754737, 4855869, 4949778, 5033845, 5101007, 5142547, 5150922, 5121310, 5051460, 4940726]
36714D940726j51395j91180k29500k65722k98406l24433l39395l39880l26266
36705B474549l03846k81289k67163k66195k76995k92467l02987l00712k82665
36696i9770k51072k11421j69750j30521r5525o3768l2202K950M4491R2677J44417
36685g69494J93595K32413K53432K52094K29138J91515J50575J17880J00971J01231
36675A053350J14416J32886J48415J54654J48399J29242R8147N6223M564n4815
36665A985481j17720j77287k25072k53565k58813k41610k07061j63421j20714
36656B20218q8712p3787p5991q8549j00884j03467r1401o5009k8288J2657N0484
36645d32729P7667Q8468Q0994N7895K5419q383l5694n0843n1589l9039j6361J2510
$$ y = [4940726, 4789331, 4598151, 4368651, 4102929, 3804523, 3480090, 3140695, 2800815, 2474549, 2170703, 1889414, 1622251, 1356056, 1079061, 786594, 483607, 182895, -99770, -350842, -562263, -732013, -862534, -958059, -1021827, -1054029, -1051079, -1006588, -913911, -769494, -575899, -343486, -90054, 162040, 391178, 582693, 733268, 851148, 952119, 1053350, 1167766, 1300652, 1449067, 1603721, 1752120, 1881362, 1979509, 2035732, 2040296, 1985481, 1867761, 1690474, 1465402, 1211837, 953024, 711414, 504353, 340932, 220218, 131506, 57719, -18272, -106821, -207705, -311172, -402573, -467582, -495870, -483213, -432729, -355062, -266594, -185600, -127705, -102286, -110669, -146363, -197206, -248795, -287834, -304195, -291685]
36633b91685M3433P2352R5865J11848J19437J18428J08817R0921O6052L7413J0721
36622E83602o421o888J2685M9733R6262J41841J77266J96947J99140J84741J56192
36611A785100J17369P3800L2086j902k4912l6983m0358l7457k9201j4822O956
36600A829676L6204P0731J06107J36588J56648J62654J53835J31812R8723N5404
36590B938382J191o4134j37773k12901k80468l32666l65587l79544l77615l64230
36580D24655l44360l22798l02990k86070k70903k55253k37351k17260j97454j82251
36570b192035j76190j81945j98751k22042k44587k58657k58102k39214k00409
36561d171932j41794o5339K4798J22452K20099L09380L81671M29288M47356M35341
$$ y = [-291685, -248252, -175900, -80035, 31813, 151250, 269678, 378495, 469416, 535468, 572881, 583602, 577181, 570293, 582978, 632711, 728973, 870814, 1048080, 1245027, 1444167, 1628908, 1785100, 1902469, 1976269, 2008355, 2006453, 1981541, 1944558, 1904200, 1866743, 1837542, 1822720, 1829676, 1865880, 1936611, 2042718, 2179306, 2335954, 2498608, 2652443, 2784255, 2882978, 2938382, 2939573, 2875439, 2737666, 2524765, 2244297, 1911631, 1546044, 1166500, 788885, 424655, 80295, -242503, -545493, -831563, -1102466, -1357719, -1595070, -1812330, -2009784, -2192035, -2368225, -2550170, -2748921, -2970963, -3215550, -3474207, -3732309, -3971523, -4171932, -4313726, -4379065, -4354267, -4231815, -4011716, -3702336, -3320665, -2891377, -2444021, -2008680]
36551b008680L97292L40476K72870K00753J27940N7301o938n8572r1414j02137
36541h71109r1524o3453k2888K5677P8647J32873J84879K30538K65528K86095
36531A55263K89296K72762K34947J76407J01390J8226o2307j30079j78558k06250
36521F71097k16130k13658k04392j92191j78643j63914j48617j35373j28579j32200
36511a042600j46972j69100j91475k06681k10083k01293j83412j60814j37150
36502b649580j14795r5284p9394o6490n4112l8808j7564J1381M8546R3075J42332
36491b820693J92235K38870K80148L15719L45191L66379L75267L67593L41031
36482A740K96739K39465J76090J13192N5098L409m2059q1807j15584j42269j60637
$$ y = [-2008680, -1611388, -1270912, -998042, -797289, -669349, -612048, -618986, -677558, -768972, -871109, -962633, -1026086, -1048974, -1023297, -944650, -811777, -626898, -396360, -130832, 155263, 444559, 717321, 952268, 1128675, 1230065, 1248291, 1185984, 1055905, 877347, 671097, 454967, 241309, 36917, -155274, -333917, -497831, -646448, -781821, -910400, -1042600, -1189572, -1358672, -1550147, -1756828, -1966911, -2168204, -2351616, -2512430, -2649580, -2764375, -2859659, -2939053, -3005543, -3059655, -3098463, -3116027, -3104646, -3056100, -2963025, -2820693, -2628458, -2389588, -2109440, -1793721, -1448530, -1082151, -706884, -339291, 1740, 298479, 537944, 714034, 827226, 882324, 885733, 843674, 761867, 646283, 504014, 343377]
36471C43377j70373j72505j69044j62413j55132j49606j47494j48900j52174j54847
36461a239111j55093j52804j49477j46916j45430j42775j34872j18097r1809n9218
36451b535602k6100J747K0641K9770L0771K6973K2765K2816L0869M8482P4447
36440b252421J05375J36882J64666J84946J94667J91959J76818J51311J18905
36431h26892Q3459M8765J8565l954j7523k3763k6370k9002l3688m0816m9848n9633
36419i60700o8320p3604p3501o7127n4994l8735k0351j436J7097L4607N0330O3559
36407a193175P4116Q2339Q8549R2623R3838R0617Q0446O0929L1935k870l6918
36396e37571o3519p8197p9079o6164m1109p640K8723O2394Q9775J09889J23144
$$ y = [343377, 173004, 499, -168545, -330958, -486090, -635696, -783190, -932090, -1084264, -1239111, -1394204, -1547008, -1696485, -1843401, -1988831, -2131606, -2266478, -2384575, -2476384, -2535602, -2561702, -2559955, -2539314, -2509544, -2478773, -2451800, -2429035, -2406219, -2375350, -2326868, -2252421, -2147046, -2010164, -1845498, -1660552, -1465885, -1273926, -1097108, -945797, -826892, -743433, -694668, -676103, -680057, -697580, -721343, -747713, -776715, -810403, -851219, -901067, -960700, -1029020, -1102624, -1176125, -1243252, -1298246, -1336981, -1357332, -1358768, -1341671, -1307064, -1256734, -1193175, -1119059, -1036720, -948171, -855548, -761710, -671093, -590647, -529718, -497783, -500653, -537571, -601090, -679287, -758366, -824530, -865639, -873279, -844556, -782162, -692387, -582498, -459354]
36385d59354J29751J29441J22521J10802R7268Q4647P4052O4407N2880L6168J2387
36374D54970j7231m7816p2022q2460p4097m5570Q29N9953J24688J87002K39487
36363G27733K77245K98944L06186L01705K87841K66280K38547K06251J70726J32690
36353C214148R2615N1870J3662j7408l7457m5751m5497m2270m1431m6684o0304
36342C035493q3668j16524j55471j93752k23678k40328k43698k37743k27384k15981
36332A097266k04684j93177j80603j66153j49729j33009j20204j17183j28482
36323b95958j53982j87979k21888k48523k64575k69887k65105k50319k25617j92657
36313b576490j55673j20930r4687q0728p9034q6319r7709j08147j13102j09327
$$ y = [-459354, -329603, -200162, -77641, 33161, 130429, 215076, 289128, 353535, 406415, 442583, 454970, 437739, 389923, 317901, 235441, 161344, 115774, 116603, 176556, 301244, 488246, 727733, 1004978, 1303922, 1610108, 1911813, 2199654, 2465934, 2704481, 2910732, 3081458, 3214148, 3306763, 3358633, 3372295, 3354887, 3317430, 3271679, 3226182, 3183912, 3142481, 3095797, 3035493, 2951825, 2835301, 2679830, 2486078, 2262400, 2022072, 1778374, 1540631, 1313247, 1097266, 892582, 699405, 518802, 352649, 202920, 69911, -50293, -167476, -295958, -449940, -637919, -859807, -1108330, -1372905, -1642792, -1907897, -2158216, -2383833, -2576490, -2732163, -2853093, -2947780, -3028508, -3107542, -3193861, -3291570, -3399717, -3512819, -3622146]
36303c622146r6052p5949n4471l7439k8127k5666k5582k1826q908J6889N7022
36292c922255J10341J72782K37871K98618L49965L90077M19507M39276M49609
36283a054209M50159M40654M20923L90336L47871K93244K28335J57613Q7295K3758
36273A785979k7766o3902q3440q7702q0966p0157o3091o5911q1363j09001j46579
36262I06101j90944k37808k81270l14404l31217l29087l10214k80828k48212k17218
36252a835101j88663j60556j30916r9833o9435m2371k0398m162O000R531O312
36241b529592k038j1739j8319j9244j5753j2414j4546k4979m2031n9733p0025
36230b820413o5782m3546n153M2354Q9128J26474J50232J61286J63110J58551
$$ y = [-3622146, -3718198, -3794147, -3848618, -3886057, -3914184, -3939850, -3965432, -3987258, -3996166, -3979277, -3922255, -3811914, -3639132, -3401261, -3102643, -2752678, -2362601, -1943094, -1503818, -1054209, -604050, -163396, 257527, 647863, 995734, 1288978, 1517313, 1674926, 1762221, 1785979, 1758213, 1694311, 1610871, 1523169, 1442203, 1372046, 1308955, 1243044, 1161681, 1052680, 906101, 715157, 477349, 196079, -118325, -449542, -778629, -1088843, -1369671, -1617883, -1835101, -2023764, -2184320, -2315236, -2415069, -2484504, -2526875, -2547273, -2551435, -2545435, -2535904, -2529592, -2531630, -2543369, -2561688, -2580932, -2596685, -2609099, -2623645, -2648624, -2690655, -2750388, -2820413, -2886195, -2929741, -2934894, -2892540, -2803412, -2676938, -2526706, -2365420, -2202310, -2043759]
36220b043759J48191J30768J04711O9731K7949j5846n5146q3756r7995r7958q7126
36209b000236p0545n2518l5256j9292m924P047J6195K3907L3453M8042O8265R1043
36197a894819J10860J22325J22289J10504Q8945O0641K8692m141l5266o1681p9638
36186a431289q5248p6077n2822j9783J6242M7975O9408P6668O8242M5109J0891
36175a330684k8558o6619r7976j19820j31529j33701j27977j17605j07192j00897
36165b362558j00370j04391j10361j16054j20348j23023j24184j23434j18885
36156c403608j07021q4275m9854p517L5447P1698R7261J12589J21002J26365J31818
36145b956095J39847J52369J69998J90883K10444K22411K20706K01392J64314
$$ y = [-2043759, -1895568, -1764800, -1660089, -1590358, -1562409, -1578255, -1633401, -1717157, -1815152, -1913110, -2000236, -2070781, -2123299, -2158555, -2177847, -2182771, -2175724, -2159529, -2135622, -2102169, -2054127, -1985862, -1894819, -1783959, -1661634, -1539345, -1428841, -1339896, -1279255, -1250563, -1254704, -1289970, -1351651, -1431289, -1516537, -1592614, -1645436, -1665219, -1648977, -1601002, -1531594, -1454926, -1386684, -1341575, -1330684, -1359242, -1425861, -1523837, -1643657, -1775186, -1908887, -2036864, -2154469, -2261661, -2362558, -2462928, -2567319, -2677680, -2793734, -2914082, -3037105, -3161289, -3284723, -3403608, -3510629, -3594904, -3644758, -3652275, -3616828, -3545130, -3447869, -3335280, -3214278, -3087913, -2956095, -2816248, -2663879, -2493881, -2302998, -2092554, -1870143, -1649437, -1448045, -1283731]
36136a283731J13923N8559P795l0997n4661o3592n9334m3009j6021J7954N2206
36125a300908P8913R2609R2758Q3571P1435O1713N6663N5136N3763M8721L7245
36114e68381J8515o086l3116n7712p5008q1915p8249o6204m8535k7072k891K2204
36102a004450M4838O1210O9510P1385P0678P0232O9351O4458N2762L6069K1319
36091c72638J7022K8335N4747R1835J34872J80742K27049K70117L04392L23775
36081A260248L23661L02205K60297K00649J26883M3303m4659j30125k05419k63643
36071A873400l00470l15251l11024k93444k69007k43229k19522j99121j81926
36062d59594j67617j56211j47555j40140j30400j13421q4877m3146R516O7239
$$ y = [-1283731, -1169808, -1111249, -1103454, -1134451, -1189112, -1252704, -1312038, -1355047, -1371068, -1353114, -1300908, -1221995, -1129386, -1036628, -953057, -881622, -819909, -763246, -708110, -654347, -605626, -568381, -549866, -555952, -589068, -646780, -721788, -803703, -881952, -948156, -996691, -1023763, -1026654, -1004450, -959612, -898402, -828892, -757507, -686829, -616597, -547246, -482788, -430026, -393957, -372638, -355616, -327281, -272534, -180699, -45827, 134915, 361964, 632081, 936473, 1260248, 1583909, 1886114, 2146411, 2347060, 2473943, 2517246, 2472587, 2342462, 2137043, 1873400, 1572930, 1257679, 946655, 653211, 384204, 140975, -78547, -277668, -459594, -627211, -783422, -930977, -1071117, -1201517, -1314938, -1399815, -1442961, -1433445, -1366206]
36052a366206J22241J67226J97244K09972K04881J82672J45976J00549N5402K1069
36042D1026O521J6266M8830R7214J50963J99046K32595K46558K39817K14174J73447
36031A666457J23382P1605K6175p211k7436l7516m1568m1451l5605k0995L521
36020A679358L5121O7971R6228J16540J28454J33326J33137J29849J25146J20343
36010B765473J16365J13391J09947J02099Q3865M9204n248p8028j62429k48235
36000B846404l24882l84429m22714m38517m32070m04519l58612k99656k35460
35991d54455j74900j25832r3113p7062p2726p1020o2401m1546r644K7659O4808
35980a090232R9398J31545J60882J84218J96015J91547J70576J38743J05278P8468
$$ y = [-1366206, -1243965, -1076739, -879495, -669523, -464642, -281970, -135994, -35445, 19957, 41026, 47547, 63813, 112643, 209857, 360820, 559866, 792461, 1039019, 1278836, 1493010, 1666457, 1789839, 1861444, 1887619, 1880408, 1852972, 1815456, 1773888, 1732437, 1696832, 1675837, 1679358, 1714479, 1782450, 1878678, 1995218, 2123672, 2256998, 2390135, 2519984, 2645130, 2765473, 2881838, 2995229, 3105176, 3207275, 3291140, 3340344, 3335096, 3257068, 3094639, 2846404, 2521522, 2137093, 1714379, 1275862, 843792, 439273, 80661, -218995, -454455, -629355, -755187, -848300, -925362, -998088, -1069108, -1131509, -1173055, -1182699, -1155040, -1090232, -990834, -859289, -698407, -514189, -318174, -126627, 43949, 182692, 287970, 366438]
35970C66438O1950N3851M8645M0342K5661O031j2662k2759j8533J198L2716O8807
35958F51685J00758J20386J22069J04546P1584L0871q358l7658n1080m6553k6884
35947A031366O97K7071M4727N0027M3493K8987J2695J750K081J6213M2244P4660
35935A376011J06367J31004J44671J46743J39714J28014J16089J06526R9423R3267
35925B587829Q6355P7575O6432N3098L8595K4616J2920N036K559P375K1178M4580
35913C028148P6567J14531J54662J92626K24476K47461K60364K63520K58834K49778
35903E070967K40900K36577K39299K48412K60338K70555K76126K76723K73020
35894G392917K63640K43203K03293J36145L9082q2431k14743l39379m38646n01071
$$ y = [366438, 428388, 482239, 530884, 571226, 596887, 602918, 590256, 567497, 548964, 550162, 582878, 651685, 752443, 872829, 994898, 1099444, 1171028, 1201899, 1193541, 1155883, 1104803, 1058250, 1031366, 1032063, 1059134, 1103861, 1153888, 1197381, 1226368, 1239063, 1240813, 1242894, 1259107, 1301351, 1376011, 1482378, 1613382, 1758053, 1904796, 2044510, 2172524, 2288613, 2395139, 2494562, 2587829, 2674184, 2751759, 2818191, 2871289, 2909884, 2934500, 2947420, 2952456, 2955015, 2962390, 2983568, 3028148, 3104715, 3219246, 3373908, 3566534, 3791010, 4038471, 4298835, 4562355, 4821189, 5070967, 5311867, 5548444, 5787743, 6036155, 6296493, 6567048, 6843174, 7119897, 7392917, 7656557, 7899760, 8103053, 8239198, 8278280, 8195849, 7981106, 7641727, 7203081, 6702010]
35884F702010n23879n11497m71668m12135l39741k61264j84046j15154n9541j8633
35874C804452R328K7199L6678L7802L0482J6441m3j2576j3891K021L6858Q5964
35862D060715J39630J87479K22944K45155K57979K67499K78843K93212L06576
35853F260032L11120K98779K64566K07829J31300L9497o1904j65398k61131l38148
35843F686542l87566m05912l96443l67444l28324k86060k44337k05363j71601
35834C893492j45111j25562j10058r5644q1840p0455o2982n8023n0798l4854m934
35823C053231M0701R9777J67280K37327L04489L64555M15047M55512M87498N14292
35813F139709N40273N69777O05836O49357O98890P50886Q00801Q45128Q83249
$$ y = [6702010, 6178131, 5666634, 5194966, 4782831, 4443090, 4181826, 3997780, 3882626, 3823085, 3804452, 3813780, 3840979, 3877657, 3915459, 3945941, 3962382, 3962339, 3949763, 3935872, 3937893, 3974751, 4060715, 4200345, 4387824, 4610768, 4855923, 5113902, 5381401, 5660244, 5953456, 6260032, 6571152, 6869931, 7134497, 7342326, 7473626, 7513123, 7451219, 7285821, 7024690, 6686542, 6298976, 5893064, 5496621, 5129177, 4800853, 4514793, 4270456, 4065093, 3893492, 3748381, 3622819, 3512761, 3417117, 3335277, 3264822, 3201840, 3143817, 3093019, 3058165, 3053231, 3093932, 3193709, 3360989, 3598316, 3902805, 4267360, 4682407, 5137919, 5625417, 6139709, 6679982, 7249759, 7855595, 8504952, 9203842, 9954728, 10755529, 11600657, 12483906]
35804A2483906R17632R52654R93377J044700J110384J192308J291018J407087
35796B1393066J541531J695148J868535K063446K283816K535220K823706L155179
35788C9359647L535072L967852M456989N005606N617051O295397P046234P876812
35780H3160660Q793846R800246J0894360J2072659J3332309J4669895J6074035
35773A68798010J7509532J8891929K0058927K0752038K0622936J9280578J6396854
35766C02310804J1865494N949171o96012p184654j2691435j6703322j9104355
35759B63745691k0091258k0016094j9249708j8101174j6786563j5432708j4101917
35752A39966269j2821507j1605449j0465082r411483q452663p589457o814874
$$ y = [12483906, 13401538, 14354192, 15347569, 16392269, 17502653, 18694961, 19985979, 21393066, 22934597, 24629745, 26498280, 28561726, 30845542, 33380762, 36204468, 39359647, 42894719, 46862571, 51319560, 56325166, 61942217, 68237614, 75283848, 83160660, 91954506, 101754752, 112649112, 124721771, 138054080, 152723975, 168798010, 186307542, 205199471, 225258398, 246010436, 266633372, 285913950, 302310804, 314176298, 320125469, 319429457, 312244803, 299553368, 282850046, 263745691, 243654433, 223638339, 204388631, 186287457, 169500894, 154068186, 139966269, 127144762, 115539313, 105074231, 95662748, 87210085, 79620628, 72805754]
35745G2805754o118002n488612m918946m403397l937908l519231l143939k808391
35737C8467328k509765k246501k017353j820671j654852j518618j410241j326922
35729B3962405j265232j221393j190445j165660j139654j106291j061696j004298
35721A4807736r34619q54673p66864o73432n77216m82547l94874l19461k60550
35712I543500k21072k02058k01868k16061k38139k60500k75512k76959k61603
35703G389728k29895j85426j33684q0751l2181P935L7719N8044P2696Q7651J09137
35692G100973J40875J81720K25111K61007K79638K74963K45981J95598J28621
35683I034487N0380l3415j16158j90211k48006k84400k98648k94468k78235k57006
$$ y = [72805754, 66687752, 61199140, 56280194, 51876797, 47938889, 44419658, 41275719, 38467328, 35957563, 33711062, 31693709, 29873038, 28218186, 26699568, 25289327, 23962405, 22697173, 21475780, 20285335, 19119675, 17980021, 16873730, 15812034, 14807736, 13873117, 13018444, 12251580, 11578148, 11000932, 10518385, 10123511, 9804050, 9543500, 9322428, 9120370, 8918502, 8702441, 8464302, 8203802, 7928290, 7651331, 7389728, 7159833, 6974407, 6840723, 6759972, 6727791, 6735726, 6773445, 6831489, 6904185, 6991836, 7100973, 7241848, 7423568, 7648679, 7909686, 8189324, 8464287, 8710268, 8905866, 9034487, 9084867, 9051452, 8935294, 8745083, 8497077, 8212677, 7914029, 7619561, 7341326, 7084320]
35673G084320k37408k25141k24393k37208k62940k97955l35953l69523l92479
35664D501320m01539l96612l80300l57238l32809l11010k92800k76553k60348
35655A492111k43980k28999k16865k06875j95620j78774j54195j24040r4184p1350
35645b22771o0111o1676p4572r5850j21434j45682j61502j62021j42913j03869
35635a352401m8508J6503Q2528J40432J82479K04109K05077J89768J66255J43657
35625g0101J28863J24895J31916J49135J75235K07225K39679K65655K78657K74477
35615A905636K52262K14730J67576J18257P4433M2310K5296K3641L5180N6240
35605B915561Q1928J06138J22310J25060J11765Q3339M4209J547l6464o3126p5571
$$ y = [7084320, 6846912, 6621771, 6397378, 6160170, 5897230, 5599275, 5263322, 4893799, 4501320, 4099781, 3703169, 3322869, 2965631, 2632822, 2321812, 2029012, 1752459, 1492111, 1248131, 1019132, 802267, 595392, 399772, 220998, 66803, -57237, -151421, -222771, -282882, -344558, -419130, -514980, -636414, -782096, -943598, -1105619, -1248532, -1352401, -1400909, -1384406, -1301878, -1161446, -978967, -774858, -569781, -380013, -213758, -70101, 58762, 183657, 315573, 464708, 639943, 847168, 1086847, 1352502, 1631159, 1905636, 2157898, 2372628, 2540204, 2658461, 2732894, 2775204, 2800500, 2824141, 2859321, 2915561, 2997489, 3103627, 3225937, 3350997, 3462762, 3546101, 3590310, 3591857, 3555393, 3492267, 3416696]
35594C416696p5631o8675o0856n6365n6267n9389o4152o9862p7028q7005j01204
35583B640262j19805j40536j58559j68030j64707j48079j21601r0809o0630l3929
35573A433577j1979M586J5913K3833L1543M1446N2938O2428O5699O0607M8008
35562A828599L0416R700j4294m3151p8022j18003j59850j98817k29972k49310
35552G77296k54403k44402k19691j81864j34174q1844l1379J1136M1753N9361
35542b58211O5155O1522N1151L6579J9978L110j2262k3634k7406j9611K675M0100
35530f0854R0442J48533K06784K56759K91361L06332L00141K73062K26781J64771
35520B204112R2213J4812o2667j36855k05167k65365l16028l57164l89781m14444
$$ y = [3416696, 3341065, 3272390, 3211534, 3155169, 3098902, 3039513, 2975361, 2905499, 2828471, 2741466, 2640262, 2520457, 2379921, 2221362, 2053332, 1888625, 1740546, 1618945, 1528136, 1467506, 1433577, 1421598, 1426184, 1442097, 1465930, 1497473, 1538919, 1591857, 1654285, 1719984, 1780591, 1828599, 1859015, 1868715, 1854421, 1811270, 1733248, 1615245, 1455395, 1256578, 1026606, 777296, 522893, 278491, 58800, -123064, -257238, -339082, -370461, -359325, -317572, -258211, -193056, -131534, -80383, -43804, -23826, -20716, -32978, -56612, -84018, -103629, -100954, -60854, 29588, 178121, 384905, 641664, 933025, 1239357, 1539498, 1812560, 2039341, 2204112, 2296325, 2311137, 2248470, 2111615, 1906448, 1641083, 1325055, 967891, 578110, 163666]
35510A63666m30077m34080m23735l98124l59750l14969k72501k40305k22586k18835
35500c151296k25231k36902k49587k60099k65892k64345k52543k28222j91415
35491e325532j45349r5422m6841k623L6714P1908J03292J29765J48885J57935
35481d967268J55461J42735J24430J07856J00500J06912J26830J55918J88602
35472c758024K20979K52034K82913L15373L50300L86575M20233M44370M50649
35463f34598M32428L87991L21868K43325J63056Q9977K9537j6090m6566o1780
35453I09148o1339m5573j7247J7760N1858P8676R5548J04032J08318J12870J20863
35442A474914J34192J54423J83282K21681K67963L17098L61870L95164M11354
$$ y = [163666, -266411, -700491, -1124226, -1522350, -1882100, -2197069, -2469570, -2709875, -2932461, -3151296, -3376527, -3613429, -3863016, -4123115, -4389007, -4653352, -4905895, -5134117, -5325532, -5470881, -5566303, -5613144, -5615767, -5579053, -5507145, -5403853, -5274088, -5125203, -4967268, -4811807, -4669072, -4544642, -4436786, -4336286, -4229374, -4102544, -3946626, -3758024, -3537045, -3285011, -3002098, -2686725, -2336425, -1949850, -1529617, -1085247, -634598, -202170, 185821, 507689, 751014, 914070, 1004047, 1033584, 1017494, 970928, 909148, 847809, 802236, 784989, 802749, 854607, 933283, 1028831, 1132863, 1241181, 1354051, 1474914, 1609106, 1763529, 1946811, 2168492, 2436455, 2753553, 3115423, 3510587, 3921941]
35433C921941M06145L76227L20315K41472J48809N6646j9319o7352q3995p4942
35423E225947n2100k8654j4894j6213l3030o1678r5960j29003j54959j70028j73016
35412D296412j65584j51901j37312j26339j21269j22001j26722j32551j36021
35403C076712j33958j24963j10605r5171q3879q0856q8309j06977j36624j75483
35393A939887k19181k60760k92752l10215l12558l02897k85685k64414k40610
35384e49185k14423j86117j57489j31995j13156j02219r6897r2272q3234o7030
35374a794017m4653k0601r30R699J0568N474R30L100J5327L7613O7872J03569
35362a606049J42262J80941K15406K40712K52484K48030K26755J89937J40218
$$ y = [3921941, 4328086, 4704313, 5024628, 5266100, 5414909, 5471555, 5452236, 5384884, 5300889, 5225947, 5173847, 5145193, 5130299, 5114086, 5081056, 5019378, 4923418, 4794415, 4639456, 4469428, 4296412, 4130828, 3978927, 3841615, 3715276, 3594007, 3472006, 3345284, 3212733, 3076712, 2942754, 2817791, 2707186, 2612015, 2528136, 2447280, 2358971, 2251994, 2115370, 1939887, 1720706, 1459946, 1167194, 856979, 544421, 241524, -44161, -308575, -549185, -763608, -949725, -1107214, -1239209, -1352365, -1454584, -1551481, -1643753, -1726987, -1794017, -1838670, -1859271, -1860201, -1850502, -1839934, -1834460, -1833530, -1830430, -1815103, -1777490, -1709618, -1606049, -1463787, -1282846, -1067440, -826728, -574244, -326214, -99459, 90478, 230696]
35353B30696Q0994J6096n0126j12872j67772k12177k45679k69112k82952k86543
35343a299447k78768k59647k31656j99718j69368j44068j23640j05202q5890o5172
35333b962576m5160k9174j9804j7426j9626k1971k0292j3398m112K707L720p35
35321c147847p664j4157j8948k1696k1346j5596k076J9910M8317P8605J04931
35310b997567J21711J24881J12699Q6233M9481Q850k8191n5091o8139o7507n6774
35299b769414m1038k4658j0109J567R612J3163J2062P893M067M679J3067L1025
35287b748084N8562R3588J31456J65435J88724J97048J90027J70726J44400J17293
35277a290825R5300Q2152P7917P9002P9953P6110O5782N0871L5409K2820J3938
$$ y = [230696, 311690, 327786, 277660, 164788, -2984, -215161, -460840, -729952, -1012904, -1299447, -1578215, -1837862, -2069518, -2269236, -2438604, -2582672, -2706312, -2811514, -2897404, -2962576, -3007736, -3036910, -3056714, -3074140, -3093766, -3115737, -3136029, -3149427, -3153539, -3150832, -3147112, -3147847, -3155511, -3169668, -3188616, -3210312, -3231658, -3247254, -3249330, -3229420, -3181103, -3102498, -2997567, -2875856, -2750975, -2638276, -2552043, -2502562, -2493712, -2521903, -2576994, -2645133, -2712640, -2769414, -2810452, -2835110, -2845219, -2843652, -2834040, -2820877, -2808815, -2800922, -2796855, -2792176, -2779109, -2748084, -2689522, -2595934, -2464478, -2299043, -2110319, -1913271, -1723244, -1552518, -1408118, -1290825, -1195525, -1113373, -1035456, -956454, -876501, -800391, -734609, -683738, -648329, -625509, -611571]
35266f11571P396J719l121o105o708n863n549p478j1786j6480j7832j1376O989
35253f87765L9865Q7045J44486K04606K58217K97033L15356L10706K84038K39674
35243A493261J84490J26253P2022K7271m424k1990k7631k6746k6114l0849m1936
35232A723607n6111o8185p4160p3024o6481n7452m8759m2540m0051m1313m4700
35221A110831m7226m5986m0165l2022k5604k3874k6319k8913k6380j5124M786
35210H04004K9352N1899O5411O5093N0375K5454k149k4683l7309l9278l2512j9369
35198I36288k049J5949K8388K7386O983l3206q6912j43520j92328k26274k43325
35187H7380k45407k36189k19174j96824j70596j41518j10615p8748m6032j1712
$$ y = [-611571, -604175, -602456, -605577, -611682, -618390, -624253, -629802, -637280, -649066, -665546, -683378, -694754, -687765, -647900, -560855, -416369, -211763, 46454, 343487, 658843, 969549, 1253587, 1493261, 1677751, 1804004, 1876026, 1903297, 1898873, 1876883, 1849252, 1822506, 1796392, 1765543, 1723607, 1667496, 1599311, 1525151, 1452127, 1385646, 1328194, 1279435, 1236895, 1196844, 1155531, 1110831, 1063605, 1017619, 977454, 945432, 919828, 895954, 869635, 840722, 814342, 799218, 804004, 833356, 885255, 950666, 1015759, 1066134, 1091588, 1089439, 1064756, 1027447, 988169, 955657, 936288, 934239, 950188, 978576, 1005962, 1012945, 979739, 892827, 749307, 556979, 330705, 87380, -158027, -394216, -613390, -810214, -980810, -1122328, -1232943, -1311691, -1357723, -1369435]
35177a369435K5006O3791J02631J38238J66994J86113J94745J94533J89087J82711
35167G4414J79183J80930J88207J98338K05813K03942J87565J55727J13210P0073
35157A757402L8421K7228L7951O3972R4229J18304J29708J26304J09076Q0919
35147B583514M5940Q882k5929n5962q1406j04572j27847j51395j72450j86780
35137A731995j91303j85804j72703j55348j36379j17136r7875p8054n6561l2361
35127E08471n792K0370M1394N2873N3269M4506K9877J1061j2935m3897q1147j19846
35115D98204j52121j70123j69070j48837j13770p1086k8595P495L3848M9959N6918
35104b07178N5792M6775K9765N841k1750m8073o8167p8849p9943p4615o8395o6669
$$ y = [-1369435, -1344429, -1280638, -1178007, -1039769, -872775, -686662, -491917, -297384, -108297, 74414, 253597, 434527, 622734, 821072, 1026885, 1230827, 1418392, 1574119, 1687329, 1757402, 1795823, 1823051, 1861002, 1924974, 2019203, 2137507, 2267215, 2393519, 2502595, 2583514, 2629454, 2638336, 2612407, 2556445, 2475039, 2370467, 2242620, 2091225, 1918775, 1731995, 1540692, 1354888, 1182185, 1026837, 890458, 773322, 675447, 597393, 540832, 508471, 502679, 523049, 564443, 617316, 670585, 715091, 744968, 756029, 743094, 699197, 618050, 498204, 346083, 175960, 6890, -141947, -255717, -326803, -355398, -347903, -314055, -264096, -207178, -151386, -104611, -74846, -69005, -90755, -138828, -206995, -285844, -365787, -440402, -508797, -575466]
35092e75466p1531q0119q6008q2880o7920m2863j2850J5603L6386M5189M0621
35081h81838K4732K437k0525m0374n7241p4541r5756j20911j45558j62996j67525
35070a740096j56153j28217q4552k7559L8405J07321J72533K27535K66178K83274
35060a041331K76199K46691K01358J50333J04627P2966N8862N9355O6770P2971
35050B68801P3214O7060N6433M3235K8368J2019n653k3929m1148n4819o2398o2433
35038B98750n5506m4475l3699k7370k7588l3353m0996m5562m2368k8418l435K9969
35026e4051O7308J03775J35262J58557J71338J72404J61786J40278J08769O8278
35016A233704K0963k8861p4939j10693j31159j33990j19297q9162m7446L56M7916
$$ y = [-575466, -646997, -727116, -813124, -896004, -963924, -1006787, -1019637, -1004034, -967648, -922459, -881838, -857106, -854669, -875194, -915568, -972809, -1047350, -1143106, -1264017, -1409575, -1572571, -1740096, -1896249, -2024466, -2109018, -2136577, -2098172, -1990851, -1818318, -1590783, -1324605, -1041331, -765132, -518441, -317083, -166750, -62123, 10843, 69705, 129060, 195830, 268801, 342015, 409075, 465508, 508743, 537111, 549130, 543477, 519548, 478400, 423581, 361183, 298750, 243244, 198769, 165070, 137700, 110112, 76759, 35763, -9799, -52167, -80585, -84020, -54051, 13257, 117032, 252294, 410851, 582189, 754593, 916379, 1056657, 1165426, 1233704, 1254667, 1225806, 1150867, 1040174, 909015, 775025, 655728, 566566, 519120, 519476, 567392]
35005E67392Q9688J22557J46468J63431J75509J83286J86137J84036J79171J75558
34995B173233J76695J83140J91878J97822J96069J83486J59019J23340P8485K7548
34985C690715k5833p8176j26611j68904k03480k29784k48792k62934k75138k87501
34975A783562l00433l12735l22264l26471l22411l06860k77225k33073j77225
34966g95135j15585n6041o884K5282L8045L4732K3234J2031N878M067K314l400
34954h31462j3793k5924l5340l8818l5811k8091j8417r148j252O004J4382K5356
34942i92314L9244N5394P2989R1390J09915J27729J44176J58975J71671J80694
34932A59863J83132J75648J56104J24705Q3966L7790r542n3740r0293j14430j22048
$$ y = [567392, 657080, 779637, 926105, 1089536, 1265045, 1448331, 1634468, 1818504, 1997675, 2173233, 2349928, 2533068, 2724946, 2922768, 3118837, 3302323, 3461342, 3584682, 3663167, 3690715, 3664882, 3586706, 3460095, 3291191, 3087711, 2857927, 2609135, 2346201, 2071063, 1783562, 1483129, 1170394, 848130, 521659, 199248, -107612, -384837, -617910, -795135, -910720, -966761, -973645, -948363, -910318, -875586, -852352, -840321, -834443, -830376, -828062, -831462, -845255, -871179, -906519, -945337, -981148, -1009239, -1027656, -1036804, -1038056, -1032052, -1017670, -992314, -953070, -897676, -824687, -733297, -623382, -495653, -351477, -192502, -20831, 159863, 342995, 518643, 674747, 799452, 883418, 921208, 911666, 857926, 767633, 653203, 531155]
34921E31155j11470q4938m8396r327K6105N4756P6416R2650J05605J16992J27247
34910H76795J35218J38879J36549J27526J11812Q9840O3060L4750R759p136j3286
34899A703766r468qQ494R978K300j1110k3057k6980k0672o846R121K1977K8033
34886A685528K5384J3870m529k5622m4445n8121o8030p8812r4496j15018j36318
34875A099391j53571j64228j68341j66756j59444j45465j24175r6423o4674l1841
34865a75527K66L1509O2280R1562J15926J30323J30165J13253Q0718L6832j2101
34854F05206n9509j00359j32072j53939j65524j65393j51218j21411p7432k5437
34844e47088K4220O0287P5466O9884N0835K9012J3640R157J4670K6069L9343N2828
$$ y = [531155, 419685, 334747, 286351, 277024, 303129, 357885, 434301, 526951, 632556, 749548, 876795, 1012013, 1150892, 1287441, 1414967, 1526779, 1616619, 1679679, 1714429, 1724188, 1717052, 1703766, 1694298, 1694290, 1702784, 1712762, 1715062, 1703952, 1680895, 1653915, 1633243, 1626397, 1635518, 1657495, 1685528, 1710912, 1724782, 1720253, 1694631, 1650186, 1592065, 1524035, 1445223, 1350727, 1235709, 1099391, 945820, 781592, 613251, 446495, 287051, 141586, 17411, -79012, -143686, -175527, -175261, -143752, -81472, 10090, 126016, 256339, 386504, 499757, 580475, 617307, 605206, 545697, 445338, 313266, 159327, -6197, -171590, -322808, -444219, -521651, -547088, -522868, -462581, -387115, -317231, -266396, -237384, -223744, -214587, -199917, -173848, -134505, -81677]
34832h1677O6714Q0571R1488R4675Q5821O2991K7005j9115p0626j21316j64249
34821E2282j93478k06134k03488j89890j70121j47100j21330r1739n6669j4519
34811a342186L5537R2502J52715K10004K57134K88223L00890K96672K79189K51413
34801H22093K14463J68897J17078O4174J6598k1030m8139o7829q4109r8842j10733
34790I72621j16859j15091j05455q9988p1908n5022m3290m0157m7532o4788q8416
34779A34115j12689j31323j39634j36251j23518j06008q7883p0647n2796l1458
34769h58092m652K7442O2624R7749J30028J58173J83122K07855K36121K70441
34759E10811L10445L52489L90865M19901M35683M36485M22075L92930L50110K95468
$$ y = [-81677, -14963, 65608, 157096, 251771, 337592, 400583, 427588, 408473, 337847, 216531, 52282, -141196, -347330, -550818, -740708, -910829, -1057929, -1179259, -1270998, -1327667, -1342186, -1306649, -1214147, -1061432, -851428, -594294, -306071, -5181, 291491, 570680, 822093, 1036556, 1205453, 1322531, 1386705, 1403303, 1382273, 1334134, 1266305, 1182196, 1083354, 972621, 855762, 740671, 635216, 545228, 473320, 418298, 375008, 334851, 287319, 222531, 134115, 21426, -109897, -249531, -385782, -509300, -615308, -703191, -773838, -826634, -858092, -862744, -835302, -772678, -674929, -544901, -386728, -203606, 4249, 240370, 510811, 821256, 1173745, 1564610, 1984511, 2420194, 2856679, 3278754, 3671684, 4021794, 4317262]
34749D317262K31365J59799Q1977q30q5664j67168k38822k95428l35049l59262
34739C308180l71879l77177l78538l77911l75918l72131l65160l52832l32693
34730C941l02891k62966k14247j59834j04049n1222m197L6446P1828J03368J31701
34719g52122J56561J77364J93910K06689K16538K23814K27778K26848K19404K04199
34709A300983J80030J45576J00283M5891j2802o8920j15817j49364j68954j76695
34699A080211j75421j66944j51802j30515j05220q0246o1047n1904n3712o3266
34689D0134p4571q1340p8993o5521m1634j0858K0826M6413N9965N8146M0462Q663
34677g8308l4078q4113j38187j93518k46729k92687l25015l38650l32455l09575
$$ y = [4317262, 4548627, 4708426, 4790403, 4789573, 4703909, 4536741, 4297919, 4002491, 3667442, 3308180, 2936301, 2559124, 2180586, 1802675, 1426757, 1054626, 689466, 336634, 3941, -298950, -561916, -776163, -935997, -1040046, -1091268, -1095465, -1059019, -987191, -883823, -752122, -595561, -418197, -224287, -17598, 198940, 422754, 650532, 877380, 1096784, 1300983, 1481013, 1626589, 1726872, 1772763, 1759961, 1691041, 1575224, 1425860, 1256906, 1080211, 904790, 737846, 586044, 455529, 350309, 270063, 209016, 157112, 103400, 40134, -34437, -115777, -194770, -260291, -301925, -312783, -291957, -245544, -185579, -127433, -86971, -78308, -112386, -196499, -334686, -528204, -774933, -1067620, -1392635, -1731285, -2063740, -2373315]
34667b373315k75260k34340j90445j46879j07254p4631n0143l2830k1060j3976
34657c520133j1437j2497j4002j0497M359L5577Q4585J47742K16378K78657L22854
34646b478414L40856L30530K95977K45639J89163J34414Q5798M4437R805j8275
34636h20070l8837n0813n4979n4808n5274o0657p3174r2990j18573j46441j70784
34625a737400j84177j79734j53710j07025m5071K3903R0912J47959J89104K11092
34615a744147K13724J99904J74857J44710J14962Q9387O9454N4249M1083K6828
34605f14989R447j1102l3010n3595p0436q2183q8631r0100q6591p7499o2168m0895
34593a301752j5602J0302L2726M7949N3563M9130L6578K0076N160k948j109J0820
$$ y = [-2373315, -2648575, -2882915, -3073360, -3220239, -3327493, -3402124, -3452267, -3485097, -3506157, -3520133, -3531570, -3544067, -3558069, -3568566, -3564207, -3528630, -3444045, -3296303, -3079925, -2801268, -2478414, -2137558, -1807028, -1511051, -1265412, -1076249, -941835, -856037, -811600, -801795, -820070, -858907, -909720, -964699, -1019507, -1074781, -1135438, -1208612, -1301602, -1420175, -1566616, -1737400, -1921577, -2101311, -2255021, -2362046, -2407117, -2383214, -2292302, -2144343, -1955239, -1744147, -1530423, -1330519, -1155662, -1010952, -895990, -806603, -737149, -682900, -641817, -614989, -605542, -616644, -649654, -703249, -773685, -855868, -944499, -1034599, -1121190, -1198689, -1260857, -1301752, -1317354, -1307052, -1274326, -1226377, -1172814, -1123684, -1087106, -1067030, -1061870, -1064818, -1065927, -1055107]
34581a055107L0356N3557P6197R4704J06913J12537J12993J10514J06988J03300
34571a47048R9338R4296Q6888P5431N8074L3147n31m3357r4308j50071k05009
34560a93150k52647k87897l08265l13280l03282k78957k41559j93066j36126p4257
34550b582486j2049M5510R4602J33752J63438J84558J97188K00530J93934J78159
34540a202864J55883J30901J06366Q3625O2822M4770L2051K7819L2906M3809N3616
34529d28296N5545M6474K7902M249j9593l9731n3836o1442o3825o2920n9955n5130
34517g10558m8633m1762l7067l7770m7015o6724r5990j30065j61330j81938j86322
34506a745174j72307j41067r6677m5186P024N5013R6204J30172J57808J80463
$$ y = [-1055107, -1024751, -971194, -894997, -800293, -693380, -580843, -467850, -357336, -250348, -147048, -47710, 46586, 133474, 208905, 266979, 300126, 299595, 256238, 161930, 11859, -193150, -445797, -733694, -1041959, -1355239, -1658521, -1937478, -2179037, -2372103, -2508229, -2582486, -2594535, -2549025, -2454423, -2320671, -2157233, -1972675, -1775487, -1574957, -1381023, -1202864, -1046981, -916080, -809714, -726089, -663267, -618497, -586446, -558627, -525721, -481912, -428296, -372751, -326277, -298375, -294126, -313719, -353450, -407286, -468728, -532553, -595473, -655428, -710558, -759191, -800953, -838020, -875790, -922805, -989529, -1085519, -1215584, -1376914, -1558852, -1745174, -1917481, -2058548, -2155225, -2200411, -2193387, -2138374, -2042170, -1911998, -1754190, -1573727]
34496a573727J99354K15405K29624K43369K57642K71421K80373K77420K55387
34487F56268K10396J44111O3579k1294j01186j69733k23635k61224k81136k82220
34477b66074k64299k28932j79811j22738o5102j4493K3259M5598N3180M8498L4457
34466i36457J4081q977l0541m7210n7770o3047o4146o0897n2317l8739k3418j1789
34454a381227q595j4936k7301l9358m5517m4239l8991l5862l9188m8263n7876
34443a781353o2263n9215n0991m1901l5332l2764l4720m1731n4012p0360q7403
34432b352045r9984j02524r0897o3976k4238K2901P0707J13105J46257J68969
34422b211725J81757J85410J80500J68362J52381J37690J28753J26536J27621
$$ y = [-1573727, -1374373, -1158968, -929344, -685975, -428333, -156912, 123461, 400881, 656268, 866664, 1010775, 1074354, 1053060, 951874, 782141, 558506, 297282, 16146, -266074, -530373, -759305, -939116, -1061854, -1126956, -1141449, -1118190, -1072592, -1019412, -970914, -936457, -922376, -931353, -961894, -1009104, -1066874, -1129921, -1194067, -1254964, -1307281, -1346020, -1369438, -1381227, -1389822, -1404758, -1432059, -1471417, -1516934, -1561173, -1600164, -1636026, -1675214, -1723477, -1781353, -1843616, -1902831, -1953822, -1995723, -2031055, -2063819, -2098539, -2140270, -2194282, -2264642, -2352045, -2452029, -2554553, -2645450, -2709426, -2733664, -2710763, -2640056, -2526951, -2380694, -2211725, -2029968, -1844558, -1664058, -1495696, -1343315, -1205625, -1076872, -950336, -822715]
34413h22715J26138J17211R9561P5884N1420L2055K2939K7559M6781P7902J14580
34402c0685J48327J71206J78261J68414J43779J08453O7638K6801r574l9427o3568
34391H69625q4712j05681j27925j50760j71257j85025j88079j79207j61023j38697
34381f22741j17178r9205q5225p4555o6222n9123n2212m5182l9058l6006l8198
34370a334905m6347n8586p0439p6233p1624n5878l2478p825J1156J9476J5984
34359a707699M168q738j4232n542K0076O0459J09086J56936J95096K17336K21717
34348g51337K10727J89825J64814J39343J14025Q7524N8291K5582j0248m7525
34338A81021q3158j13408j35270j47512j50883j48042j43262j41172j44568j52814
$$ y = [-822715, -696577, -579366, -479805, -403921, -352501, -320446, -297507, -269948, -223167, -145265, -30685, 117642, 288848, 467109, 635523, 779302, 887755, 955393, 982194, 972620, 933193, 869625, 784913, 679232, 551307, 400547, 229290, 44265, -143814, -323021, -484044, -622741, -739919, -839124, -924349, -998904, -1065126, -1124249, -1176461, -1221643, -1260701, -1296707, -1334905, -1381252, -1439838, -1510277, -1586510, -1658134, -1714012, -1746490, -1754315, -1743159, -1723683, -1707699, -1703531, -1712269, -1726501, -1732043, -1711967, -1651508, -1542422, -1385486, -1190390, -973054, -751337, -540610, -350785, -185971, -46628, 67397, 154921, 213212, 238794, 228546, 181021, 97863, -15545, -150815, -298327, -449210, -597252, -740514, -881686, -1026254, -1179068]
34328a179068j62290j68309j66959j56089j35797j08410p7528m6377j6544J2217
34318b205154M1486P3414J09480J48874J87690K20138K41487K50644K50421K45401
34308d36119K39070K32093K22312K05963J79351J40676R1722L8499r945m4538
34298H59084n9883n6927m3131k9482k5439l4538n3377p4379r0179r6622r2953
34287B02174p9895n7747k6456J2332N3441Q9114J12840J23139J24374J23956J28063
34276H05335J38196J50204J56151J48348J23587Q5152M1505K509k4557l7335l8407
34265A550688l3730l0610l5903n4550q8400j35703j91353k47720k95895l27645
34255A09179l38007l27170l00124k64094k25707j89684j59026j35367j18699j06934
$$ y = [-1179068, -1341358, -1509667, -1676626, -1832715, -1968512, -2076922, -2154450, -2200827, -2217371, -2205154, -2163668, -2090254, -1980774, -1831900, -1644210, -1424072, -1182585, -931941, -681520, -436119, -197049, 35044, 257356, 463319, 642670, 783346, 875068, 913567, 903622, 859084, 799201, 742274, 699143, 669661, 644222, 609684, 556307, 481928, 391749, 295127, 202174, 122279, 64532, 38076, 50408, 103849, 192963, 305803, 428942, 553316, 677272, 805335, 943531, 1093735, 1249886, 1398234, 1521821, 1606973, 1648478, 1650987, 1626430, 1589095, 1550688, 1516958, 1486348, 1450445, 1395895, 1307495, 1171792, 980439, 732719, 436824, 109179, -228828, -555998, -856122, -1120216, -1345923, -1535607, -1694633, -1830000, -1948699, -2055633]
34245b055633r6297q2890o4767m3172k1974n639K866L022l377j2763k0445k1654
$$ y = [-2055633, -2151930, -2234820, -2299587, -2342759, -2364733, -2370372, -2367506, -2364484, -2367861, -2380624, -2401069, -2422723]
$$ [...]
##END NTUPLES=NMR SPECTRUM
##END=
